Build failed in Hudson: Lucene-trunk #1244

classic Classic list List threaded Threaded
7 messages Options
Reply | Threaded
Open this post in threaded view
|

Build failed in Hudson: Lucene-trunk #1244

Apache Hudson Server
See <http://hudson.zones.apache.org/hudson/job/Lucene-trunk/1244/changes>

Changes:

[rmuir] LUCENE-2514: consume tokenstreams in QP like the indexer: dont create intermediate string

[uschindler] revert accidental commit by buschmi

[buschmi] LUCENE-2324: Committing second version of the patch to the real-time branch.  It's not done yet, but easier to track progress using the branch.

[gsingers] SOLR-1568: moved DistanceUtils up one package, as it isn't tier specific

[uschindler] LUCENE-2523: Modify the test to check only for failure on IR.open(), add TODO to make IW.ctor() fail early, too

[uschindler] LUCENE-2523: Add IndexFormatTooOldException and IndexFormatTooNewException

[rmuir] LUCENE-2458: queryparser turns all CJK queries into phrase queries

[uschindler] LUCENE-2549: Fix TimeLimitingCollector#TimeExceededException to record the absolute docid

[uschindler] Generics und Classloader Policeman fixes

[uschindler] A small improvement in FuzzyTermsEnum, as the ArrayList was initially allocated with one element less so internal array reallocated every time. This removes the use of ArrayList at all.

[uschindler] LUCENE-2541: Improve readability of TestNumericUtils by using autoboxing and varargs

[uschindler] LUCENE-2541: Fix NumericRangeQuery that returned incorrect results with endpoints near Long.MIN_VALUE and Long.MAX_VALUE

------------------------------------------
[...truncated 14626 lines...]
    [junit] Tests run: 4, Failures: 0, Errors: 0, Time elapsed: 1.541 sec
    [junit]

junit-parallel:

common.test:
     [echo] Building wordnet...

common.init:

build-lucene:

init:

test:
     [echo] Building wordnet...

common.init:

build-lucene:

init:

compile-test:
     [echo] Building wordnet...

compile-analyzers-common:

common.init:

build-lucene:

init:

clover.setup:
[clover-setup] Clover Version 2.6.3, built on November 20 2009 (build-778)
[clover-setup] Loaded from: /export/home/hudson/tools/clover/clover2latest/clover-2.6.3.jar
[clover-setup] Clover: Open Source License registered to Apache.
[clover-setup] Clover is enabled with initstring '<http://hudson.zones.apache.org/hudson/job/Lucene-trunk/ws/lucene/build/test/clover/db/lucene_coverage.db'>

clover.info:

clover:

common.compile-core:

compile-core:

common.compile-test:

junit-mkdir:
    [mkdir] Created dir: <http://hudson.zones.apache.org/hudson/job/Lucene-trunk/ws/lucene/build/contrib/wordnet/test>

junit-sequential:
    [junit] Testsuite: org.apache.lucene.wordnet.TestSynonymTokenFilter
    [junit] Tests run: 4, Failures: 0, Errors: 0, Time elapsed: 5.159 sec
    [junit]
    [junit] Testsuite: org.apache.lucene.wordnet.TestWordnet
    [junit] Tests run: 2, Failures: 0, Errors: 0, Time elapsed: 1.082 sec
    [junit]
    [junit] ------------- Standard Output ---------------
    [junit] Opening Prolog file <http://hudson.zones.apache.org/hudson/job/Lucene-trunk/ws/lucene/build/contrib/wordnet/classes/test/org/apache/lucene/wordnet/testSynonyms.txt>
    [junit] [1/2] Parsing <http://hudson.zones.apache.org/hudson/job/Lucene-trunk/ws/lucene/build/contrib/wordnet/classes/test/org/apache/lucene/wordnet/testSynonyms.txt>
    [junit] 2 s(100000001,1,'woods',n,1,0). 0 0 ndecent=0
    [junit] 4 s(100000001,3,'forest',n,1,0). 2 1 ndecent=0
    [junit] 8 s(100000003,2,'baron',n,1,1). 6 3 ndecent=0
    [junit] [2/2] Building index to store synonyms,  map sizes are 8 and 4
    [junit] row=1/8 doc= Document<stored,omitNorms<syn:king> stored,indexed<word:baron>>
    [junit] row=2/8 doc= Document<stored,omitNorms<syn:wood> stored,omitNorms<syn:woods> stored,indexed<word:forest>>
    [junit] row=4/8 doc= Document<stored,omitNorms<syn:wolfish> stored,indexed<word:ravenous>>
    [junit] Optimizing..
    [junit] Opening Prolog file <http://hudson.zones.apache.org/hudson/job/Lucene-trunk/ws/lucene/build/contrib/wordnet/classes/test/org/apache/lucene/wordnet/testSynonyms.txt>
    [junit] [1/2] Parsing <http://hudson.zones.apache.org/hudson/job/Lucene-trunk/ws/lucene/build/contrib/wordnet/classes/test/org/apache/lucene/wordnet/testSynonyms.txt>
    [junit] 2 s(100000001,1,'woods',n,1,0). 0 0 ndecent=0
    [junit] 4 s(100000001,3,'forest',n,1,0). 2 1 ndecent=0
    [junit] 8 s(100000003,2,'baron',n,1,1). 6 3 ndecent=0
    [junit] [2/2] Building index to store synonyms,  map sizes are 8 and 4
    [junit] row=1/8 doc= Document<stored,omitNorms<syn:king> stored,indexed<word:baron>>
    [junit] row=2/8 doc= Document<stored,omitNorms<syn:wood> stored,omitNorms<syn:woods> stored,indexed<word:forest>>
    [junit] row=4/8 doc= Document<stored,omitNorms<syn:wolfish> stored,indexed<word:ravenous>>
    [junit] Optimizing..
    [junit] ------------- ---------------- ---------------

junit-parallel:

common.test:
     [echo] Building xml-query-parser...

common.init:

build-lucene:

init:

test:
     [echo] Building xml-query-parser...

common.init:

build-lucene:

init:

compile-test:
     [echo] Building xml-query-parser...

build-queries:

common.init:

build-lucene:

init:

clover.setup:
[clover-setup] Clover Version 2.6.3, built on November 20 2009 (build-778)
[clover-setup] Loaded from: /export/home/hudson/tools/clover/clover2latest/clover-2.6.3.jar
[clover-setup] Clover: Open Source License registered to Apache.
[clover-setup] Clover is enabled with initstring '<http://hudson.zones.apache.org/hudson/job/Lucene-trunk/ws/lucene/build/test/clover/db/lucene_coverage.db'>

clover.info:

clover:

common.compile-core:

compile-core:

common.compile-test:

junit-mkdir:
    [mkdir] Created dir: <http://hudson.zones.apache.org/hudson/job/Lucene-trunk/ws/lucene/build/contrib/xml-query-parser/test>

junit-sequential:
    [junit] Testsuite: org.apache.lucene.xmlparser.TestParser
    [junit] Tests run: 20, Failures: 0, Errors: 0, Time elapsed: 5.92 sec
    [junit]
    [junit] Testsuite: org.apache.lucene.xmlparser.TestQueryTemplateManager
    [junit] Tests run: 1, Failures: 0, Errors: 0, Time elapsed: 0.341 sec
    [junit]
    [junit] Testsuite: org.apache.lucene.xmlparser.builders.TestNumericRangeFilterBuilder
    [junit] Tests run: 6, Failures: 0, Errors: 0, Time elapsed: 0.1 sec
    [junit]
    [junit] Testsuite: org.apache.lucene.xmlparser.builders.TestNumericRangeQueryBuilder
    [junit] Tests run: 5, Failures: 0, Errors: 0, Time elapsed: 0.069 sec
    [junit]

junit-parallel:

common.test:

test-backwards:

test:

BUILD SUCCESSFUL
Total time: 138 minutes 46 seconds
RET=0
+ set -e
+ /export/home/hudson/tools/ant/latest/bin/ant -lib /export/home/hudson/tools/clover/clover2latest -Dsvnversion.exe=/opt/subversion-1.6.9/bin/svnversion -Dsvn.exe=/opt/subversion-1.6.9/bin/svn -Dversion=4.0-2010-07-21_15-10-16 -Drun.clover=true generate-clover-reports
ANT_OPTS=-Xmx896M
Buildfile: build.xml

clover.check:

clover.setup:
[clover-setup] Clover Version 2.6.3, built on November 20 2009 (build-778)
[clover-setup] Loaded from: /export/home/hudson/tools/clover/clover2latest/clover-2.6.3.jar
[clover-setup] Clover: Open Source License registered to Apache.
[clover-setup] Clover is enabled with initstring '<http://hudson.zones.apache.org/hudson/job/Lucene-trunk/ws/lucene/build/test/clover/db/lucene_coverage.db'>

clover.info:

clover:

generate-clover-reports:
    [mkdir] Created dir: <http://hudson.zones.apache.org/hudson/job/Lucene-trunk/ws/lucene/build/test/clover/reports>
[clover-report] Clover Version 2.6.3, built on November 20 2009 (build-778)
[clover-report] Loaded from: /export/home/hudson/tools/clover/clover2latest/clover-2.6.3.jar
[clover-report] Clover: Open Source License registered to Apache.
[clover-report] Loading coverage database from: '<http://hudson.zones.apache.org/hudson/job/Lucene-trunk/ws/lucene/build/test/clover/db/lucene_coverage.db'>
[clover-report] Loading coverage database from: '<http://hudson.zones.apache.org/hudson/job/Lucene-trunk/ws/lucene/build/test/clover/db/lucene_coverage.db'>
[clover-report] Processed 1952 test case results from 300 results files.
[clover-report] Writing HTML report to '<http://hudson.zones.apache.org/hudson/job/Lucene-trunk/ws/lucene/build/test/clover/reports'>
FATAL: command execution failed
hudson.util.IOException2: Failed to join the process
        at hudson.Proc$RemoteProc.join(Proc.java:355)
        at hudson.Launcher$ProcStarter.join(Launcher.java:280)
        at hudson.tasks.CommandInterpreter.perform(CommandInterpreter.java:83)
        at hudson.tasks.CommandInterpreter.perform(CommandInterpreter.java:58)
        at hudson.tasks.BuildStepMonitor$1.perform(BuildStepMonitor.java:19)
        at hudson.model.AbstractBuild$AbstractRunner.perform(AbstractBuild.java:601)
        at hudson.model.Build$RunnerImpl.build(Build.java:174)
        at hudson.model.Build$RunnerImpl.doRun(Build.java:138)
        at hudson.model.AbstractBuild$AbstractRunner.run(AbstractBuild.java:416)
        at hudson.model.Run.run(Run.java:1257)
        at hudson.model.FreeStyleBuild.run(FreeStyleBuild.java:46)
        at hudson.model.ResourceController.execute(ResourceController.java:88)
        at hudson.model.Executor.run(Executor.java:127)
Caused by: java.util.concurrent.ExecutionException: hudson.remoting.RequestAbortedException: java.io.IOException: Unexpected termination of the channel
        at hudson.remoting.Request$1.get(Request.java:218)
        at hudson.remoting.Request$1.get(Request.java:172)
        at hudson.remoting.FutureAdapter.get(FutureAdapter.java:55)
        at hudson.Proc$RemoteProc.join(Proc.java:347)
        ... 12 more
Caused by: hudson.remoting.RequestAbortedException: java.io.IOException: Unexpected termination of the channel
        at hudson.remoting.Request.abort(Request.java:257)
        at hudson.remoting.Channel.terminate(Channel.java:602)
        at hudson.remoting.Channel$ReaderThread.run(Channel.java:893)
Caused by: java.io.IOException: Unexpected termination of the channel
        at hudson.remoting.Channel$ReaderThread.run(Channel.java:875)
Caused by: java.io.EOFException
        at java.io.ObjectInputStream$BlockDataInputStream.peekByte(ObjectInputStream.java:2554)
        at java.io.ObjectInputStream.readObject0(ObjectInputStream.java:1297)
        at java.io.ObjectInputStream.readObject(ObjectInputStream.java:351)
        at hudson.remoting.Channel$ReaderThread.run(Channel.java:869)
FATAL: Unable to delete script file /var/tmp/hudson4829207034882905638.sh
hudson.util.IOException2: remote file operation failed: /var/tmp/hudson4829207034882905638.sh at hudson.remoting.Channel@d47cae:lucene.zones.apache.org (Solaris 10)
        at hudson.FilePath.act(FilePath.java:749)
        at hudson.FilePath.act(FilePath.java:735)
        at hudson.FilePath.delete(FilePath.java:990)
        at hudson.tasks.CommandInterpreter.perform(CommandInterpreter.java:93)
        at hudson.tasks.CommandInterpreter.perform(CommandInterpreter.java:58)
        at hudson.tasks.BuildStepMonitor$1.perform(BuildStepMonitor.java:19)
        at hudson.model.AbstractBuild$AbstractRunner.perform(AbstractBuild.java:601)
        at hudson.model.Build$RunnerImpl.build(Build.java:174)
        at hudson.model.Build$RunnerImpl.doRun(Build.java:138)
        at hudson.model.AbstractBuild$AbstractRunner.run(AbstractBuild.java:416)
        at hudson.model.Run.run(Run.java:1257)
        at hudson.model.FreeStyleBuild.run(FreeStyleBuild.java:46)
        at hudson.model.ResourceController.execute(ResourceController.java:88)
        at hudson.model.Executor.run(Executor.java:127)
Caused by: hudson.remoting.ChannelClosedException: channel is already closed
        at hudson.remoting.Channel.send(Channel.java:412)
        at hudson.remoting.Request.call(Request.java:105)
        at hudson.remoting.Channel.call(Channel.java:555)
        at hudson.FilePath.act(FilePath.java:742)
        ... 13 more
FATAL: channel is already closed
hudson.remoting.ChannelClosedException: channel is already closed
        at hudson.remoting.Channel.send(Channel.java:412)
        at hudson.remoting.Request.call(Request.java:105)
        at hudson.remoting.Channel.call(Channel.java:555)
        at hudson.Launcher$RemoteLauncher.kill(Launcher.java:744)
        at hudson.model.AbstractBuild$AbstractRunner.run(AbstractBuild.java:421)
        at hudson.model.Run.run(Run.java:1257)
        at hudson.model.FreeStyleBuild.run(FreeStyleBuild.java:46)
        at hudson.model.ResourceController.execute(ResourceController.java:88)
        at hudson.model.Executor.run(Executor.java:127)


---------------------------------------------------------------------
To unsubscribe, e-mail: [hidden email]
For additional commands, e-mail: [hidden email]

Reply | Threaded
Open this post in threaded view
|

Build failed in Hudson: Lucene-trunk #1245

Apache Hudson Server
See <http://hudson.zones.apache.org/hudson/job/Lucene-trunk/1245/changes>

Changes:

[yonik] LUCENE-2542: remove final from some TopDocsCollector methods

------------------------------------------
[...truncated 2706 lines...]
    [junit] Testsuite: org.apache.lucene.search.TestPrefixQuery
    [junit] Tests run: 1, Failures: 0, Errors: 0, Time elapsed: 0.006 sec
    [junit]
    [junit] Testsuite: org.apache.lucene.search.TestQueryTermVector
    [junit] Tests run: 1, Failures: 0, Errors: 0, Time elapsed: 0.006 sec
    [junit]
    [junit] Testsuite: org.apache.lucene.search.TestQueryWrapperFilter
    [junit] Tests run: 1, Failures: 0, Errors: 0, Time elapsed: 0.009 sec
    [junit]
    [junit] Testsuite: org.apache.lucene.search.TestRegexpQuery
    [junit] Tests run: 7, Failures: 0, Errors: 0, Time elapsed: 0.054 sec
    [junit]
    [junit] Testsuite: org.apache.lucene.search.TestRegexpRandom
    [junit] Tests run: 1, Failures: 0, Errors: 0, Time elapsed: 41.17 sec
    [junit]
    [junit] Testsuite: org.apache.lucene.search.TestRegexpRandom2
    [junit] Tests run: 1, Failures: 0, Errors: 0, Time elapsed: 130.688 sec
    [junit]
    [junit] Testsuite: org.apache.lucene.search.TestScoreCachingWrappingScorer
    [junit] Tests run: 1, Failures: 0, Errors: 0, Time elapsed: 0.006 sec
    [junit]
    [junit] Testsuite: org.apache.lucene.search.TestScorerPerf
    [junit] Tests run: 1, Failures: 0, Errors: 0, Time elapsed: 1.655 sec
    [junit]
    [junit] Testsuite: org.apache.lucene.search.TestSetNorm
    [junit] Tests run: 1, Failures: 0, Errors: 0, Time elapsed: 0.005 sec
    [junit]
    [junit] Testsuite: org.apache.lucene.search.TestSimilarity
    [junit] Tests run: 1, Failures: 0, Errors: 0, Time elapsed: 0.008 sec
    [junit]
    [junit] Testsuite: org.apache.lucene.search.TestSimpleExplanations
    [junit] Tests run: 53, Failures: 0, Errors: 0, Time elapsed: 2.646 sec
    [junit]
    [junit] Testsuite: org.apache.lucene.search.TestSimpleExplanationsOfNonMatches
    [junit] Tests run: 53, Failures: 0, Errors: 0, Time elapsed: 0.198 sec
    [junit]
    [junit] Testsuite: org.apache.lucene.search.TestSloppyPhraseQuery
    [junit] Tests run: 5, Failures: 0, Errors: 0, Time elapsed: 0.293 sec
    [junit]
    [junit] Testsuite: org.apache.lucene.search.TestSort
    [junit] Tests run: 24, Failures: 0, Errors: 0, Time elapsed: 5.806 sec
    [junit]
    [junit] Testsuite: org.apache.lucene.search.TestSpanQueryFilter
    [junit] Tests run: 1, Failures: 0, Errors: 0, Time elapsed: 0.015 sec
    [junit]
    [junit] Testsuite: org.apache.lucene.search.TestTermRangeFilter
    [junit] Tests run: 7, Failures: 0, Errors: 0, Time elapsed: 12.233 sec
    [junit]
    [junit] Testsuite: org.apache.lucene.search.TestTermRangeQuery
    [junit] Tests run: 11, Failures: 0, Errors: 0, Time elapsed: 0.04 sec
    [junit]
    [junit] Testsuite: org.apache.lucene.search.TestTermScorer
    [junit] Tests run: 3, Failures: 0, Errors: 0, Time elapsed: 0.013 sec
    [junit]
    [junit] Testsuite: org.apache.lucene.search.TestTermVectors
    [junit] Tests run: 8, Failures: 0, Errors: 0, Time elapsed: 0.294 sec
    [junit]
    [junit] Testsuite: org.apache.lucene.search.TestThreadSafe
    [junit] Tests run: 1, Failures: 0, Errors: 0, Time elapsed: 6.209 sec
    [junit]
    [junit] Testsuite: org.apache.lucene.search.TestTimeLimitingCollector
    [junit] Tests run: 6, Failures: 0, Errors: 0, Time elapsed: 1.308 sec
    [junit]
    [junit] Testsuite: org.apache.lucene.search.TestTopDocsCollector
    [junit] Tests run: 8, Failures: 0, Errors: 0, Time elapsed: 0.013 sec
    [junit]
    [junit] Testsuite: org.apache.lucene.search.TestTopScoreDocCollector
    [junit] Tests run: 1, Failures: 0, Errors: 0, Time elapsed: 0.005 sec
    [junit]
    [junit] Testsuite: org.apache.lucene.search.TestWildcard
    [junit] Tests run: 7, Failures: 0, Errors: 0, Time elapsed: 0.039 sec
    [junit]
    [junit] Testsuite: org.apache.lucene.search.TestWildcardRandom
    [junit] Tests run: 1, Failures: 0, Errors: 0, Time elapsed: 77.928 sec
    [junit]
    [junit] Testsuite: org.apache.lucene.search.function.TestCustomScoreQuery
    [junit] Tests run: 6, Failures: 0, Errors: 0, Time elapsed: 7.133 sec
    [junit]
    [junit] Testsuite: org.apache.lucene.search.function.TestDocValues
    [junit] Tests run: 3, Failures: 0, Errors: 0, Time elapsed: 0.008 sec
    [junit]
    [junit] Testsuite: org.apache.lucene.search.function.TestFieldScoreQuery
    [junit] Tests run: 12, Failures: 0, Errors: 0, Time elapsed: 0.223 sec
    [junit]
    [junit] Testsuite: org.apache.lucene.search.function.TestOrdValues
    [junit] Tests run: 6, Failures: 0, Errors: 0, Time elapsed: 0.115 sec
    [junit]
    [junit] Testsuite: org.apache.lucene.search.function.TestValueSource
    [junit] Tests run: 1, Failures: 0, Errors: 0, Time elapsed: 0.024 sec
    [junit]
    [junit] Testsuite: org.apache.lucene.search.payloads.TestPayloadNearQuery
    [junit] Tests run: 4, Failures: 0, Errors: 0, Time elapsed: 0.6 sec
    [junit]
    [junit] Testsuite: org.apache.lucene.search.payloads.TestPayloadTermQuery
    [junit] Tests run: 6, Failures: 0, Errors: 0, Time elapsed: 0.742 sec
    [junit]
    [junit] Testsuite: org.apache.lucene.search.spans.TestBasics
    [junit] Tests run: 20, Failures: 0, Errors: 0, Time elapsed: 5.892 sec
    [junit]
    [junit] Testsuite: org.apache.lucene.search.spans.TestFieldMaskingSpanQuery
    [junit] Tests run: 11, Failures: 0, Errors: 0, Time elapsed: 0.515 sec
    [junit]
    [junit] Testsuite: org.apache.lucene.search.spans.TestNearSpansOrdered
    [junit] Tests run: 10, Failures: 0, Errors: 0, Time elapsed: 0.072 sec
    [junit]
    [junit] Testsuite: org.apache.lucene.search.spans.TestPayloadSpans
    [junit] Tests run: 10, Failures: 0, Errors: 0, Time elapsed: 1.02 sec
    [junit]
    [junit] Testsuite: org.apache.lucene.search.spans.TestSpanExplanations
    [junit] Tests run: 31, Failures: 0, Errors: 0, Time elapsed: 1.069 sec
    [junit]
    [junit] Testsuite: org.apache.lucene.search.spans.TestSpanExplanationsOfNonMatches
    [junit] Tests run: 31, Failures: 0, Errors: 0, Time elapsed: 0.076 sec
    [junit]
    [junit] Testsuite: org.apache.lucene.search.spans.TestSpans
    [junit] Tests run: 25, Failures: 0, Errors: 0, Time elapsed: 0.531 sec
    [junit]
    [junit] Testsuite: org.apache.lucene.search.spans.TestSpansAdvanced
    [junit] Tests run: 1, Failures: 0, Errors: 0, Time elapsed: 0.045 sec
    [junit]
    [junit] Testsuite: org.apache.lucene.search.spans.TestSpansAdvanced2
    [junit] Tests run: 4, Failures: 0, Errors: 0, Time elapsed: 0.147 sec
    [junit]
    [junit] Testsuite: org.apache.lucene.store.TestBufferedIndexInput
    [junit] Tests run: 4, Failures: 0, Errors: 0, Time elapsed: 3.119 sec
    [junit]
    [junit] Testsuite: org.apache.lucene.store.TestDirectory
    [junit] Tests run: 7, Failures: 0, Errors: 0, Time elapsed: 0.061 sec
    [junit]
    [junit] Testsuite: org.apache.lucene.store.TestFileSwitchDirectory
    [junit] Tests run: 1, Failures: 0, Errors: 0, Time elapsed: 0.011 sec
    [junit]
    [junit] Testsuite: org.apache.lucene.store.TestHugeRamFile
    [junit] Tests run: 1, Failures: 0, Errors: 0, Time elapsed: 4.152 sec
    [junit]
    [junit] Testsuite: org.apache.lucene.store.TestLock
    [junit] Tests run: 1, Failures: 0, Errors: 0, Time elapsed: 0.015 sec
    [junit]
    [junit] Testsuite: org.apache.lucene.store.TestLockFactory
    [junit] Tests run: 11, Failures: 0, Errors: 0, Time elapsed: 3.072 sec
    [junit]
    [junit] Testsuite: org.apache.lucene.store.TestRAMDirectory
    [junit] Tests run: 4, Failures: 0, Errors: 0, Time elapsed: 0.079 sec
    [junit]
    [junit] Testsuite: org.apache.lucene.store.TestWindowsMMap
    [junit] Tests run: 1, Failures: 0, Errors: 0, Time elapsed: 0.073 sec
    [junit]
    [junit] Testsuite: org.apache.lucene.util.TestArrayUtil
    [junit] Tests run: 5, Failures: 0, Errors: 0, Time elapsed: 0.025 sec
    [junit]
    [junit] Testsuite: org.apache.lucene.util.TestAttributeSource
    [junit] Tests run: 5, Failures: 0, Errors: 0, Time elapsed: 0.016 sec
    [junit]
    [junit] Testsuite: org.apache.lucene.util.TestBitVector
    [junit] Tests run: 7, Failures: 0, Errors: 0, Time elapsed: 1.571 sec
    [junit]
    [junit] Testsuite: org.apache.lucene.util.TestCharacterUtils
    [junit] Tests run: 7, Failures: 0, Errors: 0, Time elapsed: 0.008 sec
    [junit]
    [junit] Testsuite: org.apache.lucene.util.TestCloseableThreadLocal
    [junit] Tests run: 3, Failures: 0, Errors: 0, Time elapsed: 0.007 sec
    [junit]
    [junit] Testsuite: org.apache.lucene.util.TestDoubleBarrelLRUCache
    [junit] Tests run: 2, Failures: 0, Errors: 0, Time elapsed: 1.016 sec
    [junit]
    [junit] Testsuite: org.apache.lucene.util.TestFieldCacheSanityChecker
    [junit] Tests run: 4, Failures: 0, Errors: 0, Time elapsed: 0.229 sec
    [junit]
    [junit] Testsuite: org.apache.lucene.util.TestIndexableBinaryStringTools
    [junit] Tests run: 10, Failures: 0, Errors: 0, Time elapsed: 10.757 sec
    [junit]
    [junit] Testsuite: org.apache.lucene.util.TestNumericUtils
    [junit] Tests run: 10, Failures: 0, Errors: 0, Time elapsed: 47.103 sec
    [junit]
    [junit] Testsuite: org.apache.lucene.util.TestOpenBitSet
    [junit] Tests run: 5, Failures: 0, Errors: 0, Time elapsed: 5.86 sec
    [junit]
    [junit] Testsuite: org.apache.lucene.util.TestPriorityQueue
    [junit] Tests run: 4, Failures: 0, Errors: 0, Time elapsed: 0.054 sec
    [junit]
    [junit] Testsuite: org.apache.lucene.util.TestRamUsageEstimator
    [junit] Tests run: 1, Failures: 0, Errors: 0, Time elapsed: 0.005 sec
    [junit]
    [junit] Testsuite: org.apache.lucene.util.TestSetOnce
    [junit] Tests run: 4, Failures: 0, Errors: 0, Time elapsed: 0.021 sec
    [junit]
    [junit] Testsuite: org.apache.lucene.util.TestSmallFloat
    [junit] Tests run: 2, Failures: 0, Errors: 0, Time elapsed: 0.165 sec
    [junit]
    [junit] Testsuite: org.apache.lucene.util.TestSortedVIntList
    [junit] Tests run: 19, Failures: 0, Errors: 0, Time elapsed: 0.032 sec
    [junit]
    [junit] Testsuite: org.apache.lucene.util.TestStringHelper
    [junit] Tests run: 1, Failures: 0, Errors: 0, Time elapsed: 0.004 sec
    [junit]
    [junit] Testsuite: org.apache.lucene.util.TestStringIntern
    [junit] Tests run: 1, Failures: 0, Errors: 0, Time elapsed: 18.015 sec
    [junit]
    [junit] Testsuite: org.apache.lucene.util.TestUnicodeUtil
    [junit] Tests run: 4, Failures: 0, Errors: 0, Time elapsed: 0.608 sec
    [junit]
    [junit] Testsuite: org.apache.lucene.util.TestVersion
    [junit] Tests run: 1, Failures: 0, Errors: 0, Time elapsed: 0.003 sec
    [junit]
    [junit] Testsuite: org.apache.lucene.util.TestVirtualMethod
    [junit] Tests run: 2, Failures: 0, Errors: 0, Time elapsed: 0.031 sec
    [junit]
    [junit] Testsuite: org.apache.lucene.util.automaton.TestBasicOperations
    [junit] Tests run: 6, Failures: 0, Errors: 0, Time elapsed: 0.303 sec
    [junit]
    [junit] Testsuite: org.apache.lucene.util.automaton.TestDeterminism
    [junit] Tests run: 1, Failures: 0, Errors: 0, Time elapsed: 0.559 sec
    [junit]
    [junit] Testsuite: org.apache.lucene.util.automaton.TestDeterminizeLexicon
    [junit] Tests run: 1, Failures: 0, Errors: 0, Time elapsed: 14.888 sec
    [junit]
    [junit] Testsuite: org.apache.lucene.util.automaton.TestLevenshteinAutomata
    [junit] Tests run: 3, Failures: 0, Errors: 0, Time elapsed: 0.71 sec
    [junit]
    [junit] Testsuite: org.apache.lucene.util.automaton.TestUTF32ToUTF8
    [junit] Tests run: 5, Failures: 0, Errors: 0, Time elapsed: 4.56 sec
    [junit]
    [junit] Testsuite: org.apache.lucene.util.packed.TestPackedInts
    [junit] Tests run: 7, Failures: 0, Errors: 0, Time elapsed: 3.879 sec
    [junit]

junit-parallel:

common.test:

test-core:

build-contrib:
     [echo] Building ant...

compile-analyzers-common:

BUILD FAILED
<http://hudson.zones.apache.org/hudson/job/Lucene-trunk/ws/lucene/build.xml>:546: The following error occurred while executing this line:
<http://hudson.zones.apache.org/hudson/job/Lucene-trunk/ws/lucene/build.xml>:535: The following error occurred while executing this line:
<http://hudson.zones.apache.org/hudson/job/Lucene-trunk/ws/lucene/contrib/ant/build.xml>:49: <http://hudson.zones.apache.org/hudson/job/Lucene-trunk/ws/modules/analysis/common> not found.

Total time: 14 minutes 2 seconds
[TASKS] Skipping publisher since build result is FAILURE
Publishing Javadoc
Archiving artifacts
Recording test results
Publishing Clover coverage report...
No Clover report will be published due to a Build Failure


---------------------------------------------------------------------
To unsubscribe, e-mail: [hidden email]
For additional commands, e-mail: [hidden email]

Reply | Threaded
Open this post in threaded view
|

Build failed in Hudson: Lucene-trunk #1246

Apache Hudson Server
See <http://hudson.zones.apache.org/hudson/job/Lucene-trunk/1246/changes>

Changes:

[rmuir] add randomRealisticUnicodeString, all chars in the same unicode block

[uschindler] As BytesRef has now native order use them in numeric tests. The contents are raw byte[] and no strings, it should compare native

[rmuir] add random prefixquerytest (hopefully easy to debug preflex issues with)

[rmuir] fix some bytesref abuse in these tests

------------------------------------------
[...truncated 2710 lines...]
    [junit] Testsuite: org.apache.lucene.search.TestPrefixRandom
    [junit] Tests run: 1, Failures: 0, Errors: 0, Time elapsed: 23.153 sec
    [junit]
    [junit] Testsuite: org.apache.lucene.search.TestQueryTermVector
    [junit] Tests run: 1, Failures: 0, Errors: 0, Time elapsed: 0.019 sec
    [junit]
    [junit] Testsuite: org.apache.lucene.search.TestQueryWrapperFilter
    [junit] Tests run: 1, Failures: 0, Errors: 0, Time elapsed: 0.009 sec
    [junit]
    [junit] Testsuite: org.apache.lucene.search.TestRegexpQuery
    [junit] Tests run: 7, Failures: 0, Errors: 0, Time elapsed: 0.028 sec
    [junit]
    [junit] Testsuite: org.apache.lucene.search.TestRegexpRandom
    [junit] Tests run: 1, Failures: 0, Errors: 0, Time elapsed: 107.362 sec
    [junit]
    [junit] Testsuite: org.apache.lucene.search.TestRegexpRandom2
    [junit] Tests run: 1, Failures: 0, Errors: 0, Time elapsed: 35.416 sec
    [junit]
    [junit] Testsuite: org.apache.lucene.search.TestScoreCachingWrappingScorer
    [junit] Tests run: 1, Failures: 0, Errors: 0, Time elapsed: 0.02 sec
    [junit]
    [junit] Testsuite: org.apache.lucene.search.TestScorerPerf
    [junit] Tests run: 1, Failures: 0, Errors: 0, Time elapsed: 1.572 sec
    [junit]
    [junit] Testsuite: org.apache.lucene.search.TestSetNorm
    [junit] Tests run: 1, Failures: 0, Errors: 0, Time elapsed: 0.006 sec
    [junit]
    [junit] Testsuite: org.apache.lucene.search.TestSimilarity
    [junit] Tests run: 1, Failures: 0, Errors: 0, Time elapsed: 0.008 sec
    [junit]
    [junit] Testsuite: org.apache.lucene.search.TestSimpleExplanations
    [junit] Tests run: 53, Failures: 0, Errors: 0, Time elapsed: 2.778 sec
    [junit]
    [junit] Testsuite: org.apache.lucene.search.TestSimpleExplanationsOfNonMatches
    [junit] Tests run: 53, Failures: 0, Errors: 0, Time elapsed: 0.133 sec
    [junit]
    [junit] Testsuite: org.apache.lucene.search.TestSloppyPhraseQuery
    [junit] Tests run: 5, Failures: 0, Errors: 0, Time elapsed: 0.253 sec
    [junit]
    [junit] Testsuite: org.apache.lucene.search.TestSort
    [junit] Tests run: 24, Failures: 0, Errors: 0, Time elapsed: 6.451 sec
    [junit]
    [junit] Testsuite: org.apache.lucene.search.TestSpanQueryFilter
    [junit] Tests run: 1, Failures: 0, Errors: 0, Time elapsed: 0.012 sec
    [junit]
    [junit] Testsuite: org.apache.lucene.search.TestTermRangeFilter
    [junit] Tests run: 7, Failures: 0, Errors: 0, Time elapsed: 18.939 sec
    [junit]
    [junit] Testsuite: org.apache.lucene.search.TestTermRangeQuery
    [junit] Tests run: 11, Failures: 0, Errors: 0, Time elapsed: 0.047 sec
    [junit]
    [junit] Testsuite: org.apache.lucene.search.TestTermScorer
    [junit] Tests run: 3, Failures: 0, Errors: 0, Time elapsed: 0.011 sec
    [junit]
    [junit] Testsuite: org.apache.lucene.search.TestTermVectors
    [junit] Tests run: 8, Failures: 0, Errors: 0, Time elapsed: 0.321 sec
    [junit]
    [junit] Testsuite: org.apache.lucene.search.TestThreadSafe
    [junit] Tests run: 1, Failures: 0, Errors: 0, Time elapsed: 6.786 sec
    [junit]
    [junit] Testsuite: org.apache.lucene.search.TestTimeLimitingCollector
    [junit] Tests run: 6, Failures: 0, Errors: 0, Time elapsed: 1.123 sec
    [junit]
    [junit] Testsuite: org.apache.lucene.search.TestTopDocsCollector
    [junit] Tests run: 8, Failures: 0, Errors: 0, Time elapsed: 0.013 sec
    [junit]
    [junit] Testsuite: org.apache.lucene.search.TestTopScoreDocCollector
    [junit] Tests run: 1, Failures: 0, Errors: 0, Time elapsed: 0.004 sec
    [junit]
    [junit] Testsuite: org.apache.lucene.search.TestWildcard
    [junit] Tests run: 7, Failures: 0, Errors: 0, Time elapsed: 0.038 sec
    [junit]
    [junit] Testsuite: org.apache.lucene.search.TestWildcardRandom
    [junit] Tests run: 1, Failures: 0, Errors: 0, Time elapsed: 26.908 sec
    [junit]
    [junit] Testsuite: org.apache.lucene.search.function.TestCustomScoreQuery
    [junit] Tests run: 6, Failures: 0, Errors: 0, Time elapsed: 7.058 sec
    [junit]
    [junit] Testsuite: org.apache.lucene.search.function.TestDocValues
    [junit] Tests run: 3, Failures: 0, Errors: 0, Time elapsed: 0.007 sec
    [junit]
    [junit] Testsuite: org.apache.lucene.search.function.TestFieldScoreQuery
    [junit] Tests run: 12, Failures: 0, Errors: 0, Time elapsed: 0.21 sec
    [junit]
    [junit] Testsuite: org.apache.lucene.search.function.TestOrdValues
    [junit] Tests run: 6, Failures: 0, Errors: 0, Time elapsed: 0.097 sec
    [junit]
    [junit] Testsuite: org.apache.lucene.search.function.TestValueSource
    [junit] Tests run: 1, Failures: 0, Errors: 0, Time elapsed: 0.024 sec
    [junit]
    [junit] Testsuite: org.apache.lucene.search.payloads.TestPayloadNearQuery
    [junit] Tests run: 4, Failures: 0, Errors: 0, Time elapsed: 0.454 sec
    [junit]
    [junit] Testsuite: org.apache.lucene.search.payloads.TestPayloadTermQuery
    [junit] Tests run: 6, Failures: 0, Errors: 0, Time elapsed: 0.657 sec
    [junit]
    [junit] Testsuite: org.apache.lucene.search.spans.TestBasics
    [junit] Tests run: 20, Failures: 0, Errors: 0, Time elapsed: 8.382 sec
    [junit]
    [junit] Testsuite: org.apache.lucene.search.spans.TestFieldMaskingSpanQuery
    [junit] Tests run: 11, Failures: 0, Errors: 0, Time elapsed: 0.476 sec
    [junit]
    [junit] Testsuite: org.apache.lucene.search.spans.TestNearSpansOrdered
    [junit] Tests run: 10, Failures: 0, Errors: 0, Time elapsed: 0.047 sec
    [junit]
    [junit] Testsuite: org.apache.lucene.search.spans.TestPayloadSpans
    [junit] Tests run: 10, Failures: 0, Errors: 0, Time elapsed: 0.892 sec
    [junit]
    [junit] Testsuite: org.apache.lucene.search.spans.TestSpanExplanations
    [junit] Tests run: 31, Failures: 0, Errors: 0, Time elapsed: 1.065 sec
    [junit]
    [junit] Testsuite: org.apache.lucene.search.spans.TestSpanExplanationsOfNonMatches
    [junit] Tests run: 31, Failures: 0, Errors: 0, Time elapsed: 0.071 sec
    [junit]
    [junit] Testsuite: org.apache.lucene.search.spans.TestSpans
    [junit] Tests run: 25, Failures: 0, Errors: 0, Time elapsed: 0.441 sec
    [junit]
    [junit] Testsuite: org.apache.lucene.search.spans.TestSpansAdvanced
    [junit] Tests run: 1, Failures: 0, Errors: 0, Time elapsed: 0.057 sec
    [junit]
    [junit] Testsuite: org.apache.lucene.search.spans.TestSpansAdvanced2
    [junit] Tests run: 4, Failures: 0, Errors: 0, Time elapsed: 0.147 sec
    [junit]
    [junit] Testsuite: org.apache.lucene.store.TestBufferedIndexInput
    [junit] Tests run: 4, Failures: 0, Errors: 0, Time elapsed: 3.159 sec
    [junit]
    [junit] Testsuite: org.apache.lucene.store.TestDirectory
    [junit] Tests run: 7, Failures: 0, Errors: 0, Time elapsed: 0.093 sec
    [junit]
    [junit] Testsuite: org.apache.lucene.store.TestFileSwitchDirectory
    [junit] Tests run: 1, Failures: 0, Errors: 0, Time elapsed: 0.011 sec
    [junit]
    [junit] Testsuite: org.apache.lucene.store.TestHugeRamFile
    [junit] Tests run: 1, Failures: 0, Errors: 0, Time elapsed: 3.542 sec
    [junit]
    [junit] Testsuite: org.apache.lucene.store.TestLock
    [junit] Tests run: 1, Failures: 0, Errors: 0, Time elapsed: 0.015 sec
    [junit]
    [junit] Testsuite: org.apache.lucene.store.TestLockFactory
    [junit] Tests run: 11, Failures: 0, Errors: 0, Time elapsed: 3.073 sec
    [junit]
    [junit] Testsuite: org.apache.lucene.store.TestRAMDirectory
    [junit] Tests run: 4, Failures: 0, Errors: 0, Time elapsed: 0.086 sec
    [junit]
    [junit] Testsuite: org.apache.lucene.store.TestWindowsMMap
    [junit] Tests run: 1, Failures: 0, Errors: 0, Time elapsed: 0.068 sec
    [junit]
    [junit] Testsuite: org.apache.lucene.util.TestArrayUtil
    [junit] Tests run: 5, Failures: 0, Errors: 0, Time elapsed: 0.028 sec
    [junit]
    [junit] Testsuite: org.apache.lucene.util.TestAttributeSource
    [junit] Tests run: 5, Failures: 0, Errors: 0, Time elapsed: 0.034 sec
    [junit]
    [junit] Testsuite: org.apache.lucene.util.TestBitVector
    [junit] Tests run: 7, Failures: 0, Errors: 0, Time elapsed: 1.576 sec
    [junit]
    [junit] Testsuite: org.apache.lucene.util.TestCharacterUtils
    [junit] Tests run: 7, Failures: 0, Errors: 0, Time elapsed: 0.007 sec
    [junit]
    [junit] Testsuite: org.apache.lucene.util.TestCloseableThreadLocal
    [junit] Tests run: 3, Failures: 0, Errors: 0, Time elapsed: 0.007 sec
    [junit]
    [junit] Testsuite: org.apache.lucene.util.TestDoubleBarrelLRUCache
    [junit] Tests run: 2, Failures: 0, Errors: 0, Time elapsed: 1.017 sec
    [junit]
    [junit] Testsuite: org.apache.lucene.util.TestFieldCacheSanityChecker
    [junit] Tests run: 4, Failures: 0, Errors: 0, Time elapsed: 0.272 sec
    [junit]
    [junit] Testsuite: org.apache.lucene.util.TestIndexableBinaryStringTools
    [junit] Tests run: 10, Failures: 0, Errors: 0, Time elapsed: 12.502 sec
    [junit]
    [junit] Testsuite: org.apache.lucene.util.TestNumericUtils
    [junit] Tests run: 10, Failures: 0, Errors: 0, Time elapsed: 50.36 sec
    [junit]
    [junit] Testsuite: org.apache.lucene.util.TestOpenBitSet
    [junit] Tests run: 5, Failures: 0, Errors: 0, Time elapsed: 6.067 sec
    [junit]
    [junit] Testsuite: org.apache.lucene.util.TestPriorityQueue
    [junit] Tests run: 4, Failures: 0, Errors: 0, Time elapsed: 0.045 sec
    [junit]
    [junit] Testsuite: org.apache.lucene.util.TestRamUsageEstimator
    [junit] Tests run: 1, Failures: 0, Errors: 0, Time elapsed: 0.005 sec
    [junit]
    [junit] Testsuite: org.apache.lucene.util.TestSetOnce
    [junit] Tests run: 4, Failures: 0, Errors: 0, Time elapsed: 0.017 sec
    [junit]
    [junit] Testsuite: org.apache.lucene.util.TestSmallFloat
    [junit] Tests run: 2, Failures: 0, Errors: 0, Time elapsed: 0.165 sec
    [junit]
    [junit] Testsuite: org.apache.lucene.util.TestSortedVIntList
    [junit] Tests run: 19, Failures: 0, Errors: 0, Time elapsed: 0.042 sec
    [junit]
    [junit] Testsuite: org.apache.lucene.util.TestStringHelper
    [junit] Tests run: 1, Failures: 0, Errors: 0, Time elapsed: 0.004 sec
    [junit]
    [junit] Testsuite: org.apache.lucene.util.TestStringIntern
    [junit] Tests run: 1, Failures: 0, Errors: 0, Time elapsed: 20.305 sec
    [junit]
    [junit] Testsuite: org.apache.lucene.util.TestUnicodeUtil
    [junit] Tests run: 4, Failures: 0, Errors: 0, Time elapsed: 0.59 sec
    [junit]
    [junit] Testsuite: org.apache.lucene.util.TestVersion
    [junit] Tests run: 1, Failures: 0, Errors: 0, Time elapsed: 0.003 sec
    [junit]
    [junit] Testsuite: org.apache.lucene.util.TestVirtualMethod
    [junit] Tests run: 2, Failures: 0, Errors: 0, Time elapsed: 0.024 sec
    [junit]
    [junit] Testsuite: org.apache.lucene.util.automaton.TestBasicOperations
    [junit] Tests run: 6, Failures: 0, Errors: 0, Time elapsed: 0.317 sec
    [junit]
    [junit] Testsuite: org.apache.lucene.util.automaton.TestDeterminism
    [junit] Tests run: 1, Failures: 0, Errors: 0, Time elapsed: 0.595 sec
    [junit]
    [junit] Testsuite: org.apache.lucene.util.automaton.TestDeterminizeLexicon
    [junit] Tests run: 1, Failures: 0, Errors: 0, Time elapsed: 15.168 sec
    [junit]
    [junit] Testsuite: org.apache.lucene.util.automaton.TestLevenshteinAutomata
    [junit] Tests run: 3, Failures: 0, Errors: 0, Time elapsed: 0.718 sec
    [junit]
    [junit] Testsuite: org.apache.lucene.util.automaton.TestUTF32ToUTF8
    [junit] Tests run: 5, Failures: 0, Errors: 0, Time elapsed: 5.139 sec
    [junit]
    [junit] Testsuite: org.apache.lucene.util.packed.TestPackedInts
    [junit] Tests run: 7, Failures: 0, Errors: 0, Time elapsed: 3.548 sec
    [junit]

junit-parallel:

common.test:

test-core:

build-contrib:
     [echo] Building ant...

compile-analyzers-common:

BUILD FAILED
<http://hudson.zones.apache.org/hudson/job/Lucene-trunk/ws/lucene/build.xml>:546: The following error occurred while executing this line:
<http://hudson.zones.apache.org/hudson/job/Lucene-trunk/ws/lucene/build.xml>:535: The following error occurred while executing this line:
<http://hudson.zones.apache.org/hudson/job/Lucene-trunk/ws/lucene/contrib/ant/build.xml>:49: <http://hudson.zones.apache.org/hudson/job/Lucene-trunk/ws/modules/analysis/common> not found.

Total time: 14 minutes 2 seconds
[TASKS] Skipping publisher since build result is FAILURE
Publishing Javadoc
Archiving artifacts
Recording test results
Publishing Clover coverage report...
No Clover report will be published due to a Build Failure


---------------------------------------------------------------------
To unsubscribe, e-mail: [hidden email]
For additional commands, e-mail: [hidden email]

Reply | Threaded
Open this post in threaded view
|

Build failed in Hudson: Lucene-trunk #1247

Apache Hudson Server
See <http://hudson.zones.apache.org/hudson/job/Lucene-trunk/1247/changes>

Changes:

[rmuir] warn if you fix a random seed (so we dont leave the test de-randomized)

------------------------------------------
[...truncated 2710 lines...]
    [junit] Testsuite: org.apache.lucene.search.TestPrefixRandom
    [junit] Tests run: 1, Failures: 0, Errors: 0, Time elapsed: 30.371 sec
    [junit]
    [junit] Testsuite: org.apache.lucene.search.TestQueryTermVector
    [junit] Tests run: 1, Failures: 0, Errors: 0, Time elapsed: 0.012 sec
    [junit]
    [junit] Testsuite: org.apache.lucene.search.TestQueryWrapperFilter
    [junit] Tests run: 1, Failures: 0, Errors: 0, Time elapsed: 0.013 sec
    [junit]
    [junit] Testsuite: org.apache.lucene.search.TestRegexpQuery
    [junit] Tests run: 7, Failures: 0, Errors: 0, Time elapsed: 0.034 sec
    [junit]
    [junit] Testsuite: org.apache.lucene.search.TestRegexpRandom
    [junit] Tests run: 1, Failures: 0, Errors: 0, Time elapsed: 399.913 sec
    [junit]
    [junit] Testsuite: org.apache.lucene.search.TestRegexpRandom2
    [junit] Tests run: 1, Failures: 0, Errors: 0, Time elapsed: 35.973 sec
    [junit]
    [junit] Testsuite: org.apache.lucene.search.TestScoreCachingWrappingScorer
    [junit] Tests run: 1, Failures: 0, Errors: 0, Time elapsed: 0.005 sec
    [junit]
    [junit] Testsuite: org.apache.lucene.search.TestScorerPerf
    [junit] Tests run: 1, Failures: 0, Errors: 0, Time elapsed: 1.53 sec
    [junit]
    [junit] Testsuite: org.apache.lucene.search.TestSetNorm
    [junit] Tests run: 1, Failures: 0, Errors: 0, Time elapsed: 0.006 sec
    [junit]
    [junit] Testsuite: org.apache.lucene.search.TestSimilarity
    [junit] Tests run: 1, Failures: 0, Errors: 0, Time elapsed: 0.007 sec
    [junit]
    [junit] Testsuite: org.apache.lucene.search.TestSimpleExplanations
    [junit] Tests run: 53, Failures: 0, Errors: 0, Time elapsed: 2.49 sec
    [junit]
    [junit] Testsuite: org.apache.lucene.search.TestSimpleExplanationsOfNonMatches
    [junit] Tests run: 53, Failures: 0, Errors: 0, Time elapsed: 0.148 sec
    [junit]
    [junit] Testsuite: org.apache.lucene.search.TestSloppyPhraseQuery
    [junit] Tests run: 5, Failures: 0, Errors: 0, Time elapsed: 0.347 sec
    [junit]
    [junit] Testsuite: org.apache.lucene.search.TestSort
    [junit] Tests run: 24, Failures: 0, Errors: 0, Time elapsed: 6.237 sec
    [junit]
    [junit] Testsuite: org.apache.lucene.search.TestSpanQueryFilter
    [junit] Tests run: 1, Failures: 0, Errors: 0, Time elapsed: 0.038 sec
    [junit]
    [junit] Testsuite: org.apache.lucene.search.TestTermRangeFilter
    [junit] Tests run: 7, Failures: 0, Errors: 0, Time elapsed: 14.982 sec
    [junit]
    [junit] Testsuite: org.apache.lucene.search.TestTermRangeQuery
    [junit] Tests run: 11, Failures: 0, Errors: 0, Time elapsed: 0.039 sec
    [junit]
    [junit] Testsuite: org.apache.lucene.search.TestTermScorer
    [junit] Tests run: 3, Failures: 0, Errors: 0, Time elapsed: 0.012 sec
    [junit]
    [junit] Testsuite: org.apache.lucene.search.TestTermVectors
    [junit] Tests run: 8, Failures: 0, Errors: 0, Time elapsed: 0.51 sec
    [junit]
    [junit] Testsuite: org.apache.lucene.search.TestThreadSafe
    [junit] Tests run: 1, Failures: 0, Errors: 0, Time elapsed: 8.107 sec
    [junit]
    [junit] Testsuite: org.apache.lucene.search.TestTimeLimitingCollector
    [junit] Tests run: 6, Failures: 0, Errors: 0, Time elapsed: 1.453 sec
    [junit]
    [junit] Testsuite: org.apache.lucene.search.TestTopDocsCollector
    [junit] Tests run: 8, Failures: 0, Errors: 0, Time elapsed: 0.032 sec
    [junit]
    [junit] Testsuite: org.apache.lucene.search.TestTopScoreDocCollector
    [junit] Tests run: 1, Failures: 0, Errors: 0, Time elapsed: 0.005 sec
    [junit]
    [junit] Testsuite: org.apache.lucene.search.TestWildcard
    [junit] Tests run: 7, Failures: 0, Errors: 0, Time elapsed: 0.059 sec
    [junit]
    [junit] Testsuite: org.apache.lucene.search.TestWildcardRandom
    [junit] Tests run: 1, Failures: 0, Errors: 0, Time elapsed: 17.445 sec
    [junit]
    [junit] Testsuite: org.apache.lucene.search.function.TestCustomScoreQuery
    [junit] Tests run: 6, Failures: 0, Errors: 0, Time elapsed: 8.162 sec
    [junit]
    [junit] Testsuite: org.apache.lucene.search.function.TestDocValues
    [junit] Tests run: 3, Failures: 0, Errors: 0, Time elapsed: 0.009 sec
    [junit]
    [junit] Testsuite: org.apache.lucene.search.function.TestFieldScoreQuery
    [junit] Tests run: 12, Failures: 0, Errors: 0, Time elapsed: 0.259 sec
    [junit]
    [junit] Testsuite: org.apache.lucene.search.function.TestOrdValues
    [junit] Tests run: 6, Failures: 0, Errors: 0, Time elapsed: 0.208 sec
    [junit]
    [junit] Testsuite: org.apache.lucene.search.function.TestValueSource
    [junit] Tests run: 1, Failures: 0, Errors: 0, Time elapsed: 0.067 sec
    [junit]
    [junit] Testsuite: org.apache.lucene.search.payloads.TestPayloadNearQuery
    [junit] Tests run: 4, Failures: 0, Errors: 0, Time elapsed: 0.554 sec
    [junit]
    [junit] Testsuite: org.apache.lucene.search.payloads.TestPayloadTermQuery
    [junit] Tests run: 6, Failures: 0, Errors: 0, Time elapsed: 0.824 sec
    [junit]
    [junit] Testsuite: org.apache.lucene.search.spans.TestBasics
    [junit] Tests run: 20, Failures: 0, Errors: 0, Time elapsed: 9.74 sec
    [junit]
    [junit] Testsuite: org.apache.lucene.search.spans.TestFieldMaskingSpanQuery
    [junit] Tests run: 11, Failures: 0, Errors: 0, Time elapsed: 0.581 sec
    [junit]
    [junit] Testsuite: org.apache.lucene.search.spans.TestNearSpansOrdered
    [junit] Tests run: 10, Failures: 0, Errors: 0, Time elapsed: 0.051 sec
    [junit]
    [junit] Testsuite: org.apache.lucene.search.spans.TestPayloadSpans
    [junit] Tests run: 10, Failures: 0, Errors: 0, Time elapsed: 1.007 sec
    [junit]
    [junit] Testsuite: org.apache.lucene.search.spans.TestSpanExplanations
    [junit] Tests run: 31, Failures: 0, Errors: 0, Time elapsed: 1.964 sec
    [junit]
    [junit] Testsuite: org.apache.lucene.search.spans.TestSpanExplanationsOfNonMatches
    [junit] Tests run: 31, Failures: 0, Errors: 0, Time elapsed: 0.143 sec
    [junit]
    [junit] Testsuite: org.apache.lucene.search.spans.TestSpans
    [junit] Tests run: 25, Failures: 0, Errors: 0, Time elapsed: 0.738 sec
    [junit]
    [junit] Testsuite: org.apache.lucene.search.spans.TestSpansAdvanced
    [junit] Tests run: 1, Failures: 0, Errors: 0, Time elapsed: 0.06 sec
    [junit]
    [junit] Testsuite: org.apache.lucene.search.spans.TestSpansAdvanced2
    [junit] Tests run: 4, Failures: 0, Errors: 0, Time elapsed: 0.129 sec
    [junit]
    [junit] Testsuite: org.apache.lucene.store.TestBufferedIndexInput
    [junit] Tests run: 4, Failures: 0, Errors: 0, Time elapsed: 3.947 sec
    [junit]
    [junit] Testsuite: org.apache.lucene.store.TestDirectory
    [junit] Tests run: 7, Failures: 0, Errors: 0, Time elapsed: 0.022 sec
    [junit]
    [junit] Testsuite: org.apache.lucene.store.TestFileSwitchDirectory
    [junit] Tests run: 1, Failures: 0, Errors: 0, Time elapsed: 0.012 sec
    [junit]
    [junit] Testsuite: org.apache.lucene.store.TestHugeRamFile
    [junit] Tests run: 1, Failures: 0, Errors: 0, Time elapsed: 4.033 sec
    [junit]
    [junit] Testsuite: org.apache.lucene.store.TestLock
    [junit] Tests run: 1, Failures: 0, Errors: 0, Time elapsed: 0.015 sec
    [junit]
    [junit] Testsuite: org.apache.lucene.store.TestLockFactory
    [junit] Tests run: 11, Failures: 0, Errors: 0, Time elapsed: 3.058 sec
    [junit]
    [junit] Testsuite: org.apache.lucene.store.TestRAMDirectory
    [junit] Tests run: 4, Failures: 0, Errors: 0, Time elapsed: 0.107 sec
    [junit]
    [junit] Testsuite: org.apache.lucene.store.TestWindowsMMap
    [junit] Tests run: 1, Failures: 0, Errors: 0, Time elapsed: 0.073 sec
    [junit]
    [junit] Testsuite: org.apache.lucene.util.TestArrayUtil
    [junit] Tests run: 5, Failures: 0, Errors: 0, Time elapsed: 0.034 sec
    [junit]
    [junit] Testsuite: org.apache.lucene.util.TestAttributeSource
    [junit] Tests run: 5, Failures: 0, Errors: 0, Time elapsed: 0.019 sec
    [junit]
    [junit] Testsuite: org.apache.lucene.util.TestBitVector
    [junit] Tests run: 7, Failures: 0, Errors: 0, Time elapsed: 1.803 sec
    [junit]
    [junit] Testsuite: org.apache.lucene.util.TestCharacterUtils
    [junit] Tests run: 7, Failures: 0, Errors: 0, Time elapsed: 0.009 sec
    [junit]
    [junit] Testsuite: org.apache.lucene.util.TestCloseableThreadLocal
    [junit] Tests run: 3, Failures: 0, Errors: 0, Time elapsed: 0.007 sec
    [junit]
    [junit] Testsuite: org.apache.lucene.util.TestDoubleBarrelLRUCache
    [junit] Tests run: 2, Failures: 0, Errors: 0, Time elapsed: 1.02 sec
    [junit]
    [junit] Testsuite: org.apache.lucene.util.TestFieldCacheSanityChecker
    [junit] Tests run: 4, Failures: 0, Errors: 0, Time elapsed: 0.264 sec
    [junit]
    [junit] Testsuite: org.apache.lucene.util.TestIndexableBinaryStringTools
    [junit] Tests run: 10, Failures: 0, Errors: 0, Time elapsed: 15.104 sec
    [junit]
    [junit] Testsuite: org.apache.lucene.util.TestNumericUtils
    [junit] Tests run: 10, Failures: 0, Errors: 0, Time elapsed: 54.339 sec
    [junit]
    [junit] Testsuite: org.apache.lucene.util.TestOpenBitSet
    [junit] Tests run: 5, Failures: 0, Errors: 0, Time elapsed: 6.382 sec
    [junit]
    [junit] Testsuite: org.apache.lucene.util.TestPriorityQueue
    [junit] Tests run: 4, Failures: 0, Errors: 0, Time elapsed: 0.052 sec
    [junit]
    [junit] Testsuite: org.apache.lucene.util.TestRamUsageEstimator
    [junit] Tests run: 1, Failures: 0, Errors: 0, Time elapsed: 0.005 sec
    [junit]
    [junit] Testsuite: org.apache.lucene.util.TestSetOnce
    [junit] Tests run: 4, Failures: 0, Errors: 0, Time elapsed: 0.017 sec
    [junit]
    [junit] Testsuite: org.apache.lucene.util.TestSmallFloat
    [junit] Tests run: 2, Failures: 0, Errors: 0, Time elapsed: 0.165 sec
    [junit]
    [junit] Testsuite: org.apache.lucene.util.TestSortedVIntList
    [junit] Tests run: 19, Failures: 0, Errors: 0, Time elapsed: 0.027 sec
    [junit]
    [junit] Testsuite: org.apache.lucene.util.TestStringHelper
    [junit] Tests run: 1, Failures: 0, Errors: 0, Time elapsed: 0.003 sec
    [junit]
    [junit] Testsuite: org.apache.lucene.util.TestStringIntern
    [junit] Tests run: 1, Failures: 0, Errors: 0, Time elapsed: 26.472 sec
    [junit]
    [junit] Testsuite: org.apache.lucene.util.TestUnicodeUtil
    [junit] Tests run: 4, Failures: 0, Errors: 0, Time elapsed: 0.577 sec
    [junit]
    [junit] Testsuite: org.apache.lucene.util.TestVersion
    [junit] Tests run: 1, Failures: 0, Errors: 0, Time elapsed: 0.004 sec
    [junit]
    [junit] Testsuite: org.apache.lucene.util.TestVirtualMethod
    [junit] Tests run: 2, Failures: 0, Errors: 0, Time elapsed: 0.007 sec
    [junit]
    [junit] Testsuite: org.apache.lucene.util.automaton.TestBasicOperations
    [junit] Tests run: 6, Failures: 0, Errors: 0, Time elapsed: 0.308 sec
    [junit]
    [junit] Testsuite: org.apache.lucene.util.automaton.TestDeterminism
    [junit] Tests run: 1, Failures: 0, Errors: 0, Time elapsed: 0.688 sec
    [junit]
    [junit] Testsuite: org.apache.lucene.util.automaton.TestDeterminizeLexicon
    [junit] Tests run: 1, Failures: 0, Errors: 0, Time elapsed: 16.851 sec
    [junit]
    [junit] Testsuite: org.apache.lucene.util.automaton.TestLevenshteinAutomata
    [junit] Tests run: 3, Failures: 0, Errors: 0, Time elapsed: 0.837 sec
    [junit]
    [junit] Testsuite: org.apache.lucene.util.automaton.TestUTF32ToUTF8
    [junit] Tests run: 5, Failures: 0, Errors: 0, Time elapsed: 6.212 sec
    [junit]
    [junit] Testsuite: org.apache.lucene.util.packed.TestPackedInts
    [junit] Tests run: 7, Failures: 0, Errors: 0, Time elapsed: 5.38 sec
    [junit]

junit-parallel:

common.test:

test-core:

build-contrib:
     [echo] Building ant...

compile-analyzers-common:

BUILD FAILED
<http://hudson.zones.apache.org/hudson/job/Lucene-trunk/ws/lucene/build.xml>:546: The following error occurred while executing this line:
<http://hudson.zones.apache.org/hudson/job/Lucene-trunk/ws/lucene/build.xml>:535: The following error occurred while executing this line:
<http://hudson.zones.apache.org/hudson/job/Lucene-trunk/ws/lucene/contrib/ant/build.xml>:49: <http://hudson.zones.apache.org/hudson/job/Lucene-trunk/ws/modules/analysis/common> not found.

Total time: 21 minutes 23 seconds
[TASKS] Skipping publisher since build result is FAILURE
Publishing Javadoc
Archiving artifacts
Recording test results
Publishing Clover coverage report...
No Clover report will be published due to a Build Failure


---------------------------------------------------------------------
To unsubscribe, e-mail: [hidden email]
For additional commands, e-mail: [hidden email]

Reply | Threaded
Open this post in threaded view
|

Build failed in Hudson: Lucene-trunk #1248

Apache Hudson Server
See <http://hudson.zones.apache.org/hudson/job/Lucene-trunk/1248/>

------------------------------------------
[...truncated 2711 lines...]
    [junit] Testsuite: org.apache.lucene.search.TestPrefixRandom
    [junit] Tests run: 1, Failures: 0, Errors: 0, Time elapsed: 13.268 sec
    [junit]
    [junit] Testsuite: org.apache.lucene.search.TestQueryTermVector
    [junit] Tests run: 1, Failures: 0, Errors: 0, Time elapsed: 0.005 sec
    [junit]
    [junit] Testsuite: org.apache.lucene.search.TestQueryWrapperFilter
    [junit] Tests run: 1, Failures: 0, Errors: 0, Time elapsed: 0.009 sec
    [junit]
    [junit] Testsuite: org.apache.lucene.search.TestRegexpQuery
    [junit] Tests run: 7, Failures: 0, Errors: 0, Time elapsed: 0.026 sec
    [junit]
    [junit] Testsuite: org.apache.lucene.search.TestRegexpRandom
    [junit] Tests run: 1, Failures: 0, Errors: 0, Time elapsed: 14.643 sec
    [junit]
    [junit] Testsuite: org.apache.lucene.search.TestRegexpRandom2
    [junit] Tests run: 1, Failures: 0, Errors: 0, Time elapsed: 183.828 sec
    [junit]
    [junit] Testsuite: org.apache.lucene.search.TestScoreCachingWrappingScorer
    [junit] Tests run: 1, Failures: 0, Errors: 0, Time elapsed: 0.004 sec
    [junit]
    [junit] Testsuite: org.apache.lucene.search.TestScorerPerf
    [junit] Tests run: 1, Failures: 0, Errors: 0, Time elapsed: 1.589 sec
    [junit]
    [junit] Testsuite: org.apache.lucene.search.TestSetNorm
    [junit] Tests run: 1, Failures: 0, Errors: 0, Time elapsed: 0.006 sec
    [junit]
    [junit] Testsuite: org.apache.lucene.search.TestSimilarity
    [junit] Tests run: 1, Failures: 0, Errors: 0, Time elapsed: 0.009 sec
    [junit]
    [junit] Testsuite: org.apache.lucene.search.TestSimpleExplanations
    [junit] Tests run: 53, Failures: 0, Errors: 0, Time elapsed: 2.541 sec
    [junit]
    [junit] Testsuite: org.apache.lucene.search.TestSimpleExplanationsOfNonMatches
    [junit] Tests run: 53, Failures: 0, Errors: 0, Time elapsed: 0.131 sec
    [junit]
    [junit] Testsuite: org.apache.lucene.search.TestSloppyPhraseQuery
    [junit] Tests run: 5, Failures: 0, Errors: 0, Time elapsed: 0.325 sec
    [junit]
    [junit] Testsuite: org.apache.lucene.search.TestSort
    [junit] Tests run: 24, Failures: 0, Errors: 0, Time elapsed: 6.092 sec
    [junit]
    [junit] Testsuite: org.apache.lucene.search.TestSpanQueryFilter
    [junit] Tests run: 1, Failures: 0, Errors: 0, Time elapsed: 0.012 sec
    [junit]
    [junit] Testsuite: org.apache.lucene.search.TestTermRangeFilter
    [junit] Tests run: 7, Failures: 0, Errors: 0, Time elapsed: 11.848 sec
    [junit]
    [junit] Testsuite: org.apache.lucene.search.TestTermRangeQuery
    [junit] Tests run: 11, Failures: 0, Errors: 0, Time elapsed: 0.044 sec
    [junit]
    [junit] Testsuite: org.apache.lucene.search.TestTermScorer
    [junit] Tests run: 3, Failures: 0, Errors: 0, Time elapsed: 0.026 sec
    [junit]
    [junit] Testsuite: org.apache.lucene.search.TestTermVectors
    [junit] Tests run: 8, Failures: 0, Errors: 0, Time elapsed: 0.469 sec
    [junit]
    [junit] Testsuite: org.apache.lucene.search.TestThreadSafe
    [junit] Tests run: 1, Failures: 0, Errors: 0, Time elapsed: 5.634 sec
    [junit]
    [junit] Testsuite: org.apache.lucene.search.TestTimeLimitingCollector
    [junit] Tests run: 6, Failures: 0, Errors: 0, Time elapsed: 1.173 sec
    [junit]
    [junit] Testsuite: org.apache.lucene.search.TestTopDocsCollector
    [junit] Tests run: 8, Failures: 0, Errors: 0, Time elapsed: 0.013 sec
    [junit]
    [junit] Testsuite: org.apache.lucene.search.TestTopScoreDocCollector
    [junit] Tests run: 1, Failures: 0, Errors: 0, Time elapsed: 0.005 sec
    [junit]
    [junit] Testsuite: org.apache.lucene.search.TestWildcard
    [junit] Tests run: 7, Failures: 0, Errors: 0, Time elapsed: 0.036 sec
    [junit]
    [junit] Testsuite: org.apache.lucene.search.TestWildcardRandom
    [junit] Tests run: 1, Failures: 0, Errors: 0, Time elapsed: 46.144 sec
    [junit]
    [junit] Testsuite: org.apache.lucene.search.function.TestCustomScoreQuery
    [junit] Tests run: 6, Failures: 0, Errors: 0, Time elapsed: 7.39 sec
    [junit]
    [junit] Testsuite: org.apache.lucene.search.function.TestDocValues
    [junit] Tests run: 3, Failures: 0, Errors: 0, Time elapsed: 0.006 sec
    [junit]
    [junit] Testsuite: org.apache.lucene.search.function.TestFieldScoreQuery
    [junit] Tests run: 12, Failures: 0, Errors: 0, Time elapsed: 0.223 sec
    [junit]
    [junit] Testsuite: org.apache.lucene.search.function.TestOrdValues
    [junit] Tests run: 6, Failures: 0, Errors: 0, Time elapsed: 0.096 sec
    [junit]
    [junit] Testsuite: org.apache.lucene.search.function.TestValueSource
    [junit] Tests run: 1, Failures: 0, Errors: 0, Time elapsed: 0.025 sec
    [junit]
    [junit] Testsuite: org.apache.lucene.search.payloads.TestPayloadNearQuery
    [junit] Tests run: 4, Failures: 0, Errors: 0, Time elapsed: 0.43 sec
    [junit]
    [junit] Testsuite: org.apache.lucene.search.payloads.TestPayloadTermQuery
    [junit] Tests run: 6, Failures: 0, Errors: 0, Time elapsed: 0.729 sec
    [junit]
    [junit] Testsuite: org.apache.lucene.search.spans.TestBasics
    [junit] Tests run: 20, Failures: 0, Errors: 0, Time elapsed: 7.494 sec
    [junit]
    [junit] Testsuite: org.apache.lucene.search.spans.TestFieldMaskingSpanQuery
    [junit] Tests run: 11, Failures: 0, Errors: 0, Time elapsed: 0.545 sec
    [junit]
    [junit] Testsuite: org.apache.lucene.search.spans.TestNearSpansOrdered
    [junit] Tests run: 10, Failures: 0, Errors: 0, Time elapsed: 0.045 sec
    [junit]
    [junit] Testsuite: org.apache.lucene.search.spans.TestPayloadSpans
    [junit] Tests run: 10, Failures: 0, Errors: 0, Time elapsed: 1.047 sec
    [junit]
    [junit] Testsuite: org.apache.lucene.search.spans.TestSpanExplanations
    [junit] Tests run: 31, Failures: 0, Errors: 0, Time elapsed: 1.178 sec
    [junit]
    [junit] Testsuite: org.apache.lucene.search.spans.TestSpanExplanationsOfNonMatches
    [junit] Tests run: 31, Failures: 0, Errors: 0, Time elapsed: 0.068 sec
    [junit]
    [junit] Testsuite: org.apache.lucene.search.spans.TestSpans
    [junit] Tests run: 25, Failures: 0, Errors: 0, Time elapsed: 0.44 sec
    [junit]
    [junit] Testsuite: org.apache.lucene.search.spans.TestSpansAdvanced
    [junit] Tests run: 1, Failures: 0, Errors: 0, Time elapsed: 0.08 sec
    [junit]
    [junit] Testsuite: org.apache.lucene.search.spans.TestSpansAdvanced2
    [junit] Tests run: 4, Failures: 0, Errors: 0, Time elapsed: 0.157 sec
    [junit]
    [junit] Testsuite: org.apache.lucene.store.TestBufferedIndexInput
    [junit] Tests run: 4, Failures: 0, Errors: 0, Time elapsed: 3.238 sec
    [junit]
    [junit] Testsuite: org.apache.lucene.store.TestDirectory
    [junit] Tests run: 7, Failures: 0, Errors: 0, Time elapsed: 0.017 sec
    [junit]
    [junit] Testsuite: org.apache.lucene.store.TestFileSwitchDirectory
    [junit] Tests run: 1, Failures: 0, Errors: 0, Time elapsed: 0.011 sec
    [junit]
    [junit] Testsuite: org.apache.lucene.store.TestHugeRamFile
    [junit] Tests run: 1, Failures: 0, Errors: 0, Time elapsed: 3.876 sec
    [junit]
    [junit] Testsuite: org.apache.lucene.store.TestLock
    [junit] Tests run: 1, Failures: 0, Errors: 0, Time elapsed: 0.015 sec
    [junit]
    [junit] Testsuite: org.apache.lucene.store.TestLockFactory
    [junit] Tests run: 11, Failures: 0, Errors: 0, Time elapsed: 3.075 sec
    [junit]
    [junit] Testsuite: org.apache.lucene.store.TestRAMDirectory
    [junit] Tests run: 4, Failures: 0, Errors: 0, Time elapsed: 0.104 sec
    [junit]
    [junit] Testsuite: org.apache.lucene.store.TestWindowsMMap
    [junit] Tests run: 1, Failures: 0, Errors: 0, Time elapsed: 0.072 sec
    [junit]
    [junit] Testsuite: org.apache.lucene.util.TestArrayUtil
    [junit] Tests run: 5, Failures: 0, Errors: 0, Time elapsed: 0.034 sec
    [junit]
    [junit] Testsuite: org.apache.lucene.util.TestAttributeSource
    [junit] Tests run: 5, Failures: 0, Errors: 0, Time elapsed: 0.008 sec
    [junit]
    [junit] Testsuite: org.apache.lucene.util.TestBitVector
    [junit] Tests run: 7, Failures: 0, Errors: 0, Time elapsed: 1.65 sec
    [junit]
    [junit] Testsuite: org.apache.lucene.util.TestCharacterUtils
    [junit] Tests run: 7, Failures: 0, Errors: 0, Time elapsed: 0.007 sec
    [junit]
    [junit] Testsuite: org.apache.lucene.util.TestCloseableThreadLocal
    [junit] Tests run: 3, Failures: 0, Errors: 0, Time elapsed: 0.005 sec
    [junit]
    [junit] Testsuite: org.apache.lucene.util.TestDoubleBarrelLRUCache
    [junit] Tests run: 2, Failures: 0, Errors: 0, Time elapsed: 1.012 sec
    [junit]
    [junit] Testsuite: org.apache.lucene.util.TestFieldCacheSanityChecker
    [junit] Tests run: 4, Failures: 0, Errors: 0, Time elapsed: 0.241 sec
    [junit]
    [junit] Testsuite: org.apache.lucene.util.TestIndexableBinaryStringTools
    [junit] Tests run: 10, Failures: 0, Errors: 0, Time elapsed: 9.934 sec
    [junit]
    [junit] Testsuite: org.apache.lucene.util.TestNumericUtils
    [junit] Tests run: 10, Failures: 0, Errors: 0, Time elapsed: 46.23 sec
    [junit]
    [junit] Testsuite: org.apache.lucene.util.TestOpenBitSet
    [junit] Tests run: 5, Failures: 0, Errors: 0, Time elapsed: 5.374 sec
    [junit]
    [junit] Testsuite: org.apache.lucene.util.TestPriorityQueue
    [junit] Tests run: 4, Failures: 0, Errors: 0, Time elapsed: 0.047 sec
    [junit]
    [junit] Testsuite: org.apache.lucene.util.TestRamUsageEstimator
    [junit] Tests run: 1, Failures: 0, Errors: 0, Time elapsed: 0.004 sec
    [junit]
    [junit] Testsuite: org.apache.lucene.util.TestSetOnce
    [junit] Tests run: 4, Failures: 0, Errors: 0, Time elapsed: 0.018 sec
    [junit]
    [junit] Testsuite: org.apache.lucene.util.TestSmallFloat
    [junit] Tests run: 2, Failures: 0, Errors: 0, Time elapsed: 0.149 sec
    [junit]
    [junit] Testsuite: org.apache.lucene.util.TestSortedVIntList
    [junit] Tests run: 19, Failures: 0, Errors: 0, Time elapsed: 0.018 sec
    [junit]
    [junit] Testsuite: org.apache.lucene.util.TestStringHelper
    [junit] Tests run: 1, Failures: 0, Errors: 0, Time elapsed: 0.003 sec
    [junit]
    [junit] Testsuite: org.apache.lucene.util.TestStringIntern
    [junit] Tests run: 1, Failures: 0, Errors: 0, Time elapsed: 18.848 sec
    [junit]
    [junit] Testsuite: org.apache.lucene.util.TestUnicodeUtil
    [junit] Tests run: 4, Failures: 0, Errors: 0, Time elapsed: 0.589 sec
    [junit]
    [junit] Testsuite: org.apache.lucene.util.TestVersion
    [junit] Tests run: 1, Failures: 0, Errors: 0, Time elapsed: 0.003 sec
    [junit]
    [junit] Testsuite: org.apache.lucene.util.TestVirtualMethod
    [junit] Tests run: 2, Failures: 0, Errors: 0, Time elapsed: 0.006 sec
    [junit]
    [junit] Testsuite: org.apache.lucene.util.automaton.TestBasicOperations
    [junit] Tests run: 6, Failures: 0, Errors: 0, Time elapsed: 0.265 sec
    [junit]
    [junit] Testsuite: org.apache.lucene.util.automaton.TestDeterminism
    [junit] Tests run: 1, Failures: 0, Errors: 0, Time elapsed: 0.503 sec
    [junit]
    [junit] Testsuite: org.apache.lucene.util.automaton.TestDeterminizeLexicon
    [junit] Tests run: 1, Failures: 0, Errors: 0, Time elapsed: 14.842 sec
    [junit]
    [junit] Testsuite: org.apache.lucene.util.automaton.TestLevenshteinAutomata
    [junit] Tests run: 3, Failures: 0, Errors: 0, Time elapsed: 0.7 sec
    [junit]
    [junit] Testsuite: org.apache.lucene.util.automaton.TestUTF32ToUTF8
    [junit] Tests run: 5, Failures: 0, Errors: 0, Time elapsed: 4.672 sec
    [junit]
    [junit] Testsuite: org.apache.lucene.util.packed.TestPackedInts
    [junit] Tests run: 7, Failures: 0, Errors: 0, Time elapsed: 3.824 sec
    [junit]

junit-parallel:

common.test:

test-core:

build-contrib:
     [echo] Building ant...

compile-analyzers-common:

BUILD FAILED
<http://hudson.zones.apache.org/hudson/job/Lucene-trunk/ws/lucene/build.xml>:546: The following error occurred while executing this line:
<http://hudson.zones.apache.org/hudson/job/Lucene-trunk/ws/lucene/build.xml>:535: The following error occurred while executing this line:
<http://hudson.zones.apache.org/hudson/job/Lucene-trunk/ws/lucene/contrib/ant/build.xml>:49: <http://hudson.zones.apache.org/hudson/job/Lucene-trunk/ws/modules/analysis/common> not found.

Total time: 14 minutes 6 seconds
[TASKS] Skipping publisher since build result is FAILURE
Publishing Javadoc
Archiving artifacts
Recording test results
Publishing Clover coverage report...
No Clover report will be published due to a Build Failure


---------------------------------------------------------------------
To unsubscribe, e-mail: [hidden email]
For additional commands, e-mail: [hidden email]

Reply | Threaded
Open this post in threaded view
|

RE: Build failed in Hudson: Lucene-trunk #1248

Uwe Schindler
The config was corrupt (missing modules checkout). Fixed and restarted.

-----
Uwe Schindler
H.-H.-Meier-Allee 63, D-28213 Bremen
http://www.thetaphi.de
eMail: [hidden email]

> -----Original Message-----
> From: Apache Hudson Server [mailto:[hidden email]]
> Sent: Monday, July 26, 2010 4:19 AM
> To: [hidden email]
> Subject: Build failed in Hudson: Lucene-trunk #1248
>
> See <http://hudson.zones.apache.org/hudson/job/Lucene-trunk/1248/>
>
> ------------------------------------------
> [...truncated 2711 lines...]
>     [junit] Testsuite: org.apache.lucene.search.TestPrefixRandom
>     [junit] Tests run: 1, Failures: 0, Errors: 0, Time elapsed: 13.268 sec
>     [junit]
>     [junit] Testsuite: org.apache.lucene.search.TestQueryTermVector
>     [junit] Tests run: 1, Failures: 0, Errors: 0, Time elapsed: 0.005 sec
>     [junit]
>     [junit] Testsuite: org.apache.lucene.search.TestQueryWrapperFilter
>     [junit] Tests run: 1, Failures: 0, Errors: 0, Time elapsed: 0.009 sec
>     [junit]
>     [junit] Testsuite: org.apache.lucene.search.TestRegexpQuery
>     [junit] Tests run: 7, Failures: 0, Errors: 0, Time elapsed: 0.026 sec
>     [junit]
>     [junit] Testsuite: org.apache.lucene.search.TestRegexpRandom
>     [junit] Tests run: 1, Failures: 0, Errors: 0, Time elapsed: 14.643 sec
>     [junit]
>     [junit] Testsuite: org.apache.lucene.search.TestRegexpRandom2
>     [junit] Tests run: 1, Failures: 0, Errors: 0, Time elapsed: 183.828 sec
>     [junit]
>     [junit] Testsuite:
> org.apache.lucene.search.TestScoreCachingWrappingScorer
>     [junit] Tests run: 1, Failures: 0, Errors: 0, Time elapsed: 0.004 sec
>     [junit]
>     [junit] Testsuite: org.apache.lucene.search.TestScorerPerf
>     [junit] Tests run: 1, Failures: 0, Errors: 0, Time elapsed: 1.589 sec
>     [junit]
>     [junit] Testsuite: org.apache.lucene.search.TestSetNorm
>     [junit] Tests run: 1, Failures: 0, Errors: 0, Time elapsed: 0.006 sec
>     [junit]
>     [junit] Testsuite: org.apache.lucene.search.TestSimilarity
>     [junit] Tests run: 1, Failures: 0, Errors: 0, Time elapsed: 0.009 sec
>     [junit]
>     [junit] Testsuite: org.apache.lucene.search.TestSimpleExplanations
>     [junit] Tests run: 53, Failures: 0, Errors: 0, Time elapsed: 2.541 sec
>     [junit]
>     [junit] Testsuite:
> org.apache.lucene.search.TestSimpleExplanationsOfNonMatches
>     [junit] Tests run: 53, Failures: 0, Errors: 0, Time elapsed: 0.131 sec
>     [junit]
>     [junit] Testsuite: org.apache.lucene.search.TestSloppyPhraseQuery
>     [junit] Tests run: 5, Failures: 0, Errors: 0, Time elapsed: 0.325 sec
>     [junit]
>     [junit] Testsuite: org.apache.lucene.search.TestSort
>     [junit] Tests run: 24, Failures: 0, Errors: 0, Time elapsed: 6.092 sec
>     [junit]
>     [junit] Testsuite: org.apache.lucene.search.TestSpanQueryFilter
>     [junit] Tests run: 1, Failures: 0, Errors: 0, Time elapsed: 0.012 sec
>     [junit]
>     [junit] Testsuite: org.apache.lucene.search.TestTermRangeFilter
>     [junit] Tests run: 7, Failures: 0, Errors: 0, Time elapsed: 11.848 sec
>     [junit]
>     [junit] Testsuite: org.apache.lucene.search.TestTermRangeQuery
>     [junit] Tests run: 11, Failures: 0, Errors: 0, Time elapsed: 0.044 sec
>     [junit]
>     [junit] Testsuite: org.apache.lucene.search.TestTermScorer
>     [junit] Tests run: 3, Failures: 0, Errors: 0, Time elapsed: 0.026 sec
>     [junit]
>     [junit] Testsuite: org.apache.lucene.search.TestTermVectors
>     [junit] Tests run: 8, Failures: 0, Errors: 0, Time elapsed: 0.469 sec
>     [junit]
>     [junit] Testsuite: org.apache.lucene.search.TestThreadSafe
>     [junit] Tests run: 1, Failures: 0, Errors: 0, Time elapsed: 5.634 sec
>     [junit]
>     [junit] Testsuite: org.apache.lucene.search.TestTimeLimitingCollector
>     [junit] Tests run: 6, Failures: 0, Errors: 0, Time elapsed: 1.173 sec
>     [junit]
>     [junit] Testsuite: org.apache.lucene.search.TestTopDocsCollector
>     [junit] Tests run: 8, Failures: 0, Errors: 0, Time elapsed: 0.013 sec
>     [junit]
>     [junit] Testsuite: org.apache.lucene.search.TestTopScoreDocCollector
>     [junit] Tests run: 1, Failures: 0, Errors: 0, Time elapsed: 0.005 sec
>     [junit]
>     [junit] Testsuite: org.apache.lucene.search.TestWildcard
>     [junit] Tests run: 7, Failures: 0, Errors: 0, Time elapsed: 0.036 sec
>     [junit]
>     [junit] Testsuite: org.apache.lucene.search.TestWildcardRandom
>     [junit] Tests run: 1, Failures: 0, Errors: 0, Time elapsed: 46.144 sec
>     [junit]
>     [junit] Testsuite:
> org.apache.lucene.search.function.TestCustomScoreQuery
>     [junit] Tests run: 6, Failures: 0, Errors: 0, Time elapsed: 7.39 sec
>     [junit]
>     [junit] Testsuite: org.apache.lucene.search.function.TestDocValues
>     [junit] Tests run: 3, Failures: 0, Errors: 0, Time elapsed: 0.006 sec
>     [junit]
>     [junit] Testsuite: org.apache.lucene.search.function.TestFieldScoreQuery
>     [junit] Tests run: 12, Failures: 0, Errors: 0, Time elapsed: 0.223 sec
>     [junit]
>     [junit] Testsuite: org.apache.lucene.search.function.TestOrdValues
>     [junit] Tests run: 6, Failures: 0, Errors: 0, Time elapsed: 0.096 sec
>     [junit]
>     [junit] Testsuite: org.apache.lucene.search.function.TestValueSource
>     [junit] Tests run: 1, Failures: 0, Errors: 0, Time elapsed: 0.025 sec
>     [junit]
>     [junit] Testsuite:
> org.apache.lucene.search.payloads.TestPayloadNearQuery
>     [junit] Tests run: 4, Failures: 0, Errors: 0, Time elapsed: 0.43 sec
>     [junit]
>     [junit] Testsuite:
> org.apache.lucene.search.payloads.TestPayloadTermQuery
>     [junit] Tests run: 6, Failures: 0, Errors: 0, Time elapsed: 0.729 sec
>     [junit]
>     [junit] Testsuite: org.apache.lucene.search.spans.TestBasics
>     [junit] Tests run: 20, Failures: 0, Errors: 0, Time elapsed: 7.494 sec
>     [junit]
>     [junit] Testsuite:
> org.apache.lucene.search.spans.TestFieldMaskingSpanQuery
>     [junit] Tests run: 11, Failures: 0, Errors: 0, Time elapsed: 0.545 sec
>     [junit]
>     [junit] Testsuite: org.apache.lucene.search.spans.TestNearSpansOrdered
>     [junit] Tests run: 10, Failures: 0, Errors: 0, Time elapsed: 0.045 sec
>     [junit]
>     [junit] Testsuite: org.apache.lucene.search.spans.TestPayloadSpans
>     [junit] Tests run: 10, Failures: 0, Errors: 0, Time elapsed: 1.047 sec
>     [junit]
>     [junit] Testsuite: org.apache.lucene.search.spans.TestSpanExplanations
>     [junit] Tests run: 31, Failures: 0, Errors: 0, Time elapsed: 1.178 sec
>     [junit]
>     [junit] Testsuite:
> org.apache.lucene.search.spans.TestSpanExplanationsOfNonMatches
>     [junit] Tests run: 31, Failures: 0, Errors: 0, Time elapsed: 0.068 sec
>     [junit]
>     [junit] Testsuite: org.apache.lucene.search.spans.TestSpans
>     [junit] Tests run: 25, Failures: 0, Errors: 0, Time elapsed: 0.44 sec
>     [junit]
>     [junit] Testsuite: org.apache.lucene.search.spans.TestSpansAdvanced
>     [junit] Tests run: 1, Failures: 0, Errors: 0, Time elapsed: 0.08 sec
>     [junit]
>     [junit] Testsuite: org.apache.lucene.search.spans.TestSpansAdvanced2
>     [junit] Tests run: 4, Failures: 0, Errors: 0, Time elapsed: 0.157 sec
>     [junit]
>     [junit] Testsuite: org.apache.lucene.store.TestBufferedIndexInput
>     [junit] Tests run: 4, Failures: 0, Errors: 0, Time elapsed: 3.238 sec
>     [junit]
>     [junit] Testsuite: org.apache.lucene.store.TestDirectory
>     [junit] Tests run: 7, Failures: 0, Errors: 0, Time elapsed: 0.017 sec
>     [junit]
>     [junit] Testsuite: org.apache.lucene.store.TestFileSwitchDirectory
>     [junit] Tests run: 1, Failures: 0, Errors: 0, Time elapsed: 0.011 sec
>     [junit]
>     [junit] Testsuite: org.apache.lucene.store.TestHugeRamFile
>     [junit] Tests run: 1, Failures: 0, Errors: 0, Time elapsed: 3.876 sec
>     [junit]
>     [junit] Testsuite: org.apache.lucene.store.TestLock
>     [junit] Tests run: 1, Failures: 0, Errors: 0, Time elapsed: 0.015 sec
>     [junit]
>     [junit] Testsuite: org.apache.lucene.store.TestLockFactory
>     [junit] Tests run: 11, Failures: 0, Errors: 0, Time elapsed: 3.075 sec
>     [junit]
>     [junit] Testsuite: org.apache.lucene.store.TestRAMDirectory
>     [junit] Tests run: 4, Failures: 0, Errors: 0, Time elapsed: 0.104 sec
>     [junit]
>     [junit] Testsuite: org.apache.lucene.store.TestWindowsMMap
>     [junit] Tests run: 1, Failures: 0, Errors: 0, Time elapsed: 0.072 sec
>     [junit]
>     [junit] Testsuite: org.apache.lucene.util.TestArrayUtil
>     [junit] Tests run: 5, Failures: 0, Errors: 0, Time elapsed: 0.034 sec
>     [junit]
>     [junit] Testsuite: org.apache.lucene.util.TestAttributeSource
>     [junit] Tests run: 5, Failures: 0, Errors: 0, Time elapsed: 0.008 sec
>     [junit]
>     [junit] Testsuite: org.apache.lucene.util.TestBitVector
>     [junit] Tests run: 7, Failures: 0, Errors: 0, Time elapsed: 1.65 sec
>     [junit]
>     [junit] Testsuite: org.apache.lucene.util.TestCharacterUtils
>     [junit] Tests run: 7, Failures: 0, Errors: 0, Time elapsed: 0.007 sec
>     [junit]
>     [junit] Testsuite: org.apache.lucene.util.TestCloseableThreadLocal
>     [junit] Tests run: 3, Failures: 0, Errors: 0, Time elapsed: 0.005 sec
>     [junit]
>     [junit] Testsuite: org.apache.lucene.util.TestDoubleBarrelLRUCache
>     [junit] Tests run: 2, Failures: 0, Errors: 0, Time elapsed: 1.012 sec
>     [junit]
>     [junit] Testsuite: org.apache.lucene.util.TestFieldCacheSanityChecker
>     [junit] Tests run: 4, Failures: 0, Errors: 0, Time elapsed: 0.241 sec
>     [junit]
>     [junit] Testsuite: org.apache.lucene.util.TestIndexableBinaryStringTools
>     [junit] Tests run: 10, Failures: 0, Errors: 0, Time elapsed: 9.934 sec
>     [junit]
>     [junit] Testsuite: org.apache.lucene.util.TestNumericUtils
>     [junit] Tests run: 10, Failures: 0, Errors: 0, Time elapsed: 46.23 sec
>     [junit]
>     [junit] Testsuite: org.apache.lucene.util.TestOpenBitSet
>     [junit] Tests run: 5, Failures: 0, Errors: 0, Time elapsed: 5.374 sec
>     [junit]
>     [junit] Testsuite: org.apache.lucene.util.TestPriorityQueue
>     [junit] Tests run: 4, Failures: 0, Errors: 0, Time elapsed: 0.047 sec
>     [junit]
>     [junit] Testsuite: org.apache.lucene.util.TestRamUsageEstimator
>     [junit] Tests run: 1, Failures: 0, Errors: 0, Time elapsed: 0.004 sec
>     [junit]
>     [junit] Testsuite: org.apache.lucene.util.TestSetOnce
>     [junit] Tests run: 4, Failures: 0, Errors: 0, Time elapsed: 0.018 sec
>     [junit]
>     [junit] Testsuite: org.apache.lucene.util.TestSmallFloat
>     [junit] Tests run: 2, Failures: 0, Errors: 0, Time elapsed: 0.149 sec
>     [junit]
>     [junit] Testsuite: org.apache.lucene.util.TestSortedVIntList
>     [junit] Tests run: 19, Failures: 0, Errors: 0, Time elapsed: 0.018 sec
>     [junit]
>     [junit] Testsuite: org.apache.lucene.util.TestStringHelper
>     [junit] Tests run: 1, Failures: 0, Errors: 0, Time elapsed: 0.003 sec
>     [junit]
>     [junit] Testsuite: org.apache.lucene.util.TestStringIntern
>     [junit] Tests run: 1, Failures: 0, Errors: 0, Time elapsed: 18.848 sec
>     [junit]
>     [junit] Testsuite: org.apache.lucene.util.TestUnicodeUtil
>     [junit] Tests run: 4, Failures: 0, Errors: 0, Time elapsed: 0.589 sec
>     [junit]
>     [junit] Testsuite: org.apache.lucene.util.TestVersion
>     [junit] Tests run: 1, Failures: 0, Errors: 0, Time elapsed: 0.003 sec
>     [junit]
>     [junit] Testsuite: org.apache.lucene.util.TestVirtualMethod
>     [junit] Tests run: 2, Failures: 0, Errors: 0, Time elapsed: 0.006 sec
>     [junit]
>     [junit] Testsuite: org.apache.lucene.util.automaton.TestBasicOperations
>     [junit] Tests run: 6, Failures: 0, Errors: 0, Time elapsed: 0.265 sec
>     [junit]
>     [junit] Testsuite: org.apache.lucene.util.automaton.TestDeterminism
>     [junit] Tests run: 1, Failures: 0, Errors: 0, Time elapsed: 0.503 sec
>     [junit]
>     [junit] Testsuite:
> org.apache.lucene.util.automaton.TestDeterminizeLexicon
>     [junit] Tests run: 1, Failures: 0, Errors: 0, Time elapsed: 14.842 sec
>     [junit]
>     [junit] Testsuite:
> org.apache.lucene.util.automaton.TestLevenshteinAutomata
>     [junit] Tests run: 3, Failures: 0, Errors: 0, Time elapsed: 0.7 sec
>     [junit]
>     [junit] Testsuite: org.apache.lucene.util.automaton.TestUTF32ToUTF8
>     [junit] Tests run: 5, Failures: 0, Errors: 0, Time elapsed: 4.672 sec
>     [junit]
>     [junit] Testsuite: org.apache.lucene.util.packed.TestPackedInts
>     [junit] Tests run: 7, Failures: 0, Errors: 0, Time elapsed: 3.824 sec
>     [junit]
>
> junit-parallel:
>
> common.test:
>
> test-core:
>
> build-contrib:
>      [echo] Building ant...
>
> compile-analyzers-common:
>
> BUILD FAILED
> <http://hudson.zones.apache.org/hudson/job/Lucene-
> trunk/ws/lucene/build.xml>:546: The following error occurred while
> executing this line:
> <http://hudson.zones.apache.org/hudson/job/Lucene-
> trunk/ws/lucene/build.xml>:535: The following error occurred while
> executing this line:
> <http://hudson.zones.apache.org/hudson/job/Lucene-
> trunk/ws/lucene/contrib/ant/build.xml>:49:
> <http://hudson.zones.apache.org/hudson/job/Lucene-
> trunk/ws/modules/analysis/common> not found.
>
> Total time: 14 minutes 6 seconds
> [TASKS] Skipping publisher since build result is FAILURE Publishing Javadoc
> Archiving artifacts Recording test results Publishing Clover coverage report...
> No Clover report will be published due to a Build Failure
>
>
> ---------------------------------------------------------------------
> To unsubscribe, e-mail: [hidden email] For additional
> commands, e-mail: [hidden email]



---------------------------------------------------------------------
To unsubscribe, e-mail: [hidden email]
For additional commands, e-mail: [hidden email]

Reply | Threaded
Open this post in threaded view
|

Hudson build is back to normal : Lucene-trunk #1249

Apache Hudson Server
In reply to this post by Apache Hudson Server
See <http://hudson.zones.apache.org/hudson/job/Lucene-trunk/1249/>



---------------------------------------------------------------------
To unsubscribe, e-mail: [hidden email]
For additional commands, e-mail: [hidden email]