Build failed in Hudson: Nutch-Nightly #221

classic Classic list List threaded Threaded
2 messages Options
Reply | Threaded
Open this post in threaded view
|

Build failed in Hudson: Nutch-Nightly #221

hudson-6
See http://lucene.zones.apache.org:8080/hudson/job/Nutch-Nightly/221/changes

------------------------------------------
[...truncated 4592 lines...]

deploy:
    [mkdir] Created dir: http://lucene.zones.apache.org:8080/hudson/job/Nutch-Nightly/ws/trunk/build/plugins/urlfilter-regex 
     [copy] Copying 1 file to http://lucene.zones.apache.org:8080/hudson/job/Nutch-Nightly/ws/trunk/build/plugins/urlfilter-regex 
Overriding previous definition of reference to plugin.deps

copy-generated-lib:
     [copy] Copying 1 file to http://lucene.zones.apache.org:8080/hudson/job/Nutch-Nightly/ws/trunk/build/plugins/urlfilter-regex 

init:
    [mkdir] Created dir: http://lucene.zones.apache.org:8080/hudson/job/Nutch-Nightly/ws/trunk/build/urlfilter-suffix 
    [mkdir] Created dir: http://lucene.zones.apache.org:8080/hudson/job/Nutch-Nightly/ws/trunk/build/urlfilter-suffix/classes 
    [mkdir] Created dir: http://lucene.zones.apache.org:8080/hudson/job/Nutch-Nightly/ws/trunk/build/urlfilter-suffix/test 

init-plugin:

deps-jar:

compile:
     [echo] Compiling plugin: urlfilter-suffix
    [javac] Compiling 1 source file to http://lucene.zones.apache.org:8080/hudson/job/Nutch-Nightly/ws/trunk/build/urlfilter-suffix/classes 
    [javac] Note: http://lucene.zones.apache.org:8080/hudson/job/Nutch-Nightly/ws/trunk/src/plugin/urlfilter-suffix/src/java/org/apache/nutch/urlfilter/suffix/SuffixURLFilter.java  uses unchecked or unsafe operations.
    [javac] Note: Recompile with -Xlint:unchecked for details.

jar:
      [jar] Building jar: http://lucene.zones.apache.org:8080/hudson/job/Nutch-Nightly/ws/trunk/build/urlfilter-suffix/urlfilter-suffix.jar 

deps-test:

deploy:
    [mkdir] Created dir: http://lucene.zones.apache.org:8080/hudson/job/Nutch-Nightly/ws/trunk/build/plugins/urlfilter-suffix 
     [copy] Copying 1 file to http://lucene.zones.apache.org:8080/hudson/job/Nutch-Nightly/ws/trunk/build/plugins/urlfilter-suffix 

copy-generated-lib:
     [copy] Copying 1 file to http://lucene.zones.apache.org:8080/hudson/job/Nutch-Nightly/ws/trunk/build/plugins/urlfilter-suffix 

init:
    [mkdir] Created dir: http://lucene.zones.apache.org:8080/hudson/job/Nutch-Nightly/ws/trunk/build/urlfilter-validator 
    [mkdir] Created dir: http://lucene.zones.apache.org:8080/hudson/job/Nutch-Nightly/ws/trunk/build/urlfilter-validator/classes 
    [mkdir] Created dir: http://lucene.zones.apache.org:8080/hudson/job/Nutch-Nightly/ws/trunk/build/urlfilter-validator/test 

init-plugin:

deps-jar:

compile:
     [echo] Compiling plugin: urlfilter-validator
    [javac] Compiling 1 source file to http://lucene.zones.apache.org:8080/hudson/job/Nutch-Nightly/ws/trunk/build/urlfilter-validator/classes 

jar:
      [jar] Building jar: http://lucene.zones.apache.org:8080/hudson/job/Nutch-Nightly/ws/trunk/build/urlfilter-validator/urlfilter-validator.jar 

deps-test:

deploy:
    [mkdir] Created dir: http://lucene.zones.apache.org:8080/hudson/job/Nutch-Nightly/ws/trunk/build/plugins/urlfilter-validator 
     [copy] Copying 1 file to http://lucene.zones.apache.org:8080/hudson/job/Nutch-Nightly/ws/trunk/build/plugins/urlfilter-validator 

copy-generated-lib:
     [copy] Copying 1 file to http://lucene.zones.apache.org:8080/hudson/job/Nutch-Nightly/ws/trunk/build/plugins/urlfilter-validator 

init:
    [mkdir] Created dir: http://lucene.zones.apache.org:8080/hudson/job/Nutch-Nightly/ws/trunk/build/urlnormalizer-basic 
    [mkdir] Created dir: http://lucene.zones.apache.org:8080/hudson/job/Nutch-Nightly/ws/trunk/build/urlnormalizer-basic/classes 
    [mkdir] Created dir: http://lucene.zones.apache.org:8080/hudson/job/Nutch-Nightly/ws/trunk/build/urlnormalizer-basic/test 

init-plugin:

deps-jar:

compile:
     [echo] Compiling plugin: urlnormalizer-basic
    [javac] Compiling 1 source file to http://lucene.zones.apache.org:8080/hudson/job/Nutch-Nightly/ws/trunk/build/urlnormalizer-basic/classes 

jar:
      [jar] Building jar: http://lucene.zones.apache.org:8080/hudson/job/Nutch-Nightly/ws/trunk/build/urlnormalizer-basic/urlnormalizer-basic.jar 

deps-test:

deploy:
    [mkdir] Created dir: http://lucene.zones.apache.org:8080/hudson/job/Nutch-Nightly/ws/trunk/build/plugins/urlnormalizer-basic 
     [copy] Copying 1 file to http://lucene.zones.apache.org:8080/hudson/job/Nutch-Nightly/ws/trunk/build/plugins/urlnormalizer-basic 

copy-generated-lib:
     [copy] Copying 1 file to http://lucene.zones.apache.org:8080/hudson/job/Nutch-Nightly/ws/trunk/build/plugins/urlnormalizer-basic 

init:
    [mkdir] Created dir: http://lucene.zones.apache.org:8080/hudson/job/Nutch-Nightly/ws/trunk/build/urlnormalizer-pass 
    [mkdir] Created dir: http://lucene.zones.apache.org:8080/hudson/job/Nutch-Nightly/ws/trunk/build/urlnormalizer-pass/classes 
    [mkdir] Created dir: http://lucene.zones.apache.org:8080/hudson/job/Nutch-Nightly/ws/trunk/build/urlnormalizer-pass/test 

init-plugin:

deps-jar:

compile:
     [echo] Compiling plugin: urlnormalizer-pass
    [javac] Compiling 1 source file to http://lucene.zones.apache.org:8080/hudson/job/Nutch-Nightly/ws/trunk/build/urlnormalizer-pass/classes 

jar:
      [jar] Building jar: http://lucene.zones.apache.org:8080/hudson/job/Nutch-Nightly/ws/trunk/build/urlnormalizer-pass/urlnormalizer-pass.jar 

deps-test:

deploy:
    [mkdir] Created dir: http://lucene.zones.apache.org:8080/hudson/job/Nutch-Nightly/ws/trunk/build/plugins/urlnormalizer-pass 
     [copy] Copying 1 file to http://lucene.zones.apache.org:8080/hudson/job/Nutch-Nightly/ws/trunk/build/plugins/urlnormalizer-pass 

copy-generated-lib:
     [copy] Copying 1 file to http://lucene.zones.apache.org:8080/hudson/job/Nutch-Nightly/ws/trunk/build/plugins/urlnormalizer-pass 
    [mkdir] Created dir: http://lucene.zones.apache.org:8080/hudson/job/Nutch-Nightly/ws/trunk/build/urlnormalizer-regex/test/data 
     [copy] Copying 4 files to http://lucene.zones.apache.org:8080/hudson/job/Nutch-Nightly/ws/trunk/build/urlnormalizer-regex/test/data 

init:
    [mkdir] Created dir: http://lucene.zones.apache.org:8080/hudson/job/Nutch-Nightly/ws/trunk/build/urlnormalizer-regex/classes 

init-plugin:

deps-jar:

compile:
     [echo] Compiling plugin: urlnormalizer-regex
    [javac] Compiling 1 source file to http://lucene.zones.apache.org:8080/hudson/job/Nutch-Nightly/ws/trunk/build/urlnormalizer-regex/classes 
    [javac] Note: http://lucene.zones.apache.org:8080/hudson/job/Nutch-Nightly/ws/trunk/src/plugin/urlnormalizer-regex/src/java/org/apache/nutch/net/urlnormalizer/regex/RegexURLNormalizer.java  uses unchecked or unsafe operations.
    [javac] Note: Recompile with -Xlint:unchecked for details.

jar:
      [jar] Building jar: http://lucene.zones.apache.org:8080/hudson/job/Nutch-Nightly/ws/trunk/build/urlnormalizer-regex/urlnormalizer-regex.jar 

deps-test:

init:

init-plugin:

compile:

jar:

deps-test:

deploy:

copy-generated-lib:

deploy:
    [mkdir] Created dir: http://lucene.zones.apache.org:8080/hudson/job/Nutch-Nightly/ws/trunk/build/plugins/urlnormalizer-regex 
     [copy] Copying 1 file to http://lucene.zones.apache.org:8080/hudson/job/Nutch-Nightly/ws/trunk/build/plugins/urlnormalizer-regex 

copy-generated-lib:
     [copy] Copying 1 file to http://lucene.zones.apache.org:8080/hudson/job/Nutch-Nightly/ws/trunk/build/plugins/urlnormalizer-regex 

compile:

compile-core-test:
    [javac] Compiling 46 source files to http://lucene.zones.apache.org:8080/hudson/job/Nutch-Nightly/ws/trunk/build/test/classes 
    [javac] Note: Some input files use unchecked or unsafe operations.
    [javac] Note: Recompile with -Xlint:unchecked for details.

test-core:
    [mkdir] Created dir: http://lucene.zones.apache.org:8080/hudson/job/Nutch-Nightly/ws/trunk/build/test/data 
     [copy] Copying 90 files to http://lucene.zones.apache.org:8080/hudson/job/Nutch-Nightly/ws/trunk/build/test/data 
     [copy] Copying 1 file to http://lucene.zones.apache.org:8080/hudson/job/Nutch-Nightly/ws/trunk/build/test/classes 
     [copy] Copying 1 file to http://lucene.zones.apache.org:8080/hudson/job/Nutch-Nightly/ws/trunk/build/test/classes 
    [junit] Running org.apache.nutch.analysis.TestAnalyzerFactory
    [junit] Tests run: 4, Failures: 0, Errors: 0, Time elapsed: 1.638 sec
    [junit] Running org.apache.nutch.analysis.TestQueryParser
    [junit] Tests run: 1, Failures: 0, Errors: 0, Time elapsed: 0.757 sec
    [junit] Running org.apache.nutch.clustering.TestOnlineClustererFactory
    [junit] Tests run: 1, Failures: 0, Errors: 0, Time elapsed: 1.218 sec
    [junit] Running org.apache.nutch.crawl.TestCrawlDbMerger
    [junit] Tests run: 1, Failures: 0, Errors: 0, Time elapsed: 3.952 sec
    [junit] Running org.apache.nutch.crawl.TestGenerator
    [junit] Tests run: 4, Failures: 0, Errors: 0, Time elapsed: 28.546 sec
    [junit] Running org.apache.nutch.crawl.TestInjector
    [junit] Tests run: 1, Failures: 0, Errors: 0, Time elapsed: 5.588 sec
    [junit] Running org.apache.nutch.crawl.TestLinkDbMerger
    [junit] Tests run: 1, Failures: 0, Errors: 0, Time elapsed: 2.532 sec
    [junit] Running org.apache.nutch.crawl.TestMapWritable
    [junit] Tests run: 5, Failures: 0, Errors: 0, Time elapsed: 61.411 sec
    [junit] Running org.apache.nutch.crawl.TestSignatureFactory
    [junit] Tests run: 1, Failures: 0, Errors: 0, Time elapsed: 0.554 sec
    [junit] Running org.apache.nutch.fetcher.TestFetcher
    [junit] Tests run: 1, Failures: 0, Errors: 0, Time elapsed: 9.654 sec
    [junit] Running org.apache.nutch.indexer.TestDeleteDuplicates
    [junit] Tests run: 4, Failures: 0, Errors: 0, Time elapsed: 20.968 sec
    [junit] Running org.apache.nutch.indexer.TestIndexingFilters
    [junit] Tests run: 1, Failures: 0, Errors: 0, Time elapsed: 2.33 sec
    [junit] Running org.apache.nutch.metadata.TestMetadata
    [junit] Tests run: 10, Failures: 0, Errors: 0, Time elapsed: 0.364 sec
    [junit] Running org.apache.nutch.metadata.TestSpellCheckedMetadata
    [junit] Tests run: 11, Failures: 0, Errors: 0, Time elapsed: 13.652 sec
    [junit] Running org.apache.nutch.net.TestURLFilters
    [junit] Tests run: 1, Failures: 0, Errors: 0, Time elapsed: 1.91 sec
    [junit] Running org.apache.nutch.net.TestURLNormalizers
    [junit] Tests run: 1, Failures: 0, Errors: 0, Time elapsed: 0.909 sec
    [junit] Running org.apache.nutch.ontology.TestOntologyFactory
    [junit] Tests run: 1, Failures: 0, Errors: 0, Time elapsed: 2.262 sec
    [junit] Running org.apache.nutch.parse.TestOutlinkExtractor
    [junit] Tests run: 4, Failures: 0, Errors: 0, Time elapsed: 0.972 sec
    [junit] Running org.apache.nutch.parse.TestParseData
    [junit] Tests run: 2, Failures: 0, Errors: 0, Time elapsed: 1.393 sec
    [junit] Running org.apache.nutch.parse.TestParseText
    [junit] Tests run: 1, Failures: 0, Errors: 0, Time elapsed: 0.348 sec
    [junit] Running org.apache.nutch.parse.TestParserFactory
    [junit] Tests run: 2, Failures: 0, Errors: 0, Time elapsed: 1.376 sec
    [junit] Running org.apache.nutch.plugin.TestPluginSystem
    [junit] Tests run: 6, Failures: 0, Errors: 0, Time elapsed: 2.486 sec
    [junit] Running org.apache.nutch.protocol.TestContent
    [junit] Tests run: 2, Failures: 0, Errors: 0, Time elapsed: 0.602 sec
    [junit] Running org.apache.nutch.protocol.TestProtocolFactory
    [junit] Tests run: 2, Failures: 0, Errors: 0, Time elapsed: 1.241 sec
    [junit] Running org.apache.nutch.searcher.TestHitDetails
    [junit] Tests run: 1, Failures: 0, Errors: 0, Time elapsed: 0.297 sec
    [junit] Running org.apache.nutch.searcher.TestOpenSearchServlet
    [junit] Tests run: 1, Failures: 0, Errors: 0, Time elapsed: 0.328 sec
    [junit] Running org.apache.nutch.searcher.TestQuery
    [junit] Tests run: 6, Failures: 0, Errors: 0, Time elapsed: 1.758 sec
    [junit] Running org.apache.nutch.searcher.TestSummarizerFactory
    [junit] Tests run: 1, Failures: 0, Errors: 0, Time elapsed: 1.13 sec
    [junit] Running org.apache.nutch.searcher.TestSummary
    [junit] Tests run: 8, Failures: 0, Errors: 0, Time elapsed: 0.446 sec
    [junit] Running org.apache.nutch.util.TestEncodingDetector
    [junit] Tests run: 1, Failures: 1, Errors: 0, Time elapsed: 0.667 sec
    [junit] Test org.apache.nutch.util.TestEncodingDetector FAILED
    [junit] Running org.apache.nutch.util.TestFibonacciHeap
    [junit] Tests run: 1, Failures: 0, Errors: 0, Time elapsed: 1.115 sec
    [junit] Running org.apache.nutch.util.TestGZIPUtils
    [junit] Tests run: 4, Failures: 0, Errors: 0, Time elapsed: 1.293 sec
    [junit] Running org.apache.nutch.util.TestNodeWalker
    [junit] Tests run: 1, Failures: 0, Errors: 0, Time elapsed: 1.84 sec
    [junit] Running org.apache.nutch.util.TestPrefixStringMatcher
    [junit] Tests run: 1, Failures: 0, Errors: 0, Time elapsed: 0.364 sec
    [junit] Running org.apache.nutch.util.TestStringUtil
    [junit] Tests run: 2, Failures: 0, Errors: 0, Time elapsed: 0.231 sec
    [junit] Running org.apache.nutch.util.TestSuffixStringMatcher
    [junit] Tests run: 1, Failures: 0, Errors: 0, Time elapsed: 0.357 sec
    [junit] Running org.apache.nutch.util.TestURLUtil
    [junit] Tests run: 3, Failures: 0, Errors: 0, Time elapsed: 1.39 sec
    [junit] Running org.apache.nutch.util.mime.TestMimeType
    [junit] Tests run: 17, Failures: 0, Errors: 0, Time elapsed: 0.246 sec
    [junit] Running org.apache.nutch.util.mime.TestMimeTypes
    [junit] Tests run: 5, Failures: 0, Errors: 0, Time elapsed: 1.695 sec

BUILD FAILED
http://lucene.zones.apache.org:8080/hudson/job/Nutch-Nightly/ws/trunk/build.xml :297: Tests failed!

Total time: 4 minutes 12 seconds
Publishing Javadoc
Recording test results

Reply | Threaded
Open this post in threaded view
|

Re: Build failed in Hudson: Nutch-Nightly #221

Doğacan Güney-3
On 9/29/07, [hidden email]
<[hidden email]> wrote:

> See http://lucene.zones.apache.org:8080/hudson/job/Nutch-Nightly/221/changes
>
> ------------------------------------------
> [...truncated 4592 lines...]
>
> deploy:
>     [mkdir] Created dir: http://lucene.zones.apache.org:8080/hudson/job/Nutch-Nightly/ws/trunk/build/plugins/urlfilter-regex
>      [copy] Copying 1 file to http://lucene.zones.apache.org:8080/hudson/job/Nutch-Nightly/ws/trunk/build/plugins/urlfilter-regex
> Overriding previous definition of reference to plugin.deps
>
> copy-generated-lib:
>      [copy] Copying 1 file to http://lucene.zones.apache.org:8080/hudson/job/Nutch-Nightly/ws/trunk/build/plugins/urlfilter-regex
>
> init:
>     [mkdir] Created dir: http://lucene.zones.apache.org:8080/hudson/job/Nutch-Nightly/ws/trunk/build/urlfilter-suffix
>     [mkdir] Created dir: http://lucene.zones.apache.org:8080/hudson/job/Nutch-Nightly/ws/trunk/build/urlfilter-suffix/classes
>     [mkdir] Created dir: http://lucene.zones.apache.org:8080/hudson/job/Nutch-Nightly/ws/trunk/build/urlfilter-suffix/test
>
> init-plugin:
>
> deps-jar:
>
> compile:
>      [echo] Compiling plugin: urlfilter-suffix
>     [javac] Compiling 1 source file to http://lucene.zones.apache.org:8080/hudson/job/Nutch-Nightly/ws/trunk/build/urlfilter-suffix/classes
>     [javac] Note: http://lucene.zones.apache.org:8080/hudson/job/Nutch-Nightly/ws/trunk/src/plugin/urlfilter-suffix/src/java/org/apache/nutch/urlfilter/suffix/SuffixURLFilter.java  uses unchecked or unsafe operations.
>     [javac] Note: Recompile with -Xlint:unchecked for details.
>
> jar:
>       [jar] Building jar: http://lucene.zones.apache.org:8080/hudson/job/Nutch-Nightly/ws/trunk/build/urlfilter-suffix/urlfilter-suffix.jar
>
> deps-test:
>
> deploy:
>     [mkdir] Created dir: http://lucene.zones.apache.org:8080/hudson/job/Nutch-Nightly/ws/trunk/build/plugins/urlfilter-suffix
>      [copy] Copying 1 file to http://lucene.zones.apache.org:8080/hudson/job/Nutch-Nightly/ws/trunk/build/plugins/urlfilter-suffix
>
> copy-generated-lib:
>      [copy] Copying 1 file to http://lucene.zones.apache.org:8080/hudson/job/Nutch-Nightly/ws/trunk/build/plugins/urlfilter-suffix
>
> init:
>     [mkdir] Created dir: http://lucene.zones.apache.org:8080/hudson/job/Nutch-Nightly/ws/trunk/build/urlfilter-validator
>     [mkdir] Created dir: http://lucene.zones.apache.org:8080/hudson/job/Nutch-Nightly/ws/trunk/build/urlfilter-validator/classes
>     [mkdir] Created dir: http://lucene.zones.apache.org:8080/hudson/job/Nutch-Nightly/ws/trunk/build/urlfilter-validator/test
>
> init-plugin:
>
> deps-jar:
>
> compile:
>      [echo] Compiling plugin: urlfilter-validator
>     [javac] Compiling 1 source file to http://lucene.zones.apache.org:8080/hudson/job/Nutch-Nightly/ws/trunk/build/urlfilter-validator/classes
>
> jar:
>       [jar] Building jar: http://lucene.zones.apache.org:8080/hudson/job/Nutch-Nightly/ws/trunk/build/urlfilter-validator/urlfilter-validator.jar
>
> deps-test:
>
> deploy:
>     [mkdir] Created dir: http://lucene.zones.apache.org:8080/hudson/job/Nutch-Nightly/ws/trunk/build/plugins/urlfilter-validator
>      [copy] Copying 1 file to http://lucene.zones.apache.org:8080/hudson/job/Nutch-Nightly/ws/trunk/build/plugins/urlfilter-validator
>
> copy-generated-lib:
>      [copy] Copying 1 file to http://lucene.zones.apache.org:8080/hudson/job/Nutch-Nightly/ws/trunk/build/plugins/urlfilter-validator
>
> init:
>     [mkdir] Created dir: http://lucene.zones.apache.org:8080/hudson/job/Nutch-Nightly/ws/trunk/build/urlnormalizer-basic
>     [mkdir] Created dir: http://lucene.zones.apache.org:8080/hudson/job/Nutch-Nightly/ws/trunk/build/urlnormalizer-basic/classes
>     [mkdir] Created dir: http://lucene.zones.apache.org:8080/hudson/job/Nutch-Nightly/ws/trunk/build/urlnormalizer-basic/test
>
> init-plugin:
>
> deps-jar:
>
> compile:
>      [echo] Compiling plugin: urlnormalizer-basic
>     [javac] Compiling 1 source file to http://lucene.zones.apache.org:8080/hudson/job/Nutch-Nightly/ws/trunk/build/urlnormalizer-basic/classes
>
> jar:
>       [jar] Building jar: http://lucene.zones.apache.org:8080/hudson/job/Nutch-Nightly/ws/trunk/build/urlnormalizer-basic/urlnormalizer-basic.jar
>
> deps-test:
>
> deploy:
>     [mkdir] Created dir: http://lucene.zones.apache.org:8080/hudson/job/Nutch-Nightly/ws/trunk/build/plugins/urlnormalizer-basic
>      [copy] Copying 1 file to http://lucene.zones.apache.org:8080/hudson/job/Nutch-Nightly/ws/trunk/build/plugins/urlnormalizer-basic
>
> copy-generated-lib:
>      [copy] Copying 1 file to http://lucene.zones.apache.org:8080/hudson/job/Nutch-Nightly/ws/trunk/build/plugins/urlnormalizer-basic
>
> init:
>     [mkdir] Created dir: http://lucene.zones.apache.org:8080/hudson/job/Nutch-Nightly/ws/trunk/build/urlnormalizer-pass
>     [mkdir] Created dir: http://lucene.zones.apache.org:8080/hudson/job/Nutch-Nightly/ws/trunk/build/urlnormalizer-pass/classes
>     [mkdir] Created dir: http://lucene.zones.apache.org:8080/hudson/job/Nutch-Nightly/ws/trunk/build/urlnormalizer-pass/test
>
> init-plugin:
>
> deps-jar:
>
> compile:
>      [echo] Compiling plugin: urlnormalizer-pass
>     [javac] Compiling 1 source file to http://lucene.zones.apache.org:8080/hudson/job/Nutch-Nightly/ws/trunk/build/urlnormalizer-pass/classes
>
> jar:
>       [jar] Building jar: http://lucene.zones.apache.org:8080/hudson/job/Nutch-Nightly/ws/trunk/build/urlnormalizer-pass/urlnormalizer-pass.jar
>
> deps-test:
>
> deploy:
>     [mkdir] Created dir: http://lucene.zones.apache.org:8080/hudson/job/Nutch-Nightly/ws/trunk/build/plugins/urlnormalizer-pass
>      [copy] Copying 1 file to http://lucene.zones.apache.org:8080/hudson/job/Nutch-Nightly/ws/trunk/build/plugins/urlnormalizer-pass
>
> copy-generated-lib:
>      [copy] Copying 1 file to http://lucene.zones.apache.org:8080/hudson/job/Nutch-Nightly/ws/trunk/build/plugins/urlnormalizer-pass
>     [mkdir] Created dir: http://lucene.zones.apache.org:8080/hudson/job/Nutch-Nightly/ws/trunk/build/urlnormalizer-regex/test/data
>      [copy] Copying 4 files to http://lucene.zones.apache.org:8080/hudson/job/Nutch-Nightly/ws/trunk/build/urlnormalizer-regex/test/data
>
> init:
>     [mkdir] Created dir: http://lucene.zones.apache.org:8080/hudson/job/Nutch-Nightly/ws/trunk/build/urlnormalizer-regex/classes
>
> init-plugin:
>
> deps-jar:
>
> compile:
>      [echo] Compiling plugin: urlnormalizer-regex
>     [javac] Compiling 1 source file to http://lucene.zones.apache.org:8080/hudson/job/Nutch-Nightly/ws/trunk/build/urlnormalizer-regex/classes
>     [javac] Note: http://lucene.zones.apache.org:8080/hudson/job/Nutch-Nightly/ws/trunk/src/plugin/urlnormalizer-regex/src/java/org/apache/nutch/net/urlnormalizer/regex/RegexURLNormalizer.java  uses unchecked or unsafe operations.
>     [javac] Note: Recompile with -Xlint:unchecked for details.
>
> jar:
>       [jar] Building jar: http://lucene.zones.apache.org:8080/hudson/job/Nutch-Nightly/ws/trunk/build/urlnormalizer-regex/urlnormalizer-regex.jar
>
> deps-test:
>
> init:
>
> init-plugin:
>
> compile:
>
> jar:
>
> deps-test:
>
> deploy:
>
> copy-generated-lib:
>
> deploy:
>     [mkdir] Created dir: http://lucene.zones.apache.org:8080/hudson/job/Nutch-Nightly/ws/trunk/build/plugins/urlnormalizer-regex
>      [copy] Copying 1 file to http://lucene.zones.apache.org:8080/hudson/job/Nutch-Nightly/ws/trunk/build/plugins/urlnormalizer-regex
>
> copy-generated-lib:
>      [copy] Copying 1 file to http://lucene.zones.apache.org:8080/hudson/job/Nutch-Nightly/ws/trunk/build/plugins/urlnormalizer-regex
>
> compile:
>
> compile-core-test:
>     [javac] Compiling 46 source files to http://lucene.zones.apache.org:8080/hudson/job/Nutch-Nightly/ws/trunk/build/test/classes
>     [javac] Note: Some input files use unchecked or unsafe operations.
>     [javac] Note: Recompile with -Xlint:unchecked for details.
>
> test-core:
>     [mkdir] Created dir: http://lucene.zones.apache.org:8080/hudson/job/Nutch-Nightly/ws/trunk/build/test/data
>      [copy] Copying 90 files to http://lucene.zones.apache.org:8080/hudson/job/Nutch-Nightly/ws/trunk/build/test/data
>      [copy] Copying 1 file to http://lucene.zones.apache.org:8080/hudson/job/Nutch-Nightly/ws/trunk/build/test/classes
>      [copy] Copying 1 file to http://lucene.zones.apache.org:8080/hudson/job/Nutch-Nightly/ws/trunk/build/test/classes
>     [junit] Running org.apache.nutch.analysis.TestAnalyzerFactory
>     [junit] Tests run: 4, Failures: 0, Errors: 0, Time elapsed: 1.638 sec
>     [junit] Running org.apache.nutch.analysis.TestQueryParser
>     [junit] Tests run: 1, Failures: 0, Errors: 0, Time elapsed: 0.757 sec
>     [junit] Running org.apache.nutch.clustering.TestOnlineClustererFactory
>     [junit] Tests run: 1, Failures: 0, Errors: 0, Time elapsed: 1.218 sec
>     [junit] Running org.apache.nutch.crawl.TestCrawlDbMerger
>     [junit] Tests run: 1, Failures: 0, Errors: 0, Time elapsed: 3.952 sec
>     [junit] Running org.apache.nutch.crawl.TestGenerator
>     [junit] Tests run: 4, Failures: 0, Errors: 0, Time elapsed: 28.546 sec
>     [junit] Running org.apache.nutch.crawl.TestInjector
>     [junit] Tests run: 1, Failures: 0, Errors: 0, Time elapsed: 5.588 sec
>     [junit] Running org.apache.nutch.crawl.TestLinkDbMerger
>     [junit] Tests run: 1, Failures: 0, Errors: 0, Time elapsed: 2.532 sec
>     [junit] Running org.apache.nutch.crawl.TestMapWritable
>     [junit] Tests run: 5, Failures: 0, Errors: 0, Time elapsed: 61.411 sec
>     [junit] Running org.apache.nutch.crawl.TestSignatureFactory
>     [junit] Tests run: 1, Failures: 0, Errors: 0, Time elapsed: 0.554 sec
>     [junit] Running org.apache.nutch.fetcher.TestFetcher
>     [junit] Tests run: 1, Failures: 0, Errors: 0, Time elapsed: 9.654 sec
>     [junit] Running org.apache.nutch.indexer.TestDeleteDuplicates
>     [junit] Tests run: 4, Failures: 0, Errors: 0, Time elapsed: 20.968 sec
>     [junit] Running org.apache.nutch.indexer.TestIndexingFilters
>     [junit] Tests run: 1, Failures: 0, Errors: 0, Time elapsed: 2.33 sec
>     [junit] Running org.apache.nutch.metadata.TestMetadata
>     [junit] Tests run: 10, Failures: 0, Errors: 0, Time elapsed: 0.364 sec
>     [junit] Running org.apache.nutch.metadata.TestSpellCheckedMetadata
>     [junit] Tests run: 11, Failures: 0, Errors: 0, Time elapsed: 13.652 sec
>     [junit] Running org.apache.nutch.net.TestURLFilters
>     [junit] Tests run: 1, Failures: 0, Errors: 0, Time elapsed: 1.91 sec
>     [junit] Running org.apache.nutch.net.TestURLNormalizers
>     [junit] Tests run: 1, Failures: 0, Errors: 0, Time elapsed: 0.909 sec
>     [junit] Running org.apache.nutch.ontology.TestOntologyFactory
>     [junit] Tests run: 1, Failures: 0, Errors: 0, Time elapsed: 2.262 sec
>     [junit] Running org.apache.nutch.parse.TestOutlinkExtractor
>     [junit] Tests run: 4, Failures: 0, Errors: 0, Time elapsed: 0.972 sec
>     [junit] Running org.apache.nutch.parse.TestParseData
>     [junit] Tests run: 2, Failures: 0, Errors: 0, Time elapsed: 1.393 sec
>     [junit] Running org.apache.nutch.parse.TestParseText
>     [junit] Tests run: 1, Failures: 0, Errors: 0, Time elapsed: 0.348 sec
>     [junit] Running org.apache.nutch.parse.TestParserFactory
>     [junit] Tests run: 2, Failures: 0, Errors: 0, Time elapsed: 1.376 sec
>     [junit] Running org.apache.nutch.plugin.TestPluginSystem
>     [junit] Tests run: 6, Failures: 0, Errors: 0, Time elapsed: 2.486 sec
>     [junit] Running org.apache.nutch.protocol.TestContent
>     [junit] Tests run: 2, Failures: 0, Errors: 0, Time elapsed: 0.602 sec
>     [junit] Running org.apache.nutch.protocol.TestProtocolFactory
>     [junit] Tests run: 2, Failures: 0, Errors: 0, Time elapsed: 1.241 sec
>     [junit] Running org.apache.nutch.searcher.TestHitDetails
>     [junit] Tests run: 1, Failures: 0, Errors: 0, Time elapsed: 0.297 sec
>     [junit] Running org.apache.nutch.searcher.TestOpenSearchServlet
>     [junit] Tests run: 1, Failures: 0, Errors: 0, Time elapsed: 0.328 sec
>     [junit] Running org.apache.nutch.searcher.TestQuery
>     [junit] Tests run: 6, Failures: 0, Errors: 0, Time elapsed: 1.758 sec
>     [junit] Running org.apache.nutch.searcher.TestSummarizerFactory
>     [junit] Tests run: 1, Failures: 0, Errors: 0, Time elapsed: 1.13 sec
>     [junit] Running org.apache.nutch.searcher.TestSummary
>     [junit] Tests run: 8, Failures: 0, Errors: 0, Time elapsed: 0.446 sec
>     [junit] Running org.apache.nutch.util.TestEncodingDetector
>     [junit] Tests run: 1, Failures: 1, Errors: 0, Time elapsed: 0.667 sec
>     [junit] Test org.apache.nutch.util.TestEncodingDetector FAILED

Heh, another java5/java6 problem (Charset.isSupported("utf-32") is
false for java 5, true for java 6). I have made another commit,
hopefully everything will be OK this time.

>     [junit] Running org.apache.nutch.util.TestFibonacciHeap
>     [junit] Tests run: 1, Failures: 0, Errors: 0, Time elapsed: 1.115 sec
>     [junit] Running org.apache.nutch.util.TestGZIPUtils
>     [junit] Tests run: 4, Failures: 0, Errors: 0, Time elapsed: 1.293 sec
>     [junit] Running org.apache.nutch.util.TestNodeWalker
>     [junit] Tests run: 1, Failures: 0, Errors: 0, Time elapsed: 1.84 sec
>     [junit] Running org.apache.nutch.util.TestPrefixStringMatcher
>     [junit] Tests run: 1, Failures: 0, Errors: 0, Time elapsed: 0.364 sec
>     [junit] Running org.apache.nutch.util.TestStringUtil
>     [junit] Tests run: 2, Failures: 0, Errors: 0, Time elapsed: 0.231 sec
>     [junit] Running org.apache.nutch.util.TestSuffixStringMatcher
>     [junit] Tests run: 1, Failures: 0, Errors: 0, Time elapsed: 0.357 sec
>     [junit] Running org.apache.nutch.util.TestURLUtil
>     [junit] Tests run: 3, Failures: 0, Errors: 0, Time elapsed: 1.39 sec
>     [junit] Running org.apache.nutch.util.mime.TestMimeType
>     [junit] Tests run: 17, Failures: 0, Errors: 0, Time elapsed: 0.246 sec
>     [junit] Running org.apache.nutch.util.mime.TestMimeTypes
>     [junit] Tests run: 5, Failures: 0, Errors: 0, Time elapsed: 1.695 sec
>
> BUILD FAILED
> http://lucene.zones.apache.org:8080/hudson/job/Nutch-Nightly/ws/trunk/build.xml :297: Tests failed!
>
> Total time: 4 minutes 12 seconds
> Publishing Javadoc
> Recording test results
>
>


--
Doğacan Güney