Build failed in Hudson: Nutch-trunk #362

classic Classic list List threaded Threaded
17 messages Options
Reply | Threaded
Open this post in threaded view
|

Build failed in Hudson: Nutch-trunk #362

Apache Hudson Server
See http://hudson.zones.apache.org/hudson/job/Nutch-trunk/362/changes

Changes:

[kubes] NUTCH-611 - Upgrade Nutch to use Hadoop 0.16.  This upgrade removes the deprecated addDefaultResouce and addFinalResource methods.  Should now use addResource.  Two scripts start-balancer.sh and stop-balancer.sh are added to the bin directory.

[kubes] NUTCH-603 - Add more default url normalizations.

------------------------------------------
[...truncated 4600 lines...]
     [copy] Copying 1 file to http://hudson.zones.apache.org/hudson/job/Nutch-trunk/ws/trunk/build/plugins/urlfilter-regex 

init:
    [mkdir] Created dir: http://hudson.zones.apache.org/hudson/job/Nutch-trunk/ws/trunk/build/urlfilter-suffix 
    [mkdir] Created dir: http://hudson.zones.apache.org/hudson/job/Nutch-trunk/ws/trunk/build/urlfilter-suffix/classes 
    [mkdir] Created dir: http://hudson.zones.apache.org/hudson/job/Nutch-trunk/ws/trunk/build/urlfilter-suffix/test 

init-plugin:

deps-jar:

compile:
     [echo] Compiling plugin: urlfilter-suffix
    [javac] Compiling 1 source file to http://hudson.zones.apache.org/hudson/job/Nutch-trunk/ws/trunk/build/urlfilter-suffix/classes 
    [javac] Note: http://hudson.zones.apache.org/hudson/job/Nutch-trunk/ws/trunk/src/plugin/urlfilter-suffix/src/java/org/apache/nutch/urlfilter/suffix/SuffixURLFilter.java  uses unchecked or unsafe operations.
    [javac] Note: Recompile with -Xlint:unchecked for details.

jar:
      [jar] Building jar: http://hudson.zones.apache.org/hudson/job/Nutch-trunk/ws/trunk/build/urlfilter-suffix/urlfilter-suffix.jar 

deps-test:

deploy:
    [mkdir] Created dir: http://hudson.zones.apache.org/hudson/job/Nutch-trunk/ws/trunk/build/plugins/urlfilter-suffix 
     [copy] Copying 1 file to http://hudson.zones.apache.org/hudson/job/Nutch-trunk/ws/trunk/build/plugins/urlfilter-suffix 

copy-generated-lib:
     [copy] Copying 1 file to http://hudson.zones.apache.org/hudson/job/Nutch-trunk/ws/trunk/build/plugins/urlfilter-suffix 

init:
    [mkdir] Created dir: http://hudson.zones.apache.org/hudson/job/Nutch-trunk/ws/trunk/build/urlfilter-validator 
    [mkdir] Created dir: http://hudson.zones.apache.org/hudson/job/Nutch-trunk/ws/trunk/build/urlfilter-validator/classes 
    [mkdir] Created dir: http://hudson.zones.apache.org/hudson/job/Nutch-trunk/ws/trunk/build/urlfilter-validator/test 

init-plugin:

deps-jar:

compile:
     [echo] Compiling plugin: urlfilter-validator
    [javac] Compiling 1 source file to http://hudson.zones.apache.org/hudson/job/Nutch-trunk/ws/trunk/build/urlfilter-validator/classes 

jar:
      [jar] Building jar: http://hudson.zones.apache.org/hudson/job/Nutch-trunk/ws/trunk/build/urlfilter-validator/urlfilter-validator.jar 

deps-test:

deploy:
    [mkdir] Created dir: http://hudson.zones.apache.org/hudson/job/Nutch-trunk/ws/trunk/build/plugins/urlfilter-validator 
     [copy] Copying 1 file to http://hudson.zones.apache.org/hudson/job/Nutch-trunk/ws/trunk/build/plugins/urlfilter-validator 

copy-generated-lib:
     [copy] Copying 1 file to http://hudson.zones.apache.org/hudson/job/Nutch-trunk/ws/trunk/build/plugins/urlfilter-validator 

init:
    [mkdir] Created dir: http://hudson.zones.apache.org/hudson/job/Nutch-trunk/ws/trunk/build/urlnormalizer-basic 
    [mkdir] Created dir: http://hudson.zones.apache.org/hudson/job/Nutch-trunk/ws/trunk/build/urlnormalizer-basic/classes 
    [mkdir] Created dir: http://hudson.zones.apache.org/hudson/job/Nutch-trunk/ws/trunk/build/urlnormalizer-basic/test 

init-plugin:

deps-jar:

compile:
     [echo] Compiling plugin: urlnormalizer-basic
    [javac] Compiling 1 source file to http://hudson.zones.apache.org/hudson/job/Nutch-trunk/ws/trunk/build/urlnormalizer-basic/classes 

jar:
      [jar] Building jar: http://hudson.zones.apache.org/hudson/job/Nutch-trunk/ws/trunk/build/urlnormalizer-basic/urlnormalizer-basic.jar 

deps-test:

deploy:
    [mkdir] Created dir: http://hudson.zones.apache.org/hudson/job/Nutch-trunk/ws/trunk/build/plugins/urlnormalizer-basic 
     [copy] Copying 1 file to http://hudson.zones.apache.org/hudson/job/Nutch-trunk/ws/trunk/build/plugins/urlnormalizer-basic 

copy-generated-lib:
     [copy] Copying 1 file to http://hudson.zones.apache.org/hudson/job/Nutch-trunk/ws/trunk/build/plugins/urlnormalizer-basic 

init:
    [mkdir] Created dir: http://hudson.zones.apache.org/hudson/job/Nutch-trunk/ws/trunk/build/urlnormalizer-pass 
    [mkdir] Created dir: http://hudson.zones.apache.org/hudson/job/Nutch-trunk/ws/trunk/build/urlnormalizer-pass/classes 
    [mkdir] Created dir: http://hudson.zones.apache.org/hudson/job/Nutch-trunk/ws/trunk/build/urlnormalizer-pass/test 

init-plugin:

deps-jar:

compile:
     [echo] Compiling plugin: urlnormalizer-pass
    [javac] Compiling 1 source file to http://hudson.zones.apache.org/hudson/job/Nutch-trunk/ws/trunk/build/urlnormalizer-pass/classes 

jar:
      [jar] Building jar: http://hudson.zones.apache.org/hudson/job/Nutch-trunk/ws/trunk/build/urlnormalizer-pass/urlnormalizer-pass.jar 

deps-test:

deploy:
    [mkdir] Created dir: http://hudson.zones.apache.org/hudson/job/Nutch-trunk/ws/trunk/build/plugins/urlnormalizer-pass 
     [copy] Copying 1 file to http://hudson.zones.apache.org/hudson/job/Nutch-trunk/ws/trunk/build/plugins/urlnormalizer-pass 

copy-generated-lib:
     [copy] Copying 1 file to http://hudson.zones.apache.org/hudson/job/Nutch-trunk/ws/trunk/build/plugins/urlnormalizer-pass 
    [mkdir] Created dir: http://hudson.zones.apache.org/hudson/job/Nutch-trunk/ws/trunk/build/urlnormalizer-regex/test/data 
     [copy] Copying 4 files to http://hudson.zones.apache.org/hudson/job/Nutch-trunk/ws/trunk/build/urlnormalizer-regex/test/data 

init:
    [mkdir] Created dir: http://hudson.zones.apache.org/hudson/job/Nutch-trunk/ws/trunk/build/urlnormalizer-regex/classes 

init-plugin:

deps-jar:

compile:
     [echo] Compiling plugin: urlnormalizer-regex
    [javac] Compiling 1 source file to http://hudson.zones.apache.org/hudson/job/Nutch-trunk/ws/trunk/build/urlnormalizer-regex/classes 
    [javac] Note: http://hudson.zones.apache.org/hudson/job/Nutch-trunk/ws/trunk/src/plugin/urlnormalizer-regex/src/java/org/apache/nutch/net/urlnormalizer/regex/RegexURLNormalizer.java  uses unchecked or unsafe operations.
    [javac] Note: Recompile with -Xlint:unchecked for details.

jar:
      [jar] Building jar: http://hudson.zones.apache.org/hudson/job/Nutch-trunk/ws/trunk/build/urlnormalizer-regex/urlnormalizer-regex.jar 

deps-test:

init:

init-plugin:

compile:

jar:
      [jar] Warning: skipping jar archive http://hudson.zones.apache.org/hudson/job/Nutch-trunk/ws/trunk/build/nutch-extensionpoints/nutch-extensionpoints.jar  because no files were included.

deps-test:

deploy:

copy-generated-lib:

deploy:
    [mkdir] Created dir: http://hudson.zones.apache.org/hudson/job/Nutch-trunk/ws/trunk/build/plugins/urlnormalizer-regex 
     [copy] Copying 1 file to http://hudson.zones.apache.org/hudson/job/Nutch-trunk/ws/trunk/build/plugins/urlnormalizer-regex 

copy-generated-lib:
     [copy] Copying 1 file to http://hudson.zones.apache.org/hudson/job/Nutch-trunk/ws/trunk/build/plugins/urlnormalizer-regex 

compile:

compile-core-test:
    [javac] Compiling 43 source files to http://hudson.zones.apache.org/hudson/job/Nutch-trunk/ws/trunk/build/test/classes 
    [javac] Note: Some input files use unchecked or unsafe operations.
    [javac] Note: Recompile with -Xlint:unchecked for details.

test-core:
    [mkdir] Created dir: http://hudson.zones.apache.org/hudson/job/Nutch-trunk/ws/trunk/build/test/data 
     [copy] Copying 90 files to http://hudson.zones.apache.org/hudson/job/Nutch-trunk/ws/trunk/build/test/data 
     [copy] Copying 1 file to http://hudson.zones.apache.org/hudson/job/Nutch-trunk/ws/trunk/build/test/classes 
     [copy] Copying 1 file to http://hudson.zones.apache.org/hudson/job/Nutch-trunk/ws/trunk/build/test/classes 
    [junit] Running org.apache.nutch.analysis.TestAnalyzerFactory
    [junit] Tests run: 4, Failures: 0, Errors: 0, Time elapsed: 1.911 sec
    [junit] Running org.apache.nutch.analysis.TestQueryParser
    [junit] Tests run: 1, Failures: 0, Errors: 0, Time elapsed: 0.886 sec
    [junit] Running org.apache.nutch.clustering.TestOnlineClustererFactory
    [junit] Tests run: 1, Failures: 0, Errors: 0, Time elapsed: 1.181 sec
    [junit] Running org.apache.nutch.crawl.TestCrawlDbMerger
    [junit] Tests run: 1, Failures: 0, Errors: 1, Time elapsed: 1.959 sec
    [junit] Test org.apache.nutch.crawl.TestCrawlDbMerger FAILED
    [junit] Running org.apache.nutch.crawl.TestGenerator
    [junit] Tests run: 4, Failures: 0, Errors: 4, Time elapsed: 5.475 sec
    [junit] Test org.apache.nutch.crawl.TestGenerator FAILED
    [junit] Running org.apache.nutch.crawl.TestInjector
    [junit] Tests run: 1, Failures: 0, Errors: 1, Time elapsed: 0.722 sec
    [junit] Test org.apache.nutch.crawl.TestInjector FAILED
    [junit] Running org.apache.nutch.crawl.TestLinkDbMerger
    [junit] Tests run: 1, Failures: 0, Errors: 1, Time elapsed: 1.15 sec
    [junit] Test org.apache.nutch.crawl.TestLinkDbMerger FAILED
    [junit] Running org.apache.nutch.crawl.TestMapWritable
    [junit] Tests run: 5, Failures: 0, Errors: 0, Time elapsed: 61.827 sec
    [junit] Running org.apache.nutch.crawl.TestSignatureFactory
    [junit] Tests run: 1, Failures: 0, Errors: 0, Time elapsed: 0.582 sec
    [junit] Running org.apache.nutch.fetcher.TestFetcher
    [junit] Tests run: 1, Failures: 0, Errors: 1, Time elapsed: 0.948 sec
    [junit] Test org.apache.nutch.fetcher.TestFetcher FAILED
    [junit] Running org.apache.nutch.indexer.TestDeleteDuplicates
    [junit] Tests run: 4, Failures: 0, Errors: 4, Time elapsed: 1.645 sec
    [junit] Test org.apache.nutch.indexer.TestDeleteDuplicates FAILED
    [junit] Running org.apache.nutch.indexer.TestIndexingFilters
    [junit] Tests run: 1, Failures: 0, Errors: 0, Time elapsed: 2.317 sec
    [junit] Running org.apache.nutch.metadata.TestMetadata
    [junit] Tests run: 10, Failures: 0, Errors: 0, Time elapsed: 0.406 sec
    [junit] Running org.apache.nutch.metadata.TestSpellCheckedMetadata
    [junit] Tests run: 11, Failures: 0, Errors: 0, Time elapsed: 14.606 sec
    [junit] Running org.apache.nutch.net.TestURLFilters
    [junit] Tests run: 1, Failures: 0, Errors: 0, Time elapsed: 1.524 sec
    [junit] Running org.apache.nutch.net.TestURLNormalizers
    [junit] Tests run: 1, Failures: 0, Errors: 0, Time elapsed: 0.944 sec
    [junit] Running org.apache.nutch.ontology.TestOntologyFactory
    [junit] Tests run: 1, Failures: 0, Errors: 0, Time elapsed: 2.062 sec
    [junit] Running org.apache.nutch.parse.TestOutlinkExtractor
    [junit] Tests run: 4, Failures: 0, Errors: 0, Time elapsed: 0.314 sec
    [junit] Running org.apache.nutch.parse.TestParseData
    [junit] Tests run: 2, Failures: 0, Errors: 0, Time elapsed: 0.314 sec
    [junit] Running org.apache.nutch.parse.TestParseText
    [junit] Tests run: 1, Failures: 0, Errors: 0, Time elapsed: 0.407 sec
    [junit] Running org.apache.nutch.parse.TestParserFactory
    [junit] Tests run: 2, Failures: 0, Errors: 0, Time elapsed: 1.239 sec
    [junit] Running org.apache.nutch.plugin.TestPluginSystem
    [junit] Tests run: 6, Failures: 0, Errors: 0, Time elapsed: 2.184 sec
    [junit] Running org.apache.nutch.protocol.TestContent
    [junit] Tests run: 2, Failures: 0, Errors: 0, Time elapsed: 0.815 sec
    [junit] Running org.apache.nutch.protocol.TestProtocolFactory
    [junit] Tests run: 2, Failures: 0, Errors: 0, Time elapsed: 1.342 sec
    [junit] Running org.apache.nutch.searcher.TestDistributedSearch
    [junit] Tests run: 2, Failures: 0, Errors: 0, Time elapsed: 3.209 sec
    [junit] Running org.apache.nutch.searcher.TestHitDetails
    [junit] Tests run: 1, Failures: 0, Errors: 0, Time elapsed: 0.298 sec
    [junit] Running org.apache.nutch.searcher.TestOpenSearchServlet
    [junit] Tests run: 1, Failures: 0, Errors: 0, Time elapsed: 0.311 sec
    [junit] Running org.apache.nutch.searcher.TestQuery
    [junit] Tests run: 6, Failures: 0, Errors: 0, Time elapsed: 1.028 sec
    [junit] Running org.apache.nutch.searcher.TestSummarizerFactory
    [junit] Tests run: 1, Failures: 0, Errors: 0, Time elapsed: 0.901 sec
    [junit] Running org.apache.nutch.searcher.TestSummary
    [junit] Tests run: 8, Failures: 0, Errors: 0, Time elapsed: 0.401 sec
    [junit] Running org.apache.nutch.util.TestEncodingDetector
    [junit] Tests run: 1, Failures: 0, Errors: 0, Time elapsed: 0.755 sec
    [junit] Running org.apache.nutch.util.TestGZIPUtils
    [junit] Tests run: 4, Failures: 0, Errors: 0, Time elapsed: 1.512 sec
    [junit] Running org.apache.nutch.util.TestNodeWalker
    [junit] Tests run: 1, Failures: 0, Errors: 0, Time elapsed: 2.305 sec
    [junit] Running org.apache.nutch.util.TestPrefixStringMatcher
    [junit] Tests run: 1, Failures: 0, Errors: 0, Time elapsed: 0.422 sec
    [junit] Running org.apache.nutch.util.TestStringUtil
    [junit] Tests run: 2, Failures: 0, Errors: 0, Time elapsed: 0.304 sec
    [junit] Running org.apache.nutch.util.TestSuffixStringMatcher
    [junit] Tests run: 1, Failures: 0, Errors: 0, Time elapsed: 0.421 sec
    [junit] Running org.apache.nutch.util.TestURLUtil
    [junit] Tests run: 3, Failures: 0, Errors: 0, Time elapsed: 0.765 sec

BUILD FAILED
http://hudson.zones.apache.org/hudson/job/Nutch-trunk/ws/trunk/build.xml :298: Tests failed!

Total time: 2 minutes 49 seconds
ERROR: No artifacts found that match the file pattern "trunk/build/*.tar.gz". Configuration error?
ERROR: 'trunk/build/*.tar.gz' doesn't match anything: 'trunk' exists but not 'trunk/build/*.tar.gz'
Publishing Javadoc
Recording test results
Updating NUTCH-603
Updating NUTCH-611

Reply | Threaded
Open this post in threaded view
|

Re: Build failed in Hudson: Nutch-trunk #362

Dennis Kubes-2
I reran all unit tests for this, everything passed.  Error from hudson
for failed test are:

java.io.IOException: Failed to get the current user's information: Login
failed: whoami: not found

Dennis

Apache Hudson Server wrote:

> See http://hudson.zones.apache.org/hudson/job/Nutch-trunk/362/changes
>
> Changes:
>
> [kubes] NUTCH-611 - Upgrade Nutch to use Hadoop 0.16.  This upgrade removes the deprecated addDefaultResouce and addFinalResource methods.  Should now use addResource.  Two scripts start-balancer.sh and stop-balancer.sh are added to the bin directory.
>
> [kubes] NUTCH-603 - Add more default url normalizations.
>
> ------------------------------------------
> [...truncated 4600 lines...]
>      [copy] Copying 1 file to http://hudson.zones.apache.org/hudson/job/Nutch-trunk/ws/trunk/build/plugins/urlfilter-regex 
>
> init:
>     [mkdir] Created dir: http://hudson.zones.apache.org/hudson/job/Nutch-trunk/ws/trunk/build/urlfilter-suffix 
>     [mkdir] Created dir: http://hudson.zones.apache.org/hudson/job/Nutch-trunk/ws/trunk/build/urlfilter-suffix/classes 
>     [mkdir] Created dir: http://hudson.zones.apache.org/hudson/job/Nutch-trunk/ws/trunk/build/urlfilter-suffix/test 
>
> init-plugin:
>
> deps-jar:
>
> compile:
>      [echo] Compiling plugin: urlfilter-suffix
>     [javac] Compiling 1 source file to http://hudson.zones.apache.org/hudson/job/Nutch-trunk/ws/trunk/build/urlfilter-suffix/classes 
>     [javac] Note: http://hudson.zones.apache.org/hudson/job/Nutch-trunk/ws/trunk/src/plugin/urlfilter-suffix/src/java/org/apache/nutch/urlfilter/suffix/SuffixURLFilter.java  uses unchecked or unsafe operations.
>     [javac] Note: Recompile with -Xlint:unchecked for details.
>
> jar:
>       [jar] Building jar: http://hudson.zones.apache.org/hudson/job/Nutch-trunk/ws/trunk/build/urlfilter-suffix/urlfilter-suffix.jar 
>
> deps-test:
>
> deploy:
>     [mkdir] Created dir: http://hudson.zones.apache.org/hudson/job/Nutch-trunk/ws/trunk/build/plugins/urlfilter-suffix 
>      [copy] Copying 1 file to http://hudson.zones.apache.org/hudson/job/Nutch-trunk/ws/trunk/build/plugins/urlfilter-suffix 
>
> copy-generated-lib:
>      [copy] Copying 1 file to http://hudson.zones.apache.org/hudson/job/Nutch-trunk/ws/trunk/build/plugins/urlfilter-suffix 
>
> init:
>     [mkdir] Created dir: http://hudson.zones.apache.org/hudson/job/Nutch-trunk/ws/trunk/build/urlfilter-validator 
>     [mkdir] Created dir: http://hudson.zones.apache.org/hudson/job/Nutch-trunk/ws/trunk/build/urlfilter-validator/classes 
>     [mkdir] Created dir: http://hudson.zones.apache.org/hudson/job/Nutch-trunk/ws/trunk/build/urlfilter-validator/test 
>
> init-plugin:
>
> deps-jar:
>
> compile:
>      [echo] Compiling plugin: urlfilter-validator
>     [javac] Compiling 1 source file to http://hudson.zones.apache.org/hudson/job/Nutch-trunk/ws/trunk/build/urlfilter-validator/classes 
>
> jar:
>       [jar] Building jar: http://hudson.zones.apache.org/hudson/job/Nutch-trunk/ws/trunk/build/urlfilter-validator/urlfilter-validator.jar 
>
> deps-test:
>
> deploy:
>     [mkdir] Created dir: http://hudson.zones.apache.org/hudson/job/Nutch-trunk/ws/trunk/build/plugins/urlfilter-validator 
>      [copy] Copying 1 file to http://hudson.zones.apache.org/hudson/job/Nutch-trunk/ws/trunk/build/plugins/urlfilter-validator 
>
> copy-generated-lib:
>      [copy] Copying 1 file to http://hudson.zones.apache.org/hudson/job/Nutch-trunk/ws/trunk/build/plugins/urlfilter-validator 
>
> init:
>     [mkdir] Created dir: http://hudson.zones.apache.org/hudson/job/Nutch-trunk/ws/trunk/build/urlnormalizer-basic 
>     [mkdir] Created dir: http://hudson.zones.apache.org/hudson/job/Nutch-trunk/ws/trunk/build/urlnormalizer-basic/classes 
>     [mkdir] Created dir: http://hudson.zones.apache.org/hudson/job/Nutch-trunk/ws/trunk/build/urlnormalizer-basic/test 
>
> init-plugin:
>
> deps-jar:
>
> compile:
>      [echo] Compiling plugin: urlnormalizer-basic
>     [javac] Compiling 1 source file to http://hudson.zones.apache.org/hudson/job/Nutch-trunk/ws/trunk/build/urlnormalizer-basic/classes 
>
> jar:
>       [jar] Building jar: http://hudson.zones.apache.org/hudson/job/Nutch-trunk/ws/trunk/build/urlnormalizer-basic/urlnormalizer-basic.jar 
>
> deps-test:
>
> deploy:
>     [mkdir] Created dir: http://hudson.zones.apache.org/hudson/job/Nutch-trunk/ws/trunk/build/plugins/urlnormalizer-basic 
>      [copy] Copying 1 file to http://hudson.zones.apache.org/hudson/job/Nutch-trunk/ws/trunk/build/plugins/urlnormalizer-basic 
>
> copy-generated-lib:
>      [copy] Copying 1 file to http://hudson.zones.apache.org/hudson/job/Nutch-trunk/ws/trunk/build/plugins/urlnormalizer-basic 
>
> init:
>     [mkdir] Created dir: http://hudson.zones.apache.org/hudson/job/Nutch-trunk/ws/trunk/build/urlnormalizer-pass 
>     [mkdir] Created dir: http://hudson.zones.apache.org/hudson/job/Nutch-trunk/ws/trunk/build/urlnormalizer-pass/classes 
>     [mkdir] Created dir: http://hudson.zones.apache.org/hudson/job/Nutch-trunk/ws/trunk/build/urlnormalizer-pass/test 
>
> init-plugin:
>
> deps-jar:
>
> compile:
>      [echo] Compiling plugin: urlnormalizer-pass
>     [javac] Compiling 1 source file to http://hudson.zones.apache.org/hudson/job/Nutch-trunk/ws/trunk/build/urlnormalizer-pass/classes 
>
> jar:
>       [jar] Building jar: http://hudson.zones.apache.org/hudson/job/Nutch-trunk/ws/trunk/build/urlnormalizer-pass/urlnormalizer-pass.jar 
>
> deps-test:
>
> deploy:
>     [mkdir] Created dir: http://hudson.zones.apache.org/hudson/job/Nutch-trunk/ws/trunk/build/plugins/urlnormalizer-pass 
>      [copy] Copying 1 file to http://hudson.zones.apache.org/hudson/job/Nutch-trunk/ws/trunk/build/plugins/urlnormalizer-pass 
>
> copy-generated-lib:
>      [copy] Copying 1 file to http://hudson.zones.apache.org/hudson/job/Nutch-trunk/ws/trunk/build/plugins/urlnormalizer-pass 
>     [mkdir] Created dir: http://hudson.zones.apache.org/hudson/job/Nutch-trunk/ws/trunk/build/urlnormalizer-regex/test/data 
>      [copy] Copying 4 files to http://hudson.zones.apache.org/hudson/job/Nutch-trunk/ws/trunk/build/urlnormalizer-regex/test/data 
>
> init:
>     [mkdir] Created dir: http://hudson.zones.apache.org/hudson/job/Nutch-trunk/ws/trunk/build/urlnormalizer-regex/classes 
>
> init-plugin:
>
> deps-jar:
>
> compile:
>      [echo] Compiling plugin: urlnormalizer-regex
>     [javac] Compiling 1 source file to http://hudson.zones.apache.org/hudson/job/Nutch-trunk/ws/trunk/build/urlnormalizer-regex/classes 
>     [javac] Note: http://hudson.zones.apache.org/hudson/job/Nutch-trunk/ws/trunk/src/plugin/urlnormalizer-regex/src/java/org/apache/nutch/net/urlnormalizer/regex/RegexURLNormalizer.java  uses unchecked or unsafe operations.
>     [javac] Note: Recompile with -Xlint:unchecked for details.
>
> jar:
>       [jar] Building jar: http://hudson.zones.apache.org/hudson/job/Nutch-trunk/ws/trunk/build/urlnormalizer-regex/urlnormalizer-regex.jar 
>
> deps-test:
>
> init:
>
> init-plugin:
>
> compile:
>
> jar:
>       [jar] Warning: skipping jar archive http://hudson.zones.apache.org/hudson/job/Nutch-trunk/ws/trunk/build/nutch-extensionpoints/nutch-extensionpoints.jar  because no files were included.
>
> deps-test:
>
> deploy:
>
> copy-generated-lib:
>
> deploy:
>     [mkdir] Created dir: http://hudson.zones.apache.org/hudson/job/Nutch-trunk/ws/trunk/build/plugins/urlnormalizer-regex 
>      [copy] Copying 1 file to http://hudson.zones.apache.org/hudson/job/Nutch-trunk/ws/trunk/build/plugins/urlnormalizer-regex 
>
> copy-generated-lib:
>      [copy] Copying 1 file to http://hudson.zones.apache.org/hudson/job/Nutch-trunk/ws/trunk/build/plugins/urlnormalizer-regex 
>
> compile:
>
> compile-core-test:
>     [javac] Compiling 43 source files to http://hudson.zones.apache.org/hudson/job/Nutch-trunk/ws/trunk/build/test/classes 
>     [javac] Note: Some input files use unchecked or unsafe operations.
>     [javac] Note: Recompile with -Xlint:unchecked for details.
>
> test-core:
>     [mkdir] Created dir: http://hudson.zones.apache.org/hudson/job/Nutch-trunk/ws/trunk/build/test/data 
>      [copy] Copying 90 files to http://hudson.zones.apache.org/hudson/job/Nutch-trunk/ws/trunk/build/test/data 
>      [copy] Copying 1 file to http://hudson.zones.apache.org/hudson/job/Nutch-trunk/ws/trunk/build/test/classes 
>      [copy] Copying 1 file to http://hudson.zones.apache.org/hudson/job/Nutch-trunk/ws/trunk/build/test/classes 
>     [junit] Running org.apache.nutch.analysis.TestAnalyzerFactory
>     [junit] Tests run: 4, Failures: 0, Errors: 0, Time elapsed: 1.911 sec
>     [junit] Running org.apache.nutch.analysis.TestQueryParser
>     [junit] Tests run: 1, Failures: 0, Errors: 0, Time elapsed: 0.886 sec
>     [junit] Running org.apache.nutch.clustering.TestOnlineClustererFactory
>     [junit] Tests run: 1, Failures: 0, Errors: 0, Time elapsed: 1.181 sec
>     [junit] Running org.apache.nutch.crawl.TestCrawlDbMerger
>     [junit] Tests run: 1, Failures: 0, Errors: 1, Time elapsed: 1.959 sec
>     [junit] Test org.apache.nutch.crawl.TestCrawlDbMerger FAILED
>     [junit] Running org.apache.nutch.crawl.TestGenerator
>     [junit] Tests run: 4, Failures: 0, Errors: 4, Time elapsed: 5.475 sec
>     [junit] Test org.apache.nutch.crawl.TestGenerator FAILED
>     [junit] Running org.apache.nutch.crawl.TestInjector
>     [junit] Tests run: 1, Failures: 0, Errors: 1, Time elapsed: 0.722 sec
>     [junit] Test org.apache.nutch.crawl.TestInjector FAILED
>     [junit] Running org.apache.nutch.crawl.TestLinkDbMerger
>     [junit] Tests run: 1, Failures: 0, Errors: 1, Time elapsed: 1.15 sec
>     [junit] Test org.apache.nutch.crawl.TestLinkDbMerger FAILED
>     [junit] Running org.apache.nutch.crawl.TestMapWritable
>     [junit] Tests run: 5, Failures: 0, Errors: 0, Time elapsed: 61.827 sec
>     [junit] Running org.apache.nutch.crawl.TestSignatureFactory
>     [junit] Tests run: 1, Failures: 0, Errors: 0, Time elapsed: 0.582 sec
>     [junit] Running org.apache.nutch.fetcher.TestFetcher
>     [junit] Tests run: 1, Failures: 0, Errors: 1, Time elapsed: 0.948 sec
>     [junit] Test org.apache.nutch.fetcher.TestFetcher FAILED
>     [junit] Running org.apache.nutch.indexer.TestDeleteDuplicates
>     [junit] Tests run: 4, Failures: 0, Errors: 4, Time elapsed: 1.645 sec
>     [junit] Test org.apache.nutch.indexer.TestDeleteDuplicates FAILED
>     [junit] Running org.apache.nutch.indexer.TestIndexingFilters
>     [junit] Tests run: 1, Failures: 0, Errors: 0, Time elapsed: 2.317 sec
>     [junit] Running org.apache.nutch.metadata.TestMetadata
>     [junit] Tests run: 10, Failures: 0, Errors: 0, Time elapsed: 0.406 sec
>     [junit] Running org.apache.nutch.metadata.TestSpellCheckedMetadata
>     [junit] Tests run: 11, Failures: 0, Errors: 0, Time elapsed: 14.606 sec
>     [junit] Running org.apache.nutch.net.TestURLFilters
>     [junit] Tests run: 1, Failures: 0, Errors: 0, Time elapsed: 1.524 sec
>     [junit] Running org.apache.nutch.net.TestURLNormalizers
>     [junit] Tests run: 1, Failures: 0, Errors: 0, Time elapsed: 0.944 sec
>     [junit] Running org.apache.nutch.ontology.TestOntologyFactory
>     [junit] Tests run: 1, Failures: 0, Errors: 0, Time elapsed: 2.062 sec
>     [junit] Running org.apache.nutch.parse.TestOutlinkExtractor
>     [junit] Tests run: 4, Failures: 0, Errors: 0, Time elapsed: 0.314 sec
>     [junit] Running org.apache.nutch.parse.TestParseData
>     [junit] Tests run: 2, Failures: 0, Errors: 0, Time elapsed: 0.314 sec
>     [junit] Running org.apache.nutch.parse.TestParseText
>     [junit] Tests run: 1, Failures: 0, Errors: 0, Time elapsed: 0.407 sec
>     [junit] Running org.apache.nutch.parse.TestParserFactory
>     [junit] Tests run: 2, Failures: 0, Errors: 0, Time elapsed: 1.239 sec
>     [junit] Running org.apache.nutch.plugin.TestPluginSystem
>     [junit] Tests run: 6, Failures: 0, Errors: 0, Time elapsed: 2.184 sec
>     [junit] Running org.apache.nutch.protocol.TestContent
>     [junit] Tests run: 2, Failures: 0, Errors: 0, Time elapsed: 0.815 sec
>     [junit] Running org.apache.nutch.protocol.TestProtocolFactory
>     [junit] Tests run: 2, Failures: 0, Errors: 0, Time elapsed: 1.342 sec
>     [junit] Running org.apache.nutch.searcher.TestDistributedSearch
>     [junit] Tests run: 2, Failures: 0, Errors: 0, Time elapsed: 3.209 sec
>     [junit] Running org.apache.nutch.searcher.TestHitDetails
>     [junit] Tests run: 1, Failures: 0, Errors: 0, Time elapsed: 0.298 sec
>     [junit] Running org.apache.nutch.searcher.TestOpenSearchServlet
>     [junit] Tests run: 1, Failures: 0, Errors: 0, Time elapsed: 0.311 sec
>     [junit] Running org.apache.nutch.searcher.TestQuery
>     [junit] Tests run: 6, Failures: 0, Errors: 0, Time elapsed: 1.028 sec
>     [junit] Running org.apache.nutch.searcher.TestSummarizerFactory
>     [junit] Tests run: 1, Failures: 0, Errors: 0, Time elapsed: 0.901 sec
>     [junit] Running org.apache.nutch.searcher.TestSummary
>     [junit] Tests run: 8, Failures: 0, Errors: 0, Time elapsed: 0.401 sec
>     [junit] Running org.apache.nutch.util.TestEncodingDetector
>     [junit] Tests run: 1, Failures: 0, Errors: 0, Time elapsed: 0.755 sec
>     [junit] Running org.apache.nutch.util.TestGZIPUtils
>     [junit] Tests run: 4, Failures: 0, Errors: 0, Time elapsed: 1.512 sec
>     [junit] Running org.apache.nutch.util.TestNodeWalker
>     [junit] Tests run: 1, Failures: 0, Errors: 0, Time elapsed: 2.305 sec
>     [junit] Running org.apache.nutch.util.TestPrefixStringMatcher
>     [junit] Tests run: 1, Failures: 0, Errors: 0, Time elapsed: 0.422 sec
>     [junit] Running org.apache.nutch.util.TestStringUtil
>     [junit] Tests run: 2, Failures: 0, Errors: 0, Time elapsed: 0.304 sec
>     [junit] Running org.apache.nutch.util.TestSuffixStringMatcher
>     [junit] Tests run: 1, Failures: 0, Errors: 0, Time elapsed: 0.421 sec
>     [junit] Running org.apache.nutch.util.TestURLUtil
>     [junit] Tests run: 3, Failures: 0, Errors: 0, Time elapsed: 0.765 sec
>
> BUILD FAILED
> http://hudson.zones.apache.org/hudson/job/Nutch-trunk/ws/trunk/build.xml :298: Tests failed!
>
> Total time: 2 minutes 49 seconds
> ERROR: No artifacts found that match the file pattern "trunk/build/*.tar.gz". Configuration error?
> ERROR: 'trunk/build/*.tar.gz' doesn't match anything: 'trunk' exists but not 'trunk/build/*.tar.gz'
> Publishing Javadoc
> Recording test results
> Updating NUTCH-603
> Updating NUTCH-611
>
Reply | Threaded
Open this post in threaded view
|

Build failed in Hudson: Nutch-trunk #363

Apache Hudson Server
In reply to this post by Apache Hudson Server
See http://hudson.zones.apache.org/hudson/job/Nutch-trunk/363/changes

Changes:

[kubes] NUTCH-44 - Too many search results.  Configurable limit on max number of search results returned.  Thanks Emilijan Mirceski and Susam Pal.

------------------------------------------
[...truncated 4599 lines...]
copy-generated-lib:
     [copy] Copying 1 file to http://hudson.zones.apache.org/hudson/job/Nutch-trunk/ws/trunk/build/plugins/urlfilter-regex 

init:
    [mkdir] Created dir: http://hudson.zones.apache.org/hudson/job/Nutch-trunk/ws/trunk/build/urlfilter-suffix 
    [mkdir] Created dir: http://hudson.zones.apache.org/hudson/job/Nutch-trunk/ws/trunk/build/urlfilter-suffix/classes 
    [mkdir] Created dir: http://hudson.zones.apache.org/hudson/job/Nutch-trunk/ws/trunk/build/urlfilter-suffix/test 

init-plugin:

deps-jar:

compile:
     [echo] Compiling plugin: urlfilter-suffix
    [javac] Compiling 1 source file to http://hudson.zones.apache.org/hudson/job/Nutch-trunk/ws/trunk/build/urlfilter-suffix/classes 
    [javac] Note: http://hudson.zones.apache.org/hudson/job/Nutch-trunk/ws/trunk/src/plugin/urlfilter-suffix/src/java/org/apache/nutch/urlfilter/suffix/SuffixURLFilter.java  uses unchecked or unsafe operations.
    [javac] Note: Recompile with -Xlint:unchecked for details.

jar:
      [jar] Building jar: http://hudson.zones.apache.org/hudson/job/Nutch-trunk/ws/trunk/build/urlfilter-suffix/urlfilter-suffix.jar 

deps-test:

deploy:
    [mkdir] Created dir: http://hudson.zones.apache.org/hudson/job/Nutch-trunk/ws/trunk/build/plugins/urlfilter-suffix 
     [copy] Copying 1 file to http://hudson.zones.apache.org/hudson/job/Nutch-trunk/ws/trunk/build/plugins/urlfilter-suffix 

copy-generated-lib:
     [copy] Copying 1 file to http://hudson.zones.apache.org/hudson/job/Nutch-trunk/ws/trunk/build/plugins/urlfilter-suffix 

init:
    [mkdir] Created dir: http://hudson.zones.apache.org/hudson/job/Nutch-trunk/ws/trunk/build/urlfilter-validator 
    [mkdir] Created dir: http://hudson.zones.apache.org/hudson/job/Nutch-trunk/ws/trunk/build/urlfilter-validator/classes 
    [mkdir] Created dir: http://hudson.zones.apache.org/hudson/job/Nutch-trunk/ws/trunk/build/urlfilter-validator/test 

init-plugin:

deps-jar:

compile:
     [echo] Compiling plugin: urlfilter-validator
    [javac] Compiling 1 source file to http://hudson.zones.apache.org/hudson/job/Nutch-trunk/ws/trunk/build/urlfilter-validator/classes 

jar:
      [jar] Building jar: http://hudson.zones.apache.org/hudson/job/Nutch-trunk/ws/trunk/build/urlfilter-validator/urlfilter-validator.jar 

deps-test:

deploy:
    [mkdir] Created dir: http://hudson.zones.apache.org/hudson/job/Nutch-trunk/ws/trunk/build/plugins/urlfilter-validator 
     [copy] Copying 1 file to http://hudson.zones.apache.org/hudson/job/Nutch-trunk/ws/trunk/build/plugins/urlfilter-validator 

copy-generated-lib:
     [copy] Copying 1 file to http://hudson.zones.apache.org/hudson/job/Nutch-trunk/ws/trunk/build/plugins/urlfilter-validator 

init:
    [mkdir] Created dir: http://hudson.zones.apache.org/hudson/job/Nutch-trunk/ws/trunk/build/urlnormalizer-basic 
    [mkdir] Created dir: http://hudson.zones.apache.org/hudson/job/Nutch-trunk/ws/trunk/build/urlnormalizer-basic/classes 
    [mkdir] Created dir: http://hudson.zones.apache.org/hudson/job/Nutch-trunk/ws/trunk/build/urlnormalizer-basic/test 

init-plugin:

deps-jar:

compile:
     [echo] Compiling plugin: urlnormalizer-basic
    [javac] Compiling 1 source file to http://hudson.zones.apache.org/hudson/job/Nutch-trunk/ws/trunk/build/urlnormalizer-basic/classes 

jar:
      [jar] Building jar: http://hudson.zones.apache.org/hudson/job/Nutch-trunk/ws/trunk/build/urlnormalizer-basic/urlnormalizer-basic.jar 

deps-test:

deploy:
    [mkdir] Created dir: http://hudson.zones.apache.org/hudson/job/Nutch-trunk/ws/trunk/build/plugins/urlnormalizer-basic 
     [copy] Copying 1 file to http://hudson.zones.apache.org/hudson/job/Nutch-trunk/ws/trunk/build/plugins/urlnormalizer-basic 

copy-generated-lib:
     [copy] Copying 1 file to http://hudson.zones.apache.org/hudson/job/Nutch-trunk/ws/trunk/build/plugins/urlnormalizer-basic 

init:
    [mkdir] Created dir: http://hudson.zones.apache.org/hudson/job/Nutch-trunk/ws/trunk/build/urlnormalizer-pass 
    [mkdir] Created dir: http://hudson.zones.apache.org/hudson/job/Nutch-trunk/ws/trunk/build/urlnormalizer-pass/classes 
    [mkdir] Created dir: http://hudson.zones.apache.org/hudson/job/Nutch-trunk/ws/trunk/build/urlnormalizer-pass/test 

init-plugin:

deps-jar:

compile:
     [echo] Compiling plugin: urlnormalizer-pass
    [javac] Compiling 1 source file to http://hudson.zones.apache.org/hudson/job/Nutch-trunk/ws/trunk/build/urlnormalizer-pass/classes 

jar:
      [jar] Building jar: http://hudson.zones.apache.org/hudson/job/Nutch-trunk/ws/trunk/build/urlnormalizer-pass/urlnormalizer-pass.jar 

deps-test:

deploy:
    [mkdir] Created dir: http://hudson.zones.apache.org/hudson/job/Nutch-trunk/ws/trunk/build/plugins/urlnormalizer-pass 
     [copy] Copying 1 file to http://hudson.zones.apache.org/hudson/job/Nutch-trunk/ws/trunk/build/plugins/urlnormalizer-pass 

copy-generated-lib:
     [copy] Copying 1 file to http://hudson.zones.apache.org/hudson/job/Nutch-trunk/ws/trunk/build/plugins/urlnormalizer-pass 
    [mkdir] Created dir: http://hudson.zones.apache.org/hudson/job/Nutch-trunk/ws/trunk/build/urlnormalizer-regex/test/data 
     [copy] Copying 4 files to http://hudson.zones.apache.org/hudson/job/Nutch-trunk/ws/trunk/build/urlnormalizer-regex/test/data 

init:
    [mkdir] Created dir: http://hudson.zones.apache.org/hudson/job/Nutch-trunk/ws/trunk/build/urlnormalizer-regex/classes 

init-plugin:

deps-jar:

compile:
     [echo] Compiling plugin: urlnormalizer-regex
    [javac] Compiling 1 source file to http://hudson.zones.apache.org/hudson/job/Nutch-trunk/ws/trunk/build/urlnormalizer-regex/classes 
    [javac] Note: http://hudson.zones.apache.org/hudson/job/Nutch-trunk/ws/trunk/src/plugin/urlnormalizer-regex/src/java/org/apache/nutch/net/urlnormalizer/regex/RegexURLNormalizer.java  uses unchecked or unsafe operations.
    [javac] Note: Recompile with -Xlint:unchecked for details.

jar:
      [jar] Building jar: http://hudson.zones.apache.org/hudson/job/Nutch-trunk/ws/trunk/build/urlnormalizer-regex/urlnormalizer-regex.jar 

deps-test:

init:

init-plugin:

compile:

jar:
      [jar] Warning: skipping jar archive http://hudson.zones.apache.org/hudson/job/Nutch-trunk/ws/trunk/build/nutch-extensionpoints/nutch-extensionpoints.jar  because no files were included.

deps-test:

deploy:

copy-generated-lib:

deploy:
    [mkdir] Created dir: http://hudson.zones.apache.org/hudson/job/Nutch-trunk/ws/trunk/build/plugins/urlnormalizer-regex 
     [copy] Copying 1 file to http://hudson.zones.apache.org/hudson/job/Nutch-trunk/ws/trunk/build/plugins/urlnormalizer-regex 

copy-generated-lib:
     [copy] Copying 1 file to http://hudson.zones.apache.org/hudson/job/Nutch-trunk/ws/trunk/build/plugins/urlnormalizer-regex 

compile:

compile-core-test:
    [javac] Compiling 43 source files to http://hudson.zones.apache.org/hudson/job/Nutch-trunk/ws/trunk/build/test/classes 
    [javac] Note: Some input files use unchecked or unsafe operations.
    [javac] Note: Recompile with -Xlint:unchecked for details.

test-core:
    [mkdir] Created dir: http://hudson.zones.apache.org/hudson/job/Nutch-trunk/ws/trunk/build/test/data 
     [copy] Copying 90 files to http://hudson.zones.apache.org/hudson/job/Nutch-trunk/ws/trunk/build/test/data 
     [copy] Copying 1 file to http://hudson.zones.apache.org/hudson/job/Nutch-trunk/ws/trunk/build/test/classes 
     [copy] Copying 1 file to http://hudson.zones.apache.org/hudson/job/Nutch-trunk/ws/trunk/build/test/classes 
    [junit] Running org.apache.nutch.analysis.TestAnalyzerFactory
    [junit] Tests run: 4, Failures: 0, Errors: 0, Time elapsed: 1.594 sec
    [junit] Running org.apache.nutch.analysis.TestQueryParser
    [junit] Tests run: 1, Failures: 0, Errors: 0, Time elapsed: 0.771 sec
    [junit] Running org.apache.nutch.clustering.TestOnlineClustererFactory
    [junit] Tests run: 1, Failures: 0, Errors: 0, Time elapsed: 1.019 sec
    [junit] Running org.apache.nutch.crawl.TestCrawlDbMerger
    [junit] Tests run: 1, Failures: 0, Errors: 1, Time elapsed: 0.972 sec
    [junit] Test org.apache.nutch.crawl.TestCrawlDbMerger FAILED
    [junit] Running org.apache.nutch.crawl.TestGenerator
    [junit] Tests run: 4, Failures: 0, Errors: 4, Time elapsed: 5.296 sec
    [junit] Test org.apache.nutch.crawl.TestGenerator FAILED
    [junit] Running org.apache.nutch.crawl.TestInjector
    [junit] Tests run: 1, Failures: 0, Errors: 1, Time elapsed: 0.644 sec
    [junit] Test org.apache.nutch.crawl.TestInjector FAILED
    [junit] Running org.apache.nutch.crawl.TestLinkDbMerger
    [junit] Tests run: 1, Failures: 0, Errors: 1, Time elapsed: 1.03 sec
    [junit] Test org.apache.nutch.crawl.TestLinkDbMerger FAILED
    [junit] Running org.apache.nutch.crawl.TestMapWritable
    [junit] Tests run: 5, Failures: 0, Errors: 0, Time elapsed: 60.608 sec
    [junit] Running org.apache.nutch.crawl.TestSignatureFactory
    [junit] Tests run: 1, Failures: 0, Errors: 0, Time elapsed: 0.486 sec
    [junit] Running org.apache.nutch.fetcher.TestFetcher
    [junit] Tests run: 1, Failures: 0, Errors: 1, Time elapsed: 0.777 sec
    [junit] Test org.apache.nutch.fetcher.TestFetcher FAILED
    [junit] Running org.apache.nutch.indexer.TestDeleteDuplicates
    [junit] Tests run: 4, Failures: 0, Errors: 4, Time elapsed: 1.406 sec
    [junit] Test org.apache.nutch.indexer.TestDeleteDuplicates FAILED
    [junit] Running org.apache.nutch.indexer.TestIndexingFilters
    [junit] Tests run: 1, Failures: 0, Errors: 0, Time elapsed: 1.888 sec
    [junit] Running org.apache.nutch.metadata.TestMetadata
    [junit] Tests run: 10, Failures: 0, Errors: 0, Time elapsed: 0.363 sec
    [junit] Running org.apache.nutch.metadata.TestSpellCheckedMetadata
    [junit] Tests run: 11, Failures: 0, Errors: 0, Time elapsed: 13.937 sec
    [junit] Running org.apache.nutch.net.TestURLFilters
    [junit] Tests run: 1, Failures: 0, Errors: 0, Time elapsed: 1.543 sec
    [junit] Running org.apache.nutch.net.TestURLNormalizers
    [junit] Tests run: 1, Failures: 0, Errors: 0, Time elapsed: 0.852 sec
    [junit] Running org.apache.nutch.ontology.TestOntologyFactory
    [junit] Tests run: 1, Failures: 0, Errors: 0, Time elapsed: 1.825 sec
    [junit] Running org.apache.nutch.parse.TestOutlinkExtractor
    [junit] Tests run: 4, Failures: 0, Errors: 0, Time elapsed: 0.283 sec
    [junit] Running org.apache.nutch.parse.TestParseData
    [junit] Tests run: 2, Failures: 0, Errors: 0, Time elapsed: 0.264 sec
    [junit] Running org.apache.nutch.parse.TestParseText
    [junit] Tests run: 1, Failures: 0, Errors: 0, Time elapsed: 0.367 sec
    [junit] Running org.apache.nutch.parse.TestParserFactory
    [junit] Tests run: 2, Failures: 0, Errors: 0, Time elapsed: 1.176 sec
    [junit] Running org.apache.nutch.plugin.TestPluginSystem
    [junit] Tests run: 6, Failures: 0, Errors: 0, Time elapsed: 1.853 sec
    [junit] Running org.apache.nutch.protocol.TestContent
    [junit] Tests run: 2, Failures: 0, Errors: 0, Time elapsed: 0.736 sec
    [junit] Running org.apache.nutch.protocol.TestProtocolFactory
    [junit] Tests run: 2, Failures: 0, Errors: 0, Time elapsed: 1.174 sec
    [junit] Running org.apache.nutch.searcher.TestDistributedSearch
    [junit] Tests run: 2, Failures: 0, Errors: 0, Time elapsed: 2.899 sec
    [junit] Running org.apache.nutch.searcher.TestHitDetails
    [junit] Tests run: 1, Failures: 0, Errors: 0, Time elapsed: 0.275 sec
    [junit] Running org.apache.nutch.searcher.TestOpenSearchServlet
    [junit] Tests run: 1, Failures: 0, Errors: 0, Time elapsed: 0.281 sec
    [junit] Running org.apache.nutch.searcher.TestQuery
    [junit] Tests run: 6, Failures: 0, Errors: 0, Time elapsed: 0.733 sec
    [junit] Running org.apache.nutch.searcher.TestSummarizerFactory
    [junit] Tests run: 1, Failures: 0, Errors: 0, Time elapsed: 0.866 sec
    [junit] Running org.apache.nutch.searcher.TestSummary
    [junit] Tests run: 8, Failures: 0, Errors: 0, Time elapsed: 0.366 sec
    [junit] Running org.apache.nutch.util.TestEncodingDetector
    [junit] Tests run: 1, Failures: 0, Errors: 0, Time elapsed: 0.743 sec
    [junit] Running org.apache.nutch.util.TestGZIPUtils
    [junit] Tests run: 4, Failures: 0, Errors: 0, Time elapsed: 1.292 sec
    [junit] Running org.apache.nutch.util.TestNodeWalker
    [junit] Tests run: 1, Failures: 0, Errors: 0, Time elapsed: 2.155 sec
    [junit] Running org.apache.nutch.util.TestPrefixStringMatcher
    [junit] Tests run: 1, Failures: 0, Errors: 0, Time elapsed: 0.38 sec
    [junit] Running org.apache.nutch.util.TestStringUtil
    [junit] Tests run: 2, Failures: 0, Errors: 0, Time elapsed: 0.27 sec
    [junit] Running org.apache.nutch.util.TestSuffixStringMatcher
    [junit] Tests run: 1, Failures: 0, Errors: 0, Time elapsed: 0.371 sec
    [junit] Running org.apache.nutch.util.TestURLUtil
    [junit] Tests run: 3, Failures: 0, Errors: 0, Time elapsed: 0.679 sec

BUILD FAILED
http://hudson.zones.apache.org/hudson/job/Nutch-trunk/ws/trunk/build.xml :298: Tests failed!

Total time: 2 minutes 32 seconds
ERROR: No artifacts found that match the file pattern "trunk/build/*.tar.gz". Configuration error?
ERROR: 'trunk/build/*.tar.gz' doesn't match anything: 'trunk' exists but not 'trunk/build/*.tar.gz'
Publishing Javadoc
Recording test results
Updating NUTCH-44

Reply | Threaded
Open this post in threaded view
|

Build failed in Hudson: Nutch-trunk #364

Apache Hudson Server
See http://hudson.zones.apache.org/hudson/job/Nutch-trunk/364/changes

------------------------------------------
[...truncated 4599 lines...]

copy-generated-lib:
     [copy] Copying 1 file to http://hudson.zones.apache.org/hudson/job/Nutch-trunk/ws/trunk/build/plugins/urlfilter-regex 

init:
    [mkdir] Created dir: http://hudson.zones.apache.org/hudson/job/Nutch-trunk/ws/trunk/build/urlfilter-suffix 
    [mkdir] Created dir: http://hudson.zones.apache.org/hudson/job/Nutch-trunk/ws/trunk/build/urlfilter-suffix/classes 
    [mkdir] Created dir: http://hudson.zones.apache.org/hudson/job/Nutch-trunk/ws/trunk/build/urlfilter-suffix/test 

init-plugin:

deps-jar:

compile:
     [echo] Compiling plugin: urlfilter-suffix
    [javac] Compiling 1 source file to http://hudson.zones.apache.org/hudson/job/Nutch-trunk/ws/trunk/build/urlfilter-suffix/classes 
    [javac] Note: http://hudson.zones.apache.org/hudson/job/Nutch-trunk/ws/trunk/src/plugin/urlfilter-suffix/src/java/org/apache/nutch/urlfilter/suffix/SuffixURLFilter.java  uses unchecked or unsafe operations.
    [javac] Note: Recompile with -Xlint:unchecked for details.

jar:
      [jar] Building jar: http://hudson.zones.apache.org/hudson/job/Nutch-trunk/ws/trunk/build/urlfilter-suffix/urlfilter-suffix.jar 

deps-test:

deploy:
    [mkdir] Created dir: http://hudson.zones.apache.org/hudson/job/Nutch-trunk/ws/trunk/build/plugins/urlfilter-suffix 
     [copy] Copying 1 file to http://hudson.zones.apache.org/hudson/job/Nutch-trunk/ws/trunk/build/plugins/urlfilter-suffix 

copy-generated-lib:
     [copy] Copying 1 file to http://hudson.zones.apache.org/hudson/job/Nutch-trunk/ws/trunk/build/plugins/urlfilter-suffix 

init:
    [mkdir] Created dir: http://hudson.zones.apache.org/hudson/job/Nutch-trunk/ws/trunk/build/urlfilter-validator 
    [mkdir] Created dir: http://hudson.zones.apache.org/hudson/job/Nutch-trunk/ws/trunk/build/urlfilter-validator/classes 
    [mkdir] Created dir: http://hudson.zones.apache.org/hudson/job/Nutch-trunk/ws/trunk/build/urlfilter-validator/test 

init-plugin:

deps-jar:

compile:
     [echo] Compiling plugin: urlfilter-validator
    [javac] Compiling 1 source file to http://hudson.zones.apache.org/hudson/job/Nutch-trunk/ws/trunk/build/urlfilter-validator/classes 

jar:
      [jar] Building jar: http://hudson.zones.apache.org/hudson/job/Nutch-trunk/ws/trunk/build/urlfilter-validator/urlfilter-validator.jar 

deps-test:

deploy:
    [mkdir] Created dir: http://hudson.zones.apache.org/hudson/job/Nutch-trunk/ws/trunk/build/plugins/urlfilter-validator 
     [copy] Copying 1 file to http://hudson.zones.apache.org/hudson/job/Nutch-trunk/ws/trunk/build/plugins/urlfilter-validator 

copy-generated-lib:
     [copy] Copying 1 file to http://hudson.zones.apache.org/hudson/job/Nutch-trunk/ws/trunk/build/plugins/urlfilter-validator 

init:
    [mkdir] Created dir: http://hudson.zones.apache.org/hudson/job/Nutch-trunk/ws/trunk/build/urlnormalizer-basic 
    [mkdir] Created dir: http://hudson.zones.apache.org/hudson/job/Nutch-trunk/ws/trunk/build/urlnormalizer-basic/classes 
    [mkdir] Created dir: http://hudson.zones.apache.org/hudson/job/Nutch-trunk/ws/trunk/build/urlnormalizer-basic/test 

init-plugin:

deps-jar:

compile:
     [echo] Compiling plugin: urlnormalizer-basic
    [javac] Compiling 1 source file to http://hudson.zones.apache.org/hudson/job/Nutch-trunk/ws/trunk/build/urlnormalizer-basic/classes 

jar:
      [jar] Building jar: http://hudson.zones.apache.org/hudson/job/Nutch-trunk/ws/trunk/build/urlnormalizer-basic/urlnormalizer-basic.jar 

deps-test:

deploy:
    [mkdir] Created dir: http://hudson.zones.apache.org/hudson/job/Nutch-trunk/ws/trunk/build/plugins/urlnormalizer-basic 
     [copy] Copying 1 file to http://hudson.zones.apache.org/hudson/job/Nutch-trunk/ws/trunk/build/plugins/urlnormalizer-basic 

copy-generated-lib:
     [copy] Copying 1 file to http://hudson.zones.apache.org/hudson/job/Nutch-trunk/ws/trunk/build/plugins/urlnormalizer-basic 

init:
    [mkdir] Created dir: http://hudson.zones.apache.org/hudson/job/Nutch-trunk/ws/trunk/build/urlnormalizer-pass 
    [mkdir] Created dir: http://hudson.zones.apache.org/hudson/job/Nutch-trunk/ws/trunk/build/urlnormalizer-pass/classes 
    [mkdir] Created dir: http://hudson.zones.apache.org/hudson/job/Nutch-trunk/ws/trunk/build/urlnormalizer-pass/test 

init-plugin:

deps-jar:

compile:
     [echo] Compiling plugin: urlnormalizer-pass
    [javac] Compiling 1 source file to http://hudson.zones.apache.org/hudson/job/Nutch-trunk/ws/trunk/build/urlnormalizer-pass/classes 

jar:
      [jar] Building jar: http://hudson.zones.apache.org/hudson/job/Nutch-trunk/ws/trunk/build/urlnormalizer-pass/urlnormalizer-pass.jar 

deps-test:

deploy:
    [mkdir] Created dir: http://hudson.zones.apache.org/hudson/job/Nutch-trunk/ws/trunk/build/plugins/urlnormalizer-pass 
     [copy] Copying 1 file to http://hudson.zones.apache.org/hudson/job/Nutch-trunk/ws/trunk/build/plugins/urlnormalizer-pass 

copy-generated-lib:
     [copy] Copying 1 file to http://hudson.zones.apache.org/hudson/job/Nutch-trunk/ws/trunk/build/plugins/urlnormalizer-pass 
    [mkdir] Created dir: http://hudson.zones.apache.org/hudson/job/Nutch-trunk/ws/trunk/build/urlnormalizer-regex/test/data 
     [copy] Copying 4 files to http://hudson.zones.apache.org/hudson/job/Nutch-trunk/ws/trunk/build/urlnormalizer-regex/test/data 

init:
    [mkdir] Created dir: http://hudson.zones.apache.org/hudson/job/Nutch-trunk/ws/trunk/build/urlnormalizer-regex/classes 

init-plugin:

deps-jar:

compile:
     [echo] Compiling plugin: urlnormalizer-regex
    [javac] Compiling 1 source file to http://hudson.zones.apache.org/hudson/job/Nutch-trunk/ws/trunk/build/urlnormalizer-regex/classes 
    [javac] Note: http://hudson.zones.apache.org/hudson/job/Nutch-trunk/ws/trunk/src/plugin/urlnormalizer-regex/src/java/org/apache/nutch/net/urlnormalizer/regex/RegexURLNormalizer.java  uses unchecked or unsafe operations.
    [javac] Note: Recompile with -Xlint:unchecked for details.

jar:
      [jar] Building jar: http://hudson.zones.apache.org/hudson/job/Nutch-trunk/ws/trunk/build/urlnormalizer-regex/urlnormalizer-regex.jar 

deps-test:

init:

init-plugin:

compile:

jar:
      [jar] Warning: skipping jar archive http://hudson.zones.apache.org/hudson/job/Nutch-trunk/ws/trunk/build/nutch-extensionpoints/nutch-extensionpoints.jar  because no files were included.

deps-test:

deploy:

copy-generated-lib:

deploy:
    [mkdir] Created dir: http://hudson.zones.apache.org/hudson/job/Nutch-trunk/ws/trunk/build/plugins/urlnormalizer-regex 
     [copy] Copying 1 file to http://hudson.zones.apache.org/hudson/job/Nutch-trunk/ws/trunk/build/plugins/urlnormalizer-regex 

copy-generated-lib:
     [copy] Copying 1 file to http://hudson.zones.apache.org/hudson/job/Nutch-trunk/ws/trunk/build/plugins/urlnormalizer-regex 

compile:

compile-core-test:
    [javac] Compiling 43 source files to http://hudson.zones.apache.org/hudson/job/Nutch-trunk/ws/trunk/build/test/classes 
    [javac] Note: Some input files use unchecked or unsafe operations.
    [javac] Note: Recompile with -Xlint:unchecked for details.

test-core:
    [mkdir] Created dir: http://hudson.zones.apache.org/hudson/job/Nutch-trunk/ws/trunk/build/test/data 
     [copy] Copying 90 files to http://hudson.zones.apache.org/hudson/job/Nutch-trunk/ws/trunk/build/test/data 
     [copy] Copying 1 file to http://hudson.zones.apache.org/hudson/job/Nutch-trunk/ws/trunk/build/test/classes 
     [copy] Copying 1 file to http://hudson.zones.apache.org/hudson/job/Nutch-trunk/ws/trunk/build/test/classes 
    [junit] Running org.apache.nutch.analysis.TestAnalyzerFactory
    [junit] Tests run: 4, Failures: 0, Errors: 0, Time elapsed: 1.558 sec
    [junit] Running org.apache.nutch.analysis.TestQueryParser
    [junit] Tests run: 1, Failures: 0, Errors: 0, Time elapsed: 0.809 sec
    [junit] Running org.apache.nutch.clustering.TestOnlineClustererFactory
    [junit] Tests run: 1, Failures: 0, Errors: 0, Time elapsed: 1.108 sec
    [junit] Running org.apache.nutch.crawl.TestCrawlDbMerger
    [junit] Tests run: 1, Failures: 0, Errors: 1, Time elapsed: 1.165 sec
    [junit] Test org.apache.nutch.crawl.TestCrawlDbMerger FAILED
    [junit] Running org.apache.nutch.crawl.TestGenerator
    [junit] Tests run: 4, Failures: 0, Errors: 4, Time elapsed: 5.336 sec
    [junit] Test org.apache.nutch.crawl.TestGenerator FAILED
    [junit] Running org.apache.nutch.crawl.TestInjector
    [junit] Tests run: 1, Failures: 0, Errors: 1, Time elapsed: 0.635 sec
    [junit] Test org.apache.nutch.crawl.TestInjector FAILED
    [junit] Running org.apache.nutch.crawl.TestLinkDbMerger
    [junit] Tests run: 1, Failures: 0, Errors: 1, Time elapsed: 1.004 sec
    [junit] Test org.apache.nutch.crawl.TestLinkDbMerger FAILED
    [junit] Running org.apache.nutch.crawl.TestMapWritable
    [junit] Tests run: 5, Failures: 0, Errors: 0, Time elapsed: 61.036 sec
    [junit] Running org.apache.nutch.crawl.TestSignatureFactory
    [junit] Tests run: 1, Failures: 0, Errors: 0, Time elapsed: 0.536 sec
    [junit] Running org.apache.nutch.fetcher.TestFetcher
    [junit] Tests run: 1, Failures: 0, Errors: 1, Time elapsed: 0.822 sec
    [junit] Test org.apache.nutch.fetcher.TestFetcher FAILED
    [junit] Running org.apache.nutch.indexer.TestDeleteDuplicates
    [junit] Tests run: 4, Failures: 0, Errors: 4, Time elapsed: 1.425 sec
    [junit] Test org.apache.nutch.indexer.TestDeleteDuplicates FAILED
    [junit] Running org.apache.nutch.indexer.TestIndexingFilters
    [junit] Tests run: 1, Failures: 0, Errors: 0, Time elapsed: 1.989 sec
    [junit] Running org.apache.nutch.metadata.TestMetadata
    [junit] Tests run: 10, Failures: 0, Errors: 0, Time elapsed: 0.365 sec
    [junit] Running org.apache.nutch.metadata.TestSpellCheckedMetadata
    [junit] Tests run: 11, Failures: 0, Errors: 0, Time elapsed: 13.545 sec
    [junit] Running org.apache.nutch.net.TestURLFilters
    [junit] Tests run: 1, Failures: 0, Errors: 0, Time elapsed: 1.572 sec
    [junit] Running org.apache.nutch.net.TestURLNormalizers
    [junit] Tests run: 1, Failures: 0, Errors: 0, Time elapsed: 0.864 sec
    [junit] Running org.apache.nutch.ontology.TestOntologyFactory
    [junit] Tests run: 1, Failures: 0, Errors: 0, Time elapsed: 1.762 sec
    [junit] Running org.apache.nutch.parse.TestOutlinkExtractor
    [junit] Tests run: 4, Failures: 0, Errors: 0, Time elapsed: 0.286 sec
    [junit] Running org.apache.nutch.parse.TestParseData
    [junit] Tests run: 2, Failures: 0, Errors: 0, Time elapsed: 0.262 sec
    [junit] Running org.apache.nutch.parse.TestParseText
    [junit] Tests run: 1, Failures: 0, Errors: 0, Time elapsed: 0.377 sec
    [junit] Running org.apache.nutch.parse.TestParserFactory
    [junit] Tests run: 2, Failures: 0, Errors: 0, Time elapsed: 1.171 sec
    [junit] Running org.apache.nutch.plugin.TestPluginSystem
    [junit] Tests run: 6, Failures: 0, Errors: 0, Time elapsed: 1.816 sec
    [junit] Running org.apache.nutch.protocol.TestContent
    [junit] Tests run: 2, Failures: 0, Errors: 0, Time elapsed: 0.746 sec
    [junit] Running org.apache.nutch.protocol.TestProtocolFactory
    [junit] Tests run: 2, Failures: 0, Errors: 0, Time elapsed: 1.129 sec
    [junit] Running org.apache.nutch.searcher.TestDistributedSearch
    [junit] Tests run: 2, Failures: 0, Errors: 0, Time elapsed: 2.847 sec
    [junit] Running org.apache.nutch.searcher.TestHitDetails
    [junit] Tests run: 1, Failures: 0, Errors: 0, Time elapsed: 0.269 sec
    [junit] Running org.apache.nutch.searcher.TestOpenSearchServlet
    [junit] Tests run: 1, Failures: 0, Errors: 0, Time elapsed: 0.284 sec
    [junit] Running org.apache.nutch.searcher.TestQuery
    [junit] Tests run: 6, Failures: 0, Errors: 0, Time elapsed: 0.781 sec
    [junit] Running org.apache.nutch.searcher.TestSummarizerFactory
    [junit] Tests run: 1, Failures: 0, Errors: 0, Time elapsed: 0.851 sec
    [junit] Running org.apache.nutch.searcher.TestSummary
    [junit] Tests run: 8, Failures: 0, Errors: 0, Time elapsed: 0.373 sec
    [junit] Running org.apache.nutch.util.TestEncodingDetector
    [junit] Tests run: 1, Failures: 0, Errors: 0, Time elapsed: 0.723 sec
    [junit] Running org.apache.nutch.util.TestGZIPUtils
    [junit] Tests run: 4, Failures: 0, Errors: 0, Time elapsed: 1.299 sec
    [junit] Running org.apache.nutch.util.TestNodeWalker
    [junit] Tests run: 1, Failures: 0, Errors: 0, Time elapsed: 2.268 sec
    [junit] Running org.apache.nutch.util.TestPrefixStringMatcher
    [junit] Tests run: 1, Failures: 0, Errors: 0, Time elapsed: 0.378 sec
    [junit] Running org.apache.nutch.util.TestStringUtil
    [junit] Tests run: 2, Failures: 0, Errors: 0, Time elapsed: 0.268 sec
    [junit] Running org.apache.nutch.util.TestSuffixStringMatcher
    [junit] Tests run: 1, Failures: 0, Errors: 0, Time elapsed: 0.385 sec
    [junit] Running org.apache.nutch.util.TestURLUtil
    [junit] Tests run: 3, Failures: 0, Errors: 0, Time elapsed: 0.689 sec

BUILD FAILED
http://hudson.zones.apache.org/hudson/job/Nutch-trunk/ws/trunk/build.xml :298: Tests failed!

Total time: 2 minutes 37 seconds
ERROR: No artifacts found that match the file pattern "trunk/build/*.tar.gz". Configuration error?
ERROR: 'trunk/build/*.tar.gz' doesn't match anything: 'trunk' exists but not 'trunk/build/*.tar.gz'
Publishing Javadoc
Recording test results

Reply | Threaded
Open this post in threaded view
|

Build failed in Hudson: Nutch-trunk #365

Apache Hudson Server
See http://hudson.zones.apache.org/hudson/job/Nutch-trunk/365/changes

------------------------------------------
[...truncated 4599 lines...]

copy-generated-lib:
     [copy] Copying 1 file to http://hudson.zones.apache.org/hudson/job/Nutch-trunk/ws/trunk/build/plugins/urlfilter-regex 

init:
    [mkdir] Created dir: http://hudson.zones.apache.org/hudson/job/Nutch-trunk/ws/trunk/build/urlfilter-suffix 
    [mkdir] Created dir: http://hudson.zones.apache.org/hudson/job/Nutch-trunk/ws/trunk/build/urlfilter-suffix/classes 
    [mkdir] Created dir: http://hudson.zones.apache.org/hudson/job/Nutch-trunk/ws/trunk/build/urlfilter-suffix/test 

init-plugin:

deps-jar:

compile:
     [echo] Compiling plugin: urlfilter-suffix
    [javac] Compiling 1 source file to http://hudson.zones.apache.org/hudson/job/Nutch-trunk/ws/trunk/build/urlfilter-suffix/classes 
    [javac] Note: http://hudson.zones.apache.org/hudson/job/Nutch-trunk/ws/trunk/src/plugin/urlfilter-suffix/src/java/org/apache/nutch/urlfilter/suffix/SuffixURLFilter.java  uses unchecked or unsafe operations.
    [javac] Note: Recompile with -Xlint:unchecked for details.

jar:
      [jar] Building jar: http://hudson.zones.apache.org/hudson/job/Nutch-trunk/ws/trunk/build/urlfilter-suffix/urlfilter-suffix.jar 

deps-test:

deploy:
    [mkdir] Created dir: http://hudson.zones.apache.org/hudson/job/Nutch-trunk/ws/trunk/build/plugins/urlfilter-suffix 
     [copy] Copying 1 file to http://hudson.zones.apache.org/hudson/job/Nutch-trunk/ws/trunk/build/plugins/urlfilter-suffix 

copy-generated-lib:
     [copy] Copying 1 file to http://hudson.zones.apache.org/hudson/job/Nutch-trunk/ws/trunk/build/plugins/urlfilter-suffix 

init:
    [mkdir] Created dir: http://hudson.zones.apache.org/hudson/job/Nutch-trunk/ws/trunk/build/urlfilter-validator 
    [mkdir] Created dir: http://hudson.zones.apache.org/hudson/job/Nutch-trunk/ws/trunk/build/urlfilter-validator/classes 
    [mkdir] Created dir: http://hudson.zones.apache.org/hudson/job/Nutch-trunk/ws/trunk/build/urlfilter-validator/test 

init-plugin:

deps-jar:

compile:
     [echo] Compiling plugin: urlfilter-validator
    [javac] Compiling 1 source file to http://hudson.zones.apache.org/hudson/job/Nutch-trunk/ws/trunk/build/urlfilter-validator/classes 

jar:
      [jar] Building jar: http://hudson.zones.apache.org/hudson/job/Nutch-trunk/ws/trunk/build/urlfilter-validator/urlfilter-validator.jar 

deps-test:

deploy:
    [mkdir] Created dir: http://hudson.zones.apache.org/hudson/job/Nutch-trunk/ws/trunk/build/plugins/urlfilter-validator 
     [copy] Copying 1 file to http://hudson.zones.apache.org/hudson/job/Nutch-trunk/ws/trunk/build/plugins/urlfilter-validator 

copy-generated-lib:
     [copy] Copying 1 file to http://hudson.zones.apache.org/hudson/job/Nutch-trunk/ws/trunk/build/plugins/urlfilter-validator 

init:
    [mkdir] Created dir: http://hudson.zones.apache.org/hudson/job/Nutch-trunk/ws/trunk/build/urlnormalizer-basic 
    [mkdir] Created dir: http://hudson.zones.apache.org/hudson/job/Nutch-trunk/ws/trunk/build/urlnormalizer-basic/classes 
    [mkdir] Created dir: http://hudson.zones.apache.org/hudson/job/Nutch-trunk/ws/trunk/build/urlnormalizer-basic/test 

init-plugin:

deps-jar:

compile:
     [echo] Compiling plugin: urlnormalizer-basic
    [javac] Compiling 1 source file to http://hudson.zones.apache.org/hudson/job/Nutch-trunk/ws/trunk/build/urlnormalizer-basic/classes 

jar:
      [jar] Building jar: http://hudson.zones.apache.org/hudson/job/Nutch-trunk/ws/trunk/build/urlnormalizer-basic/urlnormalizer-basic.jar 

deps-test:

deploy:
    [mkdir] Created dir: http://hudson.zones.apache.org/hudson/job/Nutch-trunk/ws/trunk/build/plugins/urlnormalizer-basic 
     [copy] Copying 1 file to http://hudson.zones.apache.org/hudson/job/Nutch-trunk/ws/trunk/build/plugins/urlnormalizer-basic 

copy-generated-lib:
     [copy] Copying 1 file to http://hudson.zones.apache.org/hudson/job/Nutch-trunk/ws/trunk/build/plugins/urlnormalizer-basic 

init:
    [mkdir] Created dir: http://hudson.zones.apache.org/hudson/job/Nutch-trunk/ws/trunk/build/urlnormalizer-pass 
    [mkdir] Created dir: http://hudson.zones.apache.org/hudson/job/Nutch-trunk/ws/trunk/build/urlnormalizer-pass/classes 
    [mkdir] Created dir: http://hudson.zones.apache.org/hudson/job/Nutch-trunk/ws/trunk/build/urlnormalizer-pass/test 

init-plugin:

deps-jar:

compile:
     [echo] Compiling plugin: urlnormalizer-pass
    [javac] Compiling 1 source file to http://hudson.zones.apache.org/hudson/job/Nutch-trunk/ws/trunk/build/urlnormalizer-pass/classes 

jar:
      [jar] Building jar: http://hudson.zones.apache.org/hudson/job/Nutch-trunk/ws/trunk/build/urlnormalizer-pass/urlnormalizer-pass.jar 

deps-test:

deploy:
    [mkdir] Created dir: http://hudson.zones.apache.org/hudson/job/Nutch-trunk/ws/trunk/build/plugins/urlnormalizer-pass 
     [copy] Copying 1 file to http://hudson.zones.apache.org/hudson/job/Nutch-trunk/ws/trunk/build/plugins/urlnormalizer-pass 

copy-generated-lib:
     [copy] Copying 1 file to http://hudson.zones.apache.org/hudson/job/Nutch-trunk/ws/trunk/build/plugins/urlnormalizer-pass 
    [mkdir] Created dir: http://hudson.zones.apache.org/hudson/job/Nutch-trunk/ws/trunk/build/urlnormalizer-regex/test/data 
     [copy] Copying 4 files to http://hudson.zones.apache.org/hudson/job/Nutch-trunk/ws/trunk/build/urlnormalizer-regex/test/data 

init:
    [mkdir] Created dir: http://hudson.zones.apache.org/hudson/job/Nutch-trunk/ws/trunk/build/urlnormalizer-regex/classes 

init-plugin:

deps-jar:

compile:
     [echo] Compiling plugin: urlnormalizer-regex
    [javac] Compiling 1 source file to http://hudson.zones.apache.org/hudson/job/Nutch-trunk/ws/trunk/build/urlnormalizer-regex/classes 
    [javac] Note: http://hudson.zones.apache.org/hudson/job/Nutch-trunk/ws/trunk/src/plugin/urlnormalizer-regex/src/java/org/apache/nutch/net/urlnormalizer/regex/RegexURLNormalizer.java  uses unchecked or unsafe operations.
    [javac] Note: Recompile with -Xlint:unchecked for details.

jar:
      [jar] Building jar: http://hudson.zones.apache.org/hudson/job/Nutch-trunk/ws/trunk/build/urlnormalizer-regex/urlnormalizer-regex.jar 

deps-test:

init:

init-plugin:

compile:

jar:
      [jar] Warning: skipping jar archive http://hudson.zones.apache.org/hudson/job/Nutch-trunk/ws/trunk/build/nutch-extensionpoints/nutch-extensionpoints.jar  because no files were included.

deps-test:

deploy:

copy-generated-lib:

deploy:
    [mkdir] Created dir: http://hudson.zones.apache.org/hudson/job/Nutch-trunk/ws/trunk/build/plugins/urlnormalizer-regex 
     [copy] Copying 1 file to http://hudson.zones.apache.org/hudson/job/Nutch-trunk/ws/trunk/build/plugins/urlnormalizer-regex 

copy-generated-lib:
     [copy] Copying 1 file to http://hudson.zones.apache.org/hudson/job/Nutch-trunk/ws/trunk/build/plugins/urlnormalizer-regex 

compile:

compile-core-test:
    [javac] Compiling 43 source files to http://hudson.zones.apache.org/hudson/job/Nutch-trunk/ws/trunk/build/test/classes 
    [javac] Note: Some input files use unchecked or unsafe operations.
    [javac] Note: Recompile with -Xlint:unchecked for details.

test-core:
    [mkdir] Created dir: http://hudson.zones.apache.org/hudson/job/Nutch-trunk/ws/trunk/build/test/data 
     [copy] Copying 90 files to http://hudson.zones.apache.org/hudson/job/Nutch-trunk/ws/trunk/build/test/data 
     [copy] Copying 1 file to http://hudson.zones.apache.org/hudson/job/Nutch-trunk/ws/trunk/build/test/classes 
     [copy] Copying 1 file to http://hudson.zones.apache.org/hudson/job/Nutch-trunk/ws/trunk/build/test/classes 
    [junit] Running org.apache.nutch.analysis.TestAnalyzerFactory
    [junit] Tests run: 4, Failures: 0, Errors: 0, Time elapsed: 2.115 sec
    [junit] Running org.apache.nutch.analysis.TestQueryParser
    [junit] Tests run: 1, Failures: 0, Errors: 0, Time elapsed: 1.285 sec
    [junit] Running org.apache.nutch.clustering.TestOnlineClustererFactory
    [junit] Tests run: 1, Failures: 0, Errors: 0, Time elapsed: 2.562 sec
    [junit] Running org.apache.nutch.crawl.TestCrawlDbMerger
    [junit] Tests run: 1, Failures: 0, Errors: 1, Time elapsed: 3.053 sec
    [junit] Test org.apache.nutch.crawl.TestCrawlDbMerger FAILED
    [junit] Running org.apache.nutch.crawl.TestGenerator
    [junit] Tests run: 4, Failures: 0, Errors: 4, Time elapsed: 6.141 sec
    [junit] Test org.apache.nutch.crawl.TestGenerator FAILED
    [junit] Running org.apache.nutch.crawl.TestInjector
    [junit] Tests run: 1, Failures: 0, Errors: 1, Time elapsed: 0.738 sec
    [junit] Test org.apache.nutch.crawl.TestInjector FAILED
    [junit] Running org.apache.nutch.crawl.TestLinkDbMerger
    [junit] Tests run: 1, Failures: 0, Errors: 1, Time elapsed: 1.438 sec
    [junit] Test org.apache.nutch.crawl.TestLinkDbMerger FAILED
    [junit] Running org.apache.nutch.crawl.TestMapWritable
    [junit] Tests run: 5, Failures: 0, Errors: 0, Time elapsed: 69.292 sec
    [junit] Running org.apache.nutch.crawl.TestSignatureFactory
    [junit] Tests run: 1, Failures: 0, Errors: 0, Time elapsed: 0.641 sec
    [junit] Running org.apache.nutch.fetcher.TestFetcher
    [junit] Tests run: 1, Failures: 0, Errors: 1, Time elapsed: 1.28 sec
    [junit] Test org.apache.nutch.fetcher.TestFetcher FAILED
    [junit] Running org.apache.nutch.indexer.TestDeleteDuplicates
    [junit] Tests run: 4, Failures: 0, Errors: 4, Time elapsed: 1.91 sec
    [junit] Test org.apache.nutch.indexer.TestDeleteDuplicates FAILED
    [junit] Running org.apache.nutch.indexer.TestIndexingFilters
    [junit] Tests run: 1, Failures: 0, Errors: 0, Time elapsed: 3.939 sec
    [junit] Running org.apache.nutch.metadata.TestMetadata
    [junit] Tests run: 10, Failures: 0, Errors: 0, Time elapsed: 0.433 sec
    [junit] Running org.apache.nutch.metadata.TestSpellCheckedMetadata
    [junit] Tests run: 11, Failures: 0, Errors: 0, Time elapsed: 15.546 sec
    [junit] Running org.apache.nutch.net.TestURLFilters
    [junit] Tests run: 1, Failures: 0, Errors: 0, Time elapsed: 1.686 sec
    [junit] Running org.apache.nutch.net.TestURLNormalizers
    [junit] Tests run: 1, Failures: 0, Errors: 0, Time elapsed: 2.083 sec
    [junit] Running org.apache.nutch.ontology.TestOntologyFactory
    [junit] Tests run: 1, Failures: 0, Errors: 0, Time elapsed: 2.272 sec
    [junit] Running org.apache.nutch.parse.TestOutlinkExtractor
    [junit] Tests run: 4, Failures: 0, Errors: 0, Time elapsed: 0.312 sec
    [junit] Running org.apache.nutch.parse.TestParseData
    [junit] Tests run: 2, Failures: 0, Errors: 0, Time elapsed: 0.286 sec
    [junit] Running org.apache.nutch.parse.TestParseText
    [junit] Tests run: 1, Failures: 0, Errors: 0, Time elapsed: 0.541 sec
    [junit] Running org.apache.nutch.parse.TestParserFactory
    [junit] Tests run: 2, Failures: 0, Errors: 0, Time elapsed: 1.881 sec
    [junit] Running org.apache.nutch.plugin.TestPluginSystem
    [junit] Tests run: 6, Failures: 0, Errors: 0, Time elapsed: 2.935 sec
    [junit] Running org.apache.nutch.protocol.TestContent
    [junit] Tests run: 2, Failures: 0, Errors: 0, Time elapsed: 1.413 sec
    [junit] Running org.apache.nutch.protocol.TestProtocolFactory
    [junit] Tests run: 2, Failures: 0, Errors: 0, Time elapsed: 1.812 sec
    [junit] Running org.apache.nutch.searcher.TestDistributedSearch
    [junit] Tests run: 2, Failures: 0, Errors: 0, Time elapsed: 4.431 sec
    [junit] Running org.apache.nutch.searcher.TestHitDetails
    [junit] Tests run: 1, Failures: 0, Errors: 0, Time elapsed: 0.393 sec
    [junit] Running org.apache.nutch.searcher.TestOpenSearchServlet
    [junit] Tests run: 1, Failures: 0, Errors: 0, Time elapsed: 0.337 sec
    [junit] Running org.apache.nutch.searcher.TestQuery
    [junit] Tests run: 6, Failures: 0, Errors: 0, Time elapsed: 1.035 sec
    [junit] Running org.apache.nutch.searcher.TestSummarizerFactory
    [junit] Tests run: 1, Failures: 0, Errors: 0, Time elapsed: 1.611 sec
    [junit] Running org.apache.nutch.searcher.TestSummary
    [junit] Tests run: 8, Failures: 0, Errors: 0, Time elapsed: 0.455 sec
    [junit] Running org.apache.nutch.util.TestEncodingDetector
    [junit] Tests run: 1, Failures: 0, Errors: 0, Time elapsed: 0.844 sec
    [junit] Running org.apache.nutch.util.TestGZIPUtils
    [junit] Tests run: 4, Failures: 0, Errors: 0, Time elapsed: 1.596 sec
    [junit] Running org.apache.nutch.util.TestNodeWalker
    [junit] Tests run: 1, Failures: 0, Errors: 0, Time elapsed: 2.163 sec
    [junit] Running org.apache.nutch.util.TestPrefixStringMatcher
    [junit] Tests run: 1, Failures: 0, Errors: 0, Time elapsed: 0.448 sec
    [junit] Running org.apache.nutch.util.TestStringUtil
    [junit] Tests run: 2, Failures: 0, Errors: 0, Time elapsed: 0.333 sec
    [junit] Running org.apache.nutch.util.TestSuffixStringMatcher
    [junit] Tests run: 1, Failures: 0, Errors: 0, Time elapsed: 0.429 sec
    [junit] Running org.apache.nutch.util.TestURLUtil
    [junit] Tests run: 3, Failures: 0, Errors: 0, Time elapsed: 0.836 sec

BUILD FAILED
http://hudson.zones.apache.org/hudson/job/Nutch-trunk/ws/trunk/build.xml :298: Tests failed!

Total time: 3 minutes 51 seconds
ERROR: No artifacts found that match the file pattern "trunk/build/*.tar.gz". Configuration error?
ERROR: 'trunk/build/*.tar.gz' doesn't match anything: 'trunk' exists but not 'trunk/build/*.tar.gz'
Publishing Javadoc
Recording test results

Reply | Threaded
Open this post in threaded view
|

Build failed in Hudson: Nutch-trunk #366

Apache Hudson Server
See http://hudson.zones.apache.org/hudson/job/Nutch-trunk/366/changes

------------------------------------------
[...truncated 4599 lines...]

copy-generated-lib:
     [copy] Copying 1 file to http://hudson.zones.apache.org/hudson/job/Nutch-trunk/ws/trunk/build/plugins/urlfilter-regex 

init:
    [mkdir] Created dir: http://hudson.zones.apache.org/hudson/job/Nutch-trunk/ws/trunk/build/urlfilter-suffix 
    [mkdir] Created dir: http://hudson.zones.apache.org/hudson/job/Nutch-trunk/ws/trunk/build/urlfilter-suffix/classes 
    [mkdir] Created dir: http://hudson.zones.apache.org/hudson/job/Nutch-trunk/ws/trunk/build/urlfilter-suffix/test 

init-plugin:

deps-jar:

compile:
     [echo] Compiling plugin: urlfilter-suffix
    [javac] Compiling 1 source file to http://hudson.zones.apache.org/hudson/job/Nutch-trunk/ws/trunk/build/urlfilter-suffix/classes 
    [javac] Note: http://hudson.zones.apache.org/hudson/job/Nutch-trunk/ws/trunk/src/plugin/urlfilter-suffix/src/java/org/apache/nutch/urlfilter/suffix/SuffixURLFilter.java  uses unchecked or unsafe operations.
    [javac] Note: Recompile with -Xlint:unchecked for details.

jar:
      [jar] Building jar: http://hudson.zones.apache.org/hudson/job/Nutch-trunk/ws/trunk/build/urlfilter-suffix/urlfilter-suffix.jar 

deps-test:

deploy:
    [mkdir] Created dir: http://hudson.zones.apache.org/hudson/job/Nutch-trunk/ws/trunk/build/plugins/urlfilter-suffix 
     [copy] Copying 1 file to http://hudson.zones.apache.org/hudson/job/Nutch-trunk/ws/trunk/build/plugins/urlfilter-suffix 

copy-generated-lib:
     [copy] Copying 1 file to http://hudson.zones.apache.org/hudson/job/Nutch-trunk/ws/trunk/build/plugins/urlfilter-suffix 

init:
    [mkdir] Created dir: http://hudson.zones.apache.org/hudson/job/Nutch-trunk/ws/trunk/build/urlfilter-validator 
    [mkdir] Created dir: http://hudson.zones.apache.org/hudson/job/Nutch-trunk/ws/trunk/build/urlfilter-validator/classes 
    [mkdir] Created dir: http://hudson.zones.apache.org/hudson/job/Nutch-trunk/ws/trunk/build/urlfilter-validator/test 

init-plugin:

deps-jar:

compile:
     [echo] Compiling plugin: urlfilter-validator
    [javac] Compiling 1 source file to http://hudson.zones.apache.org/hudson/job/Nutch-trunk/ws/trunk/build/urlfilter-validator/classes 

jar:
      [jar] Building jar: http://hudson.zones.apache.org/hudson/job/Nutch-trunk/ws/trunk/build/urlfilter-validator/urlfilter-validator.jar 

deps-test:

deploy:
    [mkdir] Created dir: http://hudson.zones.apache.org/hudson/job/Nutch-trunk/ws/trunk/build/plugins/urlfilter-validator 
     [copy] Copying 1 file to http://hudson.zones.apache.org/hudson/job/Nutch-trunk/ws/trunk/build/plugins/urlfilter-validator 

copy-generated-lib:
     [copy] Copying 1 file to http://hudson.zones.apache.org/hudson/job/Nutch-trunk/ws/trunk/build/plugins/urlfilter-validator 

init:
    [mkdir] Created dir: http://hudson.zones.apache.org/hudson/job/Nutch-trunk/ws/trunk/build/urlnormalizer-basic 
    [mkdir] Created dir: http://hudson.zones.apache.org/hudson/job/Nutch-trunk/ws/trunk/build/urlnormalizer-basic/classes 
    [mkdir] Created dir: http://hudson.zones.apache.org/hudson/job/Nutch-trunk/ws/trunk/build/urlnormalizer-basic/test 

init-plugin:

deps-jar:

compile:
     [echo] Compiling plugin: urlnormalizer-basic
    [javac] Compiling 1 source file to http://hudson.zones.apache.org/hudson/job/Nutch-trunk/ws/trunk/build/urlnormalizer-basic/classes 

jar:
      [jar] Building jar: http://hudson.zones.apache.org/hudson/job/Nutch-trunk/ws/trunk/build/urlnormalizer-basic/urlnormalizer-basic.jar 

deps-test:

deploy:
    [mkdir] Created dir: http://hudson.zones.apache.org/hudson/job/Nutch-trunk/ws/trunk/build/plugins/urlnormalizer-basic 
     [copy] Copying 1 file to http://hudson.zones.apache.org/hudson/job/Nutch-trunk/ws/trunk/build/plugins/urlnormalizer-basic 

copy-generated-lib:
     [copy] Copying 1 file to http://hudson.zones.apache.org/hudson/job/Nutch-trunk/ws/trunk/build/plugins/urlnormalizer-basic 

init:
    [mkdir] Created dir: http://hudson.zones.apache.org/hudson/job/Nutch-trunk/ws/trunk/build/urlnormalizer-pass 
    [mkdir] Created dir: http://hudson.zones.apache.org/hudson/job/Nutch-trunk/ws/trunk/build/urlnormalizer-pass/classes 
    [mkdir] Created dir: http://hudson.zones.apache.org/hudson/job/Nutch-trunk/ws/trunk/build/urlnormalizer-pass/test 

init-plugin:

deps-jar:

compile:
     [echo] Compiling plugin: urlnormalizer-pass
    [javac] Compiling 1 source file to http://hudson.zones.apache.org/hudson/job/Nutch-trunk/ws/trunk/build/urlnormalizer-pass/classes 

jar:
      [jar] Building jar: http://hudson.zones.apache.org/hudson/job/Nutch-trunk/ws/trunk/build/urlnormalizer-pass/urlnormalizer-pass.jar 

deps-test:

deploy:
    [mkdir] Created dir: http://hudson.zones.apache.org/hudson/job/Nutch-trunk/ws/trunk/build/plugins/urlnormalizer-pass 
     [copy] Copying 1 file to http://hudson.zones.apache.org/hudson/job/Nutch-trunk/ws/trunk/build/plugins/urlnormalizer-pass 

copy-generated-lib:
     [copy] Copying 1 file to http://hudson.zones.apache.org/hudson/job/Nutch-trunk/ws/trunk/build/plugins/urlnormalizer-pass 
    [mkdir] Created dir: http://hudson.zones.apache.org/hudson/job/Nutch-trunk/ws/trunk/build/urlnormalizer-regex/test/data 
     [copy] Copying 4 files to http://hudson.zones.apache.org/hudson/job/Nutch-trunk/ws/trunk/build/urlnormalizer-regex/test/data 

init:
    [mkdir] Created dir: http://hudson.zones.apache.org/hudson/job/Nutch-trunk/ws/trunk/build/urlnormalizer-regex/classes 

init-plugin:

deps-jar:

compile:
     [echo] Compiling plugin: urlnormalizer-regex
    [javac] Compiling 1 source file to http://hudson.zones.apache.org/hudson/job/Nutch-trunk/ws/trunk/build/urlnormalizer-regex/classes 
    [javac] Note: http://hudson.zones.apache.org/hudson/job/Nutch-trunk/ws/trunk/src/plugin/urlnormalizer-regex/src/java/org/apache/nutch/net/urlnormalizer/regex/RegexURLNormalizer.java  uses unchecked or unsafe operations.
    [javac] Note: Recompile with -Xlint:unchecked for details.

jar:
      [jar] Building jar: http://hudson.zones.apache.org/hudson/job/Nutch-trunk/ws/trunk/build/urlnormalizer-regex/urlnormalizer-regex.jar 

deps-test:

init:

init-plugin:

compile:

jar:
      [jar] Warning: skipping jar archive http://hudson.zones.apache.org/hudson/job/Nutch-trunk/ws/trunk/build/nutch-extensionpoints/nutch-extensionpoints.jar  because no files were included.

deps-test:

deploy:

copy-generated-lib:

deploy:
    [mkdir] Created dir: http://hudson.zones.apache.org/hudson/job/Nutch-trunk/ws/trunk/build/plugins/urlnormalizer-regex 
     [copy] Copying 1 file to http://hudson.zones.apache.org/hudson/job/Nutch-trunk/ws/trunk/build/plugins/urlnormalizer-regex 

copy-generated-lib:
     [copy] Copying 1 file to http://hudson.zones.apache.org/hudson/job/Nutch-trunk/ws/trunk/build/plugins/urlnormalizer-regex 

compile:

compile-core-test:
    [javac] Compiling 43 source files to http://hudson.zones.apache.org/hudson/job/Nutch-trunk/ws/trunk/build/test/classes 
    [javac] Note: Some input files use unchecked or unsafe operations.
    [javac] Note: Recompile with -Xlint:unchecked for details.

test-core:
    [mkdir] Created dir: http://hudson.zones.apache.org/hudson/job/Nutch-trunk/ws/trunk/build/test/data 
     [copy] Copying 90 files to http://hudson.zones.apache.org/hudson/job/Nutch-trunk/ws/trunk/build/test/data 
     [copy] Copying 1 file to http://hudson.zones.apache.org/hudson/job/Nutch-trunk/ws/trunk/build/test/classes 
     [copy] Copying 1 file to http://hudson.zones.apache.org/hudson/job/Nutch-trunk/ws/trunk/build/test/classes 
    [junit] Running org.apache.nutch.analysis.TestAnalyzerFactory
    [junit] Tests run: 4, Failures: 0, Errors: 0, Time elapsed: 2.377 sec
    [junit] Running org.apache.nutch.analysis.TestQueryParser
    [junit] Tests run: 1, Failures: 0, Errors: 0, Time elapsed: 0.998 sec
    [junit] Running org.apache.nutch.clustering.TestOnlineClustererFactory
    [junit] Tests run: 1, Failures: 0, Errors: 0, Time elapsed: 1.945 sec
    [junit] Running org.apache.nutch.crawl.TestCrawlDbMerger
    [junit] Tests run: 1, Failures: 0, Errors: 1, Time elapsed: 2.396 sec
    [junit] Test org.apache.nutch.crawl.TestCrawlDbMerger FAILED
    [junit] Running org.apache.nutch.crawl.TestGenerator
    [junit] Tests run: 4, Failures: 0, Errors: 4, Time elapsed: 6.258 sec
    [junit] Test org.apache.nutch.crawl.TestGenerator FAILED
    [junit] Running org.apache.nutch.crawl.TestInjector
    [junit] Tests run: 1, Failures: 0, Errors: 1, Time elapsed: 0.765 sec
    [junit] Test org.apache.nutch.crawl.TestInjector FAILED
    [junit] Running org.apache.nutch.crawl.TestLinkDbMerger
    [junit] Tests run: 1, Failures: 0, Errors: 1, Time elapsed: 1.263 sec
    [junit] Test org.apache.nutch.crawl.TestLinkDbMerger FAILED
    [junit] Running org.apache.nutch.crawl.TestMapWritable
    [junit] Tests run: 5, Failures: 0, Errors: 0, Time elapsed: 69.155 sec
    [junit] Running org.apache.nutch.crawl.TestSignatureFactory
    [junit] Tests run: 1, Failures: 0, Errors: 0, Time elapsed: 0.632 sec
    [junit] Running org.apache.nutch.fetcher.TestFetcher
    [junit] Tests run: 1, Failures: 0, Errors: 1, Time elapsed: 1.701 sec
    [junit] Test org.apache.nutch.fetcher.TestFetcher FAILED
    [junit] Running org.apache.nutch.indexer.TestDeleteDuplicates
    [junit] Tests run: 4, Failures: 0, Errors: 4, Time elapsed: 2.355 sec
    [junit] Test org.apache.nutch.indexer.TestDeleteDuplicates FAILED
    [junit] Running org.apache.nutch.indexer.TestIndexingFilters
    [junit] Tests run: 1, Failures: 0, Errors: 0, Time elapsed: 2.337 sec
    [junit] Running org.apache.nutch.metadata.TestMetadata
    [junit] Tests run: 10, Failures: 0, Errors: 0, Time elapsed: 0.431 sec
    [junit] Running org.apache.nutch.metadata.TestSpellCheckedMetadata
    [junit] Tests run: 11, Failures: 0, Errors: 0, Time elapsed: 16.397 sec
    [junit] Running org.apache.nutch.net.TestURLFilters
    [junit] Tests run: 1, Failures: 0, Errors: 0, Time elapsed: 1.647 sec
    [junit] Running org.apache.nutch.net.TestURLNormalizers
    [junit] Tests run: 1, Failures: 0, Errors: 0, Time elapsed: 1.141 sec
    [junit] Running org.apache.nutch.ontology.TestOntologyFactory
    [junit] Tests run: 1, Failures: 0, Errors: 0, Time elapsed: 2.709 sec
    [junit] Running org.apache.nutch.parse.TestOutlinkExtractor
    [junit] Tests run: 4, Failures: 0, Errors: 0, Time elapsed: 0.305 sec
    [junit] Running org.apache.nutch.parse.TestParseData
    [junit] Tests run: 2, Failures: 0, Errors: 0, Time elapsed: 0.329 sec
    [junit] Running org.apache.nutch.parse.TestParseText
    [junit] Tests run: 1, Failures: 0, Errors: 0, Time elapsed: 0.481 sec
    [junit] Running org.apache.nutch.parse.TestParserFactory
    [junit] Tests run: 2, Failures: 0, Errors: 0, Time elapsed: 1.37 sec
    [junit] Running org.apache.nutch.plugin.TestPluginSystem
    [junit] Tests run: 6, Failures: 0, Errors: 0, Time elapsed: 2.321 sec
    [junit] Running org.apache.nutch.protocol.TestContent
    [junit] Tests run: 2, Failures: 0, Errors: 0, Time elapsed: 1.279 sec
    [junit] Running org.apache.nutch.protocol.TestProtocolFactory
    [junit] Tests run: 2, Failures: 0, Errors: 0, Time elapsed: 2.122 sec
    [junit] Running org.apache.nutch.searcher.TestDistributedSearch
    [junit] Tests run: 2, Failures: 0, Errors: 0, Time elapsed: 4.721 sec
    [junit] Running org.apache.nutch.searcher.TestHitDetails
    [junit] Tests run: 1, Failures: 0, Errors: 0, Time elapsed: 0.479 sec
    [junit] Running org.apache.nutch.searcher.TestOpenSearchServlet
    [junit] Tests run: 1, Failures: 0, Errors: 0, Time elapsed: 0.44 sec
    [junit] Running org.apache.nutch.searcher.TestQuery
    [junit] Tests run: 6, Failures: 0, Errors: 0, Time elapsed: 1.008 sec
    [junit] Running org.apache.nutch.searcher.TestSummarizerFactory
    [junit] Tests run: 1, Failures: 0, Errors: 0, Time elapsed: 1.296 sec
    [junit] Running org.apache.nutch.searcher.TestSummary
    [junit] Tests run: 8, Failures: 0, Errors: 0, Time elapsed: 0.471 sec
    [junit] Running org.apache.nutch.util.TestEncodingDetector
    [junit] Tests run: 1, Failures: 0, Errors: 0, Time elapsed: 1.197 sec
    [junit] Running org.apache.nutch.util.TestGZIPUtils
    [junit] Tests run: 4, Failures: 0, Errors: 0, Time elapsed: 2.335 sec
    [junit] Running org.apache.nutch.util.TestNodeWalker
    [junit] Tests run: 1, Failures: 0, Errors: 0, Time elapsed: 2.342 sec
    [junit] Running org.apache.nutch.util.TestPrefixStringMatcher
    [junit] Tests run: 1, Failures: 0, Errors: 0, Time elapsed: 0.405 sec
    [junit] Running org.apache.nutch.util.TestStringUtil
    [junit] Tests run: 2, Failures: 0, Errors: 0, Time elapsed: 0.335 sec
    [junit] Running org.apache.nutch.util.TestSuffixStringMatcher
    [junit] Tests run: 1, Failures: 0, Errors: 0, Time elapsed: 0.482 sec
    [junit] Running org.apache.nutch.util.TestURLUtil
    [junit] Tests run: 3, Failures: 0, Errors: 0, Time elapsed: 1.064 sec

BUILD FAILED
http://hudson.zones.apache.org/hudson/job/Nutch-trunk/ws/trunk/build.xml :298: Tests failed!

Total time: 3 minutes 55 seconds
ERROR: No artifacts found that match the file pattern "trunk/build/*.tar.gz". Configuration error?
ERROR: 'trunk/build/*.tar.gz' doesn't match anything: 'trunk' exists but not 'trunk/build/*.tar.gz'
Publishing Javadoc
Recording test results

Reply | Threaded
Open this post in threaded view
|

Build failed in Hudson: Nutch-trunk #367

Apache Hudson Server
See http://hudson.zones.apache.org/hudson/job/Nutch-trunk/367/changes

------------------------------------------
[...truncated 4600 lines...]
copy-generated-lib:
     [copy] Copying 1 file to http://hudson.zones.apache.org/hudson/job/Nutch-trunk/ws/trunk/build/plugins/urlfilter-regex 

init:
    [mkdir] Created dir: http://hudson.zones.apache.org/hudson/job/Nutch-trunk/ws/trunk/build/urlfilter-suffix 
    [mkdir] Created dir: http://hudson.zones.apache.org/hudson/job/Nutch-trunk/ws/trunk/build/urlfilter-suffix/classes 
    [mkdir] Created dir: http://hudson.zones.apache.org/hudson/job/Nutch-trunk/ws/trunk/build/urlfilter-suffix/test 

init-plugin:

deps-jar:

compile:
     [echo] Compiling plugin: urlfilter-suffix
    [javac] Compiling 1 source file to http://hudson.zones.apache.org/hudson/job/Nutch-trunk/ws/trunk/build/urlfilter-suffix/classes 
    [javac] Note: http://hudson.zones.apache.org/hudson/job/Nutch-trunk/ws/trunk/src/plugin/urlfilter-suffix/src/java/org/apache/nutch/urlfilter/suffix/SuffixURLFilter.java  uses unchecked or unsafe operations.
    [javac] Note: Recompile with -Xlint:unchecked for details.

jar:
      [jar] Building jar: http://hudson.zones.apache.org/hudson/job/Nutch-trunk/ws/trunk/build/urlfilter-suffix/urlfilter-suffix.jar 

deps-test:

deploy:
    [mkdir] Created dir: http://hudson.zones.apache.org/hudson/job/Nutch-trunk/ws/trunk/build/plugins/urlfilter-suffix 
     [copy] Copying 1 file to http://hudson.zones.apache.org/hudson/job/Nutch-trunk/ws/trunk/build/plugins/urlfilter-suffix 

copy-generated-lib:
     [copy] Copying 1 file to http://hudson.zones.apache.org/hudson/job/Nutch-trunk/ws/trunk/build/plugins/urlfilter-suffix 

init:
    [mkdir] Created dir: http://hudson.zones.apache.org/hudson/job/Nutch-trunk/ws/trunk/build/urlfilter-validator 
    [mkdir] Created dir: http://hudson.zones.apache.org/hudson/job/Nutch-trunk/ws/trunk/build/urlfilter-validator/classes 
    [mkdir] Created dir: http://hudson.zones.apache.org/hudson/job/Nutch-trunk/ws/trunk/build/urlfilter-validator/test 

init-plugin:

deps-jar:

compile:
     [echo] Compiling plugin: urlfilter-validator
    [javac] Compiling 1 source file to http://hudson.zones.apache.org/hudson/job/Nutch-trunk/ws/trunk/build/urlfilter-validator/classes 

jar:
      [jar] Building jar: http://hudson.zones.apache.org/hudson/job/Nutch-trunk/ws/trunk/build/urlfilter-validator/urlfilter-validator.jar 

deps-test:

deploy:
    [mkdir] Created dir: http://hudson.zones.apache.org/hudson/job/Nutch-trunk/ws/trunk/build/plugins/urlfilter-validator 
     [copy] Copying 1 file to http://hudson.zones.apache.org/hudson/job/Nutch-trunk/ws/trunk/build/plugins/urlfilter-validator 

copy-generated-lib:
     [copy] Copying 1 file to http://hudson.zones.apache.org/hudson/job/Nutch-trunk/ws/trunk/build/plugins/urlfilter-validator 

init:
    [mkdir] Created dir: http://hudson.zones.apache.org/hudson/job/Nutch-trunk/ws/trunk/build/urlnormalizer-basic 
    [mkdir] Created dir: http://hudson.zones.apache.org/hudson/job/Nutch-trunk/ws/trunk/build/urlnormalizer-basic/classes 
    [mkdir] Created dir: http://hudson.zones.apache.org/hudson/job/Nutch-trunk/ws/trunk/build/urlnormalizer-basic/test 

init-plugin:

deps-jar:

compile:
     [echo] Compiling plugin: urlnormalizer-basic
    [javac] Compiling 1 source file to http://hudson.zones.apache.org/hudson/job/Nutch-trunk/ws/trunk/build/urlnormalizer-basic/classes 

jar:
Process leaked file descriptors. See http://hudson.gotdns.com/wiki/display/HUDSON/Spawning+processes+from+build for more information      [jar] Building jar: http://hudson.zones.apache.org/hudson/job/Nutch-trunk/ws/trunk/build/urlnormalizer-basic/urlnormalizer-basic.jar 

deps-test:

deploy:
    [mkdir] Created dir: http://hudson.zones.apache.org/hudson/job/Nutch-trunk/ws/trunk/build/plugins/urlnormalizer-basic 
     [copy] Copying 1 file to http://hudson.zones.apache.org/hudson/job/Nutch-trunk/ws/trunk/build/plugins/urlnormalizer-basic 

copy-generated-lib:
     [copy] Copying 1 file to http://hudson.zones.apache.org/hudson/job/Nutch-trunk/ws/trunk/build/plugins/urlnormalizer-basic 

init:
    [mkdir] Created dir: http://hudson.zones.apache.org/hudson/job/Nutch-trunk/ws/trunk/build/urlnormalizer-pass 
    [mkdir] Created dir: http://hudson.zones.apache.org/hudson/job/Nutch-trunk/ws/trunk/build/urlnormalizer-pass/classes 
    [mkdir] Created dir: http://hudson.zones.apache.org/hudson/job/Nutch-trunk/ws/trunk/build/urlnormalizer-pass/test 

init-plugin:

deps-jar:

compile:
     [echo] Compiling plugin: urlnormalizer-pass
    [javac] Compiling 1 source file to http://hudson.zones.apache.org/hudson/job/Nutch-trunk/ws/trunk/build/urlnormalizer-pass/classes 

jar:
      [jar] Building jar: http://hudson.zones.apache.org/hudson/job/Nutch-trunk/ws/trunk/build/urlnormalizer-pass/urlnormalizer-pass.jar 

deps-test:

deploy:
    [mkdir] Created dir: http://hudson.zones.apache.org/hudson/job/Nutch-trunk/ws/trunk/build/plugins/urlnormalizer-pass 
     [copy] Copying 1 file to http://hudson.zones.apache.org/hudson/job/Nutch-trunk/ws/trunk/build/plugins/urlnormalizer-pass 

copy-generated-lib:
     [copy] Copying 1 file to http://hudson.zones.apache.org/hudson/job/Nutch-trunk/ws/trunk/build/plugins/urlnormalizer-pass 
    [mkdir] Created dir: http://hudson.zones.apache.org/hudson/job/Nutch-trunk/ws/trunk/build/urlnormalizer-regex/test/data 
     [copy] Copying 4 files to http://hudson.zones.apache.org/hudson/job/Nutch-trunk/ws/trunk/build/urlnormalizer-regex/test/data 

init:
    [mkdir] Created dir: http://hudson.zones.apache.org/hudson/job/Nutch-trunk/ws/trunk/build/urlnormalizer-regex/classes 

init-plugin:

deps-jar:

compile:
     [echo] Compiling plugin: urlnormalizer-regex
    [javac] Compiling 1 source file to http://hudson.zones.apache.org/hudson/job/Nutch-trunk/ws/trunk/build/urlnormalizer-regex/classes 
    [javac] Note: http://hudson.zones.apache.org/hudson/job/Nutch-trunk/ws/trunk/src/plugin/urlnormalizer-regex/src/java/org/apache/nutch/net/urlnormalizer/regex/RegexURLNormalizer.java  uses unchecked or unsafe operations.
    [javac] Note: Recompile with -Xlint:unchecked for details.

jar:
      [jar] Building jar: http://hudson.zones.apache.org/hudson/job/Nutch-trunk/ws/trunk/build/urlnormalizer-regex/urlnormalizer-regex.jar 

deps-test:

init:

init-plugin:

compile:

jar:
      [jar] Warning: skipping jar archive http://hudson.zones.apache.org/hudson/job/Nutch-trunk/ws/trunk/build/nutch-extensionpoints/nutch-extensionpoints.jar  because no files were included.

deps-test:

deploy:

copy-generated-lib:

deploy:
    [mkdir] Created dir: http://hudson.zones.apache.org/hudson/job/Nutch-trunk/ws/trunk/build/plugins/urlnormalizer-regex 
     [copy] Copying 1 file to http://hudson.zones.apache.org/hudson/job/Nutch-trunk/ws/trunk/build/plugins/urlnormalizer-regex 

copy-generated-lib:
     [copy] Copying 1 file to http://hudson.zones.apache.org/hudson/job/Nutch-trunk/ws/trunk/build/plugins/urlnormalizer-regex 

compile:

compile-core-test:
    [javac] Compiling 43 source files to http://hudson.zones.apache.org/hudson/job/Nutch-trunk/ws/trunk/build/test/classes 
    [javac] Note: Some input files use unchecked or unsafe operations.
    [javac] Note: Recompile with -Xlint:unchecked for details.

test-core:
    [mkdir] Created dir: http://hudson.zones.apache.org/hudson/job/Nutch-trunk/ws/trunk/build/test/data 
     [copy] Copying 90 files to http://hudson.zones.apache.org/hudson/job/Nutch-trunk/ws/trunk/build/test/data 
     [copy] Copying 1 file to http://hudson.zones.apache.org/hudson/job/Nutch-trunk/ws/trunk/build/test/classes 
     [copy] Copying 1 file to http://hudson.zones.apache.org/hudson/job/Nutch-trunk/ws/trunk/build/test/classes 
    [junit] Running org.apache.nutch.analysis.TestAnalyzerFactory
    [junit] Tests run: 4, Failures: 0, Errors: 0, Time elapsed: 1.804 sec
    [junit] Running org.apache.nutch.analysis.TestQueryParser
    [junit] Tests run: 1, Failures: 0, Errors: 0, Time elapsed: 0.853 sec
    [junit] Running org.apache.nutch.clustering.TestOnlineClustererFactory
    [junit] Tests run: 1, Failures: 0, Errors: 0, Time elapsed: 1.153 sec
    [junit] Running org.apache.nutch.crawl.TestCrawlDbMerger
    [junit] Tests run: 1, Failures: 0, Errors: 1, Time elapsed: 1.223 sec
    [junit] Test org.apache.nutch.crawl.TestCrawlDbMerger FAILED
    [junit] Running org.apache.nutch.crawl.TestGenerator
    [junit] Tests run: 4, Failures: 0, Errors: 4, Time elapsed: 5.384 sec
    [junit] Test org.apache.nutch.crawl.TestGenerator FAILED
    [junit] Running org.apache.nutch.crawl.TestInjector
    [junit] Tests run: 1, Failures: 0, Errors: 1, Time elapsed: 0.701 sec
    [junit] Test org.apache.nutch.crawl.TestInjector FAILED
    [junit] Running org.apache.nutch.crawl.TestLinkDbMerger
    [junit] Tests run: 1, Failures: 0, Errors: 1, Time elapsed: 1.219 sec
    [junit] Test org.apache.nutch.crawl.TestLinkDbMerger FAILED
    [junit] Running org.apache.nutch.crawl.TestMapWritable
    [junit] Tests run: 5, Failures: 0, Errors: 0, Time elapsed: 62.163 sec
    [junit] Running org.apache.nutch.crawl.TestSignatureFactory
    [junit] Tests run: 1, Failures: 0, Errors: 0, Time elapsed: 0.576 sec
    [junit] Running org.apache.nutch.fetcher.TestFetcher
    [junit] Tests run: 1, Failures: 0, Errors: 1, Time elapsed: 0.891 sec
    [junit] Test org.apache.nutch.fetcher.TestFetcher FAILED
    [junit] Running org.apache.nutch.indexer.TestDeleteDuplicates
    [junit] Tests run: 4, Failures: 0, Errors: 4, Time elapsed: 1.621 sec
    [junit] Test org.apache.nutch.indexer.TestDeleteDuplicates FAILED
    [junit] Running org.apache.nutch.indexer.TestIndexingFilters
    [junit] Tests run: 1, Failures: 0, Errors: 0, Time elapsed: 2.172 sec
    [junit] Running org.apache.nutch.metadata.TestMetadata
    [junit] Tests run: 10, Failures: 0, Errors: 0, Time elapsed: 0.406 sec
    [junit] Running org.apache.nutch.metadata.TestSpellCheckedMetadata
    [junit] Tests run: 11, Failures: 0, Errors: 0, Time elapsed: 14.865 sec
    [junit] Running org.apache.nutch.net.TestURLFilters
    [junit] Tests run: 1, Failures: 0, Errors: 0, Time elapsed: 1.916 sec
    [junit] Running org.apache.nutch.net.TestURLNormalizers
    [junit] Tests run: 1, Failures: 0, Errors: 0, Time elapsed: 0.998 sec
    [junit] Running org.apache.nutch.ontology.TestOntologyFactory
    [junit] Tests run: 1, Failures: 0, Errors: 0, Time elapsed: 2.062 sec
    [junit] Running org.apache.nutch.parse.TestOutlinkExtractor
    [junit] Tests run: 4, Failures: 0, Errors: 0, Time elapsed: 0.322 sec
    [junit] Running org.apache.nutch.parse.TestParseData
    [junit] Tests run: 2, Failures: 0, Errors: 0, Time elapsed: 0.312 sec
    [junit] Running org.apache.nutch.parse.TestParseText
    [junit] Tests run: 1, Failures: 0, Errors: 0, Time elapsed: 0.504 sec
    [junit] Running org.apache.nutch.parse.TestParserFactory
    [junit] Tests run: 2, Failures: 0, Errors: 0, Time elapsed: 1.307 sec
    [junit] Running org.apache.nutch.plugin.TestPluginSystem
    [junit] Tests run: 6, Failures: 0, Errors: 0, Time elapsed: 2.2 sec
    [junit] Running org.apache.nutch.protocol.TestContent
    [junit] Tests run: 2, Failures: 0, Errors: 0, Time elapsed: 0.822 sec
    [junit] Running org.apache.nutch.protocol.TestProtocolFactory
    [junit] Tests run: 2, Failures: 0, Errors: 0, Time elapsed: 1.294 sec
    [junit] Running org.apache.nutch.searcher.TestDistributedSearch
    [junit] Tests run: 2, Failures: 0, Errors: 0, Time elapsed: 3.193 sec
    [junit] Running org.apache.nutch.searcher.TestHitDetails
    [junit] Tests run: 1, Failures: 0, Errors: 0, Time elapsed: 0.311 sec
    [junit] Running org.apache.nutch.searcher.TestOpenSearchServlet
    [junit] Tests run: 1, Failures: 0, Errors: 0, Time elapsed: 0.32 sec
    [junit] Running org.apache.
nutch.searcher.TestQuery
    [junit] Tests run: 6, Failures: 0, Errors: 0, Time elapsed: 0.87 sec
    [junit] Running org.apache.nutch.searcher.TestSummarizerFactory
    [junit] Tests run: 1, Failures: 0, Errors: 0, Time elapsed: 1.052 sec
    [junit] Running org.apache.nutch.searcher.TestSummary
    [junit] Tests run: 8, Failures: 0, Errors: 0, Time elapsed: 0.41 sec
    [junit] Running org.apache.nutch.util.TestEncodingDetector
    [junit] Tests run: 1, Failures: 0, Errors: 0, Time elapsed: 0.802 sec
    [junit] Running org.apache.nutch.util.TestGZIPUtils
    [junit] Tests run: 4, Failures: 0, Errors: 0, Time elapsed: 1.501 sec
    [junit] Running org.apache.nutch.util.TestNodeWalker
    [junit] Tests run: 1, Failures: 0, Errors: 0, Time elapsed: 2.067 sec
    [junit] Running org.apache.nutch.util.TestPrefixStringMatcher
    [junit] Tests run: 1, Failures: 0, Errors: 0, Time elapsed: 0.417 sec
    [junit] Running org.apache.nutch.util.TestStringUtil
    [junit] Tests run: 2, Failures: 0, Errors: 0, Time elapsed: 0.308 sec
    [junit] Running org.apache.nutch.util.TestSuffixStringMatcher
    [junit] Tests run: 1, Failures: 0, Errors: 0, Time elapsed: 0.421 sec
    [junit] Running org.apache.nutch.util.TestURLUtil
    [junit] Tests run: 3, Failures: 0, Errors: 0, Time elapsed: 0.728 sec

BUILD FAILED
http://hudson.zones.apache.org/hudson/job/Nutch-trunk/ws/trunk/build.xml :298: Tests failed!

Total time: 2 minutes 53 seconds
ERROR: No artifacts found that match the file pattern "trunk/build/*.tar.gz". Configuration error?
ERROR: 'trunk/build/*.tar.gz' doesn't match anything: 'trunk' exists but not 'trunk/build/*.tar.gz'
Publishing Javadoc
Recording test results

Reply | Threaded
Open this post in threaded view
|

Build failed in Hudson: Nutch-trunk #368

Apache Hudson Server
See http://hudson.zones.apache.org/hudson/job/Nutch-trunk/368/changes

------------------------------------------
[...truncated 4599 lines...]

copy-generated-lib:
     [copy] Copying 1 file to http://hudson.zones.apache.org/hudson/job/Nutch-trunk/ws/trunk/build/plugins/urlfilter-regex 

init:
    [mkdir] Created dir: http://hudson.zones.apache.org/hudson/job/Nutch-trunk/ws/trunk/build/urlfilter-suffix 
    [mkdir] Created dir: http://hudson.zones.apache.org/hudson/job/Nutch-trunk/ws/trunk/build/urlfilter-suffix/classes 
    [mkdir] Created dir: http://hudson.zones.apache.org/hudson/job/Nutch-trunk/ws/trunk/build/urlfilter-suffix/test 

init-plugin:

deps-jar:

compile:
     [echo] Compiling plugin: urlfilter-suffix
    [javac] Compiling 1 source file to http://hudson.zones.apache.org/hudson/job/Nutch-trunk/ws/trunk/build/urlfilter-suffix/classes 
    [javac] Note: http://hudson.zones.apache.org/hudson/job/Nutch-trunk/ws/trunk/src/plugin/urlfilter-suffix/src/java/org/apache/nutch/urlfilter/suffix/SuffixURLFilter.java  uses unchecked or unsafe operations.
    [javac] Note: Recompile with -Xlint:unchecked for details.

jar:
      [jar] Building jar: http://hudson.zones.apache.org/hudson/job/Nutch-trunk/ws/trunk/build/urlfilter-suffix/urlfilter-suffix.jar 

deps-test:

deploy:
    [mkdir] Created dir: http://hudson.zones.apache.org/hudson/job/Nutch-trunk/ws/trunk/build/plugins/urlfilter-suffix 
     [copy] Copying 1 file to http://hudson.zones.apache.org/hudson/job/Nutch-trunk/ws/trunk/build/plugins/urlfilter-suffix 

copy-generated-lib:
     [copy] Copying 1 file to http://hudson.zones.apache.org/hudson/job/Nutch-trunk/ws/trunk/build/plugins/urlfilter-suffix 

init:
    [mkdir] Created dir: http://hudson.zones.apache.org/hudson/job/Nutch-trunk/ws/trunk/build/urlfilter-validator 
    [mkdir] Created dir: http://hudson.zones.apache.org/hudson/job/Nutch-trunk/ws/trunk/build/urlfilter-validator/classes 
    [mkdir] Created dir: http://hudson.zones.apache.org/hudson/job/Nutch-trunk/ws/trunk/build/urlfilter-validator/test 

init-plugin:

deps-jar:

compile:
     [echo] Compiling plugin: urlfilter-validator
    [javac] Compiling 1 source file to http://hudson.zones.apache.org/hudson/job/Nutch-trunk/ws/trunk/build/urlfilter-validator/classes 

jar:
      [jar] Building jar: http://hudson.zones.apache.org/hudson/job/Nutch-trunk/ws/trunk/build/urlfilter-validator/urlfilter-validator.jar 

deps-test:

deploy:
    [mkdir] Created dir: http://hudson.zones.apache.org/hudson/job/Nutch-trunk/ws/trunk/build/plugins/urlfilter-validator 
     [copy] Copying 1 file to http://hudson.zones.apache.org/hudson/job/Nutch-trunk/ws/trunk/build/plugins/urlfilter-validator 

copy-generated-lib:
     [copy] Copying 1 file to http://hudson.zones.apache.org/hudson/job/Nutch-trunk/ws/trunk/build/plugins/urlfilter-validator 

init:
    [mkdir] Created dir: http://hudson.zones.apache.org/hudson/job/Nutch-trunk/ws/trunk/build/urlnormalizer-basic 
    [mkdir] Created dir: http://hudson.zones.apache.org/hudson/job/Nutch-trunk/ws/trunk/build/urlnormalizer-basic/classes 
    [mkdir] Created dir: http://hudson.zones.apache.org/hudson/job/Nutch-trunk/ws/trunk/build/urlnormalizer-basic/test 

init-plugin:

deps-jar:

compile:
     [echo] Compiling plugin: urlnormalizer-basic
    [javac] Compiling 1 source file to http://hudson.zones.apache.org/hudson/job/Nutch-trunk/ws/trunk/build/urlnormalizer-basic/classes 

jar:
      [jar] Building jar: http://hudson.zones.apache.org/hudson/job/Nutch-trunk/ws/trunk/build/urlnormalizer-basic/urlnormalizer-basic.jar 

deps-test:

deploy:
    [mkdir] Created dir: http://hudson.zones.apache.org/hudson/job/Nutch-trunk/ws/trunk/build/plugins/urlnormalizer-basic 
     [copy] Copying 1 file to http://hudson.zones.apache.org/hudson/job/Nutch-trunk/ws/trunk/build/plugins/urlnormalizer-basic 

copy-generated-lib:
     [copy] Copying 1 file to http://hudson.zones.apache.org/hudson/job/Nutch-trunk/ws/trunk/build/plugins/urlnormalizer-basic 

init:
    [mkdir] Created dir: http://hudson.zones.apache.org/hudson/job/Nutch-trunk/ws/trunk/build/urlnormalizer-pass 
    [mkdir] Created dir: http://hudson.zones.apache.org/hudson/job/Nutch-trunk/ws/trunk/build/urlnormalizer-pass/classes 
    [mkdir] Created dir: http://hudson.zones.apache.org/hudson/job/Nutch-trunk/ws/trunk/build/urlnormalizer-pass/test 

init-plugin:

deps-jar:

compile:
     [echo] Compiling plugin: urlnormalizer-pass
    [javac] Compiling 1 source file to http://hudson.zones.apache.org/hudson/job/Nutch-trunk/ws/trunk/build/urlnormalizer-pass/classes 

jar:
      [jar] Building jar: http://hudson.zones.apache.org/hudson/job/Nutch-trunk/ws/trunk/build/urlnormalizer-pass/urlnormalizer-pass.jar 

deps-test:

deploy:
    [mkdir] Created dir: http://hudson.zones.apache.org/hudson/job/Nutch-trunk/ws/trunk/build/plugins/urlnormalizer-pass 
     [copy] Copying 1 file to http://hudson.zones.apache.org/hudson/job/Nutch-trunk/ws/trunk/build/plugins/urlnormalizer-pass 

copy-generated-lib:
     [copy] Copying 1 file to http://hudson.zones.apache.org/hudson/job/Nutch-trunk/ws/trunk/build/plugins/urlnormalizer-pass 
    [mkdir] Created dir: http://hudson.zones.apache.org/hudson/job/Nutch-trunk/ws/trunk/build/urlnormalizer-regex/test/data 
     [copy] Copying 4 files to http://hudson.zones.apache.org/hudson/job/Nutch-trunk/ws/trunk/build/urlnormalizer-regex/test/data 

init:
    [mkdir] Created dir: http://hudson.zones.apache.org/hudson/job/Nutch-trunk/ws/trunk/build/urlnormalizer-regex/classes 

init-plugin:

deps-jar:

compile:
     [echo] Compiling plugin: urlnormalizer-regex
    [javac] Compiling 1 source file to http://hudson.zones.apache.org/hudson/job/Nutch-trunk/ws/trunk/build/urlnormalizer-regex/classes 
    [javac] Note: http://hudson.zones.apache.org/hudson/job/Nutch-trunk/ws/trunk/src/plugin/urlnormalizer-regex/src/java/org/apache/nutch/net/urlnormalizer/regex/RegexURLNormalizer.java  uses unchecked or unsafe operations.
    [javac] Note: Recompile with -Xlint:unchecked for details.

jar:
      [jar] Building jar: http://hudson.zones.apache.org/hudson/job/Nutch-trunk/ws/trunk/build/urlnormalizer-regex/urlnormalizer-regex.jar 

deps-test:

init:

init-plugin:

compile:

jar:
      [jar] Warning: skipping jar archive http://hudson.zones.apache.org/hudson/job/Nutch-trunk/ws/trunk/build/nutch-extensionpoints/nutch-extensionpoints.jar  because no files were included.

deps-test:

deploy:

copy-generated-lib:

deploy:
    [mkdir] Created dir: http://hudson.zones.apache.org/hudson/job/Nutch-trunk/ws/trunk/build/plugins/urlnormalizer-regex 
     [copy] Copying 1 file to http://hudson.zones.apache.org/hudson/job/Nutch-trunk/ws/trunk/build/plugins/urlnormalizer-regex 

copy-generated-lib:
     [copy] Copying 1 file to http://hudson.zones.apache.org/hudson/job/Nutch-trunk/ws/trunk/build/plugins/urlnormalizer-regex 

compile:

compile-core-test:
    [javac] Compiling 43 source files to http://hudson.zones.apache.org/hudson/job/Nutch-trunk/ws/trunk/build/test/classes 
    [javac] Note: Some input files use unchecked or unsafe operations.
    [javac] Note: Recompile with -Xlint:unchecked for details.

test-core:
    [mkdir] Created dir: http://hudson.zones.apache.org/hudson/job/Nutch-trunk/ws/trunk/build/test/data 
     [copy] Copying 90 files to http://hudson.zones.apache.org/hudson/job/Nutch-trunk/ws/trunk/build/test/data 
     [copy] Copying 1 file to http://hudson.zones.apache.org/hudson/job/Nutch-trunk/ws/trunk/build/test/classes 
     [copy] Copying 1 file to http://hudson.zones.apache.org/hudson/job/Nutch-trunk/ws/trunk/build/test/classes 
    [junit] Running org.apache.nutch.analysis.TestAnalyzerFactory
    [junit] Tests run: 4, Failures: 0, Errors: 0, Time elapsed: 2.464 sec
    [junit] Running org.apache.nutch.analysis.TestQueryParser
    [junit] Tests run: 1, Failures: 0, Errors: 0, Time elapsed: 0.966 sec
    [junit] Running org.apache.nutch.clustering.TestOnlineClustererFactory
    [junit] Tests run: 1, Failures: 0, Errors: 0, Time elapsed: 1.292 sec
    [junit] Running org.apache.nutch.crawl.TestCrawlDbMerger
    [junit] Tests run: 1, Failures: 0, Errors: 1, Time elapsed: 1.255 sec
    [junit] Test org.apache.nutch.crawl.TestCrawlDbMerger FAILED
    [junit] Running org.apache.nutch.crawl.TestGenerator
    [junit] Tests run: 4, Failures: 0, Errors: 4, Time elapsed: 5.86 sec
    [junit] Test org.apache.nutch.crawl.TestGenerator FAILED
    [junit] Running org.apache.nutch.crawl.TestInjector
    [junit] Tests run: 1, Failures: 0, Errors: 1, Time elapsed: 0.78 sec
    [junit] Test org.apache.nutch.crawl.TestInjector FAILED
    [junit] Running org.apache.nutch.crawl.TestLinkDbMerger
    [junit] Tests run: 1, Failures: 0, Errors: 1, Time elapsed: 1.232 sec
    [junit] Test org.apache.nutch.crawl.TestLinkDbMerger FAILED
    [junit] Running org.apache.nutch.crawl.TestMapWritable
    [junit] Tests run: 5, Failures: 0, Errors: 0, Time elapsed: 65.782 sec
    [junit] Running org.apache.nutch.crawl.TestSignatureFactory
    [junit] Tests run: 1, Failures: 0, Errors: 0, Time elapsed: 0.581 sec
    [junit] Running org.apache.nutch.fetcher.TestFetcher
    [junit] Tests run: 1, Failures: 0, Errors: 1, Time elapsed: 1.018 sec
    [junit] Test org.apache.nutch.fetcher.TestFetcher FAILED
    [junit] Running org.apache.nutch.indexer.TestDeleteDuplicates
    [junit] Tests run: 4, Failures: 0, Errors: 4, Time elapsed: 2.023 sec
    [junit] Test org.apache.nutch.indexer.TestDeleteDuplicates FAILED
    [junit] Running org.apache.nutch.indexer.TestIndexingFilters
    [junit] Tests run: 1, Failures: 0, Errors: 0, Time elapsed: 2.237 sec
    [junit] Running org.apache.nutch.metadata.TestMetadata
    [junit] Tests run: 10, Failures: 0, Errors: 0, Time elapsed: 0.431 sec
    [junit] Running org.apache.nutch.metadata.TestSpellCheckedMetadata
    [junit] Tests run: 11, Failures: 0, Errors: 0, Time elapsed: 15.089 sec
    [junit] Running org.apache.nutch.net.TestURLFilters
    [junit] Tests run: 1, Failures: 0, Errors: 0, Time elapsed: 1.585 sec
    [junit] Running org.apache.nutch.net.TestURLNormalizers
    [junit] Tests run: 1, Failures: 0, Errors: 0, Time elapsed: 1.045 sec
    [junit] Running org.apache.nutch.ontology.TestOntologyFactory
    [junit] Tests run: 1, Failures: 0, Errors: 0, Time elapsed: 2.174 sec
    [junit] Running org.apache.nutch.parse.TestOutlinkExtractor
    [junit] Tests run: 4, Failures: 0, Errors: 0, Time elapsed: 0.338 sec
    [junit] Running org.apache.nutch.parse.TestParseData
    [junit] Tests run: 2, Failures: 0, Errors: 0, Time elapsed: 0.336 sec
    [junit] Running org.apache.nutch.parse.TestParseText
    [junit] Tests run: 1, Failures: 0, Errors: 0, Time elapsed: 0.43 sec
    [junit] Running org.apache.nutch.parse.TestParserFactory
    [junit] Tests run: 2, Failures: 0, Errors: 0, Time elapsed: 1.534 sec
    [junit] Running org.apache.nutch.plugin.TestPluginSystem
    [junit] Tests run: 6, Failures: 0, Errors: 0, Time elapsed: 2.376 sec
    [junit] Running org.apache.nutch.protocol.TestContent
    [junit] Tests run: 2, Failures: 0, Errors: 0, Time elapsed: 1.186 sec
    [junit] Running org.apache.nutch.protocol.TestProtocolFactory
    [junit] Tests run: 2, Failures: 0, Errors: 0, Time elapsed: 1.253 sec
    [junit] Running org.apache.nutch.searcher.TestDistributedSearch
    [junit] Tests run: 2, Failures: 0, Errors: 0, Time elapsed: 3.885 sec
    [junit] Running org.apache.nutch.searcher.TestHitDetails
    [junit] Tests run: 1, Failures: 0, Errors: 0, Time elapsed: 0.34 sec
    [junit] Running org.apache.nutch.searcher.TestOpenSearchServlet
    [junit] Tests run: 1, Failures: 0, Errors: 0, Time elapsed: 0.346 sec
    [junit] Running org.apache.nutch.searcher.TestQuery
    [junit] Tests run: 6, Failures: 0, Errors: 0, Time elapsed: 0.973 sec
    [junit] Running org.apache.nutch.searcher.TestSummarizerFactory
    [junit] Tests run: 1, Failures: 0, Errors: 0, Time elapsed: 1.03 sec
    [junit] Running org.apache.nutch.searcher.TestSummary
    [junit] Tests run: 8, Failures: 0, Errors: 0, Time elapsed: 0.429 sec
    [junit] Running org.apache.nutch.util.TestEncodingDetector
    [junit] Tests run: 1, Failures: 0, Errors: 0, Time elapsed: 0.858 sec
    [junit] Running org.apache.nutch.util.TestGZIPUtils
    [junit] Tests run: 4, Failures: 0, Errors: 0, Time elapsed: 1.572 sec
    [junit] Running org.apache.nutch.util.TestNodeWalker
    [junit] Tests run: 1, Failures: 0, Errors: 0, Time elapsed: 2.292 sec
    [junit] Running org.apache.nutch.util.TestPrefixStringMatcher
    [junit] Tests run: 1, Failures: 0, Errors: 0, Time elapsed: 0.5 sec
    [junit] Running org.apache.nutch.util.TestStringUtil
    [junit] Tests run: 2, Failures: 0, Errors: 0, Time elapsed: 0.348 sec
    [junit] Running org.apache.nutch.util.TestSuffixStringMatcher
    [junit] Tests run: 1, Failures: 0, Errors: 0, Time elapsed: 0.479 sec
    [junit] Running org.apache.nutch.util.TestURLUtil
    [junit] Tests run: 3, Failures: 0, Errors: 0, Time elapsed: 0.816 sec

BUILD FAILED
http://hudson.zones.apache.org/hudson/job/Nutch-trunk/ws/trunk/build.xml :298: Tests failed!

Total time: 3 minutes 7 seconds
ERROR: No artifacts found that match the file pattern "trunk/build/*.tar.gz". Configuration error?
ERROR: 'trunk/build/*.tar.gz' doesn't match anything: 'trunk' exists but not 'trunk/build/*.tar.gz'
Publishing Javadoc
Recording test results

Reply | Threaded
Open this post in threaded view
|

Build failed in Hudson: Nutch-trunk #369

Apache Hudson Server
See http://hudson.zones.apache.org/hudson/job/Nutch-trunk/369/changes

------------------------------------------
[...truncated 4599 lines...]

copy-generated-lib:
     [copy] Copying 1 file to http://hudson.zones.apache.org/hudson/job/Nutch-trunk/ws/trunk/build/plugins/urlfilter-regex 

init:
    [mkdir] Created dir: http://hudson.zones.apache.org/hudson/job/Nutch-trunk/ws/trunk/build/urlfilter-suffix 
    [mkdir] Created dir: http://hudson.zones.apache.org/hudson/job/Nutch-trunk/ws/trunk/build/urlfilter-suffix/classes 
    [mkdir] Created dir: http://hudson.zones.apache.org/hudson/job/Nutch-trunk/ws/trunk/build/urlfilter-suffix/test 

init-plugin:

deps-jar:

compile:
     [echo] Compiling plugin: urlfilter-suffix
    [javac] Compiling 1 source file to http://hudson.zones.apache.org/hudson/job/Nutch-trunk/ws/trunk/build/urlfilter-suffix/classes 
    [javac] Note: http://hudson.zones.apache.org/hudson/job/Nutch-trunk/ws/trunk/src/plugin/urlfilter-suffix/src/java/org/apache/nutch/urlfilter/suffix/SuffixURLFilter.java  uses unchecked or unsafe operations.
    [javac] Note: Recompile with -Xlint:unchecked for details.

jar:
      [jar] Building jar: http://hudson.zones.apache.org/hudson/job/Nutch-trunk/ws/trunk/build/urlfilter-suffix/urlfilter-suffix.jar 

deps-test:

deploy:
    [mkdir] Created dir: http://hudson.zones.apache.org/hudson/job/Nutch-trunk/ws/trunk/build/plugins/urlfilter-suffix 
     [copy] Copying 1 file to http://hudson.zones.apache.org/hudson/job/Nutch-trunk/ws/trunk/build/plugins/urlfilter-suffix 

copy-generated-lib:
     [copy] Copying 1 file to http://hudson.zones.apache.org/hudson/job/Nutch-trunk/ws/trunk/build/plugins/urlfilter-suffix 

init:
    [mkdir] Created dir: http://hudson.zones.apache.org/hudson/job/Nutch-trunk/ws/trunk/build/urlfilter-validator 
    [mkdir] Created dir: http://hudson.zones.apache.org/hudson/job/Nutch-trunk/ws/trunk/build/urlfilter-validator/classes 
    [mkdir] Created dir: http://hudson.zones.apache.org/hudson/job/Nutch-trunk/ws/trunk/build/urlfilter-validator/test 

init-plugin:

deps-jar:

compile:
     [echo] Compiling plugin: urlfilter-validator
    [javac] Compiling 1 source file to http://hudson.zones.apache.org/hudson/job/Nutch-trunk/ws/trunk/build/urlfilter-validator/classes 

jar:
      [jar] Building jar: http://hudson.zones.apache.org/hudson/job/Nutch-trunk/ws/trunk/build/urlfilter-validator/urlfilter-validator.jar 

deps-test:

deploy:
    [mkdir] Created dir: http://hudson.zones.apache.org/hudson/job/Nutch-trunk/ws/trunk/build/plugins/urlfilter-validator 
     [copy] Copying 1 file to http://hudson.zones.apache.org/hudson/job/Nutch-trunk/ws/trunk/build/plugins/urlfilter-validator 

copy-generated-lib:
     [copy] Copying 1 file to http://hudson.zones.apache.org/hudson/job/Nutch-trunk/ws/trunk/build/plugins/urlfilter-validator 

init:
    [mkdir] Created dir: http://hudson.zones.apache.org/hudson/job/Nutch-trunk/ws/trunk/build/urlnormalizer-basic 
    [mkdir] Created dir: http://hudson.zones.apache.org/hudson/job/Nutch-trunk/ws/trunk/build/urlnormalizer-basic/classes 
    [mkdir] Created dir: http://hudson.zones.apache.org/hudson/job/Nutch-trunk/ws/trunk/build/urlnormalizer-basic/test 

init-plugin:

deps-jar:

compile:
     [echo] Compiling plugin: urlnormalizer-basic
    [javac] Compiling 1 source file to http://hudson.zones.apache.org/hudson/job/Nutch-trunk/ws/trunk/build/urlnormalizer-basic/classes 

jar:
      [jar] Building jar: http://hudson.zones.apache.org/hudson/job/Nutch-trunk/ws/trunk/build/urlnormalizer-basic/urlnormalizer-basic.jar 

deps-test:

deploy:
    [mkdir] Created dir: http://hudson.zones.apache.org/hudson/job/Nutch-trunk/ws/trunk/build/plugins/urlnormalizer-basic 
     [copy] Copying 1 file to http://hudson.zones.apache.org/hudson/job/Nutch-trunk/ws/trunk/build/plugins/urlnormalizer-basic 

copy-generated-lib:
     [copy] Copying 1 file to http://hudson.zones.apache.org/hudson/job/Nutch-trunk/ws/trunk/build/plugins/urlnormalizer-basic 

init:
    [mkdir] Created dir: http://hudson.zones.apache.org/hudson/job/Nutch-trunk/ws/trunk/build/urlnormalizer-pass 
    [mkdir] Created dir: http://hudson.zones.apache.org/hudson/job/Nutch-trunk/ws/trunk/build/urlnormalizer-pass/classes 
    [mkdir] Created dir: http://hudson.zones.apache.org/hudson/job/Nutch-trunk/ws/trunk/build/urlnormalizer-pass/test 

init-plugin:

deps-jar:

compile:
     [echo] Compiling plugin: urlnormalizer-pass
    [javac] Compiling 1 source file to http://hudson.zones.apache.org/hudson/job/Nutch-trunk/ws/trunk/build/urlnormalizer-pass/classes 

jar:
      [jar] Building jar: http://hudson.zones.apache.org/hudson/job/Nutch-trunk/ws/trunk/build/urlnormalizer-pass/urlnormalizer-pass.jar 

deps-test:

deploy:
    [mkdir] Created dir: http://hudson.zones.apache.org/hudson/job/Nutch-trunk/ws/trunk/build/plugins/urlnormalizer-pass 
     [copy] Copying 1 file to http://hudson.zones.apache.org/hudson/job/Nutch-trunk/ws/trunk/build/plugins/urlnormalizer-pass 

copy-generated-lib:
     [copy] Copying 1 file to http://hudson.zones.apache.org/hudson/job/Nutch-trunk/ws/trunk/build/plugins/urlnormalizer-pass 
    [mkdir] Created dir: http://hudson.zones.apache.org/hudson/job/Nutch-trunk/ws/trunk/build/urlnormalizer-regex/test/data 
     [copy] Copying 4 files to http://hudson.zones.apache.org/hudson/job/Nutch-trunk/ws/trunk/build/urlnormalizer-regex/test/data 

init:
    [mkdir] Created dir: http://hudson.zones.apache.org/hudson/job/Nutch-trunk/ws/trunk/build/urlnormalizer-regex/classes 

init-plugin:

deps-jar:

compile:
     [echo] Compiling plugin: urlnormalizer-regex
    [javac] Compiling 1 source file to http://hudson.zones.apache.org/hudson/job/Nutch-trunk/ws/trunk/build/urlnormalizer-regex/classes 
    [javac] Note: http://hudson.zones.apache.org/hudson/job/Nutch-trunk/ws/trunk/src/plugin/urlnormalizer-regex/src/java/org/apache/nutch/net/urlnormalizer/regex/RegexURLNormalizer.java  uses unchecked or unsafe operations.
    [javac] Note: Recompile with -Xlint:unchecked for details.

jar:
      [jar] Building jar: http://hudson.zones.apache.org/hudson/job/Nutch-trunk/ws/trunk/build/urlnormalizer-regex/urlnormalizer-regex.jar 

deps-test:

init:

init-plugin:

compile:

jar:
      [jar] Warning: skipping jar archive http://hudson.zones.apache.org/hudson/job/Nutch-trunk/ws/trunk/build/nutch-extensionpoints/nutch-extensionpoints.jar  because no files were included.

deps-test:

deploy:

copy-generated-lib:

deploy:
    [mkdir] Created dir: http://hudson.zones.apache.org/hudson/job/Nutch-trunk/ws/trunk/build/plugins/urlnormalizer-regex 
     [copy] Copying 1 file to http://hudson.zones.apache.org/hudson/job/Nutch-trunk/ws/trunk/build/plugins/urlnormalizer-regex 

copy-generated-lib:
     [copy] Copying 1 file to http://hudson.zones.apache.org/hudson/job/Nutch-trunk/ws/trunk/build/plugins/urlnormalizer-regex 

compile:

compile-core-test:
    [javac] Compiling 43 source files to http://hudson.zones.apache.org/hudson/job/Nutch-trunk/ws/trunk/build/test/classes 
    [javac] Note: Some input files use unchecked or unsafe operations.
    [javac] Note: Recompile with -Xlint:unchecked for details.

test-core:
    [mkdir] Created dir: http://hudson.zones.apache.org/hudson/job/Nutch-trunk/ws/trunk/build/test/data 
     [copy] Copying 90 files to http://hudson.zones.apache.org/hudson/job/Nutch-trunk/ws/trunk/build/test/data 
     [copy] Copying 1 file to http://hudson.zones.apache.org/hudson/job/Nutch-trunk/ws/trunk/build/test/classes 
     [copy] Copying 1 file to http://hudson.zones.apache.org/hudson/job/Nutch-trunk/ws/trunk/build/test/classes 
    [junit] Running org.apache.nutch.analysis.TestAnalyzerFactory
    [junit] Tests run: 4, Failures: 0, Errors: 0, Time elapsed: 1.763 sec
    [junit] Running org.apache.nutch.analysis.TestQueryParser
    [junit] Tests run: 1, Failures: 0, Errors: 0, Time elapsed: 0.832 sec
    [junit] Running org.apache.nutch.clustering.TestOnlineClustererFactory
    [junit] Tests run: 1, Failures: 0, Errors: 0, Time elapsed: 1.162 sec
    [junit] Running org.apache.nutch.crawl.TestCrawlDbMerger
    [junit] Tests run: 1, Failures: 0, Errors: 1, Time elapsed: 1.207 sec
    [junit] Test org.apache.nutch.crawl.TestCrawlDbMerger FAILED
    [junit] Running org.apache.nutch.crawl.TestGenerator
    [junit] Tests run: 4, Failures: 0, Errors: 4, Time elapsed: 5.444 sec
    [junit] Test org.apache.nutch.crawl.TestGenerator FAILED
    [junit] Running org.apache.nutch.crawl.TestInjector
    [junit] Tests run: 1, Failures: 0, Errors: 1, Time elapsed: 0.701 sec
    [junit] Test org.apache.nutch.crawl.TestInjector FAILED
    [junit] Running org.apache.nutch.crawl.TestLinkDbMerger
    [junit] Tests run: 1, Failures: 0, Errors: 1, Time elapsed: 1.136 sec
    [junit] Test org.apache.nutch.crawl.TestLinkDbMerger FAILED
    [junit] Running org.apache.nutch.crawl.TestMapWritable
    [junit] Tests run: 5, Failures: 0, Errors: 0, Time elapsed: 61.851 sec
    [junit] Running org.apache.nutch.crawl.TestSignatureFactory
    [junit] Tests run: 1, Failures: 0, Errors: 0, Time elapsed: 0.534 sec
    [junit] Running org.apache.nutch.fetcher.TestFetcher
    [junit] Tests run: 1, Failures: 0, Errors: 1, Time elapsed: 0.92 sec
    [junit] Test org.apache.nutch.fetcher.TestFetcher FAILED
    [junit] Running org.apache.nutch.indexer.TestDeleteDuplicates
    [junit] Tests run: 4, Failures: 0, Errors: 4, Time elapsed: 1.656 sec
    [junit] Test org.apache.nutch.indexer.TestDeleteDuplicates FAILED
    [junit] Running org.apache.nutch.indexer.TestIndexingFilters
    [junit] Tests run: 1, Failures: 0, Errors: 0, Time elapsed: 2.214 sec
    [junit] Running org.apache.nutch.metadata.TestMetadata
    [junit] Tests run: 10, Failures: 0, Errors: 0, Time elapsed: 0.408 sec
    [junit] Running org.apache.nutch.metadata.TestSpellCheckedMetadata
    [junit] Tests run: 11, Failures: 0, Errors: 0, Time elapsed: 14.676 sec
    [junit] Running org.apache.nutch.net.TestURLFilters
    [junit] Tests run: 1, Failures: 0, Errors: 0, Time elapsed: 1.675 sec
    [junit] Running org.apache.nutch.net.TestURLNormalizers
    [junit] Tests run: 1, Failures: 0, Errors: 0, Time elapsed: 0.981 sec
    [junit] Running org.apache.nutch.ontology.TestOntologyFactory
    [junit] Tests run: 1, Failures: 0, Errors: 0, Time elapsed: 2.057 sec
    [junit] Running org.apache.nutch.parse.TestOutlinkExtractor
    [junit] Tests run: 4, Failures: 0, Errors: 0, Time elapsed: 0.32 sec
    [junit] Running org.apache.nutch.parse.TestParseData
    [junit] Tests run: 2, Failures: 0, Errors: 0, Time elapsed: 0.307 sec
    [junit] Running org.apache.nutch.parse.TestParseText
    [junit] Tests run: 1, Failures: 0, Errors: 0, Time elapsed: 0.417 sec
    [junit] Running org.apache.nutch.parse.TestParserFactory
    [junit] Tests run: 2, Failures: 0, Errors: 0, Time elapsed: 1.33 sec
    [junit] Running org.apache.nutch.plugin.TestPluginSystem
    [junit] Tests run: 6, Failures: 0, Errors: 0, Time elapsed: 2.214 sec
    [junit] Running org.apache.nutch.protocol.TestContent
    [junit] Tests run: 2, Failures: 0, Errors: 0, Time elapsed: 0.781 sec
    [junit] Running org.apache.nutch.protocol.TestProtocolFactory
    [junit] Tests run: 2, Failures: 0, Errors: 0, Time elapsed: 1.283 sec
    [junit] Running org.apache.nutch.searcher.TestDistributedSearch
    [junit] Tests run: 2, Failures: 0, Errors: 0, Time elapsed: 3.206 sec
    [junit] Running org.apache.nutch.searcher.TestHitDetails
    [junit] Tests run: 1, Failures: 0, Errors: 0, Time elapsed: 0.311 sec
    [junit] Running org.apache.nutch.searcher.TestOpenSearchServlet
    [junit] Tests run: 1, Failures: 0, Errors: 0, Time elapsed: 0.323 sec
    [junit] Running org.apache.nutch.searcher.TestQuery
    [junit] Tests run: 6, Failures: 0, Errors: 0, Time elapsed: 0.883 sec
    [junit] Running org.apache.nutch.searcher.TestSummarizerFactory
    [junit] Tests run: 1, Failures: 0, Errors: 0, Time elapsed: 0.961 sec
    [junit] Running org.apache.nutch.searcher.TestSummary
    [junit] Tests run: 8, Failures: 0, Errors: 0, Time elapsed: 0.424 sec
    [junit] Running org.apache.nutch.util.TestEncodingDetector
    [junit] Tests run: 1, Failures: 0, Errors: 0, Time elapsed: 0.755 sec
    [junit] Running org.apache.nutch.util.TestGZIPUtils
    [junit] Tests run: 4, Failures: 0, Errors: 0, Time elapsed: 1.509 sec
    [junit] Running org.apache.nutch.util.TestNodeWalker
    [junit] Tests run: 1, Failures: 0, Errors: 0, Time elapsed: 2.043 sec
    [junit] Running org.apache.nutch.util.TestPrefixStringMatcher
    [junit] Tests run: 1, Failures: 0, Errors: 0, Time elapsed: 0.432 sec
    [junit] Running org.apache.nutch.util.TestStringUtil
    [junit] Tests run: 2, Failures: 0, Errors: 0, Time elapsed: 0.298 sec
    [junit] Running org.apache.nutch.util.TestSuffixStringMatcher
    [junit] Tests run: 1, Failures: 0, Errors: 0, Time elapsed: 0.432 sec
    [junit] Running org.apache.nutch.util.TestURLUtil
    [junit] Tests run: 3, Failures: 0, Errors: 0, Time elapsed: 0.747 sec

BUILD FAILED
http://hudson.zones.apache.org/hudson/job/Nutch-trunk/ws/trunk/build.xml :298: Tests failed!

Total time: 2 minutes 49 seconds
ERROR: No artifacts found that match the file pattern "trunk/build/*.tar.gz". Configuration error?
ERROR: 'trunk/build/*.tar.gz' doesn't match anything: 'trunk' exists but not 'trunk/build/*.tar.gz'
Publishing Javadoc
Recording test results


Reply | Threaded
Open this post in threaded view
|

Build failed in Hudson: Nutch-trunk #370

Apache Hudson Server
See http://hudson.zones.apache.org/hudson/job/Nutch-trunk/370/changes

Changes:

[dogacan] NUTCH-567 - Proper (?) handling of URIs in TagSoup.

------------------------------------------
[...truncated 4599 lines...]
copy-generated-lib:
     [copy] Copying 1 file to http://hudson.zones.apache.org/hudson/job/Nutch-trunk/ws/trunk/build/plugins/urlfilter-regex 

init:
    [mkdir] Created dir: http://hudson.zones.apache.org/hudson/job/Nutch-trunk/ws/trunk/build/urlfilter-suffix 
    [mkdir] Created dir: http://hudson.zones.apache.org/hudson/job/Nutch-trunk/ws/trunk/build/urlfilter-suffix/classes 
    [mkdir] Created dir: http://hudson.zones.apache.org/hudson/job/Nutch-trunk/ws/trunk/build/urlfilter-suffix/test 

init-plugin:

deps-jar:

compile:
     [echo] Compiling plugin: urlfilter-suffix
    [javac] Compiling 1 source file to http://hudson.zones.apache.org/hudson/job/Nutch-trunk/ws/trunk/build/urlfilter-suffix/classes 
    [javac] Note: http://hudson.zones.apache.org/hudson/job/Nutch-trunk/ws/trunk/src/plugin/urlfilter-suffix/src/java/org/apache/nutch/urlfilter/suffix/SuffixURLFilter.java  uses unchecked or unsafe operations.
    [javac] Note: Recompile with -Xlint:unchecked for details.

jar:
      [jar] Building jar: http://hudson.zones.apache.org/hudson/job/Nutch-trunk/ws/trunk/build/urlfilter-suffix/urlfilter-suffix.jar 

deps-test:

deploy:
    [mkdir] Created dir: http://hudson.zones.apache.org/hudson/job/Nutch-trunk/ws/trunk/build/plugins/urlfilter-suffix 
     [copy] Copying 1 file to http://hudson.zones.apache.org/hudson/job/Nutch-trunk/ws/trunk/build/plugins/urlfilter-suffix 

copy-generated-lib:
     [copy] Copying 1 file to http://hudson.zones.apache.org/hudson/job/Nutch-trunk/ws/trunk/build/plugins/urlfilter-suffix 

init:
    [mkdir] Created dir: http://hudson.zones.apache.org/hudson/job/Nutch-trunk/ws/trunk/build/urlfilter-validator 
    [mkdir] Created dir: http://hudson.zones.apache.org/hudson/job/Nutch-trunk/ws/trunk/build/urlfilter-validator/classes 
    [mkdir] Created dir: http://hudson.zones.apache.org/hudson/job/Nutch-trunk/ws/trunk/build/urlfilter-validator/test 

init-plugin:

deps-jar:

compile:
     [echo] Compiling plugin: urlfilter-validator
    [javac] Compiling 1 source file to http://hudson.zones.apache.org/hudson/job/Nutch-trunk/ws/trunk/build/urlfilter-validator/classes 

jar:
      [jar] Building jar: http://hudson.zones.apache.org/hudson/job/Nutch-trunk/ws/trunk/build/urlfilter-validator/urlfilter-validator.jar 

deps-test:

deploy:
    [mkdir] Created dir: http://hudson.zones.apache.org/hudson/job/Nutch-trunk/ws/trunk/build/plugins/urlfilter-validator 
     [copy] Copying 1 file to http://hudson.zones.apache.org/hudson/job/Nutch-trunk/ws/trunk/build/plugins/urlfilter-validator 

copy-generated-lib:
     [copy] Copying 1 file to http://hudson.zones.apache.org/hudson/job/Nutch-trunk/ws/trunk/build/plugins/urlfilter-validator 

init:
    [mkdir] Created dir: http://hudson.zones.apache.org/hudson/job/Nutch-trunk/ws/trunk/build/urlnormalizer-basic 
    [mkdir] Created dir: http://hudson.zones.apache.org/hudson/job/Nutch-trunk/ws/trunk/build/urlnormalizer-basic/classes 
    [mkdir] Created dir: http://hudson.zones.apache.org/hudson/job/Nutch-trunk/ws/trunk/build/urlnormalizer-basic/test 

init-plugin:

deps-jar:

compile:
     [echo] Compiling plugin: urlnormalizer-basic
    [javac] Compiling 1 source file to http://hudson.zones.apache.org/hudson/job/Nutch-trunk/ws/trunk/build/urlnormalizer-basic/classes 

jar:
      [jar] Building jar: http://hudson.zones.apache.org/hudson/job/Nutch-trunk/ws/trunk/build/urlnormalizer-basic/urlnormalizer-basic.jar 

deps-test:

deploy:
    [mkdir] Created dir: http://hudson.zones.apache.org/hudson/job/Nutch-trunk/ws/trunk/build/plugins/urlnormalizer-basic 
     [copy] Copying 1 file to http://hudson.zones.apache.org/hudson/job/Nutch-trunk/ws/trunk/build/plugins/urlnormalizer-basic 

copy-generated-lib:
     [copy] Copying 1 file to http://hudson.zones.apache.org/hudson/job/Nutch-trunk/ws/trunk/build/plugins/urlnormalizer-basic 

init:
    [mkdir] Created dir: http://hudson.zones.apache.org/hudson/job/Nutch-trunk/ws/trunk/build/urlnormalizer-pass 
    [mkdir] Created dir: http://hudson.zones.apache.org/hudson/job/Nutch-trunk/ws/trunk/build/urlnormalizer-pass/classes 
    [mkdir] Created dir: http://hudson.zones.apache.org/hudson/job/Nutch-trunk/ws/trunk/build/urlnormalizer-pass/test 

init-plugin:

deps-jar:

compile:
     [echo] Compiling plugin: urlnormalizer-pass
    [javac] Compiling 1 source file to http://hudson.zones.apache.org/hudson/job/Nutch-trunk/ws/trunk/build/urlnormalizer-pass/classes 

jar:
      [jar] Building jar: http://hudson.zones.apache.org/hudson/job/Nutch-trunk/ws/trunk/build/urlnormalizer-pass/urlnormalizer-pass.jar 

deps-test:

deploy:
    [mkdir] Created dir: http://hudson.zones.apache.org/hudson/job/Nutch-trunk/ws/trunk/build/plugins/urlnormalizer-pass 
     [copy] Copying 1 file to http://hudson.zones.apache.org/hudson/job/Nutch-trunk/ws/trunk/build/plugins/urlnormalizer-pass 

copy-generated-lib:
     [copy] Copying 1 file to http://hudson.zones.apache.org/hudson/job/Nutch-trunk/ws/trunk/build/plugins/urlnormalizer-pass 
    [mkdir] Created dir: http://hudson.zones.apache.org/hudson/job/Nutch-trunk/ws/trunk/build/urlnormalizer-regex/test/data 
     [copy] Copying 4 files to http://hudson.zones.apache.org/hudson/job/Nutch-trunk/ws/trunk/build/urlnormalizer-regex/test/data 

init:
    [mkdir] Created dir: http://hudson.zones.apache.org/hudson/job/Nutch-trunk/ws/trunk/build/urlnormalizer-regex/classes 

init-plugin:

deps-jar:

compile:
     [echo] Compiling plugin: urlnormalizer-regex
    [javac] Compiling 1 source file to http://hudson.zones.apache.org/hudson/job/Nutch-trunk/ws/trunk/build/urlnormalizer-regex/classes 
    [javac] Note: http://hudson.zones.apache.org/hudson/job/Nutch-trunk/ws/trunk/src/plugin/urlnormalizer-regex/src/java/org/apache/nutch/net/urlnormalizer/regex/RegexURLNormalizer.java  uses unchecked or unsafe operations.
    [javac] Note: Recompile with -Xlint:unchecked for details.

jar:
      [jar] Building jar: http://hudson.zones.apache.org/hudson/job/Nutch-trunk/ws/trunk/build/urlnormalizer-regex/urlnormalizer-regex.jar 

deps-test:

init:

init-plugin:

compile:

jar:
      [jar] Warning: skipping jar archive http://hudson.zones.apache.org/hudson/job/Nutch-trunk/ws/trunk/build/nutch-extensionpoints/nutch-extensionpoints.jar  because no files were included.

deps-test:

deploy:

copy-generated-lib:

deploy:
    [mkdir] Created dir: http://hudson.zones.apache.org/hudson/job/Nutch-trunk/ws/trunk/build/plugins/urlnormalizer-regex 
     [copy] Copying 1 file to http://hudson.zones.apache.org/hudson/job/Nutch-trunk/ws/trunk/build/plugins/urlnormalizer-regex 

copy-generated-lib:
     [copy] Copying 1 file to http://hudson.zones.apache.org/hudson/job/Nutch-trunk/ws/trunk/build/plugins/urlnormalizer-regex 

compile:

compile-core-test:
    [javac] Compiling 43 source files to http://hudson.zones.apache.org/hudson/job/Nutch-trunk/ws/trunk/build/test/classes 
    [javac] Note: Some input files use unchecked or unsafe operations.
    [javac] Note: Recompile with -Xlint:unchecked for details.

test-core:
    [mkdir] Created dir: http://hudson.zones.apache.org/hudson/job/Nutch-trunk/ws/trunk/build/test/data 
     [copy] Copying 90 files to http://hudson.zones.apache.org/hudson/job/Nutch-trunk/ws/trunk/build/test/data 
     [copy] Copying 1 file to http://hudson.zones.apache.org/hudson/job/Nutch-trunk/ws/trunk/build/test/classes 
     [copy] Copying 1 file to http://hudson.zones.apache.org/hudson/job/Nutch-trunk/ws/trunk/build/test/classes 
    [junit] Running org.apache.nutch.analysis.TestAnalyzerFactory
    [junit] Tests run: 4, Failures: 0, Errors: 0, Time elapsed: 1.881 sec
    [junit] Running org.apache.nutch.analysis.TestQueryParser
    [junit] Tests run: 1, Failures: 0, Errors: 0, Time elapsed: 1.178 sec
    [junit] Running org.apache.nutch.clustering.TestOnlineClustererFactory
    [junit] Tests run: 1, Failures: 0, Errors: 0, Time elapsed: 1.163 sec
    [junit] Running org.apache.nutch.crawl.TestCrawlDbMerger
    [junit] Tests run: 1, Failures: 0, Errors: 1, Time elapsed: 4.09 sec
    [junit] Test org.apache.nutch.crawl.TestCrawlDbMerger FAILED
    [junit] Running org.apache.nutch.crawl.TestGenerator
    [junit] Tests run: 4, Failures: 0, Errors: 4, Time elapsed: 5.502 sec
    [junit] Test org.apache.nutch.crawl.TestGenerator FAILED
    [junit] Running org.apache.nutch.crawl.TestInjector
    [junit] Tests run: 1, Failures: 0, Errors: 1, Time elapsed: 0.724 sec
    [junit] Test org.apache.nutch.crawl.TestInjector FAILED
    [junit] Running org.apache.nutch.crawl.TestLinkDbMerger
    [junit] Tests run: 1, Failures: 0, Errors: 1, Time elapsed: 1.072 sec
    [junit] Test org.apache.nutch.crawl.TestLinkDbMerger FAILED
    [junit] Running org.apache.nutch.crawl.TestMapWritable
    [junit] Tests run: 5, Failures: 0, Errors: 0, Time elapsed: 71.593 sec
    [junit] Running org.apache.nutch.crawl.TestSignatureFactory
    [junit] Tests run: 1, Failures: 0, Errors: 0, Time elapsed: 0.647 sec
    [junit] Running org.apache.nutch.fetcher.TestFetcher
    [junit] Tests run: 1, Failures: 0, Errors: 1, Time elapsed: 0.965 sec
    [junit] Test org.apache.nutch.fetcher.TestFetcher FAILED
    [junit] Running org.apache.nutch.indexer.TestDeleteDuplicates
    [junit] Tests run: 4, Failures: 0, Errors: 4, Time elapsed: 2.472 sec
    [junit] Test org.apache.nutch.indexer.TestDeleteDuplicates FAILED
    [junit] Running org.apache.nutch.indexer.TestIndexingFilters
    [junit] Tests run: 1, Failures: 0, Errors: 0, Time elapsed: 3.944 sec
    [junit] Running org.apache.nutch.metadata.TestMetadata
    [junit] Tests run: 10, Failures: 0, Errors: 0, Time elapsed: 0.439 sec
    [junit] Running org.apache.nutch.metadata.TestSpellCheckedMetadata
    [junit] Tests run: 11, Failures: 0, Errors: 0, Time elapsed: 17.773 sec
    [junit] Running org.apache.nutch.net.TestURLFilters
    [junit] Tests run: 1, Failures: 0, Errors: 0, Time elapsed: 2.466 sec
    [junit] Running org.apache.nutch.net.TestURLNormalizers
    [junit] Tests run: 1, Failures: 0, Errors: 0, Time elapsed: 1.174 sec
    [junit] Running org.apache.nutch.ontology.TestOntologyFactory
    [junit] Tests run: 1, Failures: 0, Errors: 0, Time elapsed: 3.688 sec
    [junit] Running org.apache.nutch.parse.TestOutlinkExtractor
    [junit] Tests run: 4, Failures: 0, Errors: 0, Time elapsed: 0.974 sec
    [junit] Running org.apache.nutch.parse.TestParseData
    [junit] Tests run: 2, Failures: 0, Errors: 0, Time elapsed: 0.591 sec
    [junit] Running org.apache.nutch.parse.TestParseText
    [junit] Tests run: 1, Failures: 0, Errors: 0, Time elapsed: 0.626 sec
    [junit] Running org.apache.nutch.parse.TestParserFactory
    [junit] Tests run: 2, Failures: 0, Errors: 0, Time elapsed: 3.022 sec
    [junit] Running org.apache.nutch.plugin.TestPluginSystem
    [junit] Tests run: 6, Failures: 0, Errors: 0, Time elapsed: 3.78 sec
    [junit] Running org.apache.nutch.protocol.TestContent
    [junit] Tests run: 2, Failures: 0, Errors: 0, Time elapsed: 0.776 sec
    [junit] Running org.apache.nutch.protocol.TestProtocolFactory
    [junit] Tests run: 2, Failures: 0, Errors: 0, Time elapsed: 1.375 sec
    [junit] Running org.apache.nutch.searcher.TestDistributedSearch
    [junit] Tests run: 2, Failures: 0, Errors: 0, Time elapsed: 4.646 sec
    [junit] Running org.apache.nutch.searcher.TestHitDetails
    [junit] Tests run: 1, Failures: 0, Errors: 0, Time elapsed: 0.705 sec
    [junit] Running org.apache.nutch.searcher.TestOpenSearchServlet
    [junit] Tests run: 1, Failures: 0, Errors: 0, Time elapsed: 0.348 sec
    [junit] Running org.apache.nutch.searcher.TestQuery
    [junit] Tests run: 6, Failures: 0, Errors: 0, Time elapsed: 0.89 sec
    [junit] Running org.apache.nutch.searcher.TestSummarizerFactory
    [junit] Tests run: 1, Failures: 0, Errors: 0, Time elapsed: 1.155 sec
    [junit] Running org.apache.nutch.searcher.TestSummary
    [junit] Tests run: 8, Failures: 0, Errors: 0, Time elapsed: 0.404 sec
    [junit] Running org.apache.nutch.util.TestEncodingDetector
    [junit] Tests run: 1, Failures: 0, Errors: 0, Time elapsed: 0.935 sec
    [junit] Running org.apache.nutch.util.TestGZIPUtils
    [junit] Tests run: 4, Failures: 0, Errors: 0, Time elapsed: 1.91 sec
    [junit] Running org.apache.nutch.util.TestNodeWalker
    [junit] Tests run: 1, Failures: 0, Errors: 0, Time elapsed: 2.806 sec
    [junit] Running org.apache.nutch.util.TestPrefixStringMatcher
    [junit] Tests run: 1, Failures: 0, Errors: 0, Time elapsed: 0.722 sec
    [junit] Running org.apache.nutch.util.TestStringUtil
    [junit] Tests run: 2, Failures: 0, Errors: 0, Time elapsed: 0.492 sec
    [junit] Running org.apache.nutch.util.TestSuffixStringMatcher
    [junit] Tests run: 1, Failures: 0, Errors: 0, Time elapsed: 2.275 sec
    [junit] Running org.apache.nutch.util.TestURLUtil
    [junit] Tests run: 3, Failures: 0, Errors: 0, Time elapsed: 1.008 sec

BUILD FAILED
http://hudson.zones.apache.org/hudson/job/Nutch-trunk/ws/trunk/build.xml :298: Tests failed!

Total time: 3 minutes 54 seconds
ERROR: No artifacts found that match the file pattern "trunk/build/*.tar.gz". Configuration error?
ERROR: 'trunk/build/*.tar.gz' doesn't match anything: 'trunk' exists but not 'trunk/build/*.tar.gz'
Publishing Javadoc
Recording test results
Updating NUTCH-567

Reply | Threaded
Open this post in threaded view
|

Build failed in Hudson: Nutch-trunk #371

Apache Hudson Server
See http://hudson.zones.apache.org/hudson/job/Nutch-trunk/371/changes

------------------------------------------
[...truncated 2055 lines...]
AU        src/plugin/parse-html/plugin.xml
AU        src/plugin/parse-html/build.xml
A         src/plugin/protocol-httpclient
A         src/plugin/protocol-httpclient/src
A         src/plugin/protocol-httpclient/src/test
A         src/plugin/protocol-httpclient/src/test/conf
A         src/plugin/protocol-httpclient/src/test/conf/nutch-site-test.xml
A         src/plugin/protocol-httpclient/src/test/conf/httpclient-auth-test.xml
A         src/plugin/protocol-httpclient/src/test/org
A         src/plugin/protocol-httpclient/src/test/org/apache
A         src/plugin/protocol-httpclient/src/test/org/apache/nutch
A         src/plugin/protocol-httpclient/src/test/org/apache/nutch/protocol
A         src/plugin/protocol-httpclient/src/test/org/apache/nutch/protocol/httpclient
A         src/plugin/protocol-httpclient/src/test/org/apache/nutch/protocol/httpclient/TestProtocolHttpClient.java
A         src/plugin/protocol-httpclient/src/java
A         src/plugin/protocol-httpclient/src/java/org
A         src/plugin/protocol-httpclient/src/java/org/apache
A         src/plugin/protocol-httpclient/src/java/org/apache/nutch
A         src/plugin/protocol-httpclient/src/java/org/apache/nutch/protocol
A         src/plugin/protocol-httpclient/src/java/org/apache/nutch/protocol/httpclient
AU        src/plugin/protocol-httpclient/src/java/org/apache/nutch/protocol/httpclient/Http.java
AU        src/plugin/protocol-httpclient/src/java/org/apache/nutch/protocol/httpclient/HttpAuthentication.java
AU        src/plugin/protocol-httpclient/src/java/org/apache/nutch/protocol/httpclient/DummySSLProtocolSocketFactory.java
AU        src/plugin/protocol-httpclient/src/java/org/apache/nutch/protocol/httpclient/HttpBasicAuthentication.java
AU        src/plugin/protocol-httpclient/src/java/org/apache/nutch/protocol/httpclient/HttpAuthenticationFactory.java
AU        src/plugin/protocol-httpclient/src/java/org/apache/nutch/protocol/httpclient/DummyX509TrustManager.java
AU        src/plugin/protocol-httpclient/src/java/org/apache/nutch/protocol/httpclient/HttpAuthenticationException.java
AU        src/plugin/protocol-httpclient/src/java/org/apache/nutch/protocol/httpclient/HttpResponse.java
AU        src/plugin/protocol-httpclient/src/java/org/apache/nutch/protocol/httpclient/package.html
A         src/plugin/protocol-httpclient/jsp
A         src/plugin/protocol-httpclient/jsp/ntlm.jsp
A         src/plugin/protocol-httpclient/jsp/cookies.jsp
A         src/plugin/protocol-httpclient/jsp/noauth.jsp
A         src/plugin/protocol-httpclient/jsp/digest.jsp
A         src/plugin/protocol-httpclient/jsp/basic.jsp
AU        src/plugin/protocol-httpclient/plugin.xml
AU        src/plugin/protocol-httpclient/build.xml
A         src/plugin/parse-mspowerpoint
A         src/plugin/parse-mspowerpoint/sample
AU        src/plugin/parse-mspowerpoint/sample/test.ppt
A         src/plugin/parse-mspowerpoint/sample/test.ppt.meta
A         src/plugin/parse-mspowerpoint/sample/test.ppt.content
AU        src/plugin/parse-mspowerpoint/sample/README.txt
A         src/plugin/parse-mspowerpoint/src
A         src/plugin/parse-mspowerpoint/src/test
A         src/plugin/parse-mspowerpoint/src/test/org
A         src/plugin/parse-mspowerpoint/src/test/org/apache
A         src/plugin/parse-mspowerpoint/src/test/org/apache/nutch
A         src/plugin/parse-mspowerpoint/src/test/org/apache/nutch/parse
A         src/plugin/parse-mspowerpoint/src/test/org/apache/nutch/parse/mspowerpoint
AU        src/plugin/parse-mspowerpoint/src/test/org/apache/nutch/parse/mspowerpoint/FileExtensionFilter.java
AU        src/plugin/parse-mspowerpoint/src/test/org/apache/nutch/parse/mspowerpoint/TestMSPowerPointParser.java
AU        src/plugin/parse-mspowerpoint/src/test/org/apache/nutch/parse/mspowerpoint/AllTests.java
AU        src/plugin/parse-mspowerpoint/src/test/org/apache/nutch/parse/mspowerpoint/package.html
A         src/plugin/parse-mspowerpoint/src/java
A         src/plugin/parse-mspowerpoint/src/java/org
A         src/plugin/parse-mspowerpoint/src/java/org/apache
A         src/plugin/parse-mspowerpoint/src/java/org/apache/nutch
A         src/plugin/parse-mspowerpoint/src/java/org/apache/nutch/parse
A         src/plugin/parse-mspowerpoint/src/java/org/apache/nutch/parse/mspowerpoint
AU        src/plugin/parse-mspowerpoint/src/java/org/apache/nutch/parse/mspowerpoint/PPTExtractor.java
AU        src/plugin/parse-mspowerpoint/src/java/org/apache/nutch/parse/mspowerpoint/PPTConstants.java
AU        src/plugin/parse-mspowerpoint/src/java/org/apache/nutch/parse/mspowerpoint/Slide.java
AU        src/plugin/parse-mspowerpoint/src/java/org/apache/nutch/parse/mspowerpoint/FilteredStringWriter.java
AU        src/plugin/parse-mspowerpoint/src/java/org/apache/nutch/parse/mspowerpoint/ContentReaderListener.java
AU        src/plugin/parse-mspowerpoint/src/java/org/apache/nutch/parse/mspowerpoint/MSPowerPointParser.java
AU        src/plugin/parse-mspowerpoint/src/java/org/apache/nutch/parse/mspowerpoint/TextBox.java
AU        src/plugin/parse-mspowerpoint/src/java/org/apache/nutch/parse/mspowerpoint/package.html
AU        src/plugin/parse-mspowerpoint/README.txt
AU        src/plugin/parse-mspowerpoint/plugin.xml
AU        src/plugin/parse-mspowerpoint/build.xml
A         src/plugin/lib-parsems
A         src/plugin/lib-parsems/src
A         src/plugin/lib-parsems/src/java
A         src/plugin/lib-parsems/src/java/org
A         src/plugin/lib-parsems/src/java/org/apache
A         src/plugin/lib-parsems/src/java/org/apache/nutch
A         src/plugin/lib-parsems/src/java/org/apache/nutch/parse
A         src/plugin/lib-parsems/src/java/org/apache/nutch/parse/ms
AU        src/plugin/lib-parsems/src/java/org/apache/nutch/parse/ms/MSBaseParser.java
AU        src/plugin/lib-parsems/src/java/org/apache/nutch/parse/ms/MSExtractor.java
AU        src/plugin/lib-parsems/src/java/org/apache/nutch/parse/ms/package.html
AU        src/plugin/lib-parsems/plugin.xml
AU        src/plugin/lib-parsems/build.xml
A         src/plugin/protocol-http
A         src/plugin/protocol-http/src
A         src/plugin/protocol-http/src/test
A         src/plugin/protocol-http/src/test/org
A         src/plugin/protocol-http/src/test/org/apache
A         src/plugin/protocol-http/src/test/org/apache/nutch
A         src/plugin/protocol-http/src/test/org/apache/nutch/protocol
A         src/plugin/protocol-http/src/test/org/apache/nutch/protocol/http
A         src/plugin/protocol-http/src/java
A         src/plugin/protocol-http/src/java/org
A         src/plugin/protocol-http/src/java/org/apache
A         src/plugin/protocol-http/src/java/org/apache/nutch
A         src/plugin/protocol-http/src/java/org/apache/nutch/protocol
A         src/plugin/protocol-http/src/java/org/apache/nutch/protocol/http
AU        src/plugin/protocol-http/src/java/org/apache/nutch/protocol/http/Http.java
A         src/plugin/protocol-http/src/java/org/apache/nutch/protocol/http/HttpResponse.java
A         src/plugin/protocol-http/src/java/org/apache/nutch/protocol/http/package.html
AU        src/plugin/protocol-http/plugin.xml
AU        src/plugin/protocol-http/build.xml
A         bin
AU        bin/nutch
AU        bin/stop-balancer.sh
AU        bin/start-balancer.sh
A         docs
A         docs/ms
A         docs/ms/search.html
A         docs/ms/help.html
A         docs/ms/about.html
A         docs/zh
A         docs/zh/search.html
A         docs/zh/help.html
A         docs/zh/about.html
A         docs/pt
A         docs/pt/search.html
A         docs/pt/help.html
A         docs/pt/about.html
A         docs/ca
A         docs/ca/search.html
A         docs/ca/help.html
A         docs/ca/about.html
A         docs/sr
AU        docs/sr/search.html
AU        docs/sr/help.html
AU        docs/sr/about.html
A         docs/de
A         docs/de/search.html
A         docs/de/help.html
A         docs/de/about.html
A         docs/sv
A         docs/sv/search.html
A         docs/sv/help.html
A         docs/sv/about.html
A         docs/fi
A         docs/fi/search.html
A         docs/fi/help.html
A         docs/fi/about.html
A         docs/en
A         docs/en/search.html
A         docs/en/help.html
A         docs/en/about.html
A         docs/fr
A         docs/fr/search.html
AU        docs/fr/help.html
A         docs/fr/about.html
A         docs/es
A         docs/es/search.html
A         docs/es/help.html
A         docs/es/about.html
A         docs/nl
A         docs/nl/search.html
A         docs/nl/help.html
A         docs/nl/about.html
A         docs/jp
A         docs/jp/search.html
A         docs/jp/help.html
A         docs/jp/about.html
A         docs/sh
AU        docs/sh/search.html
AU        docs/sh/help.html
AU        docs/sh/about.html
A         docs/pl
A         docs/pl/search.html
A         docs/pl/help.html
A         docs/pl/about.html
A         docs/th
A         docs/th/search.html
A         docs/th/help.html
A         docs/th/about.html
A         docs/it
AU        docs/it/search.html
AU        docs/it/help.html
AU        docs/it/about.html
A         docs/img
A         docs/img/lang
AU        docs/img/lang/romanian.png
AU        docs/img/lang/bulgarian.png
AU        docs/img/lang/spanish.png
AU        docs/img/lang/danish.png
AU        docs/img/lang/dutch.png
AU        docs/img/lang/icelandic.png
AU        docs/img/lang/hungarian.png
AU        docs/img/lang/russian.png
AU        docs/img/lang/japanese.png
AU        docs/img/lang/turkish.png
AU        docs/img/lang/suomi.png
AU        docs/img/lang/lithuanian.png
AU        docs/img/lang/czech.png
AU        docs/img/lang/greek.png
AU        docs/img/lang/latvian.png
AU        docs/img/lang/galego.png
AU        docs/img/lang/polish.png
AU        docs/img/lang/croatian.png
AU        docs/img/lang/portuguese.png
AU        docs/img/lang/french.png
AU        docs/img/lang/swedish.png
AU        docs/img/lang/german.png
AU        docs/img/lang/malaysian.png
AU        docs/img/lang/chinese.png
AU        docs/img/lang/korean.png
AU        docs/img/lang/italian.png
AU        docs/img/lang/arabic.png
AU        docs/img/lang/brazil.png
AU        docs/img/lang/thai.png
AU        docs/img/lang/catala.png
AU        docs/img/lang/indonesian.png
AU        docs/img/lang/norwegian.png
AU        docs/img/lang/english.png
AU        docs/img/poweredbynutch_01.gif
AU        docs/img/poweredbynutch_02.gif
A         docs/img/reiter
AU        docs/img/reiter/reiter_inactive_le.gif
AU        docs/img/reiter/_spacer_cccccc.gif
AU        docs/img/reiter/reiter_inactive_le1.gif
AU        docs/img/reiter/bg_subnavi.gif
AU        docs/img/reiter/002bg_fle.gif
AU        docs/img/reiter/spacer_666666.gif
AU        docs/img/reiter/ul.gif
AU        docs/img/reiter/_bg_reiter.gif
AU        docs/img/reiter/logo_nutch.gif
AU        docs/img/reiter/_bg_reiter_inactive.gif
AU        docs/img/reiter/002bg_fre.gif
AU        docs/img/reiter/reiter_inactive_ri.gif
AU        docs/img/reiter/robots.gif
AU        docs/img/reiter/spacer_ff9900.gif
AU        docs/img/favicon.ico
A         docs/hu
A         docs/hu/search.html
A         docs/hu/help.html
A         docs/hu/about.html
A         index.html
A         README.txt
A         build.xml
 U        
At revision 631445
no change for http://svn.apache.org/repos/asf/lucene/nutch/trunk since the previous build
[Nutch-trunk] $ /bin/bash -xe /var/tmp/hudson34.sh
+ ANT_HOME=/export/home/hudson/tools/ant/latest
+ export ANT_HOME
+ /export/home/hudson/tools/ant/latest/bin/ant -Dversion=2008-02-27_00-59-03 -Dtest.junit.output.format=xml nightly
Buildfile: build.xml does not exist!
Build failed
ERROR: No artifacts found that match the file pattern "trunk/build/*.tar.gz". Configuration error?
ERROR: 'trunk/build/*.tar.gz' doesn't match anything: 'trunk' exists but not 'trunk/build/*.tar.gz'
Publishing Javadoc
Recording test results

Reply | Threaded
Open this post in threaded view
|

Re: Build failed in Hudson: Nutch-trunk #371

Nigel Daley
Sorry, ignore this.  I'm trying to fix the "whoami" test problem.

Nige

On Feb 26, 2008, at 5:06 PM, Apache Hudson Server wrote:

> See http://hudson.zones.apache.org/hudson/job/Nutch-trunk/371/changes
>
> ------------------------------------------
> [...truncated 2055 lines...]
> AU        src/plugin/parse-html/plugin.xml
> AU        src/plugin/parse-html/build.xml
> A         src/plugin/protocol-httpclient
> A         src/plugin/protocol-httpclient/src
> A         src/plugin/protocol-httpclient/src/test
> A         src/plugin/protocol-httpclient/src/test/conf
> A         src/plugin/protocol-httpclient/src/test/conf/nutch-site-
> test.xml
> A         src/plugin/protocol-httpclient/src/test/conf/httpclient-
> auth-test.xml
> A         src/plugin/protocol-httpclient/src/test/org
> A         src/plugin/protocol-httpclient/src/test/org/apache
> A         src/plugin/protocol-httpclient/src/test/org/apache/nutch
> A         src/plugin/protocol-httpclient/src/test/org/apache/nutch/
> protocol
> A         src/plugin/protocol-httpclient/src/test/org/apache/nutch/
> protocol/httpclient
> A         src/plugin/protocol-httpclient/src/test/org/apache/nutch/
> protocol/httpclient/TestProtocolHttpClient.java
> A         src/plugin/protocol-httpclient/src/java
> A         src/plugin/protocol-httpclient/src/java/org
> A         src/plugin/protocol-httpclient/src/java/org/apache
> A         src/plugin/protocol-httpclient/src/java/org/apache/nutch
> A         src/plugin/protocol-httpclient/src/java/org/apache/nutch/
> protocol
> A         src/plugin/protocol-httpclient/src/java/org/apache/nutch/
> protocol/httpclient
> AU        src/plugin/protocol-httpclient/src/java/org/apache/nutch/
> protocol/httpclient/Http.java
> AU        src/plugin/protocol-httpclient/src/java/org/apache/nutch/
> protocol/httpclient/HttpAuthentication.java
> AU        src/plugin/protocol-httpclient/src/java/org/apache/nutch/
> protocol/httpclient/DummySSLProtocolSocketFactory.java
> AU        src/plugin/protocol-httpclient/src/java/org/apache/nutch/
> protocol/httpclient/HttpBasicAuthentication.java
> AU        src/plugin/protocol-httpclient/src/java/org/apache/nutch/
> protocol/httpclient/HttpAuthenticationFactory.java
> AU        src/plugin/protocol-httpclient/src/java/org/apache/nutch/
> protocol/httpclient/DummyX509TrustManager.java
> AU        src/plugin/protocol-httpclient/src/java/org/apache/nutch/
> protocol/httpclient/HttpAuthenticationException.java
> AU        src/plugin/protocol-httpclient/src/java/org/apache/nutch/
> protocol/httpclient/HttpResponse.java
> AU        src/plugin/protocol-httpclient/src/java/org/apache/nutch/
> protocol/httpclient/package.html
> A         src/plugin/protocol-httpclient/jsp
> A         src/plugin/protocol-httpclient/jsp/ntlm.jsp
> A         src/plugin/protocol-httpclient/jsp/cookies.jsp
> A         src/plugin/protocol-httpclient/jsp/noauth.jsp
> A         src/plugin/protocol-httpclient/jsp/digest.jsp
> A         src/plugin/protocol-httpclient/jsp/basic.jsp
> AU        src/plugin/protocol-httpclient/plugin.xml
> AU        src/plugin/protocol-httpclient/build.xml
> A         src/plugin/parse-mspowerpoint
> A         src/plugin/parse-mspowerpoint/sample
> AU        src/plugin/parse-mspowerpoint/sample/test.ppt
> A         src/plugin/parse-mspowerpoint/sample/test.ppt.meta
> A         src/plugin/parse-mspowerpoint/sample/test.ppt.content
> AU        src/plugin/parse-mspowerpoint/sample/README.txt
> A         src/plugin/parse-mspowerpoint/src
> A         src/plugin/parse-mspowerpoint/src/test
> A         src/plugin/parse-mspowerpoint/src/test/org
> A         src/plugin/parse-mspowerpoint/src/test/org/apache
> A         src/plugin/parse-mspowerpoint/src/test/org/apache/nutch
> A         src/plugin/parse-mspowerpoint/src/test/org/apache/nutch/
> parse
> A         src/plugin/parse-mspowerpoint/src/test/org/apache/nutch/
> parse/mspowerpoint
> AU        src/plugin/parse-mspowerpoint/src/test/org/apache/nutch/
> parse/mspowerpoint/FileExtensionFilter.java
> AU        src/plugin/parse-mspowerpoint/src/test/org/apache/nutch/
> parse/mspowerpoint/TestMSPowerPointParser.java
> AU        src/plugin/parse-mspowerpoint/src/test/org/apache/nutch/
> parse/mspowerpoint/AllTests.java
> AU        src/plugin/parse-mspowerpoint/src/test/org/apache/nutch/
> parse/mspowerpoint/package.html
> A         src/plugin/parse-mspowerpoint/src/java
> A         src/plugin/parse-mspowerpoint/src/java/org
> A         src/plugin/parse-mspowerpoint/src/java/org/apache
> A         src/plugin/parse-mspowerpoint/src/java/org/apache/nutch
> A         src/plugin/parse-mspowerpoint/src/java/org/apache/nutch/
> parse
> A         src/plugin/parse-mspowerpoint/src/java/org/apache/nutch/
> parse/mspowerpoint
> AU        src/plugin/parse-mspowerpoint/src/java/org/apache/nutch/
> parse/mspowerpoint/PPTExtractor.java
> AU        src/plugin/parse-mspowerpoint/src/java/org/apache/nutch/
> parse/mspowerpoint/PPTConstants.java
> AU        src/plugin/parse-mspowerpoint/src/java/org/apache/nutch/
> parse/mspowerpoint/Slide.java
> AU        src/plugin/parse-mspowerpoint/src/java/org/apache/nutch/
> parse/mspowerpoint/FilteredStringWriter.java
> AU        src/plugin/parse-mspowerpoint/src/java/org/apache/nutch/
> parse/mspowerpoint/ContentReaderListener.java
> AU        src/plugin/parse-mspowerpoint/src/java/org/apache/nutch/
> parse/mspowerpoint/MSPowerPointParser.java
> AU        src/plugin/parse-mspowerpoint/src/java/org/apache/nutch/
> parse/mspowerpoint/TextBox.java
> AU        src/plugin/parse-mspowerpoint/src/java/org/apache/nutch/
> parse/mspowerpoint/package.html
> AU        src/plugin/parse-mspowerpoint/README.txt
> AU        src/plugin/parse-mspowerpoint/plugin.xml
> AU        src/plugin/parse-mspowerpoint/build.xml
> A         src/plugin/lib-parsems
> A         src/plugin/lib-parsems/src
> A         src/plugin/lib-parsems/src/java
> A         src/plugin/lib-parsems/src/java/org
> A         src/plugin/lib-parsems/src/java/org/apache
> A         src/plugin/lib-parsems/src/java/org/apache/nutch
> A         src/plugin/lib-parsems/src/java/org/apache/nutch/parse
> A         src/plugin/lib-parsems/src/java/org/apache/nutch/parse/ms
> AU        src/plugin/lib-parsems/src/java/org/apache/nutch/parse/ms/
> MSBaseParser.java
> AU        src/plugin/lib-parsems/src/java/org/apache/nutch/parse/ms/
> MSExtractor.java
> AU        src/plugin/lib-parsems/src/java/org/apache/nutch/parse/ms/
> package.html
> AU        src/plugin/lib-parsems/plugin.xml
> AU        src/plugin/lib-parsems/build.xml
> A         src/plugin/protocol-http
> A         src/plugin/protocol-http/src
> A         src/plugin/protocol-http/src/test
> A         src/plugin/protocol-http/src/test/org
> A         src/plugin/protocol-http/src/test/org/apache
> A         src/plugin/protocol-http/src/test/org/apache/nutch
> A         src/plugin/protocol-http/src/test/org/apache/nutch/protocol
> A         src/plugin/protocol-http/src/test/org/apache/nutch/
> protocol/http
> A         src/plugin/protocol-http/src/java
> A         src/plugin/protocol-http/src/java/org
> A         src/plugin/protocol-http/src/java/org/apache
> A         src/plugin/protocol-http/src/java/org/apache/nutch
> A         src/plugin/protocol-http/src/java/org/apache/nutch/protocol
> A         src/plugin/protocol-http/src/java/org/apache/nutch/
> protocol/http
> AU        src/plugin/protocol-http/src/java/org/apache/nutch/
> protocol/http/Http.java
> A         src/plugin/protocol-http/src/java/org/apache/nutch/
> protocol/http/HttpResponse.java
> A         src/plugin/protocol-http/src/java/org/apache/nutch/
> protocol/http/package.html
> AU        src/plugin/protocol-http/plugin.xml
> AU        src/plugin/protocol-http/build.xml
> A         bin
> AU        bin/nutch
> AU        bin/stop-balancer.sh
> AU        bin/start-balancer.sh
> A         docs
> A         docs/ms
> A         docs/ms/search.html
> A         docs/ms/help.html
> A         docs/ms/about.html
> A         docs/zh
> A         docs/zh/search.html
> A         docs/zh/help.html
> A         docs/zh/about.html
> A         docs/pt
> A         docs/pt/search.html
> A         docs/pt/help.html
> A         docs/pt/about.html
> A         docs/ca
> A         docs/ca/search.html
> A         docs/ca/help.html
> A         docs/ca/about.html
> A         docs/sr
> AU        docs/sr/search.html
> AU        docs/sr/help.html
> AU        docs/sr/about.html
> A         docs/de
> A         docs/de/search.html
> A         docs/de/help.html
> A         docs/de/about.html
> A         docs/sv
> A         docs/sv/search.html
> A         docs/sv/help.html
> A         docs/sv/about.html
> A         docs/fi
> A         docs/fi/search.html
> A         docs/fi/help.html
> A         docs/fi/about.html
> A         docs/en
> A         docs/en/search.html
> A         docs/en/help.html
> A         docs/en/about.html
> A         docs/fr
> A         docs/fr/search.html
> AU        docs/fr/help.html
> A         docs/fr/about.html
> A         docs/es
> A         docs/es/search.html
> A         docs/es/help.html
> A         docs/es/about.html
> A         docs/nl
> A         docs/nl/search.html
> A         docs/nl/help.html
> A         docs/nl/about.html
> A         docs/jp
> A         docs/jp/search.html
> A         docs/jp/help.html
> A         docs/jp/about.html
> A         docs/sh
> AU        docs/sh/search.html
> AU        docs/sh/help.html
> AU        docs/sh/about.html
> A         docs/pl
> A         docs/pl/search.html
> A         docs/pl/help.html
> A         docs/pl/about.html
> A         docs/th
> A         docs/th/search.html
> A         docs/th/help.html
> A         docs/th/about.html
> A         docs/it
> AU        docs/it/search.html
> AU        docs/it/help.html
> AU        docs/it/about.html
> A         docs/img
> A         docs/img/lang
> AU        docs/img/lang/romanian.png
> AU        docs/img/lang/bulgarian.png
> AU        docs/img/lang/spanish.png
> AU        docs/img/lang/danish.png
> AU        docs/img/lang/dutch.png
> AU        docs/img/lang/icelandic.png
> AU        docs/img/lang/hungarian.png
> AU        docs/img/lang/russian.png
> AU        docs/img/lang/japanese.png
> AU        docs/img/lang/turkish.png
> AU        docs/img/lang/suomi.png
> AU        docs/img/lang/lithuanian.png
> AU        docs/img/lang/czech.png
> AU        docs/img/lang/greek.png
> AU        docs/img/lang/latvian.png
> AU        docs/img/lang/galego.png
> AU        docs/img/lang/polish.png
> AU        docs/img/lang/croatian.png
> AU        docs/img/lang/portuguese.png
> AU        docs/img/lang/french.png
> AU        docs/img/lang/swedish.png
> AU        docs/img/lang/german.png
> AU        docs/img/lang/malaysian.png
> AU        docs/img/lang/chinese.png
> AU        docs/img/lang/korean.png
> AU        docs/img/lang/italian.png
> AU        docs/img/lang/arabic.png
> AU        docs/img/lang/brazil.png
> AU        docs/img/lang/thai.png
> AU        docs/img/lang/catala.png
> AU        docs/img/lang/indonesian.png
> AU        docs/img/lang/norwegian.png
> AU        docs/img/lang/english.png
> AU        docs/img/poweredbynutch_01.gif
> AU        docs/img/poweredbynutch_02.gif
> A         docs/img/reiter
> AU        docs/img/reiter/reiter_inactive_le.gif
> AU        docs/img/reiter/_spacer_cccccc.gif
> AU        docs/img/reiter/reiter_inactive_le1.gif
> AU        docs/img/reiter/bg_subnavi.gif
> AU        docs/img/reiter/002bg_fle.gif
> AU        docs/img/reiter/spacer_666666.gif
> AU        docs/img/reiter/ul.gif
> AU        docs/img/reiter/_bg_reiter.gif
> AU        docs/img/reiter/logo_nutch.gif
> AU        docs/img/reiter/_bg_reiter_inactive.gif
> AU        docs/img/reiter/002bg_fre.gif
> AU        docs/img/reiter/reiter_inactive_ri.gif
> AU        docs/img/reiter/robots.gif
> AU        docs/img/reiter/spacer_ff9900.gif
> AU        docs/img/favicon.ico
> A         docs/hu
> A         docs/hu/search.html
> A         docs/hu/help.html
> A         docs/hu/about.html
> A         index.html
> A         README.txt
> A         build.xml
>  U
> At revision 631445
> no change for http://svn.apache.org/repos/asf/lucene/nutch/trunk 
> since the previous build
> [Nutch-trunk] $ /bin/bash -xe /var/tmp/hudson34.sh
> + ANT_HOME=/export/home/hudson/tools/ant/latest
> + export ANT_HOME
> + /export/home/hudson/tools/ant/latest/bin/ant -
> Dversion=2008-02-27_00-59-03 -Dtest.junit.output.format=xml nightly
> Buildfile: build.xml does not exist!
> Build failed
> ERROR: No artifacts found that match the file pattern "trunk/build/
> *.tar.gz". Configuration error?
> ERROR: 'trunk/build/*.tar.gz' doesn't match anything: 'trunk'  
> exists but not 'trunk/build/*.tar.gz'
> Publishing Javadoc
> Recording test results
>

Reply | Threaded
Open this post in threaded view
|

Build failed in Hudson: Nutch-trunk #372

Apache Hudson Server
In reply to this post by Apache Hudson Server
See http://hudson.zones.apache.org/hudson/job/Nutch-trunk/372/changes

------------------------------------------
[...truncated 4603 lines...]

copy-generated-lib:
     [copy] Copying 1 file to http://hudson.zones.apache.org/hudson/job/Nutch-trunk/ws/trunk/build/plugins/urlfilter-regex 

init:
    [mkdir] Created dir: http://hudson.zones.apache.org/hudson/job/Nutch-trunk/ws/trunk/build/urlfilter-suffix 
    [mkdir] Created dir: http://hudson.zones.apache.org/hudson/job/Nutch-trunk/ws/trunk/build/urlfilter-suffix/classes 
    [mkdir] Created dir: http://hudson.zones.apache.org/hudson/job/Nutch-trunk/ws/trunk/build/urlfilter-suffix/test 

init-plugin:

deps-jar:

compile:
     [echo] Compiling plugin: urlfilter-suffix
    [javac] Compiling 1 source file to http://hudson.zones.apache.org/hudson/job/Nutch-trunk/ws/trunk/build/urlfilter-suffix/classes 
    [javac] Note: http://hudson.zones.apache.org/hudson/job/Nutch-trunk/ws/trunk/src/plugin/urlfilter-suffix/src/java/org/apache/nutch/urlfilter/suffix/SuffixURLFilter.java  uses unchecked or unsafe operations.
    [javac] Note: Recompile with -Xlint:unchecked for details.

jar:
      [jar] Building jar: http://hudson.zones.apache.org/hudson/job/Nutch-trunk/ws/trunk/build/urlfilter-suffix/urlfilter-suffix.jar 

deps-test:

deploy:
    [mkdir] Created dir: http://hudson.zones.apache.org/hudson/job/Nutch-trunk/ws/trunk/build/plugins/urlfilter-suffix 
     [copy] Copying 1 file to http://hudson.zones.apache.org/hudson/job/Nutch-trunk/ws/trunk/build/plugins/urlfilter-suffix 

copy-generated-lib:
     [copy] Copying 1 file to http://hudson.zones.apache.org/hudson/job/Nutch-trunk/ws/trunk/build/plugins/urlfilter-suffix 

init:
    [mkdir] Created dir: http://hudson.zones.apache.org/hudson/job/Nutch-trunk/ws/trunk/build/urlfilter-validator 
    [mkdir] Created dir: http://hudson.zones.apache.org/hudson/job/Nutch-trunk/ws/trunk/build/urlfilter-validator/classes 
    [mkdir] Created dir: http://hudson.zones.apache.org/hudson/job/Nutch-trunk/ws/trunk/build/urlfilter-validator/test 

init-plugin:

deps-jar:

compile:
     [echo] Compiling plugin: urlfilter-validator
    [javac] Compiling 1 source file to http://hudson.zones.apache.org/hudson/job/Nutch-trunk/ws/trunk/build/urlfilter-validator/classes 

jar:
      [jar] Building jar: http://hudson.zones.apache.org/hudson/job/Nutch-trunk/ws/trunk/build/urlfilter-validator/urlfilter-validator.jar 

deps-test:

deploy:
    [mkdir] Created dir: http://hudson.zones.apache.org/hudson/job/Nutch-trunk/ws/trunk/build/plugins/urlfilter-validator 
     [copy] Copying 1 file to http://hudson.zones.apache.org/hudson/job/Nutch-trunk/ws/trunk/build/plugins/urlfilter-validator 

copy-generated-lib:
     [copy] Copying 1 file to http://hudson.zones.apache.org/hudson/job/Nutch-trunk/ws/trunk/build/plugins/urlfilter-validator 

init:
    [mkdir] Created dir: http://hudson.zones.apache.org/hudson/job/Nutch-trunk/ws/trunk/build/urlnormalizer-basic 
    [mkdir] Created dir: http://hudson.zones.apache.org/hudson/job/Nutch-trunk/ws/trunk/build/urlnormalizer-basic/classes 
    [mkdir] Created dir: http://hudson.zones.apache.org/hudson/job/Nutch-trunk/ws/trunk/build/urlnormalizer-basic/test 

init-plugin:

deps-jar:

compile:
     [echo] Compiling plugin: urlnormalizer-basic
    [javac] Compiling 1 source file to http://hudson.zones.apache.org/hudson/job/Nutch-trunk/ws/trunk/build/urlnormalizer-basic/classes 

jar:
      [jar] Building jar: http://hudson.zones.apache.org/hudson/job/Nutch-trunk/ws/trunk/build/urlnormalizer-basic/urlnormalizer-basic.jar 

deps-test:

deploy:
    [mkdir] Created dir: http://hudson.zones.apache.org/hudson/job/Nutch-trunk/ws/trunk/build/plugins/urlnormalizer-basic 
     [copy] Copying 1 file to http://hudson.zones.apache.org/hudson/job/Nutch-trunk/ws/trunk/build/plugins/urlnormalizer-basic 

copy-generated-lib:
     [copy] Copying 1 file to http://hudson.zones.apache.org/hudson/job/Nutch-trunk/ws/trunk/build/plugins/urlnormalizer-basic 

init:
    [mkdir] Created dir: http://hudson.zones.apache.org/hudson/job/Nutch-trunk/ws/trunk/build/urlnormalizer-pass 
    [mkdir] Created dir: http://hudson.zones.apache.org/hudson/job/Nutch-trunk/ws/trunk/build/urlnormalizer-pass/classes 
    [mkdir] Created dir: http://hudson.zones.apache.org/hudson/job/Nutch-trunk/ws/trunk/build/urlnormalizer-pass/test 

init-plugin:

deps-jar:

compile:
     [echo] Compiling plugin: urlnormalizer-pass
    [javac] Compiling 1 source file to http://hudson.zones.apache.org/hudson/job/Nutch-trunk/ws/trunk/build/urlnormalizer-pass/classes 

jar:
      [jar] Building jar: http://hudson.zones.apache.org/hudson/job/Nutch-trunk/ws/trunk/build/urlnormalizer-pass/urlnormalizer-pass.jar 

deps-test:

deploy:
    [mkdir] Created dir: http://hudson.zones.apache.org/hudson/job/Nutch-trunk/ws/trunk/build/plugins/urlnormalizer-pass 
     [copy] Copying 1 file to http://hudson.zones.apache.org/hudson/job/Nutch-trunk/ws/trunk/build/plugins/urlnormalizer-pass 

copy-generated-lib:
     [copy] Copying 1 file to http://hudson.zones.apache.org/hudson/job/Nutch-trunk/ws/trunk/build/plugins/urlnormalizer-pass 
    [mkdir] Created dir: http://hudson.zones.apache.org/hudson/job/Nutch-trunk/ws/trunk/build/urlnormalizer-regex/test/data 
     [copy] Copying 4 files to http://hudson.zones.apache.org/hudson/job/Nutch-trunk/ws/trunk/build/urlnormalizer-regex/test/data 

init:
    [mkdir] Created dir: http://hudson.zones.apache.org/hudson/job/Nutch-trunk/ws/trunk/build/urlnormalizer-regex/classes 

init-plugin:

deps-jar:

compile:
     [echo] Compiling plugin: urlnormalizer-regex
    [javac] Compiling 1 source file to http://hudson.zones.apache.org/hudson/job/Nutch-trunk/ws/trunk/build/urlnormalizer-regex/classes 
    [javac] Note: http://hudson.zones.apache.org/hudson/job/Nutch-trunk/ws/trunk/src/plugin/urlnormalizer-regex/src/java/org/apache/nutch/net/urlnormalizer/regex/RegexURLNormalizer.java  uses unchecked or unsafe operations.
    [javac] Note: Recompile with -Xlint:unchecked for details.

jar:
      [jar] Building jar: http://hudson.zones.apache.org/hudson/job/Nutch-trunk/ws/trunk/build/urlnormalizer-regex/urlnormalizer-regex.jar 

deps-test:

init:

init-plugin:

compile:

jar:
      [jar] Warning: skipping jar archive http://hudson.zones.apache.org/hudson/job/Nutch-trunk/ws/trunk/build/nutch-extensionpoints/nutch-extensionpoints.jar  because no files were included.

deps-test:

deploy:

copy-generated-lib:

deploy:
    [mkdir] Created dir: http://hudson.zones.apache.org/hudson/job/Nutch-trunk/ws/trunk/build/plugins/urlnormalizer-regex 
     [copy] Copying 1 file to http://hudson.zones.apache.org/hudson/job/Nutch-trunk/ws/trunk/build/plugins/urlnormalizer-regex 

copy-generated-lib:
     [copy] Copying 1 file to http://hudson.zones.apache.org/hudson/job/Nutch-trunk/ws/trunk/build/plugins/urlnormalizer-regex 

compile:

compile-core-test:
    [javac] Compiling 43 source files to http://hudson.zones.apache.org/hudson/job/Nutch-trunk/ws/trunk/build/test/classes 
    [javac] Note: Some input files use unchecked or unsafe operations.
    [javac] Note: Recompile with -Xlint:unchecked for details.

test-core:
    [mkdir] Created dir: http://hudson.zones.apache.org/hudson/job/Nutch-trunk/ws/trunk/build/test/data 
     [copy] Copying 90 files to http://hudson.zones.apache.org/hudson/job/Nutch-trunk/ws/trunk/build/test/data 
     [copy] Copying 1 file to http://hudson.zones.apache.org/hudson/job/Nutch-trunk/ws/trunk/build/test/classes 
     [copy] Copying 1 file to http://hudson.zones.apache.org/hudson/job/Nutch-trunk/ws/trunk/build/test/classes 
    [junit] Running org.apache.nutch.analysis.TestAnalyzerFactory
    [junit] Tests run: 4, Failures: 0, Errors: 0, Time elapsed: 2.238 sec
    [junit] Running org.apache.nutch.analysis.TestQueryParser
    [junit] Tests run: 1, Failures: 0, Errors: 0, Time elapsed: 0.871 sec
    [junit] Running org.apache.nutch.clustering.TestOnlineClustererFactory
    [junit] Tests run: 1, Failures: 0, Errors: 0, Time elapsed: 1.23 sec
    [junit] Running org.apache.nutch.crawl.TestCrawlDbMerger
    [junit] Tests run: 1, Failures: 0, Errors: 1, Time elapsed: 1.688 sec
    [junit] Test org.apache.nutch.crawl.TestCrawlDbMerger FAILED
    [junit] Running org.apache.nutch.crawl.TestGenerator
    [junit] Tests run: 4, Failures: 0, Errors: 4, Time elapsed: 5.447 sec
    [junit] Test org.apache.nutch.crawl.TestGenerator FAILED
    [junit] Running org.apache.nutch.crawl.TestInjector
    [junit] Tests run: 1, Failures: 0, Errors: 1, Time elapsed: 0.743 sec
    [junit] Test org.apache.nutch.crawl.TestInjector FAILED
    [junit] Running org.apache.nutch.crawl.TestLinkDbMerger
    [junit] Tests run: 1, Failures: 0, Errors: 1, Time elapsed: 1.241 sec
    [junit] Test org.apache.nutch.crawl.TestLinkDbMerger FAILED
    [junit] Running org.apache.nutch.crawl.TestMapWritable
    [junit] Tests run: 5, Failures: 0, Errors: 0, Time elapsed: 63.251 sec
    [junit] Running org.apache.nutch.crawl.TestSignatureFactory
    [junit] Tests run: 1, Failures: 0, Errors: 0, Time elapsed: 0.701 sec
    [junit] Running org.apache.nutch.fetcher.TestFetcher
    [junit] Tests run: 1, Failures: 0, Errors: 1, Time elapsed: 1.14 sec
    [junit] Test org.apache.nutch.fetcher.TestFetcher FAILED
    [junit] Running org.apache.nutch.indexer.TestDeleteDuplicates
    [junit] Tests run: 4, Failures: 0, Errors: 4, Time elapsed: 1.626 sec
    [junit] Test org.apache.nutch.indexer.TestDeleteDuplicates FAILED
    [junit] Running org.apache.nutch.indexer.TestIndexingFilters
    [junit] Tests run: 1, Failures: 0, Errors: 0, Time elapsed: 2.59 sec
    [junit] Running org.apache.nutch.metadata.TestMetadata
    [junit] Tests run: 10, Failures: 0, Errors: 0, Time elapsed: 0.417 sec
    [junit] Running org.apache.nutch.metadata.TestSpellCheckedMetadata
    [junit] Tests run: 11, Failures: 0, Errors: 0, Time elapsed: 15.519 sec
    [junit] Running org.apache.nutch.net.TestURLFilters
    [junit] Tests run: 1, Failures: 0, Errors: 0, Time elapsed: 1.597 sec
    [junit] Running org.apache.nutch.net.TestURLNormalizers
    [junit] Tests run: 1, Failures: 0, Errors: 0, Time elapsed: 1.08 sec
    [junit] Running org.apache.nutch.ontology.TestOntologyFactory
    [junit] Tests run: 1, Failures: 0, Errors: 0, Time elapsed: 2.225 sec
    [junit] Running org.apache.nutch.parse.TestOutlinkExtractor
    [junit] Tests run: 4, Failures: 0, Errors: 0, Time elapsed: 0.363 sec
    [junit] Running org.apache.nutch.parse.TestParseData
    [junit] Tests run: 2, Failures: 0, Errors: 0, Time elapsed: 0.296 sec
    [junit] Running org.apache.nutch.parse.TestParseText
    [junit] Tests run: 1, Failures: 0, Errors: 0, Time elapsed: 0.442 sec
    [junit] Running org.apache.nutch.parse.TestParserFactory
    [junit] Tests run: 2, Failures: 0, Errors: 0, Time elapsed: 1.386 sec
    [junit] Running org.apache.nutch.plugin.TestPluginSystem
    [junit] Tests run: 6, Failures: 0, Errors: 0, Time elapsed: 2.391 sec
    [junit] Running org.apache.nutch.protocol.TestContent
    [junit] Tests run: 2, Failures: 0, Errors: 0, Time elapsed: 0.879 sec
    [junit] Running org.apache.nutch.protocol.TestProtocolFactory
    [junit] Tests run: 2, Failures: 0, Errors: 0, Time elapsed: 1.85 sec
    [junit] Running org.apache.nutch.searcher.TestDistributedSearch
    [junit] Tests run: 2, Failures: 0, Errors: 0, Time elapsed: 3.425 sec
    [junit] Running org.apache.nutch.searcher.TestHitDetails
    [junit] Tests run: 1, Failures: 0, Errors: 0, Time elapsed: 0.308 sec
    [junit] Running org.apache.nutch.searcher.TestOpenSearchServlet
    [junit] Tests run: 1, Failures: 0, Errors: 0, Time elapsed: 0.381 sec
    [junit] Running org.apache.nutch.searcher.TestQuery
    [junit] Tests run: 6, Failures: 0, Errors: 0, Time elapsed: 1.096 sec
    [junit] Running org.apache.nutch.searcher.TestSummarizerFactory
    [junit] Tests run: 1, Failures: 0, Errors: 0, Time elapsed: 1.051 sec
    [junit] Running org.apache.nutch.searcher.TestSummary
    [junit] Tests run: 8, Failures: 0, Errors: 0, Time elapsed: 0.427 sec
    [junit] Running org.apache.nutch.util.TestEncodingDetector
    [junit] Tests run: 1, Failures: 0, Errors: 0, Time elapsed: 0.9 sec
    [junit] Running org.apache.nutch.util.TestGZIPUtils
    [junit] Tests run: 4, Failures: 0, Errors: 0, Time elapsed: 1.589 sec
    [junit] Running org.apache.nutch.util.TestNodeWalker
    [junit] Tests run: 1, Failures: 0, Errors: 0, Time elapsed: 2.27 sec
    [junit] Running org.apache.nutch.util.TestPrefixStringMatcher
    [junit] Tests run: 1, Failures: 0, Errors: 0, Time elapsed: 0.487 sec
    [junit] Running org.apache.nutch.util.TestStringUtil
    [junit] Tests run: 2, Failures: 0, Errors: 0, Time elapsed: 0.285 sec
    [junit] Running org.apache.nutch.util.TestSuffixStringMatcher
    [junit] Tests run: 1, Failures: 0, Errors: 0, Time elapsed: 0.462 sec
    [junit] Running org.apache.nutch.util.TestURLUtil
    [junit] Tests run: 3, Failures: 0, Errors: 0, Time elapsed: 0.817 sec

BUILD FAILED
http://hudson.zones.apache.org/hudson/job/Nutch-trunk/ws/trunk/build.xml :298: Tests failed!

Total time: 3 minutes 30 seconds
ERROR: No artifacts found that match the file pattern "trunk/build/*.tar.gz". Configuration error?
ERROR: 'trunk/build/*.tar.gz' doesn't match anything: 'trunk' exists but not 'trunk/build/*.tar.gz'
Publishing Javadoc
Recording test results

Reply | Threaded
Open this post in threaded view
|

Build failed in Hudson: Nutch-trunk #373

Apache Hudson Server
See http://hudson.zones.apache.org/hudson/job/Nutch-trunk/373/changes

------------------------------------------
[...truncated 4603 lines...]

copy-generated-lib:
     [copy] Copying 1 file to http://hudson.zones.apache.org/hudson/job/Nutch-trunk/ws/trunk/build/plugins/urlfilter-regex 

init:
    [mkdir] Created dir: http://hudson.zones.apache.org/hudson/job/Nutch-trunk/ws/trunk/build/urlfilter-suffix 
    [mkdir] Created dir: http://hudson.zones.apache.org/hudson/job/Nutch-trunk/ws/trunk/build/urlfilter-suffix/classes 
    [mkdir] Created dir: http://hudson.zones.apache.org/hudson/job/Nutch-trunk/ws/trunk/build/urlfilter-suffix/test 

init-plugin:

deps-jar:

compile:
     [echo] Compiling plugin: urlfilter-suffix
    [javac] Compiling 1 source file to http://hudson.zones.apache.org/hudson/job/Nutch-trunk/ws/trunk/build/urlfilter-suffix/classes 
    [javac] Note: http://hudson.zones.apache.org/hudson/job/Nutch-trunk/ws/trunk/src/plugin/urlfilter-suffix/src/java/org/apache/nutch/urlfilter/suffix/SuffixURLFilter.java  uses unchecked or unsafe operations.
    [javac] Note: Recompile with -Xlint:unchecked for details.

jar:
      [jar] Building jar: http://hudson.zones.apache.org/hudson/job/Nutch-trunk/ws/trunk/build/urlfilter-suffix/urlfilter-suffix.jar 

deps-test:

deploy:
    [mkdir] Created dir: http://hudson.zones.apache.org/hudson/job/Nutch-trunk/ws/trunk/build/plugins/urlfilter-suffix 
     [copy] Copying 1 file to http://hudson.zones.apache.org/hudson/job/Nutch-trunk/ws/trunk/build/plugins/urlfilter-suffix 

copy-generated-lib:
     [copy] Copying 1 file to http://hudson.zones.apache.org/hudson/job/Nutch-trunk/ws/trunk/build/plugins/urlfilter-suffix 

init:
    [mkdir] Created dir: http://hudson.zones.apache.org/hudson/job/Nutch-trunk/ws/trunk/build/urlfilter-validator 
    [mkdir] Created dir: http://hudson.zones.apache.org/hudson/job/Nutch-trunk/ws/trunk/build/urlfilter-validator/classes 
    [mkdir] Created dir: http://hudson.zones.apache.org/hudson/job/Nutch-trunk/ws/trunk/build/urlfilter-validator/test 

init-plugin:

deps-jar:

compile:
     [echo] Compiling plugin: urlfilter-validator
    [javac] Compiling 1 source file to http://hudson.zones.apache.org/hudson/job/Nutch-trunk/ws/trunk/build/urlfilter-validator/classes 

jar:
      [jar] Building jar: http://hudson.zones.apache.org/hudson/job/Nutch-trunk/ws/trunk/build/urlfilter-validator/urlfilter-validator.jar 

deps-test:

deploy:
    [mkdir] Created dir: http://hudson.zones.apache.org/hudson/job/Nutch-trunk/ws/trunk/build/plugins/urlfilter-validator 
     [copy] Copying 1 file to http://hudson.zones.apache.org/hudson/job/Nutch-trunk/ws/trunk/build/plugins/urlfilter-validator 

copy-generated-lib:
     [copy] Copying 1 file to http://hudson.zones.apache.org/hudson/job/Nutch-trunk/ws/trunk/build/plugins/urlfilter-validator 

init:
    [mkdir] Created dir: http://hudson.zones.apache.org/hudson/job/Nutch-trunk/ws/trunk/build/urlnormalizer-basic 
    [mkdir] Created dir: http://hudson.zones.apache.org/hudson/job/Nutch-trunk/ws/trunk/build/urlnormalizer-basic/classes 
    [mkdir] Created dir: http://hudson.zones.apache.org/hudson/job/Nutch-trunk/ws/trunk/build/urlnormalizer-basic/test 

init-plugin:

deps-jar:

compile:
     [echo] Compiling plugin: urlnormalizer-basic
    [javac] Compiling 1 source file to http://hudson.zones.apache.org/hudson/job/Nutch-trunk/ws/trunk/build/urlnormalizer-basic/classes 

jar:
      [jar] Building jar: http://hudson.zones.apache.org/hudson/job/Nutch-trunk/ws/trunk/build/urlnormalizer-basic/urlnormalizer-basic.jar 

deps-test:

deploy:
    [mkdir] Created dir: http://hudson.zones.apache.org/hudson/job/Nutch-trunk/ws/trunk/build/plugins/urlnormalizer-basic 
     [copy] Copying 1 file to http://hudson.zones.apache.org/hudson/job/Nutch-trunk/ws/trunk/build/plugins/urlnormalizer-basic 

copy-generated-lib:
     [copy] Copying 1 file to http://hudson.zones.apache.org/hudson/job/Nutch-trunk/ws/trunk/build/plugins/urlnormalizer-basic 

init:
    [mkdir] Created dir: http://hudson.zones.apache.org/hudson/job/Nutch-trunk/ws/trunk/build/urlnormalizer-pass 
    [mkdir] Created dir: http://hudson.zones.apache.org/hudson/job/Nutch-trunk/ws/trunk/build/urlnormalizer-pass/classes 
    [mkdir] Created dir: http://hudson.zones.apache.org/hudson/job/Nutch-trunk/ws/trunk/build/urlnormalizer-pass/test 

init-plugin:

deps-jar:

compile:
     [echo] Compiling plugin: urlnormalizer-pass
    [javac] Compiling 1 source file to http://hudson.zones.apache.org/hudson/job/Nutch-trunk/ws/trunk/build/urlnormalizer-pass/classes 

jar:
      [jar] Building jar: http://hudson.zones.apache.org/hudson/job/Nutch-trunk/ws/trunk/build/urlnormalizer-pass/urlnormalizer-pass.jar 

deps-test:

deploy:
    [mkdir] Created dir: http://hudson.zones.apache.org/hudson/job/Nutch-trunk/ws/trunk/build/plugins/urlnormalizer-pass 
     [copy] Copying 1 file to http://hudson.zones.apache.org/hudson/job/Nutch-trunk/ws/trunk/build/plugins/urlnormalizer-pass 

copy-generated-lib:
     [copy] Copying 1 file to http://hudson.zones.apache.org/hudson/job/Nutch-trunk/ws/trunk/build/plugins/urlnormalizer-pass 
    [mkdir] Created dir: http://hudson.zones.apache.org/hudson/job/Nutch-trunk/ws/trunk/build/urlnormalizer-regex/test/data 
     [copy] Copying 4 files to http://hudson.zones.apache.org/hudson/job/Nutch-trunk/ws/trunk/build/urlnormalizer-regex/test/data 

init:
    [mkdir] Created dir: http://hudson.zones.apache.org/hudson/job/Nutch-trunk/ws/trunk/build/urlnormalizer-regex/classes 

init-plugin:

deps-jar:

compile:
     [echo] Compiling plugin: urlnormalizer-regex
    [javac] Compiling 1 source file to http://hudson.zones.apache.org/hudson/job/Nutch-trunk/ws/trunk/build/urlnormalizer-regex/classes 
    [javac] Note: http://hudson.zones.apache.org/hudson/job/Nutch-trunk/ws/trunk/src/plugin/urlnormalizer-regex/src/java/org/apache/nutch/net/urlnormalizer/regex/RegexURLNormalizer.java  uses unchecked or unsafe operations.
    [javac] Note: Recompile with -Xlint:unchecked for details.

jar:
      [jar] Building jar: http://hudson.zones.apache.org/hudson/job/Nutch-trunk/ws/trunk/build/urlnormalizer-regex/urlnormalizer-regex.jar 

deps-test:

init:

init-plugin:

compile:

jar:
      [jar] Warning: skipping jar archive http://hudson.zones.apache.org/hudson/job/Nutch-trunk/ws/trunk/build/nutch-extensionpoints/nutch-extensionpoints.jar  because no files were included.

deps-test:

deploy:

copy-generated-lib:

deploy:
    [mkdir] Created dir: http://hudson.zones.apache.org/hudson/job/Nutch-trunk/ws/trunk/build/plugins/urlnormalizer-regex 
     [copy] Copying 1 file to http://hudson.zones.apache.org/hudson/job/Nutch-trunk/ws/trunk/build/plugins/urlnormalizer-regex 

copy-generated-lib:
     [copy] Copying 1 file to http://hudson.zones.apache.org/hudson/job/Nutch-trunk/ws/trunk/build/plugins/urlnormalizer-regex 

compile:

compile-core-test:
    [javac] Compiling 43 source files to http://hudson.zones.apache.org/hudson/job/Nutch-trunk/ws/trunk/build/test/classes 
    [javac] Note: Some input files use unchecked or unsafe operations.
    [javac] Note: Recompile with -Xlint:unchecked for details.

test-core:
    [mkdir] Created dir: http://hudson.zones.apache.org/hudson/job/Nutch-trunk/ws/trunk/build/test/data 
     [copy] Copying 90 files to http://hudson.zones.apache.org/hudson/job/Nutch-trunk/ws/trunk/build/test/data 
     [copy] Copying 1 file to http://hudson.zones.apache.org/hudson/job/Nutch-trunk/ws/trunk/build/test/classes 
     [copy] Copying 1 file to http://hudson.zones.apache.org/hudson/job/Nutch-trunk/ws/trunk/build/test/classes 
    [junit] Running org.apache.nutch.analysis.TestAnalyzerFactory
    [junit] Tests run: 4, Failures: 0, Errors: 0, Time elapsed: 2.129 sec
    [junit] Running org.apache.nutch.analysis.TestQueryParser
    [junit] Tests run: 1, Failures: 0, Errors: 0, Time elapsed: 0.908 sec
    [junit] Running org.apache.nutch.clustering.TestOnlineClustererFactory
    [junit] Tests run: 1, Failures: 0, Errors: 0, Time elapsed: 1.144 sec
    [junit] Running org.apache.nutch.crawl.TestCrawlDbMerger
    [junit] Tests run: 1, Failures: 0, Errors: 1, Time elapsed: 2.489 sec
    [junit] Test org.apache.nutch.crawl.TestCrawlDbMerger FAILED
    [junit] Running org.apache.nutch.crawl.TestGenerator
    [junit] Tests run: 4, Failures: 0, Errors: 4, Time elapsed: 5.485 sec
    [junit] Test org.apache.nutch.crawl.TestGenerator FAILED
    [junit] Running org.apache.nutch.crawl.TestInjector
    [junit] Tests run: 1, Failures: 0, Errors: 1, Time elapsed: 0.716 sec
    [junit] Test org.apache.nutch.crawl.TestInjector FAILED
    [junit] Running org.apache.nutch.crawl.TestLinkDbMerger
    [junit] Tests run: 1, Failures: 0, Errors: 1, Time elapsed: 1.228 sec
    [junit] Test org.apache.nutch.crawl.TestLinkDbMerger FAILED
    [junit] Running org.apache.nutch.crawl.TestMapWritable
    [junit] Tests run: 5, Failures: 0, Errors: 0, Time elapsed: 64.791 sec
    [junit] Running org.apache.nutch.crawl.TestSignatureFactory
    [junit] Tests run: 1, Failures: 0, Errors: 0, Time elapsed: 0.589 sec
    [junit] Running org.apache.nutch.fetcher.TestFetcher
    [junit] Tests run: 1, Failures: 0, Errors: 1, Time elapsed: 0.958 sec
    [junit] Test org.apache.nutch.fetcher.TestFetcher FAILED
    [junit] Running org.apache.nutch.indexer.TestDeleteDuplicates
    [junit] Tests run: 4, Failures: 0, Errors: 4, Time elapsed: 1.817 sec
    [junit] Test org.apache.nutch.indexer.TestDeleteDuplicates FAILED
    [junit] Running org.apache.nutch.indexer.TestIndexingFilters
    [junit] Tests run: 1, Failures: 0, Errors: 0, Time elapsed: 3.03 sec
    [junit] Running org.apache.nutch.metadata.TestMetadata
    [junit] Tests run: 10, Failures: 0, Errors: 0, Time elapsed: 0.465 sec
    [junit] Running org.apache.nutch.metadata.TestSpellCheckedMetadata
    [junit] Tests run: 11, Failures: 0, Errors: 0, Time elapsed: 15.731 sec
    [junit] Running org.apache.nutch.net.TestURLFilters
    [junit] Tests run: 1, Failures: 0, Errors: 0, Time elapsed: 2.825 sec
    [junit] Running org.apache.nutch.net.TestURLNormalizers
    [junit] Tests run: 1, Failures: 0, Errors: 0, Time elapsed: 1.615 sec
    [junit] Running org.apache.nutch.ontology.TestOntologyFactory
    [junit] Tests run: 1, Failures: 0, Errors: 0, Time elapsed: 2.641 sec
    [junit] Running org.apache.nutch.parse.TestOutlinkExtractor
    [junit] Tests run: 4, Failures: 0, Errors: 0, Time elapsed: 0.447 sec
    [junit] Running org.apache.nutch.parse.TestParseData
    [junit] Tests run: 2, Failures: 0, Errors: 0, Time elapsed: 0.329 sec
    [junit] Running org.apache.nutch.parse.TestParseText
    [junit] Tests run: 1, Failures: 0, Errors: 0, Time elapsed: 0.476 sec
    [junit] Running org.apache.nutch.parse.TestParserFactory
    [junit] Tests run: 2, Failures: 0, Errors: 0, Time elapsed: 1.559 sec
    [junit] Running org.apache.nutch.plugin.TestPluginSystem
    [junit] Tests run: 6, Failures: 0, Errors: 0, Time elapsed: 2.937 sec
    [junit] Running org.apache.nutch.protocol.TestContent
    [junit] Tests run: 2, Failures: 0, Errors: 0, Time elapsed: 0.895 sec
    [junit] Running org.apache.nutch.protocol.TestProtocolFactory
    [junit] Tests run: 2, Failures: 0, Errors: 0, Time elapsed: 1.965 sec
    [junit] Running org.apache.nutch.searcher.TestDistributedSearch
    [junit] Tests run: 2, Failures: 0, Errors: 0, Time elapsed: 4.516 sec
    [junit] Running org.apache.nutch.searcher.TestHitDetails
    [junit] Tests run: 1, Failures: 0, Errors: 0, Time elapsed: 0.431 sec
    [junit] Running org.apache.nutch.searcher.TestOpenSearchServlet
    [junit] Tests run: 1, Failures: 0, Errors: 0, Time elapsed: 0.399 sec
    [junit] Running org.apache.nutch.searcher.TestQuery
    [junit] Tests run: 6, Failures: 0, Errors: 0, Time elapsed: 1.126 sec
    [junit] Running org.apache.nutch.searcher.TestSummarizerFactory
    [junit] Tests run: 1, Failures: 0, Errors: 0, Time elapsed: 0.972 sec
    [junit] Running org.apache.nutch.searcher.TestSummary
    [junit] Tests run: 8, Failures: 0, Errors: 0, Time elapsed: 0.446 sec
    [junit] Running org.apache.nutch.util.TestEncodingDetector
    [junit] Tests run: 1, Failures: 0, Errors: 0, Time elapsed: 1.002 sec
    [junit] Running org.apache.nutch.util.TestGZIPUtils
    [junit] Tests run: 4, Failures: 0, Errors: 0, Time elapsed: 1.794 sec
    [junit] Running org.apache.nutch.util.TestNodeWalker
    [junit] Tests run: 1, Failures: 0, Errors: 0, Time elapsed: 2.02 sec
    [junit] Running org.apache.nutch.util.TestPrefixStringMatcher
    [junit] Tests run: 1, Failures: 0, Errors: 0, Time elapsed: 0.431 sec
    [junit] Running org.apache.nutch.util.TestStringUtil
    [junit] Tests run: 2, Failures: 0, Errors: 0, Time elapsed: 0.326 sec
    [junit] Running org.apache.nutch.util.TestSuffixStringMatcher
    [junit] Tests run: 1, Failures: 0, Errors: 0, Time elapsed: 0.606 sec
    [junit] Running org.apache.nutch.util.TestURLUtil
    [junit] Tests run: 3, Failures: 0, Errors: 0, Time elapsed: 0.935 sec

BUILD FAILED
http://hudson.zones.apache.org/hudson/job/Nutch-trunk/ws/trunk/build.xml :298: Tests failed!

Total time: 3 minutes 56 seconds
ERROR: No artifacts found that match the file pattern "trunk/build/*.tar.gz". Configuration error?
ERROR: 'trunk/build/*.tar.gz' doesn't match anything: 'trunk' exists but not 'trunk/build/*.tar.gz'
Publishing Javadoc
Recording test results

Reply | Threaded
Open this post in threaded view
|

Build failed in Hudson: Nutch-trunk #374

Apache Hudson Server
See http://hudson.zones.apache.org/hudson/job/Nutch-trunk/374/changes

------------------------------------------
[...truncated 4605 lines...]

copy-generated-lib:
     [copy] Copying 1 file to http://hudson.zones.apache.org/hudson/job/Nutch-trunk/ws/trunk/build/plugins/urlfilter-regex 

init:
    [mkdir] Created dir: http://hudson.zones.apache.org/hudson/job/Nutch-trunk/ws/trunk/build/urlfilter-suffix 
    [mkdir] Created dir: http://hudson.zones.apache.org/hudson/job/Nutch-trunk/ws/trunk/build/urlfilter-suffix/classes 
    [mkdir] Created dir: http://hudson.zones.apache.org/hudson/job/Nutch-trunk/ws/trunk/build/urlfilter-suffix/test 

init-plugin:

deps-jar:

compile:
     [echo] Compiling plugin: urlfilter-suffix
    [javac] Compiling 1 source file to http://hudson.zones.apache.org/hudson/job/Nutch-trunk/ws/trunk/build/urlfilter-suffix/classes 
    [javac] Note: http://hudson.zones.apache.org/hudson/job/Nutch-trunk/ws/trunk/src/plugin/urlfilter-suffix/src/java/org/apache/nutch/urlfilter/suffix/SuffixURLFilter.java  uses unchecked or unsafe operations.
    [javac] Note: Recompile with -Xlint:unchecked for details.

jar:
      [jar] Building jar: http://hudson.zones.apache.org/hudson/job/Nutch-trunk/ws/trunk/build/urlfilter-suffix/urlfilter-suffix.jar 

deps-test:

deploy:
    [mkdir] Created dir: http://hudson.zones.apache.org/hudson/job/Nutch-trunk/ws/trunk/build/plugins/urlfilter-suffix 
     [copy] Copying 1 file to http://hudson.zones.apache.org/hudson/job/Nutch-trunk/ws/trunk/build/plugins/urlfilter-suffix 

copy-generated-lib:
     [copy] Copying 1 file to http://hudson.zones.apache.org/hudson/job/Nutch-trunk/ws/trunk/build/plugins/urlfilter-suffix 

init:
    [mkdir] Created dir: http://hudson.zones.apache.org/hudson/job/Nutch-trunk/ws/trunk/build/urlfilter-validator 
    [mkdir] Created dir: http://hudson.zones.apache.org/hudson/job/Nutch-trunk/ws/trunk/build/urlfilter-validator/classes 
    [mkdir] Created dir: http://hudson.zones.apache.org/hudson/job/Nutch-trunk/ws/trunk/build/urlfilter-validator/test 

init-plugin:

deps-jar:

compile:
     [echo] Compiling plugin: urlfilter-validator
    [javac] Compiling 1 source file to http://hudson.zones.apache.org/hudson/job/Nutch-trunk/ws/trunk/build/urlfilter-validator/classes 

jar:
      [jar] Building jar: http://hudson.zones.apache.org/hudson/job/Nutch-trunk/ws/trunk/build/urlfilter-validator/urlfilter-validator.jar 

deps-test:

deploy:
    [mkdir] Created dir: http://hudson.zones.apache.org/hudson/job/Nutch-trunk/ws/trunk/build/plugins/urlfilter-validator 
     [copy] Copying 1 file to http://hudson.zones.apache.org/hudson/job/Nutch-trunk/ws/trunk/build/plugins/urlfilter-validator 

copy-generated-lib:
     [copy] Copying 1 file to http://hudson.zones.apache.org/hudson/job/Nutch-trunk/ws/trunk/build/plugins/urlfilter-validator 

init:
    [mkdir] Created dir: http://hudson.zones.apache.org/hudson/job/Nutch-trunk/ws/trunk/build/urlnormalizer-basic 
    [mkdir] Created dir: http://hudson.zones.apache.org/hudson/job/Nutch-trunk/ws/trunk/build/urlnormalizer-basic/classes 
    [mkdir] Created dir: http://hudson.zones.apache.org/hudson/job/Nutch-trunk/ws/trunk/build/urlnormalizer-basic/test 

init-plugin:

deps-jar:

compile:
     [echo] Compiling plugin: urlnormalizer-basic
    [javac] Compiling 1 source file to http://hudson.zones.apache.org/hudson/job/Nutch-trunk/ws/trunk/build/urlnormalizer-basic/classes 

jar:
      [jar] Building jar: http://hudson.zones.apache.org/hudson/job/Nutch-trunk/ws/trunk/build/urlnormalizer-basic/urlnormalizer-basic.jar 

deps-test:

deploy:
    [mkdir] Created dir: http://hudson.zones.apache.org/hudson/job/Nutch-trunk/ws/trunk/build/plugins/urlnormalizer-basic 
     [copy] Copying 1 file to http://hudson.zones.apache.org/hudson/job/Nutch-trunk/ws/trunk/build/plugins/urlnormalizer-basic 

copy-generated-lib:
     [copy] Copying 1 file to http://hudson.zones.apache.org/hudson/job/Nutch-trunk/ws/trunk/build/plugins/urlnormalizer-basic 

init:
    [mkdir] Created dir: http://hudson.zones.apache.org/hudson/job/Nutch-trunk/ws/trunk/build/urlnormalizer-pass 
    [mkdir] Created dir: http://hudson.zones.apache.org/hudson/job/Nutch-trunk/ws/trunk/build/urlnormalizer-pass/classes 
    [mkdir] Created dir: http://hudson.zones.apache.org/hudson/job/Nutch-trunk/ws/trunk/build/urlnormalizer-pass/test 

init-plugin:

deps-jar:

compile:
     [echo] Compiling plugin: urlnormalizer-pass
    [javac] Compiling 1 source file to http://hudson.zones.apache.org/hudson/job/Nutch-trunk/ws/trunk/build/urlnormalizer-pass/classes 

jar:
      [jar] Building jar: http://hudson.zones.apache.org/hudson/job/Nutch-trunk/ws/trunk/build/urlnormalizer-pass/urlnormalizer-pass.jar 

deps-test:

deploy:
    [mkdir] Created dir: http://hudson.zones.apache.org/hudson/job/Nutch-trunk/ws/trunk/build/plugins/urlnormalizer-pass 
     [copy] Copying 1 file to http://hudson.zones.apache.org/hudson/job/Nutch-trunk/ws/trunk/build/plugins/urlnormalizer-pass 

copy-generated-lib:
     [copy] Copying 1 file to http://hudson.zones.apache.org/hudson/job/Nutch-trunk/ws/trunk/build/plugins/urlnormalizer-pass 
    [mkdir] Created dir: http://hudson.zones.apache.org/hudson/job/Nutch-trunk/ws/trunk/build/urlnormalizer-regex/test/data 
     [copy] Copying 4 files to http://hudson.zones.apache.org/hudson/job/Nutch-trunk/ws/trunk/build/urlnormalizer-regex/test/data 

init:
    [mkdir] Created dir: http://hudson.zones.apache.org/hudson/job/Nutch-trunk/ws/trunk/build/urlnormalizer-regex/classes 

init-plugin:

deps-jar:

compile:
     [echo] Compiling plugin: urlnormalizer-regex
    [javac] Compiling 1 source file to http://hudson.zones.apache.org/hudson/job/Nutch-trunk/ws/trunk/build/urlnormalizer-regex/classes 
    [javac] Note: http://hudson.zones.apache.org/hudson/job/Nutch-trunk/ws/trunk/src/plugin/urlnormalizer-regex/src/java/org/apache/nutch/net/urlnormalizer/regex/RegexURLNormalizer.java  uses unchecked or unsafe operations.
    [javac] Note: Recompile with -Xlint:unchecked for details.

jar:
      [jar] Building jar: http://hudson.zones.apache.org/hudson/job/Nutch-trunk/ws/trunk/build/urlnormalizer-regex/urlnormalizer-regex.jar 

deps-test:

init:

init-plugin:

compile:

jar:
      [jar] Warning: skipping jar archive http://hudson.zones.apache.org/hudson/job/Nutch-trunk/ws/trunk/build/nutch-extensionpoints/nutch-extensionpoints.jar  because no files were included.

deps-test:

deploy:

copy-generated-lib:

deploy:
    [mkdir] Created dir: http://hudson.zones.apache.org/hudson/job/Nutch-trunk/ws/trunk/build/plugins/urlnormalizer-regex 
     [copy] Copying 1 file to http://hudson.zones.apache.org/hudson/job/Nutch-trunk/ws/trunk/build/plugins/urlnormalizer-regex 

copy-generated-lib:
     [copy] Copying 1 file to http://hudson.zones.apache.org/hudson/job/Nutch-trunk/ws/trunk/build/plugins/urlnormalizer-regex 

compile:

compile-core-test:
    [javac] Compiling 43 source files to http://hudson.zones.apache.org/hudson/job/Nutch-trunk/ws/trunk/build/test/classes 
    [javac] Note: Some input files use unchecked or unsafe operations.
    [javac] Note: Recompile with -Xlint:unchecked for details.

test-core:
    [mkdir] Created dir: http://hudson.zones.apache.org/hudson/job/Nutch-trunk/ws/trunk/build/test/data 
     [copy] Copying 90 files to http://hudson.zones.apache.org/hudson/job/Nutch-trunk/ws/trunk/build/test/data 
     [copy] Copying 1 file to http://hudson.zones.apache.org/hudson/job/Nutch-trunk/ws/trunk/build/test/classes 
     [copy] Copying 1 file to http://hudson.zones.apache.org/hudson/job/Nutch-trunk/ws/trunk/build/test/classes 
    [junit] Running org.apache.nutch.analysis.TestAnalyzerFactory
    [junit] Tests run: 4, Failures: 0, Errors: 0, Time elapsed: 2.183 sec
    [junit] Running org.apache.nutch.analysis.TestQueryParser
    [junit] Tests run: 1, Failures: 0, Errors: 0, Time elapsed: 1.123 sec
    [junit] Running org.apache.nutch.clustering.TestOnlineClustererFactory
    [junit] Tests run: 1, Failures: 0, Errors: 0, Time elapsed: 1.544 sec
    [junit] Running org.apache.nutch.crawl.TestCrawlDbMerger
    [junit] Tests run: 1, Failures: 0, Errors: 1, Time elapsed: 1.24 sec
    [junit] Test org.apache.nutch.crawl.TestCrawlDbMerger FAILED
    [junit] Running org.apache.nutch.crawl.TestGenerator
    [junit] Tests run: 4, Failures: 0, Errors: 4, Time elapsed: 5.726 sec
    [junit] Test org.apache.nutch.crawl.TestGenerator FAILED
    [junit] Running org.apache.nutch.crawl.TestInjector
    [junit] Tests run: 1, Failures: 0, Errors: 1, Time elapsed: 0.846 sec
    [junit] Test org.apache.nutch.crawl.TestInjector FAILED
    [junit] Running org.apache.nutch.crawl.TestLinkDbMerger
    [junit] Tests run: 1, Failures: 0, Errors: 1, Time elapsed: 1.329 sec
    [junit] Test org.apache.nutch.crawl.TestLinkDbMerger FAILED
    [junit] Running org.apache.nutch.crawl.TestMapWritable
    [junit] Tests run: 5, Failures: 0, Errors: 0, Time elapsed: 66.619 sec
    [junit] Running org.apache.nutch.crawl.TestSignatureFactory
    [junit] Tests run: 1, Failures: 0, Errors: 0, Time elapsed: 0.619 sec
    [junit] Running org.apache.nutch.fetcher.TestFetcher
    [junit] Tests run: 1, Failures: 0, Errors: 1, Time elapsed: 1.076 sec
    [junit] Test org.apache.nutch.fetcher.TestFetcher FAILED
    [junit] Running org.apache.nutch.indexer.TestDeleteDuplicates
    [junit] Tests run: 4, Failures: 0, Errors: 4, Time elapsed: 1.845 sec
    [junit] Test org.apache.nutch.indexer.TestDeleteDuplicates FAILED
    [junit] Running org.apache.nutch.indexer.TestIndexingFilters
    [junit] Tests run: 1, Failures: 0, Errors: 0, Time elapsed: 2.669 sec
    [junit] Running org.apache.nutch.metadata.TestMetadata
    [junit] Tests run: 10, Failures: 0, Errors: 0, Time elapsed: 0.461 sec
    [junit] Running org.apache.nutch.metadata.TestSpellCheckedMetadata
    [junit] Tests run: 11, Failures: 0, Errors: 0, Time elapsed: 16.586 sec
    [junit] Running org.apache.nutch.net.TestURLFilters
    [junit] Tests run: 1, Failures: 0, Errors: 0, Time elapsed: 2.099 sec
    [junit] Running org.apache.nutch.net.TestURLNormalizers
    [junit] Tests run: 1, Failures: 0, Errors: 0, Time elapsed: 1.238 sec
    [junit] Running org.apache.nutch.ontology.TestOntologyFactory
    [junit] Tests run: 1, Failures: 0, Errors: 0, Time elapsed: 2.614 sec
    [junit] Running org.apache.nutch.parse.TestOutlinkExtractor
    [junit] Tests run: 4, Failures: 0, Errors: 0, Time elapsed: 0.351 sec
    [junit] Running org.apache.nutch.parse.TestParseData
    [junit] Tests run: 2, Failures: 0, Errors: 0, Time elapsed: 0.338 sec
    [junit] Running org.apache.nutch.parse.TestParseText
    [junit] Tests run: 1, Failures: 0, Errors: 0, Time elapsed: 0.436 sec
    [junit] Running org.apache.nutch.parse.TestParserFactory
    [junit] Tests run: 2, Failures: 0, Errors: 0, Time elapsed: 1.403 sec
    [junit] Running org.apache.nutch.plugin.TestPluginSystem
    [junit] Tests run: 6, Failures: 0, Errors: 0, Time elapsed: 3.284 sec
    [junit] Running org.apache.nutch.protocol.TestContent
    [junit] Tests run: 2, Failures: 0, Errors: 0, Time elapsed: 1.072 sec
    [junit] Running org.apache.nutch.protocol.TestProtocolFactory
    [junit] Tests run: 2, Failures: 0, Errors: 0, Time elapsed: 1.971 sec
    [junit] Running org.apache.nutch.searcher.TestDistributedSearch
    [junit] Tests run: 2, Failures: 0, Errors: 0, Time elapsed: 3.578 sec
    [junit] Running org.apache.nutch.searcher.TestHitDetails
    [junit] Tests run: 1, Failures: 0, Errors: 0, Time elapsed: 0.333 sec
    [junit] Running org.apache.nutch.searcher.TestOpenSearchServlet
    [junit] Tests run: 1, Failures: 0, Errors: 0, Time elapsed: 0.319 sec
    [junit] Running org.apache.nutch.searcher.TestQuery
    [junit] Tests run: 6, Failures: 0, Errors: 0, Time elapsed: 1.075 sec
    [junit] Running org.apache.nutch.searcher.TestSummarizerFactory
    [junit] Tests run: 1, Failures: 0, Errors: 0, Time elapsed: 1.016 sec
    [junit] Running org.apache.nutch.searcher.TestSummary
    [junit] Tests run: 8, Failures: 0, Errors: 0, Time elapsed: 0.429 sec
    [junit] Running org.apache.nutch.util.TestEncodingDetector
    [junit] Tests run: 1, Failures: 0, Errors: 0, Time elapsed: 0.924 sec
    [junit] Running org.apache.nutch.util.TestGZIPUtils
    [junit] Tests run: 4, Failures: 0, Errors: 0, Time elapsed: 2.183 sec
    [junit] Running org.apache.nutch.util.TestNodeWalker
    [junit] Tests run: 1, Failures: 0, Errors: 0, Time elapsed: 2.414 sec
    [junit] Running org.apache.nutch.util.TestPrefixStringMatcher
    [junit] Tests run: 1, Failures: 0, Errors: 0, Time elapsed: 0.482 sec
    [junit] Running org.apache.nutch.util.TestStringUtil
    [junit] Tests run: 2, Failures: 0, Errors: 0, Time elapsed: 0.335 sec
    [junit] Running org.apache.nutch.util.TestSuffixStringMatcher
    [junit] Tests run: 1, Failures: 0, Errors: 0, Time elapsed: 0.449 sec
    [junit] Running org.apache.nutch.util.TestURLUtil
    [junit] Tests run: 3, Failures: 0, Errors: 0, Time elapsed: 1.675 sec

BUILD FAILED
http://hudson.zones.apache.org/hudson/job/Nutch-trunk/ws/trunk/build.xml :298: Tests failed!

Total time: 3 minutes 15 seconds
ERROR: No artifacts found that match the file pattern "trunk/build/*.tar.gz". Configuration error?
ERROR: 'trunk/build/*.tar.gz' doesn't match anything: 'trunk' exists but not 'trunk/build/*.tar.gz'
Publishing Javadoc
Recording test results

Reply | Threaded
Open this post in threaded view
|

Build failed in Hudson: Nutch-trunk #375

Apache Hudson Server
See http://hudson.zones.apache.org/hudson/job/Nutch-trunk/375/changes

------------------------------------------
[...truncated 6123 lines...]

init-plugin:

deps-jar:

compile:
     [echo] Compiling plugin: lib-regex-filter

jar:

init:

init-plugin:

deps-jar:

compile:
     [echo] Compiling plugin: lib-regex-filter

compile-test:

compile:
     [echo] Compiling plugin: urlfilter-automaton

compile-test:
    [javac] Compiling 1 source file to http://hudson.zones.apache.org/hudson/job/Nutch-trunk/ws/trunk/build/urlfilter-automaton/test 

jar:

deps-test:

init:

init-plugin:

deps-jar:

compile:
     [echo] Compiling plugin: lib-regex-filter

jar:

deps-test:

deploy:

copy-generated-lib:

deploy:

copy-generated-lib:

test:
     [echo] Testing plugin: urlfilter-automaton
    [junit] Tests run: 1, Failures: 0, Errors: 0, Time elapsed: 0.922 sec

init:

init-plugin:

deps-jar:

init:

init-plugin:

deps-jar:

compile:
     [echo] Compiling plugin: lib-regex-filter

jar:

init:

init-plugin:

deps-jar:

compile:
     [echo] Compiling plugin: lib-regex-filter

compile-test:

compile:
     [echo] Compiling plugin: urlfilter-regex

compile-test:
    [javac] Compiling 1 source file to http://hudson.zones.apache.org/hudson/job/Nutch-trunk/ws/trunk/build/urlfilter-regex/test 
    [junit] Running org.apache.nutch.urlfilter.automaton.TestAutomatonURLFilter

jar:

deps-test:

init:

init-plugin:

deps-jar:

compile:
     [echo] Compiling plugin: lib-regex-filter

jar:

deps-test:

deploy:

copy-generated-lib:

deploy:

copy-generated-lib:

test:
     [echo] Testing plugin: urlfilter-regex
    [junit] Running org.apache.nutch.urlfilter.regex.TestRegexURLFilter
    [junit] Tests run: 1, Failures: 0, Errors: 0, Time elapsed: 4.346 sec

init:

init-plugin:

deps-jar:

compile:
     [echo] Compiling plugin: urlfilter-suffix

compile-test:
    [javac] Compiling 1 source file to http://hudson.zones.apache.org/hudson/job/Nutch-trunk/ws/trunk/build/urlfilter-suffix/test 

jar:

deps-test:

deploy:

copy-generated-lib:

test:
     [echo] Testing plugin: urlfilter-suffix
    [junit] Running org.apache.nutch.urlfilter.suffix.TestSuffixURLFilter
    [junit] Tests run: 6, Failures: 0, Errors: 0, Time elapsed: 0.179 sec

init:

init-plugin:

deps-jar:

compile:
     [echo] Compiling plugin: urlnormalizer-basic

compile-test:
    [javac] Compiling 1 source file to http://hudson.zones.apache.org/hudson/job/Nutch-trunk/ws/trunk/build/urlnormalizer-basic/test 

jar:

deps-test:

deploy:

copy-generated-lib:

test:
     [echo] Testing plugin: urlnormalizer-basic
    [junit] Running org.apache.nutch.net.urlnormalizer.basic.TestBasicURLNormalizer
    [junit] Tests run: 1, Failures: 0, Errors: 0, Time elapsed: 0.027 sec

init:

init-plugin:

deps-jar:

compile:
     [echo] Compiling plugin: urlnormalizer-pass

compile-test:
    [javac] Compiling 1 source file to http://hudson.zones.apache.org/hudson/job/Nutch-trunk/ws/trunk/build/urlnormalizer-pass/test 

jar:

deps-test:

deploy:

copy-generated-lib:

test:
     [echo] Testing plugin: urlnormalizer-pass
    [junit] Running org.apache.nutch.net.urlnormalizer.pass.TestPassURLNormalizer
    [junit] Tests run: 1, Failures: 0, Errors: 0, Time elapsed: 0.229 sec

init:

init-plugin:

deps-jar:

compile:
     [echo] Compiling plugin: urlnormalizer-regex

compile-test:
    [javac] Compiling 1 source file to http://hudson.zones.apache.org/hudson/job/Nutch-trunk/ws/trunk/build/urlnormalizer-regex/test 
    [javac] Note: http://hudson.zones.apache.org/hudson/job/Nutch-trunk/ws/trunk/src/plugin/urlnormalizer-regex/src/test/org/apache/nutch/net/urlnormalizer/regex/TestRegexURLNormalizer.java  uses unchecked or unsafe operations.
    [javac] Note: Recompile with -Xlint:unchecked for details.

jar:

deps-test:

init:

init-plugin:

compile:

jar:
      [jar] Warning: skipping jar archive http://hudson.zones.apache.org/hudson/job/Nutch-trunk/ws/trunk/build/nutch-extensionpoints/nutch-extensionpoints.jar  because no files were included.

deps-test:

deploy:

copy-generated-lib:

deploy:

copy-generated-lib:

test:
     [echo] Testing plugin: urlnormalizer-regex
    [junit] Running org.apache.nutch.net.urlnormalizer.regex.TestRegexURLNormalizer
    [junit] Tests run: 2, Failures: 0, Errors: 0, Time elapsed: 0.218 sec
    [junit] Tests run: 1, Failures: 0, Errors: 0, Time elapsed: 9.181 sec

BUILD FAILED
http://hudson.zones.apache.org/hudson/job/Nutch-trunk/ws/trunk/build.xml :303: The following error occurred while executing this line:
http://hudson.zones.apache.org/hudson/job/Nutch-trunk/ws/trunk/src/plugin/build.xml :104: The following error occurred while executing this line:
http://hudson.zones.apache.org/hudson/job/Nutch-trunk/ws/trunk/src/plugin/build-plugin.xml :200: Tests failed!

Total time: 4 minutes 58 seconds
ERROR: No artifacts found that match the file pattern "trunk/build/*.tar.gz". Configuration error?
ERROR: 'trunk/build/*.tar.gz' doesn't match anything: 'trunk' exists but not 'trunk/build/*.tar.gz'
Publishing Javadoc
Recording test results

Reply | Threaded
Open this post in threaded view
|

Hudson build is back to normal: Nutch-trunk #376

Apache Hudson Server