Build failed in Hudson: Nutch-trunk #590

classic Classic list List threaded Threaded
2 messages Options
Reply | Threaded
Open this post in threaded view
|

Build failed in Hudson: Nutch-trunk #590

Apache Hudson Server
See http://hudson.zones.apache.org/hudson/job/Nutch-trunk/590/changes

------------------------------------------
[...truncated 4662 lines...]
copy-generated-lib:
     [copy] Copying 1 file to http://hudson.zones.apache.org/hudson/job/Nutch-trunk/ws/trunk/build/plugins/urlfilter-validator 

init:
    [mkdir] Created dir: http://hudson.zones.apache.org/hudson/job/Nutch-trunk/ws/trunk/build/urlnormalizer-basic 
    [mkdir] Created dir: http://hudson.zones.apache.org/hudson/job/Nutch-trunk/ws/trunk/build/urlnormalizer-basic/classes 
    [mkdir] Created dir: http://hudson.zones.apache.org/hudson/job/Nutch-trunk/ws/trunk/build/urlnormalizer-basic/test 

init-plugin:

deps-jar:

compile:
     [echo] Compiling plugin: urlnormalizer-basic
    [javac] Compiling 1 source file to http://hudson.zones.apache.org/hudson/job/Nutch-trunk/ws/trunk/build/urlnormalizer-basic/classes 

jar:
      [jar] Building jar: http://hudson.zones.apache.org/hudson/job/Nutch-trunk/ws/trunk/build/urlnormalizer-basic/urlnormalizer-basic.jar 

deps-test:

deploy:
    [mkdir] Created dir: http://hudson.zones.apache.org/hudson/job/Nutch-trunk/ws/trunk/build/plugins/urlnormalizer-basic 
     [copy] Copying 1 file to http://hudson.zones.apache.org/hudson/job/Nutch-trunk/ws/trunk/build/plugins/urlnormalizer-basic 

copy-generated-lib:
     [copy] Copying 1 file to http://hudson.zones.apache.org/hudson/job/Nutch-trunk/ws/trunk/build/plugins/urlnormalizer-basic 

init:
    [mkdir] Created dir: http://hudson.zones.apache.org/hudson/job/Nutch-trunk/ws/trunk/build/urlnormalizer-pass 
    [mkdir] Created dir: http://hudson.zones.apache.org/hudson/job/Nutch-trunk/ws/trunk/build/urlnormalizer-pass/classes 
    [mkdir] Created dir: http://hudson.zones.apache.org/hudson/job/Nutch-trunk/ws/trunk/build/urlnormalizer-pass/test 

init-plugin:

deps-jar:

compile:
     [echo] Compiling plugin: urlnormalizer-pass
    [javac] Compiling 1 source file to http://hudson.zones.apache.org/hudson/job/Nutch-trunk/ws/trunk/build/urlnormalizer-pass/classes 

jar:
      [jar] Building jar: http://hudson.zones.apache.org/hudson/job/Nutch-trunk/ws/trunk/build/urlnormalizer-pass/urlnormalizer-pass.jar 

deps-test:

deploy:
    [mkdir] Created dir: http://hudson.zones.apache.org/hudson/job/Nutch-trunk/ws/trunk/build/plugins/urlnormalizer-pass 
     [copy] Copying 1 file to http://hudson.zones.apache.org/hudson/job/Nutch-trunk/ws/trunk/build/plugins/urlnormalizer-pass 

copy-generated-lib:
     [copy] Copying 1 file to http://hudson.zones.apache.org/hudson/job/Nutch-trunk/ws/trunk/build/plugins/urlnormalizer-pass 
    [mkdir] Created dir: http://hudson.zones.apache.org/hudson/job/Nutch-trunk/ws/trunk/build/urlnormalizer-regex/test/data 
     [copy] Copying 4 files to http://hudson.zones.apache.org/hudson/job/Nutch-trunk/ws/trunk/build/urlnormalizer-regex/test/data 

init:
    [mkdir] Created dir: http://hudson.zones.apache.org/hudson/job/Nutch-trunk/ws/trunk/build/urlnormalizer-regex/classes 

init-plugin:

deps-jar:

compile:
     [echo] Compiling plugin: urlnormalizer-regex
    [javac] Compiling 1 source file to http://hudson.zones.apache.org/hudson/job/Nutch-trunk/ws/trunk/build/urlnormalizer-regex/classes 
    [javac] Note: http://hudson.zones.apache.org/hudson/job/Nutch-trunk/ws/trunk/src/plugin/urlnormalizer-regex/src/java/org/apache/nutch/net/urlnormalizer/regex/RegexURLNormalizer.java  uses unchecked or unsafe operations.
    [javac] Note: Recompile with -Xlint:unchecked for details.

jar:
      [jar] Building jar: http://hudson.zones.apache.org/hudson/job/Nutch-trunk/ws/trunk/build/urlnormalizer-regex/urlnormalizer-regex.jar 

deps-test:

init:

init-plugin:

compile:

jar:
      [jar] Warning: skipping jar archive http://hudson.zones.apache.org/hudson/job/Nutch-trunk/ws/trunk/build/nutch-extensionpoints/nutch-extensionpoints.jar  because no files were included.

deps-test:

deploy:

copy-generated-lib:

deploy:
    [mkdir] Created dir: http://hudson.zones.apache.org/hudson/job/Nutch-trunk/ws/trunk/build/plugins/urlnormalizer-regex 
     [copy] Copying 1 file to http://hudson.zones.apache.org/hudson/job/Nutch-trunk/ws/trunk/build/plugins/urlnormalizer-regex 

copy-generated-lib:
     [copy] Copying 1 file to http://hudson.zones.apache.org/hudson/job/Nutch-trunk/ws/trunk/build/plugins/urlnormalizer-regex 

compile:

job:
      [jar] Building jar: http://hudson.zones.apache.org/hudson/job/Nutch-trunk/ws/trunk/build/nutch-2008-10-05_04-01-48.job 

compile-core-test:
    [javac] Compiling 44 source files to http://hudson.zones.apache.org/hudson/job/Nutch-trunk/ws/trunk/build/test/classes 
    [javac] Note: Some input files use or override a deprecated API.
    [javac] Note: Recompile with -Xlint:deprecation for details.
    [javac] Note: Some input files use unchecked or unsafe operations.
    [javac] Note: Recompile with -Xlint:unchecked for details.

test-core:
    [mkdir] Created dir: http://hudson.zones.apache.org/hudson/job/Nutch-trunk/ws/trunk/build/test/data 
     [copy] Copying 90 files to http://hudson.zones.apache.org/hudson/job/Nutch-trunk/ws/trunk/build/test/data 
     [copy] Copying 1 file to http://hudson.zones.apache.org/hudson/job/Nutch-trunk/ws/trunk/build/test/classes 
     [copy] Copying 1 file to http://hudson.zones.apache.org/hudson/job/Nutch-trunk/ws/trunk/build/test/classes 
    [junit] Running org.apache.nutch.analysis.TestAnalyzerFactory
    [junit] Tests run: 4, Failures: 0, Errors: 0, Time elapsed: 2.007 sec
    [junit] Running org.apache.nutch.analysis.TestQueryParser
    [junit] Tests run: 1, Failures: 0, Errors: 0, Time elapsed: 0.853 sec
    [junit] Running org.apache.nutch.clustering.TestOnlineClustererFactory
    [junit] Tests run: 1, Failures: 0, Errors: 0, Time elapsed: 1.184 sec
    [junit] Running org.apache.nutch.crawl.TestCrawlDbMerger
    [junit] Tests run: 1, Failures: 0, Errors: 0, Time elapsed: 6.079 sec
    [junit] Running org.apache.nutch.crawl.TestGenerator
    [junit] Tests run: 4, Failures: 0, Errors: 0, Time elapsed: 58.499 sec
    [junit] Running org.apache.nutch.crawl.TestInjector
    [junit] Tests run: 1, Failures: 0, Errors: 0, Time elapsed: 12.069 sec
    [junit] Running org.apache.nutch.crawl.TestLinkDbMerger
    [junit] Tests run: 1, Failures: 0, Errors: 0, Time elapsed: 5.815 sec
    [junit] Running org.apache.nutch.crawl.TestMapWritable
    [junit] Tests run: 5, Failures: 0, Errors: 0, Time elapsed: 69.74 sec
    [junit] Running org.apache.nutch.crawl.TestSignatureFactory
    [junit] Tests run: 1, Failures: 0, Errors: 0, Time elapsed: 0.576 sec
    [junit] Running org.apache.nutch.fetcher.TestFetcher
    [junit] Tests run: 1, Failures: 0, Errors: 0, Time elapsed: 17.052 sec
    [junit] Running org.apache.nutch.indexer.TestDeleteDuplicates
    [junit] Tests run: 4, Failures: 0, Errors: 0, Time elapsed: 48.826 sec
    [junit] Running org.apache.nutch.indexer.TestIndexSorter
    [junit] Tests run: 1, Failures: 0, Errors: 0, Time elapsed: 1.79 sec
    [junit] Running org.apache.nutch.indexer.TestIndexingFilters
    [junit] Tests run: 1, Failures: 0, Errors: 0, Time elapsed: 2.728 sec
    [junit] Running org.apache.nutch.metadata.TestMetadata
    [junit] Tests run: 10, Failures: 0, Errors: 0, Time elapsed: 0.417 sec
    [junit] Running org.apache.nutch.metadata.TestSpellCheckedMetadata
    [junit] Tests run: 11, Failures: 0, Errors: 0, Time elapsed: 14.721 sec
    [junit] Running org.apache.nutch.net.TestURLFilters
    [junit] Tests run: 1, Failures: 0, Errors: 0, Time elapsed: 1.644 sec
    [junit] Running org.apache.nutch.net.TestURLNormalizers
    [junit] Tests run: 1, Failures: 0, Errors: 0, Time elapsed: 1.025 sec
    [junit] Running org.apache.nutch.ontology.TestOntologyFactory
    [junit] Tests run: 1, Failures: 0, Errors: 0, Time elapsed: 2.592 sec
    [junit] Running org.apache.nutch.parse.TestOutlinkExtractor
    [junit] Tests run: 4, Failures: 0, Errors: 0, Time elapsed: 0.334 sec
    [junit] Running org.apache.nutch.parse.TestParseData
    [junit] Tests run: 2, Failures: 0, Errors: 0, Time elapsed: 0.331 sec
    [junit] Running org.apache.nutch.parse.TestParseText
    [junit] Tests run: 1, Failures: 0, Errors: 0, Time elapsed: 0.412 sec
    [junit] Running org.apache.nutch.parse.TestParserFactory
    [junit] Tests run: 2, Failures: 0, Errors: 0, Time elapsed: 1.459 sec
    [junit] Running org.apache.nutch.plugin.TestPluginSystem
    [junit] Tests run: 6, Failures: 0, Errors: 0, Time elapsed: 2.396 sec
    [junit] Running org.apache.nutch.protocol.TestContent
    [junit] Tests run: 2, Failures: 0, Errors: 0, Time elapsed: 0.57 sec
    [junit] Running org.apache.nutch.protocol.TestProtocolFactory
    [junit] Tests run: 2, Failures: 0, Errors: 0, Time elapsed: 1.387 sec
    [junit] Running org.apache.nutch.searcher.TestDistributedSearch
    [junit] Tests run: 2, Failures: 0, Errors: 0, Time elapsed: 4.39 sec
    [junit] Running org.apache.nutch.searcher.TestHitDetails
    [junit] Tests run: 1, Failures: 0, Errors: 0, Time elapsed: 0.312 sec
    [junit] Running org.apache.nutch.searcher.TestOpenSearchServlet
    [junit] Tests run: 1, Failures: 0, Errors: 0, Time elapsed: 0.342 sec
    [junit] Running org.apache.nutch.searcher.TestQuery
    [junit] Tests run: 6, Failures: 0, Errors: 0, Time elapsed: 0.857 sec
    [junit] Running org.apache.nutch.searcher.TestSummarizerFactory
    [junit] Tests run: 1, Failures: 0, Errors: 0, Time elapsed: 0.972 sec
    [junit] Running org.apache.nutch.searcher.TestSummary
    [junit] Tests run: 8, Failures: 0, Errors: 0, Time elapsed: 0.427 sec
    [junit] Running org.apache.nutch.util.TestEncodingDetector
    [junit] Tests run: 1, Failures: 0, Errors: 0, Time elapsed: 0.679 sec
    [junit] Running org.apache.nutch.util.TestGZIPUtils
    [junit] Tests run: 4, Failures: 0, Errors: 0, Time elapsed: 1.534 sec
    [junit] Running org.apache.nutch.util.TestNodeWalker
    [junit] Tests run: 1, Failures: 1, Errors: 0, Time elapsed: 1.156 sec
    [junit] Test org.apache.nutch.util.TestNodeWalker FAILED
    [junit] Running org.apache.nutch.util.TestPrefixStringMatcher
    [junit] Tests run: 1, Failures: 0, Errors: 0, Time elapsed: 0.411 sec
    [junit] Running org.apache.nutch.util.TestStringUtil
    [junit] Tests run: 2, Failures: 0, Errors: 0, Time elapsed: 0.307 sec
    [junit] Running org.apache.nutch.util.TestSuffixStringMatcher
    [junit] Tests run: 1, Failures: 0, Errors: 0, Time elapsed: 0.416 sec
    [junit] Running org.apache.nutch.util.TestURLUtil
    [junit] Tests run: 3, Failures: 0, Errors: 0, Time elapsed: 0.814 sec

BUILD FAILED
http://hudson.zones.apache.org/hudson/job/Nutch-trunk/ws/trunk/build.xml :299: Tests failed!

Total time: 5 minutes 23 seconds
Publishing Javadoc
FATAL: Unable to copy Javadoc from http://hudson.zones.apache.org/hudson/job/Nutch-trunk/ws/trunk/build/docs/api  to /export/home/hudson/hudson/jobs/Nutch-trunk/javadoc
hudson.util.IOException2: java.io.EOFException
        at java.util.zip.GZIPInputStream.readUByte(GZIPInputStream.java:207)
        at java.util.zip.GZIPInputStream.readUShort(GZIPInputStream.java:197)
        at java.util.zip.GZIPInputStream.readHeader(GZIPInputStream.java:136)
        at java.util.zip.GZIPInputStream.<init>(GZIPInputStream.java:58)
        at java.util.zip.GZIPInputStream.<init>(GZIPInputStream.java:68)
        at hudson.FilePath.readFromTar(FilePath.java:922)
        at hudson.FilePath.copyRecursiveTo(FilePath.java:851)
        at hudson.FilePath.copyRecursiveTo(FilePath.java:768)
        at hudson.tasks.JavadocArchiver.perform(JavadocArchiver.java:68)
        at hudson.model.AbstractBuild$AbstractRunner.performAllBuildStep(AbstractBuild.java:318)
        at hudson.model.AbstractBuild$AbstractRunner.performAllBuildStep(AbstractBuild.java:306)
        at hudson.model.Build$RunnerImpl.post2(Build.java:122)
        at hudson.model.AbstractBuild$AbstractRunner.post(AbstractBuild.java:291)
        at hudson.model.Run.run(Run.java:809)
        at hudson.model.Build.run(Build.java:84)
        at hudson.model.ResourceController.execute(ResourceController.java:70)
        at hudson.model.Executor.run(Executor.java:88)

        at hudson.FilePath.copyRecursiveTo(FilePath.java:858)
        at hudson.FilePath.copyRecursiveTo(FilePath.java:768)
        at hudson.tasks.JavadocArchiver.perform(JavadocArchiver.java:68)
        at hudson.model.AbstractBuild$AbstractRunner.performAllBuildStep(AbstractBuild.java:318)
        at hudson.model.AbstractBuild$AbstractRunner.performAllBuildStep(AbstractBuild.java:306)
        at hudson.model.Build$RunnerImpl.post2(Build.java:122)
        at hudson.model.AbstractBuild$AbstractRunner.post(AbstractBuild.java:291)
        at hudson.model.Run.run(Run.java:809)
        at hudson.model.Build.run(Build.java:84)
        at hudson.model.ResourceController.execute(ResourceController.java:70)
        at hudson.model.Executor.run(Executor.java:88)
Caused by: java.util.concurrent.ExecutionException: http://hudson.zones.apache.org/hudson/job/Nutch-trunk/ws/trunk/build/docs/api  not found.
        at hudson.remoting.Channel$1.adapt(Channel.java:425)
        at hudson.remoting.Channel$1.adapt(Channel.java:420)
        at hudson.remoting.FutureAdapter.get(FutureAdapter.java:36)
        at hudson.FilePath.copyRecursiveTo(FilePath.java:854)
        ... 10 more
Caused by: http://hudson.zones.apache.org/hudson/job/Nutch-trunk/ws/trunk/build/docs/api  not found.
        at org.apache.tools.ant.types.AbstractFileSet.getDirectoryScanner(AbstractFileSet.java:422)
        at hudson.FilePath.writeToTar(FilePath.java:885)
        at hudson.FilePath.access$400(FilePath.java:117)
        at hudson.FilePath$24.invoke(FilePath.java:844)
        at hudson.FilePath$24.invoke(FilePath.java:841)
        at hudson.FilePath$FileCallableWrapper.call(FilePath.java:1127)
        at hudson.remoting.UserRequest.perform(UserRequest.java:69)
        at hudson.remoting.UserRequest.perform(UserRequest.java:23)
        at hudson.remoting.Request$2.run(Request.java:200)
        at java.util.concurrent.Executors$RunnableAdapter.call(Executors.java:441)
        at java.util.concurrent.FutureTask$Sync.innerRun(FutureTask.java:303)
        at java.util.concurrent.FutureTask.run(FutureTask.java:138)
        at java.util.concurrent.ThreadPoolExecutor$Worker.runTask(ThreadPoolExecutor.java:885)
        at java.util.concurrent.ThreadPoolExecutor$Worker.run(ThreadPoolExecutor.java:907)
        at java.lang.Thread.run(Thread.java:619)
Recording test results

Reply | Threaded
Open this post in threaded view
|

Hudson build is back to normal: Nutch-trunk #591

Apache Hudson Server