Build failed in Hudson: Nutch-trunk #998

classic Classic list List threaded Threaded
5 messages Options
Reply | Threaded
Open this post in threaded view
|

Build failed in Hudson: Nutch-trunk #998

Apache Hudson Server
See <http://hudson.zones.apache.org/hudson/job/Nutch-trunk/998/>

------------------------------------------
A timer trigger started this job
Building remotely on lucene.zones.apache.org (Solaris 10)
Checking out http://svn.apache.org/repos/asf/lucene/nutch/trunk
ERROR: Failed to check out http://svn.apache.org/repos/asf/lucene/nutch/trunk
org.tmatesoft.svn.core.SVNException: svn: timed out waiting for server
svn: OPTIONS request failed on '/repos/asf/lucene/nutch/trunk'
        at org.tmatesoft.svn.core.internal.wc.SVNErrorManager.error(SVNErrorManager.java:103)
        at org.tmatesoft.svn.core.internal.wc.SVNErrorManager.error(SVNErrorManager.java:87)
        at org.tmatesoft.svn.core.internal.io.dav.http.HTTPConnection.request(HTTPConnection.java:616)
        at org.tmatesoft.svn.core.internal.io.dav.http.HTTPConnection.request(HTTPConnection.java:273)
        at org.tmatesoft.svn.core.internal.io.dav.http.HTTPConnection.request(HTTPConnection.java:261)
        at org.tmatesoft.svn.core.internal.io.dav.DAVConnection.exchangeCapabilities(DAVConnection.java:516)
        at org.tmatesoft.svn.core.internal.io.dav.DAVConnection.open(DAVConnection.java:98)
        at org.tmatesoft.svn.core.internal.io.dav.DAVRepository.openConnection(DAVRepository.java:1001)
        at org.tmatesoft.svn.core.internal.io.dav.DAVRepository.getLatestRevision(DAVRepository.java:178)
        at org.tmatesoft.svn.core.wc.SVNBasicClient.getRevisionNumber(SVNBasicClient.java:482)
        at org.tmatesoft.svn.core.wc.SVNBasicClient.getLocations(SVNBasicClient.java:851)
        at org.tmatesoft.svn.core.wc.SVNBasicClient.createRepository(SVNBasicClient.java:534)
        at org.tmatesoft.svn.core.wc.SVNUpdateClient.doCheckout(SVNUpdateClient.java:893)
        at org.tmatesoft.svn.core.wc.SVNUpdateClient.doCheckout(SVNUpdateClient.java:791)
        at hudson.scm.SubversionSCM$CheckOutTask.invoke(SubversionSCM.java:617)
        at hudson.scm.SubversionSCM$CheckOutTask.invoke(SubversionSCM.java:543)
        at hudson.FilePath$FileCallableWrapper.call(FilePath.java:2052)
        at hudson.remoting.UserRequest.perform(UserRequest.java:69)
        at hudson.remoting.UserRequest.perform(UserRequest.java:23)
        at hudson.remoting.Request$2.run(Request.java:200)
        at java.util.concurrent.Executors$RunnableAdapter.call(Executors.java:441)
        at java.util.concurrent.FutureTask$Sync.innerRun(FutureTask.java:303)
        at java.util.concurrent.FutureTask.run(FutureTask.java:138)
        at java.util.concurrent.ThreadPoolExecutor$Worker.runTask(ThreadPoolExecutor.java:885)
        at java.util.concurrent.ThreadPoolExecutor$Worker.run(ThreadPoolExecutor.java:907)
        at java.lang.Thread.run(Thread.java:619)
Caused by: java.net.SocketTimeoutException: connect timed out
        at java.net.PlainSocketImpl.socketConnect(Native Method)
        at java.net.PlainSocketImpl.doConnect(PlainSocketImpl.java:333)
        at java.net.PlainSocketImpl.connectToAddress(PlainSocketImpl.java:195)
        at java.net.PlainSocketImpl.connect(PlainSocketImpl.java:182)
        at java.net.SocksSocketImpl.connect(SocksSocketImpl.java:366)
        at java.net.Socket.connect(Socket.java:519)
        at org.tmatesoft.svn.core.internal.util.SVNSocketConnection.run(SVNSocketConnection.java:57)
        ... 1 more
Archiving artifacts
Publishing Javadoc
Recording test results

Reply | Threaded
Open this post in threaded view
|

Build failed in Hudson: Nutch-trunk #999

Apache Hudson Server
See <http://hudson.zones.apache.org/hudson/job/Nutch-trunk/999/>

------------------------------------------
[...truncated 4696 lines...]
    [javac] Compiling 1 source file to <http://hudson.zones.apache.org/hudson/job/Nutch-trunk/ws/trunk/build/urlfilter-prefix/classes>
    [javac] Note: <http://hudson.zones.apache.org/hudson/job/Nutch-trunk/ws/trunk/src/plugin/urlfilter-prefix/src/java/org/apache/nutch/urlfilter/prefix/PrefixURLFilter.java> uses unchecked or unsafe operations.
    [javac] Note: Recompile with -Xlint:unchecked for details.

jar:
      [jar] Building jar: <http://hudson.zones.apache.org/hudson/job/Nutch-trunk/ws/trunk/build/urlfilter-prefix/urlfilter-prefix.jar>

deps-test:

deploy:
    [mkdir] Created dir: <http://hudson.zones.apache.org/hudson/job/Nutch-trunk/ws/trunk/build/plugins/urlfilter-prefix>
     [copy] Copying 1 file to <http://hudson.zones.apache.org/hudson/job/Nutch-trunk/ws/trunk/build/plugins/urlfilter-prefix>

copy-generated-lib:
     [copy] Copying 1 file to <http://hudson.zones.apache.org/hudson/job/Nutch-trunk/ws/trunk/build/plugins/urlfilter-prefix>
    [mkdir] Created dir: <http://hudson.zones.apache.org/hudson/job/Nutch-trunk/ws/trunk/build/urlfilter-regex/test/data>
     [copy] Copying 6 files to <http://hudson.zones.apache.org/hudson/job/Nutch-trunk/ws/trunk/build/urlfilter-regex/test/data>

init:
    [mkdir] Created dir: <http://hudson.zones.apache.org/hudson/job/Nutch-trunk/ws/trunk/build/urlfilter-regex/classes>

init-plugin:

deps-jar:

init:

init-plugin:

deps-jar:

compile:
     [echo] Compiling plugin: lib-regex-filter

jar:

init:

init-plugin:

deps-jar:

compile:
     [echo] Compiling plugin: lib-regex-filter

compile-test:

compile:
     [echo] Compiling plugin: urlfilter-regex
    [javac] Compiling 1 source file to <http://hudson.zones.apache.org/hudson/job/Nutch-trunk/ws/trunk/build/urlfilter-regex/classes>

jar:
      [jar] Building jar: <http://hudson.zones.apache.org/hudson/job/Nutch-trunk/ws/trunk/build/urlfilter-regex/urlfilter-regex.jar>

deps-test:

init:

init-plugin:

deps-jar:

compile:
     [echo] Compiling plugin: lib-regex-filter

jar:

deps-test:

deploy:

copy-generated-lib:

deploy:
    [mkdir] Created dir: <http://hudson.zones.apache.org/hudson/job/Nutch-trunk/ws/trunk/build/plugins/urlfilter-regex>
     [copy] Copying 1 file to <http://hudson.zones.apache.org/hudson/job/Nutch-trunk/ws/trunk/build/plugins/urlfilter-regex>

copy-generated-lib:
     [copy] Copying 1 file to <http://hudson.zones.apache.org/hudson/job/Nutch-trunk/ws/trunk/build/plugins/urlfilter-regex>

init:
    [mkdir] Created dir: <http://hudson.zones.apache.org/hudson/job/Nutch-trunk/ws/trunk/build/urlfilter-suffix>
    [mkdir] Created dir: <http://hudson.zones.apache.org/hudson/job/Nutch-trunk/ws/trunk/build/urlfilter-suffix/classes>
    [mkdir] Created dir: <http://hudson.zones.apache.org/hudson/job/Nutch-trunk/ws/trunk/build/urlfilter-suffix/test>

init-plugin:

deps-jar:

compile:
     [echo] Compiling plugin: urlfilter-suffix
    [javac] Compiling 1 source file to <http://hudson.zones.apache.org/hudson/job/Nutch-trunk/ws/trunk/build/urlfilter-suffix/classes>
    [javac] Note: <http://hudson.zones.apache.org/hudson/job/Nutch-trunk/ws/trunk/src/plugin/urlfilter-suffix/src/java/org/apache/nutch/urlfilter/suffix/SuffixURLFilter.java> uses unchecked or unsafe operations.
    [javac] Note: Recompile with -Xlint:unchecked for details.

jar:
      [jar] Building jar: <http://hudson.zones.apache.org/hudson/job/Nutch-trunk/ws/trunk/build/urlfilter-suffix/urlfilter-suffix.jar>

deps-test:

deploy:
    [mkdir] Created dir: <http://hudson.zones.apache.org/hudson/job/Nutch-trunk/ws/trunk/build/plugins/urlfilter-suffix>
     [copy] Copying 1 file to <http://hudson.zones.apache.org/hudson/job/Nutch-trunk/ws/trunk/build/plugins/urlfilter-suffix>

copy-generated-lib:
     [copy] Copying 1 file to <http://hudson.zones.apache.org/hudson/job/Nutch-trunk/ws/trunk/build/plugins/urlfilter-suffix>

init:
    [mkdir] Created dir: <http://hudson.zones.apache.org/hudson/job/Nutch-trunk/ws/trunk/build/urlfilter-validator>
    [mkdir] Created dir: <http://hudson.zones.apache.org/hudson/job/Nutch-trunk/ws/trunk/build/urlfilter-validator/classes>
    [mkdir] Created dir: <http://hudson.zones.apache.org/hudson/job/Nutch-trunk/ws/trunk/build/urlfilter-validator/test>

init-plugin:

deps-jar:

compile:
     [echo] Compiling plugin: urlfilter-validator
    [javac] Compiling 1 source file to <http://hudson.zones.apache.org/hudson/job/Nutch-trunk/ws/trunk/build/urlfilter-validator/classes>

jar:
      [jar] Building jar: <http://hudson.zones.apache.org/hudson/job/Nutch-trunk/ws/trunk/build/urlfilter-validator/urlfilter-validator.jar>

deps-test:

deploy:
    [mkdir] Created dir: <http://hudson.zones.apache.org/hudson/job/Nutch-trunk/ws/trunk/build/plugins/urlfilter-validator>
     [copy] Copying 1 file to <http://hudson.zones.apache.org/hudson/job/Nutch-trunk/ws/trunk/build/plugins/urlfilter-validator>

copy-generated-lib:
     [copy] Copying 1 file to <http://hudson.zones.apache.org/hudson/job/Nutch-trunk/ws/trunk/build/plugins/urlfilter-validator>

init:
    [mkdir] Created dir: <http://hudson.zones.apache.org/hudson/job/Nutch-trunk/ws/trunk/build/urlnormalizer-basic>
    [mkdir] Created dir: <http://hudson.zones.apache.org/hudson/job/Nutch-trunk/ws/trunk/build/urlnormalizer-basic/classes>
    [mkdir] Created dir: <http://hudson.zones.apache.org/hudson/job/Nutch-trunk/ws/trunk/build/urlnormalizer-basic/test>

init-plugin:

deps-jar:

compile:
     [echo] Compiling plugin: urlnormalizer-basic
    [javac] Compiling 1 source file to <http://hudson.zones.apache.org/hudson/job/Nutch-trunk/ws/trunk/build/urlnormalizer-basic/classes>

jar:
      [jar] Building jar: <http://hudson.zones.apache.org/hudson/job/Nutch-trunk/ws/trunk/build/urlnormalizer-basic/urlnormalizer-basic.jar>

deps-test:

deploy:
    [mkdir] Created dir: <http://hudson.zones.apache.org/hudson/job/Nutch-trunk/ws/trunk/build/plugins/urlnormalizer-basic>
     [copy] Copying 1 file to <http://hudson.zones.apache.org/hudson/job/Nutch-trunk/ws/trunk/build/plugins/urlnormalizer-basic>

copy-generated-lib:
     [copy] Copying 1 file to <http://hudson.zones.apache.org/hudson/job/Nutch-trunk/ws/trunk/build/plugins/urlnormalizer-basic>

init:
    [mkdir] Created dir: <http://hudson.zones.apache.org/hudson/job/Nutch-trunk/ws/trunk/build/urlnormalizer-pass>
    [mkdir] Created dir: <http://hudson.zones.apache.org/hudson/job/Nutch-trunk/ws/trunk/build/urlnormalizer-pass/classes>
    [mkdir] Created dir: <http://hudson.zones.apache.org/hudson/job/Nutch-trunk/ws/trunk/build/urlnormalizer-pass/test>

init-plugin:

deps-jar:

compile:
     [echo] Compiling plugin: urlnormalizer-pass
    [javac] Compiling 1 source file to <http://hudson.zones.apache.org/hudson/job/Nutch-trunk/ws/trunk/build/urlnormalizer-pass/classes>

jar:
      [jar] Building jar: <http://hudson.zones.apache.org/hudson/job/Nutch-trunk/ws/trunk/build/urlnormalizer-pass/urlnormalizer-pass.jar>

deps-test:

deploy:
    [mkdir] Created dir: <http://hudson.zones.apache.org/hudson/job/Nutch-trunk/ws/trunk/build/plugins/urlnormalizer-pass>
     [copy] Copying 1 file to <http://hudson.zones.apache.org/hudson/job/Nutch-trunk/ws/trunk/build/plugins/urlnormalizer-pass>

copy-generated-lib:
     [copy] Copying 1 file to <http://hudson.zones.apache.org/hudson/job/Nutch-trunk/ws/trunk/build/plugins/urlnormalizer-pass>
    [mkdir] Created dir: <http://hudson.zones.apache.org/hudson/job/Nutch-trunk/ws/trunk/build/urlnormalizer-regex/test/data>
     [copy] Copying 4 files to <http://hudson.zones.apache.org/hudson/job/Nutch-trunk/ws/trunk/build/urlnormalizer-regex/test/data>

init:
    [mkdir] Created dir: <http://hudson.zones.apache.org/hudson/job/Nutch-trunk/ws/trunk/build/urlnormalizer-regex/classes>

init-plugin:

deps-jar:

compile:
     [echo] Compiling plugin: urlnormalizer-regex
    [javac] Compiling 1 source file to <http://hudson.zones.apache.org/hudson/job/Nutch-trunk/ws/trunk/build/urlnormalizer-regex/classes>
    [javac] Note: <http://hudson.zones.apache.org/hudson/job/Nutch-trunk/ws/trunk/src/plugin/urlnormalizer-regex/src/java/org/apache/nutch/net/urlnormalizer/regex/RegexURLNormalizer.java> uses unchecked or unsafe operations.
    [javac] Note: Recompile with -Xlint:unchecked for details.

jar:
      [jar] Building jar: <http://hudson.zones.apache.org/hudson/job/Nutch-trunk/ws/trunk/build/urlnormalizer-regex/urlnormalizer-regex.jar>

deps-test:

init:

init-plugin:

compile:

jar:
      [jar] Warning: skipping jar archive <http://hudson.zones.apache.org/hudson/job/Nutch-trunk/ws/trunk/build/nutch-extensionpoints/nutch-extensionpoints.jar> because no files were included.

deps-test:

deploy:

copy-generated-lib:

deploy:
    [mkdir] Created dir: <http://hudson.zones.apache.org/hudson/job/Nutch-trunk/ws/trunk/build/plugins/urlnormalizer-regex>
     [copy] Copying 1 file to <http://hudson.zones.apache.org/hudson/job/Nutch-trunk/ws/trunk/build/plugins/urlnormalizer-regex>

copy-generated-lib:
     [copy] Copying 1 file to <http://hudson.zones.apache.org/hudson/job/Nutch-trunk/ws/trunk/build/plugins/urlnormalizer-regex>

compile:

job:
      [jar] Building jar: <http://hudson.zones.apache.org/hudson/job/Nutch-trunk/ws/trunk/build/nutch-2009-12-02_04-00-50.job>

compile-core-test:
    [javac] Compiling 43 source files to <http://hudson.zones.apache.org/hudson/job/Nutch-trunk/ws/trunk/build/test/classes>
    [javac] <http://hudson.zones.apache.org/hudson/job/Nutch-trunk/ws/trunk/src/test/org/apache/nutch/protocol/TestContent.java>:102: cannot find symbol
    [javac] symbol  : variable DEFAULT
    [javac] location: class org.apache.tika.mime.MimeTypes
    [javac]     assertEquals(MimeTypes.DEFAULT, c.getContentType());
    [javac]                           ^
    [javac] Note: Some input files use or override a deprecated API.
    [javac] Note: Recompile with -Xlint:deprecation for details.
    [javac] Note: Some input files use unchecked or unsafe operations.
    [javac] Note: Recompile with -Xlint:unchecked for details.
    [javac] 1 error

BUILD FAILED
<http://hudson.zones.apache.org/hudson/job/Nutch-trunk/ws/trunk/build.xml>:229: Compile failed; see the compiler error output for details.

Total time: 1 minute 5 seconds
Archiving artifacts
Publishing Javadoc
Recording test results

Reply | Threaded
Open this post in threaded view
|

Build failed in Hudson: Nutch-trunk #1000

Apache Hudson Server
See <http://hudson.zones.apache.org/hudson/job/Nutch-trunk/1000/>

------------------------------------------
[...truncated 4696 lines...]
    [javac] Compiling 1 source file to <http://hudson.zones.apache.org/hudson/job/Nutch-trunk/ws/trunk/build/urlfilter-prefix/classes>
    [javac] Note: <http://hudson.zones.apache.org/hudson/job/Nutch-trunk/ws/trunk/src/plugin/urlfilter-prefix/src/java/org/apache/nutch/urlfilter/prefix/PrefixURLFilter.java> uses unchecked or unsafe operations.
    [javac] Note: Recompile with -Xlint:unchecked for details.

jar:
      [jar] Building jar: <http://hudson.zones.apache.org/hudson/job/Nutch-trunk/ws/trunk/build/urlfilter-prefix/urlfilter-prefix.jar>

deps-test:

deploy:
    [mkdir] Created dir: <http://hudson.zones.apache.org/hudson/job/Nutch-trunk/ws/trunk/build/plugins/urlfilter-prefix>
     [copy] Copying 1 file to <http://hudson.zones.apache.org/hudson/job/Nutch-trunk/ws/trunk/build/plugins/urlfilter-prefix>

copy-generated-lib:
     [copy] Copying 1 file to <http://hudson.zones.apache.org/hudson/job/Nutch-trunk/ws/trunk/build/plugins/urlfilter-prefix>
    [mkdir] Created dir: <http://hudson.zones.apache.org/hudson/job/Nutch-trunk/ws/trunk/build/urlfilter-regex/test/data>
     [copy] Copying 6 files to <http://hudson.zones.apache.org/hudson/job/Nutch-trunk/ws/trunk/build/urlfilter-regex/test/data>

init:
    [mkdir] Created dir: <http://hudson.zones.apache.org/hudson/job/Nutch-trunk/ws/trunk/build/urlfilter-regex/classes>

init-plugin:

deps-jar:

init:

init-plugin:

deps-jar:

compile:
     [echo] Compiling plugin: lib-regex-filter

jar:

init:

init-plugin:

deps-jar:

compile:
     [echo] Compiling plugin: lib-regex-filter

compile-test:

compile:
     [echo] Compiling plugin: urlfilter-regex
    [javac] Compiling 1 source file to <http://hudson.zones.apache.org/hudson/job/Nutch-trunk/ws/trunk/build/urlfilter-regex/classes>

jar:
      [jar] Building jar: <http://hudson.zones.apache.org/hudson/job/Nutch-trunk/ws/trunk/build/urlfilter-regex/urlfilter-regex.jar>

deps-test:

init:

init-plugin:

deps-jar:

compile:
     [echo] Compiling plugin: lib-regex-filter

jar:

deps-test:

deploy:

copy-generated-lib:

deploy:
    [mkdir] Created dir: <http://hudson.zones.apache.org/hudson/job/Nutch-trunk/ws/trunk/build/plugins/urlfilter-regex>
     [copy] Copying 1 file to <http://hudson.zones.apache.org/hudson/job/Nutch-trunk/ws/trunk/build/plugins/urlfilter-regex>

copy-generated-lib:
     [copy] Copying 1 file to <http://hudson.zones.apache.org/hudson/job/Nutch-trunk/ws/trunk/build/plugins/urlfilter-regex>

init:
    [mkdir] Created dir: <http://hudson.zones.apache.org/hudson/job/Nutch-trunk/ws/trunk/build/urlfilter-suffix>
    [mkdir] Created dir: <http://hudson.zones.apache.org/hudson/job/Nutch-trunk/ws/trunk/build/urlfilter-suffix/classes>
    [mkdir] Created dir: <http://hudson.zones.apache.org/hudson/job/Nutch-trunk/ws/trunk/build/urlfilter-suffix/test>

init-plugin:

deps-jar:

compile:
     [echo] Compiling plugin: urlfilter-suffix
    [javac] Compiling 1 source file to <http://hudson.zones.apache.org/hudson/job/Nutch-trunk/ws/trunk/build/urlfilter-suffix/classes>
    [javac] Note: <http://hudson.zones.apache.org/hudson/job/Nutch-trunk/ws/trunk/src/plugin/urlfilter-suffix/src/java/org/apache/nutch/urlfilter/suffix/SuffixURLFilter.java> uses unchecked or unsafe operations.
    [javac] Note: Recompile with -Xlint:unchecked for details.

jar:
      [jar] Building jar: <http://hudson.zones.apache.org/hudson/job/Nutch-trunk/ws/trunk/build/urlfilter-suffix/urlfilter-suffix.jar>

deps-test:

deploy:
    [mkdir] Created dir: <http://hudson.zones.apache.org/hudson/job/Nutch-trunk/ws/trunk/build/plugins/urlfilter-suffix>
     [copy] Copying 1 file to <http://hudson.zones.apache.org/hudson/job/Nutch-trunk/ws/trunk/build/plugins/urlfilter-suffix>

copy-generated-lib:
     [copy] Copying 1 file to <http://hudson.zones.apache.org/hudson/job/Nutch-trunk/ws/trunk/build/plugins/urlfilter-suffix>

init:
    [mkdir] Created dir: <http://hudson.zones.apache.org/hudson/job/Nutch-trunk/ws/trunk/build/urlfilter-validator>
    [mkdir] Created dir: <http://hudson.zones.apache.org/hudson/job/Nutch-trunk/ws/trunk/build/urlfilter-validator/classes>
    [mkdir] Created dir: <http://hudson.zones.apache.org/hudson/job/Nutch-trunk/ws/trunk/build/urlfilter-validator/test>

init-plugin:

deps-jar:

compile:
     [echo] Compiling plugin: urlfilter-validator
    [javac] Compiling 1 source file to <http://hudson.zones.apache.org/hudson/job/Nutch-trunk/ws/trunk/build/urlfilter-validator/classes>

jar:
      [jar] Building jar: <http://hudson.zones.apache.org/hudson/job/Nutch-trunk/ws/trunk/build/urlfilter-validator/urlfilter-validator.jar>

deps-test:

deploy:
    [mkdir] Created dir: <http://hudson.zones.apache.org/hudson/job/Nutch-trunk/ws/trunk/build/plugins/urlfilter-validator>
     [copy] Copying 1 file to <http://hudson.zones.apache.org/hudson/job/Nutch-trunk/ws/trunk/build/plugins/urlfilter-validator>

copy-generated-lib:
     [copy] Copying 1 file to <http://hudson.zones.apache.org/hudson/job/Nutch-trunk/ws/trunk/build/plugins/urlfilter-validator>

init:
    [mkdir] Created dir: <http://hudson.zones.apache.org/hudson/job/Nutch-trunk/ws/trunk/build/urlnormalizer-basic>
    [mkdir] Created dir: <http://hudson.zones.apache.org/hudson/job/Nutch-trunk/ws/trunk/build/urlnormalizer-basic/classes>
    [mkdir] Created dir: <http://hudson.zones.apache.org/hudson/job/Nutch-trunk/ws/trunk/build/urlnormalizer-basic/test>

init-plugin:

deps-jar:

compile:
     [echo] Compiling plugin: urlnormalizer-basic
    [javac] Compiling 1 source file to <http://hudson.zones.apache.org/hudson/job/Nutch-trunk/ws/trunk/build/urlnormalizer-basic/classes>

jar:
      [jar] Building jar: <http://hudson.zones.apache.org/hudson/job/Nutch-trunk/ws/trunk/build/urlnormalizer-basic/urlnormalizer-basic.jar>

deps-test:

deploy:
    [mkdir] Created dir: <http://hudson.zones.apache.org/hudson/job/Nutch-trunk/ws/trunk/build/plugins/urlnormalizer-basic>
     [copy] Copying 1 file to <http://hudson.zones.apache.org/hudson/job/Nutch-trunk/ws/trunk/build/plugins/urlnormalizer-basic>

copy-generated-lib:
     [copy] Copying 1 file to <http://hudson.zones.apache.org/hudson/job/Nutch-trunk/ws/trunk/build/plugins/urlnormalizer-basic>

init:
    [mkdir] Created dir: <http://hudson.zones.apache.org/hudson/job/Nutch-trunk/ws/trunk/build/urlnormalizer-pass>
    [mkdir] Created dir: <http://hudson.zones.apache.org/hudson/job/Nutch-trunk/ws/trunk/build/urlnormalizer-pass/classes>
    [mkdir] Created dir: <http://hudson.zones.apache.org/hudson/job/Nutch-trunk/ws/trunk/build/urlnormalizer-pass/test>

init-plugin:

deps-jar:

compile:
     [echo] Compiling plugin: urlnormalizer-pass
    [javac] Compiling 1 source file to <http://hudson.zones.apache.org/hudson/job/Nutch-trunk/ws/trunk/build/urlnormalizer-pass/classes>

jar:
      [jar] Building jar: <http://hudson.zones.apache.org/hudson/job/Nutch-trunk/ws/trunk/build/urlnormalizer-pass/urlnormalizer-pass.jar>

deps-test:

deploy:
    [mkdir] Created dir: <http://hudson.zones.apache.org/hudson/job/Nutch-trunk/ws/trunk/build/plugins/urlnormalizer-pass>
     [copy] Copying 1 file to <http://hudson.zones.apache.org/hudson/job/Nutch-trunk/ws/trunk/build/plugins/urlnormalizer-pass>

copy-generated-lib:
     [copy] Copying 1 file to <http://hudson.zones.apache.org/hudson/job/Nutch-trunk/ws/trunk/build/plugins/urlnormalizer-pass>
    [mkdir] Created dir: <http://hudson.zones.apache.org/hudson/job/Nutch-trunk/ws/trunk/build/urlnormalizer-regex/test/data>
     [copy] Copying 4 files to <http://hudson.zones.apache.org/hudson/job/Nutch-trunk/ws/trunk/build/urlnormalizer-regex/test/data>

init:
    [mkdir] Created dir: <http://hudson.zones.apache.org/hudson/job/Nutch-trunk/ws/trunk/build/urlnormalizer-regex/classes>

init-plugin:

deps-jar:

compile:
     [echo] Compiling plugin: urlnormalizer-regex
    [javac] Compiling 1 source file to <http://hudson.zones.apache.org/hudson/job/Nutch-trunk/ws/trunk/build/urlnormalizer-regex/classes>
    [javac] Note: <http://hudson.zones.apache.org/hudson/job/Nutch-trunk/ws/trunk/src/plugin/urlnormalizer-regex/src/java/org/apache/nutch/net/urlnormalizer/regex/RegexURLNormalizer.java> uses unchecked or unsafe operations.
    [javac] Note: Recompile with -Xlint:unchecked for details.

jar:
      [jar] Building jar: <http://hudson.zones.apache.org/hudson/job/Nutch-trunk/ws/trunk/build/urlnormalizer-regex/urlnormalizer-regex.jar>

deps-test:

init:

init-plugin:

compile:

jar:
      [jar] Warning: skipping jar archive <http://hudson.zones.apache.org/hudson/job/Nutch-trunk/ws/trunk/build/nutch-extensionpoints/nutch-extensionpoints.jar> because no files were included.

deps-test:

deploy:

copy-generated-lib:

deploy:
    [mkdir] Created dir: <http://hudson.zones.apache.org/hudson/job/Nutch-trunk/ws/trunk/build/plugins/urlnormalizer-regex>
     [copy] Copying 1 file to <http://hudson.zones.apache.org/hudson/job/Nutch-trunk/ws/trunk/build/plugins/urlnormalizer-regex>

copy-generated-lib:
     [copy] Copying 1 file to <http://hudson.zones.apache.org/hudson/job/Nutch-trunk/ws/trunk/build/plugins/urlnormalizer-regex>

compile:

job:
      [jar] Building jar: <http://hudson.zones.apache.org/hudson/job/Nutch-trunk/ws/trunk/build/nutch-2009-12-03_04-42-24.job>

compile-core-test:
    [javac] Compiling 43 source files to <http://hudson.zones.apache.org/hudson/job/Nutch-trunk/ws/trunk/build/test/classes>
    [javac] <http://hudson.zones.apache.org/hudson/job/Nutch-trunk/ws/trunk/src/test/org/apache/nutch/protocol/TestContent.java>:102: cannot find symbol
    [javac] symbol  : variable DEFAULT
    [javac] location: class org.apache.tika.mime.MimeTypes
    [javac]     assertEquals(MimeTypes.DEFAULT, c.getContentType());
    [javac]                           ^
    [javac] Note: Some input files use or override a deprecated API.
    [javac] Note: Recompile with -Xlint:deprecation for details.
    [javac] Note: Some input files use unchecked or unsafe operations.
    [javac] Note: Recompile with -Xlint:unchecked for details.
    [javac] 1 error

BUILD FAILED
<http://hudson.zones.apache.org/hudson/job/Nutch-trunk/ws/trunk/build.xml>:229: Compile failed; see the compiler error output for details.

Total time: 47 seconds
Archiving artifacts
Publishing Javadoc
Recording test results

Reply | Threaded
Open this post in threaded view
|

Build failed in Hudson: Nutch-trunk #1001

Apache Hudson Server
See <http://hudson.zones.apache.org/hudson/job/Nutch-trunk/1001/>

------------------------------------------
[...truncated 4696 lines...]
    [javac] Compiling 1 source file to <http://hudson.zones.apache.org/hudson/job/Nutch-trunk/ws/trunk/build/urlfilter-prefix/classes>
    [javac] Note: <http://hudson.zones.apache.org/hudson/job/Nutch-trunk/ws/trunk/src/plugin/urlfilter-prefix/src/java/org/apache/nutch/urlfilter/prefix/PrefixURLFilter.java> uses unchecked or unsafe operations.
    [javac] Note: Recompile with -Xlint:unchecked for details.

jar:
      [jar] Building jar: <http://hudson.zones.apache.org/hudson/job/Nutch-trunk/ws/trunk/build/urlfilter-prefix/urlfilter-prefix.jar>

deps-test:

deploy:
    [mkdir] Created dir: <http://hudson.zones.apache.org/hudson/job/Nutch-trunk/ws/trunk/build/plugins/urlfilter-prefix>
     [copy] Copying 1 file to <http://hudson.zones.apache.org/hudson/job/Nutch-trunk/ws/trunk/build/plugins/urlfilter-prefix>

copy-generated-lib:
     [copy] Copying 1 file to <http://hudson.zones.apache.org/hudson/job/Nutch-trunk/ws/trunk/build/plugins/urlfilter-prefix>
    [mkdir] Created dir: <http://hudson.zones.apache.org/hudson/job/Nutch-trunk/ws/trunk/build/urlfilter-regex/test/data>
     [copy] Copying 6 files to <http://hudson.zones.apache.org/hudson/job/Nutch-trunk/ws/trunk/build/urlfilter-regex/test/data>

init:
    [mkdir] Created dir: <http://hudson.zones.apache.org/hudson/job/Nutch-trunk/ws/trunk/build/urlfilter-regex/classes>

init-plugin:

deps-jar:

init:

init-plugin:

deps-jar:

compile:
     [echo] Compiling plugin: lib-regex-filter

jar:

init:

init-plugin:

deps-jar:

compile:
     [echo] Compiling plugin: lib-regex-filter

compile-test:

compile:
     [echo] Compiling plugin: urlfilter-regex
    [javac] Compiling 1 source file to <http://hudson.zones.apache.org/hudson/job/Nutch-trunk/ws/trunk/build/urlfilter-regex/classes>

jar:
      [jar] Building jar: <http://hudson.zones.apache.org/hudson/job/Nutch-trunk/ws/trunk/build/urlfilter-regex/urlfilter-regex.jar>

deps-test:

init:

init-plugin:

deps-jar:

compile:
     [echo] Compiling plugin: lib-regex-filter

jar:

deps-test:

deploy:

copy-generated-lib:

deploy:
    [mkdir] Created dir: <http://hudson.zones.apache.org/hudson/job/Nutch-trunk/ws/trunk/build/plugins/urlfilter-regex>
     [copy] Copying 1 file to <http://hudson.zones.apache.org/hudson/job/Nutch-trunk/ws/trunk/build/plugins/urlfilter-regex>

copy-generated-lib:
     [copy] Copying 1 file to <http://hudson.zones.apache.org/hudson/job/Nutch-trunk/ws/trunk/build/plugins/urlfilter-regex>

init:
    [mkdir] Created dir: <http://hudson.zones.apache.org/hudson/job/Nutch-trunk/ws/trunk/build/urlfilter-suffix>
    [mkdir] Created dir: <http://hudson.zones.apache.org/hudson/job/Nutch-trunk/ws/trunk/build/urlfilter-suffix/classes>
    [mkdir] Created dir: <http://hudson.zones.apache.org/hudson/job/Nutch-trunk/ws/trunk/build/urlfilter-suffix/test>

init-plugin:

deps-jar:

compile:
     [echo] Compiling plugin: urlfilter-suffix
    [javac] Compiling 1 source file to <http://hudson.zones.apache.org/hudson/job/Nutch-trunk/ws/trunk/build/urlfilter-suffix/classes>
    [javac] Note: <http://hudson.zones.apache.org/hudson/job/Nutch-trunk/ws/trunk/src/plugin/urlfilter-suffix/src/java/org/apache/nutch/urlfilter/suffix/SuffixURLFilter.java> uses unchecked or unsafe operations.
    [javac] Note: Recompile with -Xlint:unchecked for details.

jar:
      [jar] Building jar: <http://hudson.zones.apache.org/hudson/job/Nutch-trunk/ws/trunk/build/urlfilter-suffix/urlfilter-suffix.jar>

deps-test:

deploy:
    [mkdir] Created dir: <http://hudson.zones.apache.org/hudson/job/Nutch-trunk/ws/trunk/build/plugins/urlfilter-suffix>
     [copy] Copying 1 file to <http://hudson.zones.apache.org/hudson/job/Nutch-trunk/ws/trunk/build/plugins/urlfilter-suffix>

copy-generated-lib:
     [copy] Copying 1 file to <http://hudson.zones.apache.org/hudson/job/Nutch-trunk/ws/trunk/build/plugins/urlfilter-suffix>

init:
    [mkdir] Created dir: <http://hudson.zones.apache.org/hudson/job/Nutch-trunk/ws/trunk/build/urlfilter-validator>
    [mkdir] Created dir: <http://hudson.zones.apache.org/hudson/job/Nutch-trunk/ws/trunk/build/urlfilter-validator/classes>
    [mkdir] Created dir: <http://hudson.zones.apache.org/hudson/job/Nutch-trunk/ws/trunk/build/urlfilter-validator/test>

init-plugin:

deps-jar:

compile:
     [echo] Compiling plugin: urlfilter-validator
    [javac] Compiling 1 source file to <http://hudson.zones.apache.org/hudson/job/Nutch-trunk/ws/trunk/build/urlfilter-validator/classes>

jar:
      [jar] Building jar: <http://hudson.zones.apache.org/hudson/job/Nutch-trunk/ws/trunk/build/urlfilter-validator/urlfilter-validator.jar>

deps-test:

deploy:
    [mkdir] Created dir: <http://hudson.zones.apache.org/hudson/job/Nutch-trunk/ws/trunk/build/plugins/urlfilter-validator>
     [copy] Copying 1 file to <http://hudson.zones.apache.org/hudson/job/Nutch-trunk/ws/trunk/build/plugins/urlfilter-validator>

copy-generated-lib:
     [copy] Copying 1 file to <http://hudson.zones.apache.org/hudson/job/Nutch-trunk/ws/trunk/build/plugins/urlfilter-validator>

init:
    [mkdir] Created dir: <http://hudson.zones.apache.org/hudson/job/Nutch-trunk/ws/trunk/build/urlnormalizer-basic>
    [mkdir] Created dir: <http://hudson.zones.apache.org/hudson/job/Nutch-trunk/ws/trunk/build/urlnormalizer-basic/classes>
    [mkdir] Created dir: <http://hudson.zones.apache.org/hudson/job/Nutch-trunk/ws/trunk/build/urlnormalizer-basic/test>

init-plugin:

deps-jar:

compile:
     [echo] Compiling plugin: urlnormalizer-basic
    [javac] Compiling 1 source file to <http://hudson.zones.apache.org/hudson/job/Nutch-trunk/ws/trunk/build/urlnormalizer-basic/classes>

jar:
      [jar] Building jar: <http://hudson.zones.apache.org/hudson/job/Nutch-trunk/ws/trunk/build/urlnormalizer-basic/urlnormalizer-basic.jar>

deps-test:

deploy:
    [mkdir] Created dir: <http://hudson.zones.apache.org/hudson/job/Nutch-trunk/ws/trunk/build/plugins/urlnormalizer-basic>
     [copy] Copying 1 file to <http://hudson.zones.apache.org/hudson/job/Nutch-trunk/ws/trunk/build/plugins/urlnormalizer-basic>

copy-generated-lib:
     [copy] Copying 1 file to <http://hudson.zones.apache.org/hudson/job/Nutch-trunk/ws/trunk/build/plugins/urlnormalizer-basic>

init:
    [mkdir] Created dir: <http://hudson.zones.apache.org/hudson/job/Nutch-trunk/ws/trunk/build/urlnormalizer-pass>
    [mkdir] Created dir: <http://hudson.zones.apache.org/hudson/job/Nutch-trunk/ws/trunk/build/urlnormalizer-pass/classes>
    [mkdir] Created dir: <http://hudson.zones.apache.org/hudson/job/Nutch-trunk/ws/trunk/build/urlnormalizer-pass/test>

init-plugin:

deps-jar:

compile:
     [echo] Compiling plugin: urlnormalizer-pass
    [javac] Compiling 1 source file to <http://hudson.zones.apache.org/hudson/job/Nutch-trunk/ws/trunk/build/urlnormalizer-pass/classes>

jar:
      [jar] Building jar: <http://hudson.zones.apache.org/hudson/job/Nutch-trunk/ws/trunk/build/urlnormalizer-pass/urlnormalizer-pass.jar>

deps-test:

deploy:
    [mkdir] Created dir: <http://hudson.zones.apache.org/hudson/job/Nutch-trunk/ws/trunk/build/plugins/urlnormalizer-pass>
     [copy] Copying 1 file to <http://hudson.zones.apache.org/hudson/job/Nutch-trunk/ws/trunk/build/plugins/urlnormalizer-pass>

copy-generated-lib:
     [copy] Copying 1 file to <http://hudson.zones.apache.org/hudson/job/Nutch-trunk/ws/trunk/build/plugins/urlnormalizer-pass>
    [mkdir] Created dir: <http://hudson.zones.apache.org/hudson/job/Nutch-trunk/ws/trunk/build/urlnormalizer-regex/test/data>
     [copy] Copying 4 files to <http://hudson.zones.apache.org/hudson/job/Nutch-trunk/ws/trunk/build/urlnormalizer-regex/test/data>

init:
    [mkdir] Created dir: <http://hudson.zones.apache.org/hudson/job/Nutch-trunk/ws/trunk/build/urlnormalizer-regex/classes>

init-plugin:

deps-jar:

compile:
     [echo] Compiling plugin: urlnormalizer-regex
    [javac] Compiling 1 source file to <http://hudson.zones.apache.org/hudson/job/Nutch-trunk/ws/trunk/build/urlnormalizer-regex/classes>
    [javac] Note: <http://hudson.zones.apache.org/hudson/job/Nutch-trunk/ws/trunk/src/plugin/urlnormalizer-regex/src/java/org/apache/nutch/net/urlnormalizer/regex/RegexURLNormalizer.java> uses unchecked or unsafe operations.
    [javac] Note: Recompile with -Xlint:unchecked for details.

jar:
      [jar] Building jar: <http://hudson.zones.apache.org/hudson/job/Nutch-trunk/ws/trunk/build/urlnormalizer-regex/urlnormalizer-regex.jar>

deps-test:

init:

init-plugin:

compile:

jar:
      [jar] Warning: skipping jar archive <http://hudson.zones.apache.org/hudson/job/Nutch-trunk/ws/trunk/build/nutch-extensionpoints/nutch-extensionpoints.jar> because no files were included.

deps-test:

deploy:

copy-generated-lib:

deploy:
    [mkdir] Created dir: <http://hudson.zones.apache.org/hudson/job/Nutch-trunk/ws/trunk/build/plugins/urlnormalizer-regex>
     [copy] Copying 1 file to <http://hudson.zones.apache.org/hudson/job/Nutch-trunk/ws/trunk/build/plugins/urlnormalizer-regex>

copy-generated-lib:
     [copy] Copying 1 file to <http://hudson.zones.apache.org/hudson/job/Nutch-trunk/ws/trunk/build/plugins/urlnormalizer-regex>

compile:

job:
      [jar] Building jar: <http://hudson.zones.apache.org/hudson/job/Nutch-trunk/ws/trunk/build/nutch-2009-12-04_04-00-50.job>

compile-core-test:
    [javac] Compiling 43 source files to <http://hudson.zones.apache.org/hudson/job/Nutch-trunk/ws/trunk/build/test/classes>
    [javac] <http://hudson.zones.apache.org/hudson/job/Nutch-trunk/ws/trunk/src/test/org/apache/nutch/protocol/TestContent.java>:102: cannot find symbol
    [javac] symbol  : variable DEFAULT
    [javac] location: class org.apache.tika.mime.MimeTypes
    [javac]     assertEquals(MimeTypes.DEFAULT, c.getContentType());
    [javac]                           ^
    [javac] Note: Some input files use or override a deprecated API.
    [javac] Note: Recompile with -Xlint:deprecation for details.
    [javac] Note: Some input files use unchecked or unsafe operations.
    [javac] Note: Recompile with -Xlint:unchecked for details.
    [javac] 1 error

BUILD FAILED
<http://hudson.zones.apache.org/hudson/job/Nutch-trunk/ws/trunk/build.xml>:229: Compile failed; see the compiler error output for details.

Total time: 1 minute 6 seconds
Archiving artifacts
Publishing Javadoc
Recording test results

Reply | Threaded
Open this post in threaded view
|

Hudson build is back to normal: Nutch-trunk #1002

Apache Hudson Server