Build failed in Hudson: Solr-trunk #1277

classic Classic list List threaded Threaded
6 messages Options
Reply | Threaded
Open this post in threaded view
|

Build failed in Hudson: Solr-trunk #1277

Apache Jenkins Server
See <https://hudson.apache.org/hudson/job/Solr-trunk/1277/changes>

Changes:

[uschindler] copy changes.html to artifacts folder

[uschindler] make dir structure same as everywhere else

[rmuir] SOLR-2002: explicitly set connection-timeout for this test, otherwise the os could have a verrrrry long default

[rmuir] SOLR-2002: try setting SO_REUSEADDR during jetty tests to prevent failures for disconnect/reconnect tests

[uschindler] enable parallel tests for hourly tests

[uschindler] add correct solr tests xml formatting

[uschindler] build also contrib with 1.5

[uschindler] again...

[uschindler] fix dirs :(

[uschindler] update some dir configs

[uschindler] add a general test-only target for Lucene+Solr that can be run all the time

[mikemccand] LUCENE-2649: fix backwards params to checkMatchAllBits

[mikemccand] LUCENE-2696: MockAnalyzer injects payloads for better test coverage

------------------------------------------
[...truncated 15642 lines...]
    [junit] at sun.reflect.DelegatingMethodAccessorImpl.invoke(DelegatingMethodAccessorImpl.java:43)
    [junit] at java.lang.reflect.Method.invoke(Method.java:616)
    [junit] at org.junit.runners.model.FrameworkMethod$1.runReflectiveCall(FrameworkMethod.java:44)
    [junit] at org.junit.internal.runners.model.ReflectiveCallable.run(ReflectiveCallable.java:15)
    [junit] at org.junit.runners.model.FrameworkMethod.invokeExplosively(FrameworkMethod.java:41)
    [junit] at org.junit.internal.runners.statements.InvokeMethod.evaluate(InvokeMethod.java:20)
    [junit] at org.junit.rules.TestWatchman$1.evaluate(TestWatchman.java:48)
    [junit] at org.junit.internal.runners.statements.RunBefores.evaluate(RunBefores.java:28)
    [junit] at org.junit.internal.runners.statements.RunAfters.evaluate(RunAfters.java:31)
    [junit] at org.junit.runners.BlockJUnit4ClassRunner.runChild(BlockJUnit4ClassRunner.java:76)
    [junit] at org.apache.lucene.util.LuceneTestCase$LuceneTestCaseRunner.runChild(LuceneTestCase.java:795)
    [junit] at org.apache.lucene.util.LuceneTestCase$LuceneTestCaseRunner.runChild(LuceneTestCase.java:768)
    [junit] at org.junit.runners.ParentRunner$3.run(ParentRunner.java:193)
    [junit] at org.junit.runners.ParentRunner$1.schedule(ParentRunner.java:52)
    [junit] at org.junit.runners.ParentRunner.runChildren(ParentRunner.java:191)
    [junit] at org.junit.runners.ParentRunner.access$000(ParentRunner.java:42)
    [junit] at org.junit.runners.ParentRunner$2.evaluate(ParentRunner.java:184)
    [junit] at org.junit.internal.runners.statements.RunBefores.evaluate(RunBefores.java:28)
    [junit] at org.junit.internal.runners.statements.RunAfters.evaluate(RunAfters.java:31)
    [junit] at org.junit.runners.ParentRunner.run(ParentRunner.java:236)
    [junit] at junit.framework.JUnit4TestAdapter.run(JUnit4TestAdapter.java:39)
    [junit] at org.apache.tools.ant.taskdefs.optional.junit.JUnitTestRunner.run(JUnitTestRunner.java:421)
    [junit] at org.apache.tools.ant.taskdefs.optional.junit.JUnitTestRunner.launch(JUnitTestRunner.java:912)
    [junit] at org.apache.tools.ant.taskdefs.optional.junit.JUnitTestRunner.main(JUnitTestRunner.java:743)
    [junit] Caused by: java.lang.RuntimeException: com.ctc.wstx.exc.WstxParsingException: Unexpected close tag </id>; expected </node>.
    [junit]  at [row,col {unknown-source}]: [11,18]
    [junit] at org.apache.solr.handler.dataimport.XPathRecordReader.streamRecords(XPathRecordReader.java:181)
    [junit] at org.apache.solr.handler.dataimport.XPathEntityProcessor.initQuery(XPathEntityProcessor.java:295)
    [junit] ... 41 more
    [junit] Caused by: com.ctc.wstx.exc.WstxParsingException: Unexpected close tag </id>; expected </node>.
    [junit]  at [row,col {unknown-source}]: [11,18]
    [junit] at com.ctc.wstx.sr.StreamScanner.constructWfcException(StreamScanner.java:630)
    [junit] at com.ctc.wstx.sr.StreamScanner.throwParseError(StreamScanner.java:461)
    [junit] at com.ctc.wstx.sr.BasicStreamReader.reportWrongEndElem(BasicStreamReader.java:3258)
    [junit] at com.ctc.wstx.sr.BasicStreamReader.readEndElem(BasicStreamReader.java:3200)
    [junit] at com.ctc.wstx.sr.BasicStreamReader.nextFromTree(BasicStreamReader.java:2832)
    [junit] at com.ctc.wstx.sr.BasicStreamReader.next(BasicStreamReader.java:1019)
    [junit] at org.apache.solr.handler.dataimport.XPathRecordReader$Node.parse(XPathRecordReader.java:275)
    [junit] at org.apache.solr.handler.dataimport.XPathRecordReader$Node.handleStartElement(XPathRecordReader.java:340)
    [junit] at org.apache.solr.handler.dataimport.XPathRecordReader$Node.parse(XPathRecordReader.java:304)
    [junit] at org.apache.solr.handler.dataimport.XPathRecordReader$Node.handleStartElement(XPathRecordReader.java:340)
    [junit] at org.apache.solr.handler.dataimport.XPathRecordReader$Node.parse(XPathRecordReader.java:304)
    [junit] at org.apache.solr.handler.dataimport.XPathRecordReader$Node.access$200(XPathRecordReader.java:196)
    [junit] at org.apache.solr.handler.dataimport.XPathRecordReader.streamRecords(XPathRecordReader.java:178)
    [junit] ... 42 more
    [junit] ------------- ---------------- ---------------
    [junit] Testsuite: org.apache.solr.handler.dataimport.TestEvaluatorBag
    [junit] Tests run: 5, Failures: 0, Errors: 0, Time elapsed: 0.013 sec
    [junit]
    [junit] Testsuite: org.apache.solr.handler.dataimport.TestFieldReader
    [junit] Tests run: 1, Failures: 0, Errors: 0, Time elapsed: 0.01 sec
    [junit]
    [junit] Testsuite: org.apache.solr.handler.dataimport.TestFileListEntityProcessor
    [junit] Tests run: 4, Failures: 0, Errors: 0, Time elapsed: 0.015 sec
    [junit]
    [junit] Testsuite: org.apache.solr.handler.dataimport.TestJdbcDataSource
    [junit] Tests run: 3, Failures: 0, Errors: 0, Time elapsed: 0.045 sec
    [junit]
    [junit] Testsuite: org.apache.solr.handler.dataimport.TestLineEntityProcessor
    [junit] Tests run: 4, Failures: 0, Errors: 0, Time elapsed: 0.011 sec
    [junit]
    [junit] ------------- Standard Output ---------------
    [junit]
    [junit]      rawLine=''
    [junit]      rawLine='# this is what the output from 'find . -ls; looks like, athough the format'
    [junit]      rawLine='# of the time stamp varies depending on the age of the file and your LANG '
    [junit]      rawLine='# env setting'
    [junit]      rawLine='412577   0 drwxr-xr-x  6 user group    204 1 Apr 10:53 /Volumes/spare/ts'
    [junit]      rawLine='412582   0 drwxr-xr-x 13 user group    442 1 Apr 10:18 /Volumes/spare/ts/config'
    [junit]      rawLine='412583  24 -rwxr-xr-x  1 user group   8318 1 Apr 11:10 /Volumes/spare/ts/config/dc.xsd'
    [junit]      rawLine='412584  32 -rwxr-xr-x  1 user group  12847 1 Apr 11:10 /Volumes/spare/ts/config/dcterms.xsd'
    [junit]      rawLine='412585   8 -rwxr-xr-x  1 user group   3156 1 Apr 11:10 /Volumes/spare/ts/config/s-deliver.css'
    [junit]      rawLine='412586 192 -rwxr-xr-x  1 user group  97764 1 Apr 11:10 /Volumes/spare/ts/config/s-deliver.xsl'
    [junit]      rawLine='412587 224 -rwxr-xr-x  1 user group 112700 1 Apr 11:10 /Volumes/spare/ts/config/sml-delivery-2.1.xsd'
    [junit]      rawLine='412588 208 -rwxr-xr-x  1 user group 103419 1 Apr 11:10 /Volumes/spare/ts/config/sml-delivery-norm-2.0.dtd'
    [junit]      rawLine='412589 248 -rwxr-xr-x  1 user group 125296 1 Apr 11:10 /Volumes/spare/ts/config/sml-delivery-norm-2.1.dtd'
    [junit]      rawLine='412590  72 -rwxr-xr-x  1 user group  36256 1 Apr 11:10 /Volumes/spare/ts/config/jm.xsd'
    [junit]      rawLine='412591   8 -rwxr-xr-x  1 user group    990 1 Apr 11:10 /Volumes/spare/ts/config/video.gif'
    [junit]      rawLine='412592   8 -rwxr-xr-x  1 user group   1498 1 Apr 11:10 /Volumes/spare/ts/config/xlink.xsd'
    [junit]      rawLine='412593   8 -rwxr-xr-x  1 user group   1155 1 Apr 11:10 /Volumes/spare/ts/config/xml.xsd'
    [junit]      rawLine='412594   0 drwxr-xr-x  4 user group    136 1 Apr 10:18 /Volumes/spare/ts/acm19'
    [junit]      rawLine='412621   0 drwxr-xr-x 57 user group   1938 1 Apr 10:18 /Volumes/spare/ts/acm19/data'
    [junit]      rawLine='412622  24 -rwxr-xr-x  1 user group   8894 1 Apr 11:09 /Volumes/spare/ts/acm19/data/00000510.xml'
    [junit]      rawLine='412623  32 -rwxr-xr-x  1 user group  14124 1 Apr 11:09 /Volumes/spare/ts/acm19/data/00000603.xml'
    [junit]      rawLine='412624  24 -rwxr-xr-x  1 user group  11976 1 Apr 11:09 /Volumes/spare/ts/acm19/data/00001292.xml'
    [junit]      rawLine='# tacked on an extra line to cause a file to be deleted.'
    [junit]      rawLine='DELETE /Volumes/spare/ts/acm19/data/00001292old.xml'
    [junit] ------------- ---------------- ---------------
    [junit] Testsuite: org.apache.solr.handler.dataimport.TestNumberFormatTransformer
    [junit] Tests run: 9, Failures: 0, Errors: 0, Time elapsed: 0.021 sec
    [junit]
    [junit] Testsuite: org.apache.solr.handler.dataimport.TestPlainTextEntityProcessor
    [junit] Tests run: 1, Failures: 0, Errors: 0, Time elapsed: 0.011 sec
    [junit]
    [junit] Testsuite: org.apache.solr.handler.dataimport.TestRegexTransformer
    [junit] Tests run: 5, Failures: 0, Errors: 0, Time elapsed: 0.01 sec
    [junit]
    [junit] Testsuite: org.apache.solr.handler.dataimport.TestScriptTransformer
    [junit] Tests run: 0, Failures: 0, Errors: 0, Time elapsed: 0.005 sec
    [junit]
    [junit] Testsuite: org.apache.solr.handler.dataimport.TestSqlEntityProcessor
    [junit] Tests run: 4, Failures: 0, Errors: 0, Time elapsed: 0.01 sec
    [junit]
    [junit] Testsuite: org.apache.solr.handler.dataimport.TestSqlEntityProcessor2
    [junit] Tests run: 7, Failures: 0, Errors: 0, Time elapsed: 1.54 sec
    [junit]
    [junit] Testsuite: org.apache.solr.handler.dataimport.TestSqlEntityProcessorDelta
    [junit] Tests run: 8, Failures: 0, Errors: 0, Time elapsed: 2.004 sec
    [junit]
    [junit] Testsuite: org.apache.solr.handler.dataimport.TestSqlEntityProcessorDelta2
    [junit] Tests run: 8, Failures: 0, Errors: 0, Time elapsed: 2.562 sec
    [junit]
    [junit] Testsuite: org.apache.solr.handler.dataimport.TestTemplateString
    [junit] Tests run: 1, Failures: 0, Errors: 0, Time elapsed: 0.005 sec
    [junit]
    [junit] Testsuite: org.apache.solr.handler.dataimport.TestTemplateTransformer
    [junit] Tests run: 1, Failures: 0, Errors: 0, Time elapsed: 0.004 sec
    [junit]
    [junit] Testsuite: org.apache.solr.handler.dataimport.TestThreaded
    [junit] Tests run: 1, Failures: 0, Errors: 0, Time elapsed: 0.211 sec
    [junit]
    [junit] Testsuite: org.apache.solr.handler.dataimport.TestURLDataSource
    [junit] Tests run: 1, Failures: 0, Errors: 0, Time elapsed: 0.005 sec
    [junit]
    [junit] Testsuite: org.apache.solr.handler.dataimport.TestVariableResolver
    [junit] Tests run: 9, Failures: 0, Errors: 0, Time elapsed: 0.021 sec
    [junit]
    [junit] Testsuite: org.apache.solr.handler.dataimport.TestXPathEntityProcessor
    [junit] Tests run: 8, Failures: 0, Errors: 0, Time elapsed: 0.47 sec
    [junit]
    [junit] Testsuite: org.apache.solr.handler.dataimport.TestXPathRecordReader
    [junit] Tests run: 21, Failures: 0, Errors: 0, Time elapsed: 0.035 sec
    [junit]

compileExtras:

compileExtrasTests:
    [mkdir] Created dir: /usr<https://hudson.apache.org/hudson/job/Solr-trunk/ws/trunk/solr/contrib/dataimporthandler/target/extras/test-classes>
    [javac] Compiling 2 source files to /usr<https://hudson.apache.org/hudson/job/Solr-trunk/ws/trunk/solr/contrib/dataimporthandler/target/extras/test-classes>

testExtras:
    [junit] Testsuite: org.apache.solr.handler.dataimport.TestMailEntityProcessor
    [junit] Tests run: 0, Failures: 0, Errors: 0, Time elapsed: 0.251 sec
    [junit]
    [junit] Testsuite: org.apache.solr.handler.dataimport.TestTikaEntityProcessor
    [junit] Tests run: 1, Failures: 0, Errors: 0, Time elapsed: 2.145 sec
    [junit]

test:

init:

init-forrest-entities:

compile-lucene:

compile-solrj:

compile:
    [javac] Compiling 1 source file to /usr<https://hudson.apache.org/hudson/job/Solr-trunk/ws/trunk/solr/build/solr>

compileTests:

make-manifest:

compile:

compileTests:
    [mkdir] Created dir: /usr<https://hudson.apache.org/hudson/job/Solr-trunk/ws/trunk/solr/contrib/extraction/build/test-classes>
    [javac] Compiling 1 source file to /usr<https://hudson.apache.org/hudson/job/Solr-trunk/ws/trunk/solr/contrib/extraction/build/test-classes>

test:
    [junit] Testsuite: org.apache.solr.handler.ExtractingRequestHandlerTest
    [junit] Tests run: 8, Failures: 0, Errors: 0, Time elapsed: 3.405 sec
    [junit]

test:

clover.check:

clover.setup:
[clover-setup] Clover Version 2.6.3, built on November 20 2009 (build-778)
[clover-setup] Loaded from: /home/hudson/tools/clover/clover2latest/clover-2.6.3.jar
[clover-setup] Clover: Open Source License registered to Apache.
[clover-setup] Clover is enabled with initstring '/usr<https://hudson.apache.org/hudson/job/Solr-trunk/ws/trunk/solr/build/tests/clover/db/solr_coverage.db'>

clover.info:

clover:

generate-clover-reports:
    [mkdir] Created dir: /usr<https://hudson.apache.org/hudson/job/Solr-trunk/ws/trunk/solr/build/tests/clover/reports>
[clover-report] Clover Version 2.6.3, built on November 20 2009 (build-778)
[clover-report] Loaded from: /home/hudson/tools/clover/clover2latest/clover-2.6.3.jar
[clover-report] Clover: Open Source License registered to Apache.
[clover-report] Loading coverage database from: '/usr<https://hudson.apache.org/hudson/job/Solr-trunk/ws/trunk/solr/build/tests/clover/db/solr_coverage.db'>
[clover-report] Loading coverage database from: '/usr<https://hudson.apache.org/hudson/job/Solr-trunk/ws/trunk/solr/build/tests/clover/db/solr_coverage.db'>
[clover-report] Writing report to '/usr<https://hudson.apache.org/hudson/job/Solr-trunk/ws/trunk/solr/build/tests/clover/reports/clover.xml'>
[clover-report] Writing HTML report to '/usr<https://hudson.apache.org/hudson/job/Solr-trunk/ws/trunk/solr/build/tests/clover/reports'>
[clover-report] Done. Processed 35 packages in 5870ms (167ms per package).

BUILD SUCCESSFUL
Total time: 6 minutes 18 seconds
[TASKS] Scanning workspace files for tasks...
Publishing Javadoc
Archiving artifacts
Recording test results
Publishing Clover coverage report...
Publishing Clover HTML report...
Publishing Clover XML report...
Publishing Clover coverage results...
FATAL: Unable to copy coverage from <https://hudson.apache.org/hudson/job/Solr-trunk/ws/trunk/solr/build/tests/clover/reports> to /home/hudson/hudson/jobs/Solr-trunk/builds/2010-10-13_08-44-05
hudson.util.IOException2: Cannot parse coverage results
        at hudson.plugins.clover.CloverCoverageParser.parse(CloverCoverageParser.java:89)
        at hudson.plugins.clover.CloverCoverageParser.parse(CloverCoverageParser.java:51)
        at hudson.plugins.clover.CloverPublisher.processCloverXml(CloverPublisher.java:202)
        at hudson.plugins.clover.CloverPublisher.perform(CloverPublisher.java:163)
        at hudson.tasks.BuildStepMonitor$3.perform(BuildStepMonitor.java:36)
        at hudson.model.AbstractBuild$AbstractRunner.perform(AbstractBuild.java:601)
        at hudson.model.AbstractBuild$AbstractRunner.performAllBuildSteps(AbstractBuild.java:580)
        at hudson.model.AbstractBuild$AbstractRunner.performAllBuildSteps(AbstractBuild.java:558)
        at hudson.model.Build$RunnerImpl.post2(Build.java:157)
        at hudson.model.AbstractBuild$AbstractRunner.post(AbstractBuild.java:528)
        at hudson.model.Run.run(Run.java:1303)
        at hudson.model.FreeStyleBuild.run(FreeStyleBuild.java:46)
        at hudson.model.ResourceController.execute(ResourceController.java:88)
        at hudson.model.Executor.run(Executor.java:140)
Caused by: org.xml.sax.SAXParseException: XML document structures must start and end within the same entity.
        at com.sun.org.apache.xerces.internal.parsers.AbstractSAXParser.parse(AbstractSAXParser.java:1231)
        at com.sun.org.apache.xerces.internal.jaxp.SAXParserImpl$JAXPSAXParser.parse(SAXParserImpl.java:522)
        at org.apache.commons.digester.Digester.parse(Digester.java:1666)
        at hudson.plugins.clover.CloverCoverageParser.parse(CloverCoverageParser.java:87)
        ... 13 more
ERROR: Publisher hudson.plugins.clover.CloverPublisher aborted due to exception
java.lang.NullPointerException
        at hudson.plugins.clover.CloverBuildAction.<init>(CloverBuildAction.java:133)
        at hudson.plugins.clover.CloverBuildAction.load(CloverBuildAction.java:265)
        at hudson.plugins.clover.CloverPublisher.processCloverXml(CloverPublisher.java:208)
        at hudson.plugins.clover.CloverPublisher.perform(CloverPublisher.java:163)
        at hudson.tasks.BuildStepMonitor$3.perform(BuildStepMonitor.java:36)
        at hudson.model.AbstractBuild$AbstractRunner.perform(AbstractBuild.java:601)
        at hudson.model.AbstractBuild$AbstractRunner.performAllBuildSteps(AbstractBuild.java:580)
        at hudson.model.AbstractBuild$AbstractRunner.performAllBuildSteps(AbstractBuild.java:558)
        at hudson.model.Build$RunnerImpl.post2(Build.java:157)
        at hudson.model.AbstractBuild$AbstractRunner.post(AbstractBuild.java:528)
        at hudson.model.Run.run(Run.java:1303)
        at hudson.model.FreeStyleBuild.run(FreeStyleBuild.java:46)
        at hudson.model.ResourceController.execute(ResourceController.java:88)
        at hudson.model.Executor.run(Executor.java:140)


---------------------------------------------------------------------
To unsubscribe, e-mail: [hidden email]
For additional commands, e-mail: [hidden email]

Reply | Threaded
Open this post in threaded view
|

RE: Build failed in Hudson: Solr-trunk #1277

Uwe Schindler
This is a strange error sometimes occurring (also for some lucene build), it's not related to the last build changes. Somehow hudson's clover plugin is sometimes unable to parse the xml file (but its correct, parses fine when I download and look into it).

Mysterious!

-----
Uwe Schindler
H.-H.-Meier-Allee 63, D-28213 Bremen
http://www.thetaphi.de
eMail: [hidden email]


> -----Original Message-----
> From: Apache Hudson Server [mailto:[hidden email]]
> Sent: Wednesday, October 13, 2010 11:07 AM
> To: [hidden email]
> Subject: Build failed in Hudson: Solr-trunk #1277
>
> See <https://hudson.apache.org/hudson/job/Solr-trunk/1277/changes>
>
> Changes:
>
> [uschindler] copy changes.html to artifacts folder
>
> [uschindler] make dir structure same as everywhere else
>
> [rmuir] SOLR-2002: explicitly set connection-timeout for this test, otherwise the
> os could have a verrrrry long default
>
> [rmuir] SOLR-2002: try setting SO_REUSEADDR during jetty tests to prevent
> failures for disconnect/reconnect tests
>
> [uschindler] enable parallel tests for hourly tests
>
> [uschindler] add correct solr tests xml formatting
>
> [uschindler] build also contrib with 1.5
>
> [uschindler] again...
>
> [uschindler] fix dirs :(
>
> [uschindler] update some dir configs
>
> [uschindler] add a general test-only target for Lucene+Solr that can be run all
> the time
>
> [mikemccand] LUCENE-2649: fix backwards params to checkMatchAllBits
>
> [mikemccand] LUCENE-2696: MockAnalyzer injects payloads for better test
> coverage
>
> ------------------------------------------
> [...truncated 15642 lines...]
>     [junit] at
> sun.reflect.DelegatingMethodAccessorImpl.invoke(DelegatingMethodAccessorI
> mpl.java:43)
>     [junit] at java.lang.reflect.Method.invoke(Method.java:616)
>     [junit] at
> org.junit.runners.model.FrameworkMethod$1.runReflectiveCall(FrameworkMe
> thod.java:44)
>     [junit] at
> org.junit.internal.runners.model.ReflectiveCallable.run(ReflectiveCallable.java:
> 15)
>     [junit] at
> org.junit.runners.model.FrameworkMethod.invokeExplosively(FrameworkMeth
> od.java:41)
>     [junit] at
> org.junit.internal.runners.statements.InvokeMethod.evaluate(InvokeMethod.jav
> a:20)
>     [junit] at
> org.junit.rules.TestWatchman$1.evaluate(TestWatchman.java:48)
>     [junit] at
> org.junit.internal.runners.statements.RunBefores.evaluate(RunBefores.java:28)
>     [junit] at
> org.junit.internal.runners.statements.RunAfters.evaluate(RunAfters.java:31)
>     [junit] at
> org.junit.runners.BlockJUnit4ClassRunner.runChild(BlockJUnit4ClassRunner.java
> :76)
>     [junit] at
> org.apache.lucene.util.LuceneTestCase$LuceneTestCaseRunner.runChild(Lucen
> eTestCase.java:795)
>     [junit] at
> org.apache.lucene.util.LuceneTestCase$LuceneTestCaseRunner.runChild(Lucen
> eTestCase.java:768)
>     [junit] at
> org.junit.runners.ParentRunner$3.run(ParentRunner.java:193)
>     [junit] at
> org.junit.runners.ParentRunner$1.schedule(ParentRunner.java:52)
>     [junit] at
> org.junit.runners.ParentRunner.runChildren(ParentRunner.java:191)
>     [junit] at
> org.junit.runners.ParentRunner.access$000(ParentRunner.java:42)
>     [junit] at
> org.junit.runners.ParentRunner$2.evaluate(ParentRunner.java:184)
>     [junit] at
> org.junit.internal.runners.statements.RunBefores.evaluate(RunBefores.java:28)
>     [junit] at
> org.junit.internal.runners.statements.RunAfters.evaluate(RunAfters.java:31)
>     [junit] at org.junit.runners.ParentRunner.run(ParentRunner.java:236)
>     [junit] at
> junit.framework.JUnit4TestAdapter.run(JUnit4TestAdapter.java:39)
>     [junit] at
> org.apache.tools.ant.taskdefs.optional.junit.JUnitTestRunner.run(JUnitTestRunn
> er.java:421)
>     [junit] at
> org.apache.tools.ant.taskdefs.optional.junit.JUnitTestRunner.launch(JUnitTestRu
> nner.java:912)
>     [junit] at
> org.apache.tools.ant.taskdefs.optional.junit.JUnitTestRunner.main(JUnitTestRun
> ner.java:743)
>     [junit] Caused by: java.lang.RuntimeException:
> com.ctc.wstx.exc.WstxParsingException: Unexpected close tag </id>; expected
> </node>.
>     [junit]  at [row,col {unknown-source}]: [11,18]
>     [junit] at
> org.apache.solr.handler.dataimport.XPathRecordReader.streamRecords(XPathR
> ecordReader.java:181)
>     [junit] at
> org.apache.solr.handler.dataimport.XPathEntityProcessor.initQuery(XPathEntity
> Processor.java:295)
>     [junit] ... 41 more
>     [junit] Caused by: com.ctc.wstx.exc.WstxParsingException: Unexpected close
> tag </id>; expected </node>.
>     [junit]  at [row,col {unknown-source}]: [11,18]
>     [junit] at
> com.ctc.wstx.sr.StreamScanner.constructWfcException(StreamScanner.java:630
> )
>     [junit] at
> com.ctc.wstx.sr.StreamScanner.throwParseError(StreamScanner.java:461)
>     [junit] at
> com.ctc.wstx.sr.BasicStreamReader.reportWrongEndElem(BasicStreamReader.j
> ava:3258)
>     [junit] at
> com.ctc.wstx.sr.BasicStreamReader.readEndElem(BasicStreamReader.java:320
> 0)
>     [junit] at
> com.ctc.wstx.sr.BasicStreamReader.nextFromTree(BasicStreamReader.java:28
> 32)
>     [junit] at
> com.ctc.wstx.sr.BasicStreamReader.next(BasicStreamReader.java:1019)
>     [junit] at
> org.apache.solr.handler.dataimport.XPathRecordReader$Node.parse(XPathRec
> ordReader.java:275)
>     [junit] at
> org.apache.solr.handler.dataimport.XPathRecordReader$Node.handleStartEle
> ment(XPathRecordReader.java:340)
>     [junit] at
> org.apache.solr.handler.dataimport.XPathRecordReader$Node.parse(XPathRec
> ordReader.java:304)
>     [junit] at
> org.apache.solr.handler.dataimport.XPathRecordReader$Node.handleStartEle
> ment(XPathRecordReader.java:340)
>     [junit] at
> org.apache.solr.handler.dataimport.XPathRecordReader$Node.parse(XPathRec
> ordReader.java:304)
>     [junit] at
> org.apache.solr.handler.dataimport.XPathRecordReader$Node.access$200(XPa
> thRecordReader.java:196)
>     [junit] at
> org.apache.solr.handler.dataimport.XPathRecordReader.streamRecords(XPathR
> ecordReader.java:178)
>     [junit] ... 42 more
>     [junit] ------------- ---------------- ---------------
>     [junit] Testsuite: org.apache.solr.handler.dataimport.TestEvaluatorBag
>     [junit] Tests run: 5, Failures: 0, Errors: 0, Time elapsed: 0.013 sec
>     [junit]
>     [junit] Testsuite: org.apache.solr.handler.dataimport.TestFieldReader
>     [junit] Tests run: 1, Failures: 0, Errors: 0, Time elapsed: 0.01 sec
>     [junit]
>     [junit] Testsuite:
> org.apache.solr.handler.dataimport.TestFileListEntityProcessor
>     [junit] Tests run: 4, Failures: 0, Errors: 0, Time elapsed: 0.015 sec
>     [junit]
>     [junit] Testsuite: org.apache.solr.handler.dataimport.TestJdbcDataSource
>     [junit] Tests run: 3, Failures: 0, Errors: 0, Time elapsed: 0.045 sec
>     [junit]
>     [junit] Testsuite: org.apache.solr.handler.dataimport.TestLineEntityProcessor
>     [junit] Tests run: 4, Failures: 0, Errors: 0, Time elapsed: 0.011 sec
>     [junit]
>     [junit] ------------- Standard Output ---------------
>     [junit]
>     [junit]      rawLine=''
>     [junit]      rawLine='# this is what the output from 'find . -ls; looks like,
> athough the format'
>     [junit]      rawLine='# of the time stamp varies depending on the age of the
> file and your LANG '
>     [junit]      rawLine='# env setting'
>     [junit]      rawLine='412577   0 drwxr-xr-x  6 user group    204 1 Apr 10:53
> /Volumes/spare/ts'
>     [junit]      rawLine='412582   0 drwxr-xr-x 13 user group    442 1 Apr 10:18
> /Volumes/spare/ts/config'
>     [junit]      rawLine='412583  24 -rwxr-xr-x  1 user group   8318 1 Apr 11:10
> /Volumes/spare/ts/config/dc.xsd'
>     [junit]      rawLine='412584  32 -rwxr-xr-x  1 user group  12847 1 Apr 11:10
> /Volumes/spare/ts/config/dcterms.xsd'
>     [junit]      rawLine='412585   8 -rwxr-xr-x  1 user group   3156 1 Apr 11:10
> /Volumes/spare/ts/config/s-deliver.css'
>     [junit]      rawLine='412586 192 -rwxr-xr-x  1 user group  97764 1 Apr 11:10
> /Volumes/spare/ts/config/s-deliver.xsl'
>     [junit]      rawLine='412587 224 -rwxr-xr-x  1 user group 112700 1 Apr 11:10
> /Volumes/spare/ts/config/sml-delivery-2.1.xsd'
>     [junit]      rawLine='412588 208 -rwxr-xr-x  1 user group 103419 1 Apr 11:10
> /Volumes/spare/ts/config/sml-delivery-norm-2.0.dtd'
>     [junit]      rawLine='412589 248 -rwxr-xr-x  1 user group 125296 1 Apr 11:10
> /Volumes/spare/ts/config/sml-delivery-norm-2.1.dtd'
>     [junit]      rawLine='412590  72 -rwxr-xr-x  1 user group  36256 1 Apr 11:10
> /Volumes/spare/ts/config/jm.xsd'
>     [junit]      rawLine='412591   8 -rwxr-xr-x  1 user group    990 1 Apr 11:10
> /Volumes/spare/ts/config/video.gif'
>     [junit]      rawLine='412592   8 -rwxr-xr-x  1 user group   1498 1 Apr 11:10
> /Volumes/spare/ts/config/xlink.xsd'
>     [junit]      rawLine='412593   8 -rwxr-xr-x  1 user group   1155 1 Apr 11:10
> /Volumes/spare/ts/config/xml.xsd'
>     [junit]      rawLine='412594   0 drwxr-xr-x  4 user group    136 1 Apr 10:18
> /Volumes/spare/ts/acm19'
>     [junit]      rawLine='412621   0 drwxr-xr-x 57 user group   1938 1 Apr 10:18
> /Volumes/spare/ts/acm19/data'
>     [junit]      rawLine='412622  24 -rwxr-xr-x  1 user group   8894 1 Apr 11:09
> /Volumes/spare/ts/acm19/data/00000510.xml'
>     [junit]      rawLine='412623  32 -rwxr-xr-x  1 user group  14124 1 Apr 11:09
> /Volumes/spare/ts/acm19/data/00000603.xml'
>     [junit]      rawLine='412624  24 -rwxr-xr-x  1 user group  11976 1 Apr 11:09
> /Volumes/spare/ts/acm19/data/00001292.xml'
>     [junit]      rawLine='# tacked on an extra line to cause a file to be deleted.'
>     [junit]      rawLine='DELETE
> /Volumes/spare/ts/acm19/data/00001292old.xml'
>     [junit] ------------- ---------------- ---------------
>     [junit] Testsuite:
> org.apache.solr.handler.dataimport.TestNumberFormatTransformer
>     [junit] Tests run: 9, Failures: 0, Errors: 0, Time elapsed: 0.021 sec
>     [junit]
>     [junit] Testsuite:
> org.apache.solr.handler.dataimport.TestPlainTextEntityProcessor
>     [junit] Tests run: 1, Failures: 0, Errors: 0, Time elapsed: 0.011 sec
>     [junit]
>     [junit] Testsuite: org.apache.solr.handler.dataimport.TestRegexTransformer
>     [junit] Tests run: 5, Failures: 0, Errors: 0, Time elapsed: 0.01 sec
>     [junit]
>     [junit] Testsuite: org.apache.solr.handler.dataimport.TestScriptTransformer
>     [junit] Tests run: 0, Failures: 0, Errors: 0, Time elapsed: 0.005 sec
>     [junit]
>     [junit] Testsuite: org.apache.solr.handler.dataimport.TestSqlEntityProcessor
>     [junit] Tests run: 4, Failures: 0, Errors: 0, Time elapsed: 0.01 sec
>     [junit]
>     [junit] Testsuite: org.apache.solr.handler.dataimport.TestSqlEntityProcessor2
>     [junit] Tests run: 7, Failures: 0, Errors: 0, Time elapsed: 1.54 sec
>     [junit]
>     [junit] Testsuite:
> org.apache.solr.handler.dataimport.TestSqlEntityProcessorDelta
>     [junit] Tests run: 8, Failures: 0, Errors: 0, Time elapsed: 2.004 sec
>     [junit]
>     [junit] Testsuite:
> org.apache.solr.handler.dataimport.TestSqlEntityProcessorDelta2
>     [junit] Tests run: 8, Failures: 0, Errors: 0, Time elapsed: 2.562 sec
>     [junit]
>     [junit] Testsuite: org.apache.solr.handler.dataimport.TestTemplateString
>     [junit] Tests run: 1, Failures: 0, Errors: 0, Time elapsed: 0.005 sec
>     [junit]
>     [junit] Testsuite:
> org.apache.solr.handler.dataimport.TestTemplateTransformer
>     [junit] Tests run: 1, Failures: 0, Errors: 0, Time elapsed: 0.004 sec
>     [junit]
>     [junit] Testsuite: org.apache.solr.handler.dataimport.TestThreaded
>     [junit] Tests run: 1, Failures: 0, Errors: 0, Time elapsed: 0.211 sec
>     [junit]
>     [junit] Testsuite: org.apache.solr.handler.dataimport.TestURLDataSource
>     [junit] Tests run: 1, Failures: 0, Errors: 0, Time elapsed: 0.005 sec
>     [junit]
>     [junit] Testsuite: org.apache.solr.handler.dataimport.TestVariableResolver
>     [junit] Tests run: 9, Failures: 0, Errors: 0, Time elapsed: 0.021 sec
>     [junit]
>     [junit] Testsuite:
> org.apache.solr.handler.dataimport.TestXPathEntityProcessor
>     [junit] Tests run: 8, Failures: 0, Errors: 0, Time elapsed: 0.47 sec
>     [junit]
>     [junit] Testsuite: org.apache.solr.handler.dataimport.TestXPathRecordReader
>     [junit] Tests run: 21, Failures: 0, Errors: 0, Time elapsed: 0.035 sec
>     [junit]
>
> compileExtras:
>
> compileExtrasTests:
>     [mkdir] Created dir: /usr<https://hudson.apache.org/hudson/job/Solr-
> trunk/ws/trunk/solr/contrib/dataimporthandler/target/extras/test-classes>
>     [javac] Compiling 2 source files to
> /usr<https://hudson.apache.org/hudson/job/Solr-
> trunk/ws/trunk/solr/contrib/dataimporthandler/target/extras/test-classes>
>
> testExtras:
>     [junit] Testsuite: org.apache.solr.handler.dataimport.TestMailEntityProcessor
>     [junit] Tests run: 0, Failures: 0, Errors: 0, Time elapsed: 0.251 sec
>     [junit]
>     [junit] Testsuite: org.apache.solr.handler.dataimport.TestTikaEntityProcessor
>     [junit] Tests run: 1, Failures: 0, Errors: 0, Time elapsed: 2.145 sec
>     [junit]
>
> test:
>
> init:
>
> init-forrest-entities:
>
> compile-lucene:
>
> compile-solrj:
>
> compile:
>     [javac] Compiling 1 source file to
> /usr<https://hudson.apache.org/hudson/job/Solr-
> trunk/ws/trunk/solr/build/solr>
>
> compileTests:
>
> make-manifest:
>
> compile:
>
> compileTests:
>     [mkdir] Created dir: /usr<https://hudson.apache.org/hudson/job/Solr-
> trunk/ws/trunk/solr/contrib/extraction/build/test-classes>
>     [javac] Compiling 1 source file to
> /usr<https://hudson.apache.org/hudson/job/Solr-
> trunk/ws/trunk/solr/contrib/extraction/build/test-classes>
>
> test:
>     [junit] Testsuite: org.apache.solr.handler.ExtractingRequestHandlerTest
>     [junit] Tests run: 8, Failures: 0, Errors: 0, Time elapsed: 3.405 sec
>     [junit]
>
> test:
>
> clover.check:
>
> clover.setup:
> [clover-setup] Clover Version 2.6.3, built on November 20 2009 (build-778)
> [clover-setup] Loaded from: /home/hudson/tools/clover/clover2latest/clover-
> 2.6.3.jar
> [clover-setup] Clover: Open Source License registered to Apache.
> [clover-setup] Clover is enabled with initstring
> '/usr<https://hudson.apache.org/hudson/job/Solr-
> trunk/ws/trunk/solr/build/tests/clover/db/solr_coverage.db'>
>
> clover.info:
>
> clover:
>
> generate-clover-reports:
>     [mkdir] Created dir: /usr<https://hudson.apache.org/hudson/job/Solr-
> trunk/ws/trunk/solr/build/tests/clover/reports>
> [clover-report] Clover Version 2.6.3, built on November 20 2009 (build-778)
> [clover-report] Loaded from: /home/hudson/tools/clover/clover2latest/clover-
> 2.6.3.jar
> [clover-report] Clover: Open Source License registered to Apache.
> [clover-report] Loading coverage database from:
> '/usr<https://hudson.apache.org/hudson/job/Solr-
> trunk/ws/trunk/solr/build/tests/clover/db/solr_coverage.db'>
> [clover-report] Loading coverage database from:
> '/usr<https://hudson.apache.org/hudson/job/Solr-
> trunk/ws/trunk/solr/build/tests/clover/db/solr_coverage.db'>
> [clover-report] Writing report to
> '/usr<https://hudson.apache.org/hudson/job/Solr-
> trunk/ws/trunk/solr/build/tests/clover/reports/clover.xml'>
> [clover-report] Writing HTML report to
> '/usr<https://hudson.apache.org/hudson/job/Solr-
> trunk/ws/trunk/solr/build/tests/clover/reports'>
> [clover-report] Done. Processed 35 packages in 5870ms (167ms per package).
>
> BUILD SUCCESSFUL
> Total time: 6 minutes 18 seconds
> [TASKS] Scanning workspace files for tasks...
> Publishing Javadoc
> Archiving artifacts
> Recording test results
> Publishing Clover coverage report...
> Publishing Clover HTML report...
> Publishing Clover XML report...
> Publishing Clover coverage results...
> FATAL: Unable to copy coverage from
> <https://hudson.apache.org/hudson/job/Solr-
> trunk/ws/trunk/solr/build/tests/clover/reports> to
> /home/hudson/hudson/jobs/Solr-trunk/builds/2010-10-13_08-44-05
> hudson.util.IOException2: Cannot parse coverage results
> at
> hudson.plugins.clover.CloverCoverageParser.parse(CloverCoverageParser.java:
> 89)
> at
> hudson.plugins.clover.CloverCoverageParser.parse(CloverCoverageParser.java:
> 51)
> at
> hudson.plugins.clover.CloverPublisher.processCloverXml(CloverPublisher.java:2
> 02)
> at
> hudson.plugins.clover.CloverPublisher.perform(CloverPublisher.java:163)
> at hudson.tasks.BuildStepMonitor$3.perform(BuildStepMonitor.java:36)
> at
> hudson.model.AbstractBuild$AbstractRunner.perform(AbstractBuild.java:601)
> at
> hudson.model.AbstractBuild$AbstractRunner.performAllBuildSteps(AbstractBuil
> d.java:580)
> at
> hudson.model.AbstractBuild$AbstractRunner.performAllBuildSteps(AbstractBuil
> d.java:558)
> at hudson.model.Build$RunnerImpl.post2(Build.java:157)
> at
> hudson.model.AbstractBuild$AbstractRunner.post(AbstractBuild.java:528)
> at hudson.model.Run.run(Run.java:1303)
> at hudson.model.FreeStyleBuild.run(FreeStyleBuild.java:46)
> at
> hudson.model.ResourceController.execute(ResourceController.java:88)
> at hudson.model.Executor.run(Executor.java:140)
> Caused by: org.xml.sax.SAXParseException: XML document structures must
> start and end within the same entity.
> at
> com.sun.org.apache.xerces.internal.parsers.AbstractSAXParser.parse(AbstractS
> AXParser.java:1231)
> at
> com.sun.org.apache.xerces.internal.jaxp.SAXParserImpl$JAXPSAXParser.parse(S
> AXParserImpl.java:522)
> at org.apache.commons.digester.Digester.parse(Digester.java:1666)
> at
> hudson.plugins.clover.CloverCoverageParser.parse(CloverCoverageParser.java:
> 87)
> ... 13 more
> ERROR: Publisher hudson.plugins.clover.CloverPublisher aborted due to
> exception java.lang.NullPointerException
> at
> hudson.plugins.clover.CloverBuildAction.<init>(CloverBuildAction.java:133)
> at
> hudson.plugins.clover.CloverBuildAction.load(CloverBuildAction.java:265)
> at
> hudson.plugins.clover.CloverPublisher.processCloverXml(CloverPublisher.java:2
> 08)
> at
> hudson.plugins.clover.CloverPublisher.perform(CloverPublisher.java:163)
> at hudson.tasks.BuildStepMonitor$3.perform(BuildStepMonitor.java:36)
> at
> hudson.model.AbstractBuild$AbstractRunner.perform(AbstractBuild.java:601)
> at
> hudson.model.AbstractBuild$AbstractRunner.performAllBuildSteps(AbstractBuil
> d.java:580)
> at
> hudson.model.AbstractBuild$AbstractRunner.performAllBuildSteps(AbstractBuil
> d.java:558)
> at hudson.model.Build$RunnerImpl.post2(Build.java:157)
> at
> hudson.model.AbstractBuild$AbstractRunner.post(AbstractBuild.java:528)
> at hudson.model.Run.run(Run.java:1303)
> at hudson.model.FreeStyleBuild.run(FreeStyleBuild.java:46)
> at
> hudson.model.ResourceController.execute(ResourceController.java:88)
> at hudson.model.Executor.run(Executor.java:140)
>
>
> ---------------------------------------------------------------------
> To unsubscribe, e-mail: [hidden email] For additional
> commands, e-mail: [hidden email]



---------------------------------------------------------------------
To unsubscribe, e-mail: [hidden email]
For additional commands, e-mail: [hidden email]

Reply | Threaded
Open this post in threaded view
|

Build failed in Hudson: Solr-trunk #1278

Apache Jenkins Server
In reply to this post by Apache Jenkins Server
See <https://hudson.apache.org/hudson/job/Solr-trunk/1278/changes>

Changes:

[uschindler] unify the folder names and move to config

[mikemccand] LUCENE-2691: add MIGRATE.txt entry

------------------------------------------
[...truncated 15655 lines...]
    [junit] at sun.reflect.DelegatingMethodAccessorImpl.invoke(DelegatingMethodAccessorImpl.java:43)
    [junit] at java.lang.reflect.Method.invoke(Method.java:616)
    [junit] at org.junit.runners.model.FrameworkMethod$1.runReflectiveCall(FrameworkMethod.java:44)
    [junit] at org.junit.internal.runners.model.ReflectiveCallable.run(ReflectiveCallable.java:15)
    [junit] at org.junit.runners.model.FrameworkMethod.invokeExplosively(FrameworkMethod.java:41)
    [junit] at org.junit.internal.runners.statements.InvokeMethod.evaluate(InvokeMethod.java:20)
    [junit] at org.junit.rules.TestWatchman$1.evaluate(TestWatchman.java:48)
    [junit] at org.junit.internal.runners.statements.RunBefores.evaluate(RunBefores.java:28)
    [junit] at org.junit.internal.runners.statements.RunAfters.evaluate(RunAfters.java:31)
    [junit] at org.junit.runners.BlockJUnit4ClassRunner.runChild(BlockJUnit4ClassRunner.java:76)
    [junit] at org.apache.lucene.util.LuceneTestCase$LuceneTestCaseRunner.runChild(LuceneTestCase.java:795)
    [junit] at org.apache.lucene.util.LuceneTestCase$LuceneTestCaseRunner.runChild(LuceneTestCase.java:768)
    [junit] at org.junit.runners.ParentRunner$3.run(ParentRunner.java:193)
    [junit] at org.junit.runners.ParentRunner$1.schedule(ParentRunner.java:52)
    [junit] at org.junit.runners.ParentRunner.runChildren(ParentRunner.java:191)
    [junit] at org.junit.runners.ParentRunner.access$000(ParentRunner.java:42)
    [junit] at org.junit.runners.ParentRunner$2.evaluate(ParentRunner.java:184)
    [junit] at org.junit.internal.runners.statements.RunBefores.evaluate(RunBefores.java:28)
    [junit] at org.junit.internal.runners.statements.RunAfters.evaluate(RunAfters.java:31)
    [junit] at org.junit.runners.ParentRunner.run(ParentRunner.java:236)
    [junit] at junit.framework.JUnit4TestAdapter.run(JUnit4TestAdapter.java:39)
    [junit] at org.apache.tools.ant.taskdefs.optional.junit.JUnitTestRunner.run(JUnitTestRunner.java:421)
    [junit] at org.apache.tools.ant.taskdefs.optional.junit.JUnitTestRunner.launch(JUnitTestRunner.java:912)
    [junit] at org.apache.tools.ant.taskdefs.optional.junit.JUnitTestRunner.main(JUnitTestRunner.java:743)
    [junit] Caused by: java.lang.RuntimeException: com.ctc.wstx.exc.WstxParsingException: Unexpected close tag </id>; expected </node>.
    [junit]  at [row,col {unknown-source}]: [11,18]
    [junit] at org.apache.solr.handler.dataimport.XPathRecordReader.streamRecords(XPathRecordReader.java:181)
    [junit] at org.apache.solr.handler.dataimport.XPathEntityProcessor.initQuery(XPathEntityProcessor.java:295)
    [junit] ... 41 more
    [junit] Caused by: com.ctc.wstx.exc.WstxParsingException: Unexpected close tag </id>; expected </node>.
    [junit]  at [row,col {unknown-source}]: [11,18]
    [junit] at com.ctc.wstx.sr.StreamScanner.constructWfcException(StreamScanner.java:630)
    [junit] at com.ctc.wstx.sr.StreamScanner.throwParseError(StreamScanner.java:461)
    [junit] at com.ctc.wstx.sr.BasicStreamReader.reportWrongEndElem(BasicStreamReader.java:3258)
    [junit] at com.ctc.wstx.sr.BasicStreamReader.readEndElem(BasicStreamReader.java:3200)
    [junit] at com.ctc.wstx.sr.BasicStreamReader.nextFromTree(BasicStreamReader.java:2832)
    [junit] at com.ctc.wstx.sr.BasicStreamReader.next(BasicStreamReader.java:1019)
    [junit] at org.apache.solr.handler.dataimport.XPathRecordReader$Node.parse(XPathRecordReader.java:275)
    [junit] at org.apache.solr.handler.dataimport.XPathRecordReader$Node.handleStartElement(XPathRecordReader.java:340)
    [junit] at org.apache.solr.handler.dataimport.XPathRecordReader$Node.parse(XPathRecordReader.java:304)
    [junit] at org.apache.solr.handler.dataimport.XPathRecordReader$Node.handleStartElement(XPathRecordReader.java:340)
    [junit] at org.apache.solr.handler.dataimport.XPathRecordReader$Node.parse(XPathRecordReader.java:304)
    [junit] at org.apache.solr.handler.dataimport.XPathRecordReader$Node.access$200(XPathRecordReader.java:196)
    [junit] at org.apache.solr.handler.dataimport.XPathRecordReader.streamRecords(XPathRecordReader.java:178)
    [junit] ... 42 more
    [junit] ------------- ---------------- ---------------
    [junit] Testsuite: org.apache.solr.handler.dataimport.TestEvaluatorBag
    [junit] Tests run: 5, Failures: 0, Errors: 0, Time elapsed: 0.014 sec
    [junit]
    [junit] Testsuite: org.apache.solr.handler.dataimport.TestFieldReader
    [junit] Tests run: 1, Failures: 0, Errors: 0, Time elapsed: 0.018 sec
    [junit]
    [junit] Testsuite: org.apache.solr.handler.dataimport.TestFileListEntityProcessor
    [junit] Tests run: 4, Failures: 0, Errors: 0, Time elapsed: 0.015 sec
    [junit]
    [junit] Testsuite: org.apache.solr.handler.dataimport.TestJdbcDataSource
    [junit] Tests run: 3, Failures: 0, Errors: 0, Time elapsed: 0.046 sec
    [junit]
    [junit] Testsuite: org.apache.solr.handler.dataimport.TestLineEntityProcessor
    [junit] Tests run: 4, Failures: 0, Errors: 0, Time elapsed: 0.011 sec
    [junit]
    [junit] ------------- Standard Output ---------------
    [junit]
    [junit]      rawLine=''
    [junit]      rawLine='# this is what the output from 'find . -ls; looks like, athough the format'
    [junit]      rawLine='# of the time stamp varies depending on the age of the file and your LANG '
    [junit]      rawLine='# env setting'
    [junit]      rawLine='412577   0 drwxr-xr-x  6 user group    204 1 Apr 10:53 /Volumes/spare/ts'
    [junit]      rawLine='412582   0 drwxr-xr-x 13 user group    442 1 Apr 10:18 /Volumes/spare/ts/config'
    [junit]      rawLine='412583  24 -rwxr-xr-x  1 user group   8318 1 Apr 11:10 /Volumes/spare/ts/config/dc.xsd'
    [junit]      rawLine='412584  32 -rwxr-xr-x  1 user group  12847 1 Apr 11:10 /Volumes/spare/ts/config/dcterms.xsd'
    [junit]      rawLine='412585   8 -rwxr-xr-x  1 user group   3156 1 Apr 11:10 /Volumes/spare/ts/config/s-deliver.css'
    [junit]      rawLine='412586 192 -rwxr-xr-x  1 user group  97764 1 Apr 11:10 /Volumes/spare/ts/config/s-deliver.xsl'
    [junit]      rawLine='412587 224 -rwxr-xr-x  1 user group 112700 1 Apr 11:10 /Volumes/spare/ts/config/sml-delivery-2.1.xsd'
    [junit]      rawLine='412588 208 -rwxr-xr-x  1 user group 103419 1 Apr 11:10 /Volumes/spare/ts/config/sml-delivery-norm-2.0.dtd'
    [junit]      rawLine='412589 248 -rwxr-xr-x  1 user group 125296 1 Apr 11:10 /Volumes/spare/ts/config/sml-delivery-norm-2.1.dtd'
    [junit]      rawLine='412590  72 -rwxr-xr-x  1 user group  36256 1 Apr 11:10 /Volumes/spare/ts/config/jm.xsd'
    [junit]      rawLine='412591   8 -rwxr-xr-x  1 user group    990 1 Apr 11:10 /Volumes/spare/ts/config/video.gif'
    [junit]      rawLine='412592   8 -rwxr-xr-x  1 user group   1498 1 Apr 11:10 /Volumes/spare/ts/config/xlink.xsd'
    [junit]      rawLine='412593   8 -rwxr-xr-x  1 user group   1155 1 Apr 11:10 /Volumes/spare/ts/config/xml.xsd'
    [junit]      rawLine='412594   0 drwxr-xr-x  4 user group    136 1 Apr 10:18 /Volumes/spare/ts/acm19'
    [junit]      rawLine='412621   0 drwxr-xr-x 57 user group   1938 1 Apr 10:18 /Volumes/spare/ts/acm19/data'
    [junit]      rawLine='412622  24 -rwxr-xr-x  1 user group   8894 1 Apr 11:09 /Volumes/spare/ts/acm19/data/00000510.xml'
    [junit]      rawLine='412623  32 -rwxr-xr-x  1 user group  14124 1 Apr 11:09 /Volumes/spare/ts/acm19/data/00000603.xml'
    [junit]      rawLine='412624  24 -rwxr-xr-x  1 user group  11976 1 Apr 11:09 /Volumes/spare/ts/acm19/data/00001292.xml'
    [junit]      rawLine='# tacked on an extra line to cause a file to be deleted.'
    [junit]      rawLine='DELETE /Volumes/spare/ts/acm19/data/00001292old.xml'
    [junit] ------------- ---------------- ---------------
    [junit] Testsuite: org.apache.solr.handler.dataimport.TestNumberFormatTransformer
    [junit] Tests run: 9, Failures: 0, Errors: 0, Time elapsed: 0.017 sec
    [junit]
    [junit] Testsuite: org.apache.solr.handler.dataimport.TestPlainTextEntityProcessor
    [junit] Tests run: 1, Failures: 0, Errors: 0, Time elapsed: 0.011 sec
    [junit]
    [junit] Testsuite: org.apache.solr.handler.dataimport.TestRegexTransformer
    [junit] Tests run: 5, Failures: 0, Errors: 0, Time elapsed: 0.01 sec
    [junit]
    [junit] Testsuite: org.apache.solr.handler.dataimport.TestScriptTransformer
    [junit] Tests run: 0, Failures: 0, Errors: 0, Time elapsed: 0.006 sec
    [junit]
    [junit] Testsuite: org.apache.solr.handler.dataimport.TestSqlEntityProcessor
    [junit] Tests run: 4, Failures: 0, Errors: 0, Time elapsed: 0.015 sec
    [junit]
    [junit] Testsuite: org.apache.solr.handler.dataimport.TestSqlEntityProcessor2
    [junit] Tests run: 7, Failures: 0, Errors: 0, Time elapsed: 1.553 sec
    [junit]
    [junit] Testsuite: org.apache.solr.handler.dataimport.TestSqlEntityProcessorDelta
    [junit] Tests run: 8, Failures: 0, Errors: 0, Time elapsed: 1.972 sec
    [junit]
    [junit] Testsuite: org.apache.solr.handler.dataimport.TestSqlEntityProcessorDelta2
    [junit] Tests run: 8, Failures: 0, Errors: 0, Time elapsed: 3.885 sec
    [junit]
    [junit] Testsuite: org.apache.solr.handler.dataimport.TestTemplateString
    [junit] Tests run: 1, Failures: 0, Errors: 0, Time elapsed: 0.007 sec
    [junit]
    [junit] Testsuite: org.apache.solr.handler.dataimport.TestTemplateTransformer
    [junit] Tests run: 1, Failures: 0, Errors: 0, Time elapsed: 0.005 sec
    [junit]
    [junit] Testsuite: org.apache.solr.handler.dataimport.TestThreaded
    [junit] Tests run: 1, Failures: 0, Errors: 0, Time elapsed: 0.317 sec
    [junit]
    [junit] Testsuite: org.apache.solr.handler.dataimport.TestURLDataSource
    [junit] Tests run: 1, Failures: 0, Errors: 0, Time elapsed: 0.007 sec
    [junit]
    [junit] Testsuite: org.apache.solr.handler.dataimport.TestVariableResolver
    [junit] Tests run: 9, Failures: 0, Errors: 0, Time elapsed: 0.018 sec
    [junit]
    [junit] Testsuite: org.apache.solr.handler.dataimport.TestXPathEntityProcessor
    [junit] Tests run: 8, Failures: 0, Errors: 0, Time elapsed: 0.477 sec
    [junit]
    [junit] Testsuite: org.apache.solr.handler.dataimport.TestXPathRecordReader
    [junit] Tests run: 21, Failures: 0, Errors: 0, Time elapsed: 0.038 sec
    [junit]

compileExtras:

compileExtrasTests:
    [mkdir] Created dir: /usr<https://hudson.apache.org/hudson/job/Solr-trunk/ws/checkout/solr/contrib/dataimporthandler/target/extras/test-classes>
    [javac] Compiling 2 source files to /usr<https://hudson.apache.org/hudson/job/Solr-trunk/ws/checkout/solr/contrib/dataimporthandler/target/extras/test-classes>

testExtras:
    [junit] Testsuite: org.apache.solr.handler.dataimport.TestMailEntityProcessor
    [junit] Tests run: 0, Failures: 0, Errors: 0, Time elapsed: 0.225 sec
    [junit]
    [junit] Testsuite: org.apache.solr.handler.dataimport.TestTikaEntityProcessor
    [junit] Tests run: 1, Failures: 0, Errors: 0, Time elapsed: 2.412 sec
    [junit]

test:

init:

init-forrest-entities:

compile-lucene:

compile-solrj:

compile:
    [javac] Compiling 1 source file to /usr<https://hudson.apache.org/hudson/job/Solr-trunk/ws/checkout/solr/build/solr>

compileTests:

make-manifest:

compile:

compileTests:
    [mkdir] Created dir: /usr<https://hudson.apache.org/hudson/job/Solr-trunk/ws/checkout/solr/contrib/extraction/build/test-classes>
    [javac] Compiling 1 source file to /usr<https://hudson.apache.org/hudson/job/Solr-trunk/ws/checkout/solr/contrib/extraction/build/test-classes>

test:
    [junit] Testsuite: org.apache.solr.handler.ExtractingRequestHandlerTest
    [junit] Tests run: 8, Failures: 0, Errors: 0, Time elapsed: 3.382 sec
    [junit]

test:

clover.check:

clover.setup:
[clover-setup] Clover Version 2.6.3, built on November 20 2009 (build-778)
[clover-setup] Loaded from: /home/hudson/tools/clover/clover2latest/clover-2.6.3.jar
[clover-setup] Clover: Open Source License registered to Apache.
[clover-setup] Clover is enabled with initstring '/usr<https://hudson.apache.org/hudson/job/Solr-trunk/ws/checkout/solr/build/tests/clover/db/solr_coverage.db'>

clover.info:

clover:

generate-clover-reports:
    [mkdir] Created dir: /usr<https://hudson.apache.org/hudson/job/Solr-trunk/ws/checkout/solr/build/tests/clover/reports>
[clover-report] Clover Version 2.6.3, built on November 20 2009 (build-778)
[clover-report] Loaded from: /home/hudson/tools/clover/clover2latest/clover-2.6.3.jar
[clover-report] Clover: Open Source License registered to Apache.
[clover-report] Loading coverage database from: '/usr<https://hudson.apache.org/hudson/job/Solr-trunk/ws/checkout/solr/build/tests/clover/db/solr_coverage.db'>
[clover-report] Loading coverage database from: '/usr<https://hudson.apache.org/hudson/job/Solr-trunk/ws/checkout/solr/build/tests/clover/db/solr_coverage.db'>
[clover-report] Writing report to '/usr<https://hudson.apache.org/hudson/job/Solr-trunk/ws/checkout/solr/build/tests/clover/reports/clover.xml'>
[clover-report] Writing HTML report to '/usr<https://hudson.apache.org/hudson/job/Solr-trunk/ws/checkout/solr/build/tests/clover/reports'>
[clover-report] Done. Processed 35 packages in 5932ms (169ms per package).

BUILD SUCCESSFUL
Total time: 6 minutes 40 seconds
[TASKS] Scanning workspace files for tasks...
Publishing Javadoc
Archiving artifacts
Recording test results
Publishing Clover coverage report...
Publishing Clover HTML report...
Publishing Clover XML report...
Publishing Clover coverage results...
FATAL: Unable to copy coverage from <https://hudson.apache.org/hudson/job/Solr-trunk/ws/checkout/solr/build/tests/clover/reports> to /home/hudson/hudson/jobs/Solr-trunk/builds/2010-10-13_13-48-59
hudson.util.IOException2: Cannot parse coverage results
        at hudson.plugins.clover.CloverCoverageParser.parse(CloverCoverageParser.java:89)
        at hudson.plugins.clover.CloverCoverageParser.parse(CloverCoverageParser.java:51)
        at hudson.plugins.clover.CloverPublisher.processCloverXml(CloverPublisher.java:202)
        at hudson.plugins.clover.CloverPublisher.perform(CloverPublisher.java:163)
        at hudson.tasks.BuildStepMonitor$3.perform(BuildStepMonitor.java:36)
        at hudson.model.AbstractBuild$AbstractRunner.perform(AbstractBuild.java:601)
        at hudson.model.AbstractBuild$AbstractRunner.performAllBuildSteps(AbstractBuild.java:580)
        at hudson.model.AbstractBuild$AbstractRunner.performAllBuildSteps(AbstractBuild.java:558)
        at hudson.model.Build$RunnerImpl.post2(Build.java:157)
        at hudson.model.AbstractBuild$AbstractRunner.post(AbstractBuild.java:528)
        at hudson.model.Run.run(Run.java:1303)
        at hudson.model.FreeStyleBuild.run(FreeStyleBuild.java:46)
        at hudson.model.ResourceController.execute(ResourceController.java:88)
        at hudson.model.Executor.run(Executor.java:140)
Caused by: org.xml.sax.SAXParseException: XML document structures must start and end within the same entity.
        at com.sun.org.apache.xerces.internal.parsers.AbstractSAXParser.parse(AbstractSAXParser.java:1231)
        at com.sun.org.apache.xerces.internal.jaxp.SAXParserImpl$JAXPSAXParser.parse(SAXParserImpl.java:522)
        at org.apache.commons.digester.Digester.parse(Digester.java:1666)
        at hudson.plugins.clover.CloverCoverageParser.parse(CloverCoverageParser.java:87)
        ... 13 more
ERROR: Publisher hudson.plugins.clover.CloverPublisher aborted due to exception
java.lang.NullPointerException
        at hudson.plugins.clover.CloverBuildAction.<init>(CloverBuildAction.java:133)
        at hudson.plugins.clover.CloverBuildAction.load(CloverBuildAction.java:265)
        at hudson.plugins.clover.CloverPublisher.processCloverXml(CloverPublisher.java:208)
        at hudson.plugins.clover.CloverPublisher.perform(CloverPublisher.java:163)
        at hudson.tasks.BuildStepMonitor$3.perform(BuildStepMonitor.java:36)
        at hudson.model.AbstractBuild$AbstractRunner.perform(AbstractBuild.java:601)
        at hudson.model.AbstractBuild$AbstractRunner.performAllBuildSteps(AbstractBuild.java:580)
        at hudson.model.AbstractBuild$AbstractRunner.performAllBuildSteps(AbstractBuild.java:558)
        at hudson.model.Build$RunnerImpl.post2(Build.java:157)
        at hudson.model.AbstractBuild$AbstractRunner.post(AbstractBuild.java:528)
        at hudson.model.Run.run(Run.java:1303)
        at hudson.model.FreeStyleBuild.run(FreeStyleBuild.java:46)
        at hudson.model.ResourceController.execute(ResourceController.java:88)
        at hudson.model.Executor.run(Executor.java:140)


---------------------------------------------------------------------
To unsubscribe, e-mail: [hidden email]
For additional commands, e-mail: [hidden email]

Reply | Threaded
Open this post in threaded view
|

Build failed in Hudson: Solr-trunk #1279

Apache Jenkins Server
See <https://hudson.apache.org/hudson/job/Solr-trunk/1279/changes>

Changes:

[yonik] solrj: allow facet parsing to proceed even if no main doclist

------------------------------------------
[...truncated 15479 lines...]
    [junit] at org.apache.solr.util.TestHarness.queryAndResponse(TestHarness.java:334)
    [junit] at org.apache.solr.util.TestHarness.query(TestHarness.java:321)
    [junit] at org.apache.solr.handler.dataimport.AbstractDataImportHandlerTestCase.runFullImport(AbstractDataImportHandlerTestCase.java:108)
    [junit] at org.apache.solr.handler.dataimport.TestDocBuilder2.testFileListEntityProcessor_lastIndexTime(TestDocBuilder2.java:245)
    [junit] at sun.reflect.NativeMethodAccessorImpl.invoke0(Native Method)
    [junit] at sun.reflect.NativeMethodAccessorImpl.invoke(NativeMethodAccessorImpl.java:57)
    [junit] at sun.reflect.DelegatingMethodAccessorImpl.invoke(DelegatingMethodAccessorImpl.java:43)
    [junit] at java.lang.reflect.Method.invoke(Method.java:616)
    [junit] at org.junit.runners.model.FrameworkMethod$1.runReflectiveCall(FrameworkMethod.java:44)
    [junit] at org.junit.internal.runners.model.ReflectiveCallable.run(ReflectiveCallable.java:15)
    [junit] at org.junit.runners.model.FrameworkMethod.invokeExplosively(FrameworkMethod.java:41)
    [junit] at org.junit.internal.runners.statements.InvokeMethod.evaluate(InvokeMethod.java:20)
    [junit] at org.junit.rules.TestWatchman$1.evaluate(TestWatchman.java:48)
    [junit] at org.junit.internal.runners.statements.RunBefores.evaluate(RunBefores.java:28)
    [junit] at org.junit.internal.runners.statements.RunAfters.evaluate(RunAfters.java:31)
    [junit] at org.junit.runners.BlockJUnit4ClassRunner.runChild(BlockJUnit4ClassRunner.java:76)
    [junit] at org.apache.lucene.util.LuceneTestCase$LuceneTestCaseRunner.runChild(LuceneTestCase.java:795)
    [junit] at org.apache.lucene.util.LuceneTestCase$LuceneTestCaseRunner.runChild(LuceneTestCase.java:768)
    [junit] at org.junit.runners.ParentRunner$3.run(ParentRunner.java:193)
    [junit] at org.junit.runners.ParentRunner$1.schedule(ParentRunner.java:52)
    [junit] at org.junit.runners.ParentRunner.runChildren(ParentRunner.java:191)
    [junit] at org.junit.runners.ParentRunner.access$000(ParentRunner.java:42)
    [junit] at org.junit.runners.ParentRunner$2.evaluate(ParentRunner.java:184)
    [junit] at org.junit.internal.runners.statements.RunBefores.evaluate(RunBefores.java:28)
    [junit] at org.junit.internal.runners.statements.RunAfters.evaluate(RunAfters.java:31)
    [junit] at org.junit.runners.ParentRunner.run(ParentRunner.java:236)
    [junit] at junit.framework.JUnit4TestAdapter.run(JUnit4TestAdapter.java:39)
    [junit] at org.apache.tools.ant.taskdefs.optional.junit.JUnitTestRunner.run(JUnitTestRunner.java:421)
    [junit] at org.apache.tools.ant.taskdefs.optional.junit.JUnitTestRunner.launch(JUnitTestRunner.java:912)
    [junit] at org.apache.tools.ant.taskdefs.optional.junit.JUnitTestRunner.main(JUnitTestRunner.java:743)
    [junit] Caused by: java.text.ParseException: Unparseable date: "1970-01-01 07:00:00"
    [junit] at java.text.DateFormat.parse(DateFormat.java:354)
    [junit] at org.apache.solr.handler.dataimport.FileListEntityProcessor.getDate(FileListEntityProcessor.java:165)
    [junit] ... 40 more
    [junit] 2010/10/13 22:11:34 org.apache.solr.handler.dataimport.DataImporter doFullImport
    [junit] ???: Full Import failed
    [junit] org.apache.solr.handler.dataimport.DataImportHandlerException: Invalid expression for date Processing Document # 1
    [junit] at org.apache.solr.handler.dataimport.FileListEntityProcessor.getDate(FileListEntityProcessor.java:167)
    [junit] at org.apache.solr.handler.dataimport.FileListEntityProcessor.nextRow(FileListEntityProcessor.java:204)
    [junit] at org.apache.solr.handler.dataimport.EntityProcessorWrapper.nextRow(EntityProcessorWrapper.java:233)
    [junit] at org.apache.solr.handler.dataimport.DocBuilder.buildDocument(DocBuilder.java:579)
    [junit] at org.apache.solr.handler.dataimport.DocBuilder.doFullDump(DocBuilder.java:260)
    [junit] at org.apache.solr.handler.dataimport.DocBuilder.execute(DocBuilder.java:184)
    [junit] at org.apache.solr.handler.dataimport.DataImporter.doFullImport(DataImporter.java:334)
    [junit] at org.apache.solr.handler.dataimport.DataImporter.runCmd(DataImporter.java:392)
    [junit] at org.apache.solr.handler.dataimport.DataImportHandler.handleRequestBody(DataImportHandler.java:203)
    [junit] at org.apache.solr.handler.RequestHandlerBase.handleRequest(RequestHandlerBase.java:131)
    [junit] at org.apache.solr.core.SolrCore.execute(SolrCore.java:1324)
    [junit] at org.apache.solr.util.TestHarness.queryAndResponse(TestHarness.java:334)
    [junit] at org.apache.solr.util.TestHarness.query(TestHarness.java:321)
    [junit] at org.apache.solr.handler.dataimport.AbstractDataImportHandlerTestCase.runFullImport(AbstractDataImportHandlerTestCase.java:108)
    [junit] at org.apache.solr.handler.dataimport.TestDocBuilder2.testFileListEntityProcessor_lastIndexTime(TestDocBuilder2.java:245)
    [junit] at sun.reflect.NativeMethodAccessorImpl.invoke0(Native Method)
    [junit] at sun.reflect.NativeMethodAccessorImpl.invoke(NativeMethodAccessorImpl.java:57)
    [junit] at sun.reflect.DelegatingMethodAccessorImpl.invoke(DelegatingMethodAccessorImpl.java:43)
    [junit] at java.lang.reflect.Method.invoke(Method.java:616)
    [junit] at org.junit.runners.model.FrameworkMethod$1.runReflectiveCall(FrameworkMethod.java:44)
    [junit] at org.junit.internal.runners.model.ReflectiveCallable.run(ReflectiveCallable.java:15)
    [junit] at org.junit.runners.model.FrameworkMethod.invokeExplosively(FrameworkMethod.java:41)
    [junit] at org.junit.internal.runners.statements.InvokeMethod.evaluate(InvokeMethod.java:20)
    [junit] at org.junit.rules.TestWatchman$1.evaluate(TestWatchman.java:48)
    [junit] at org.junit.internal.runners.statements.RunBefores.evaluate(RunBefores.java:28)
    [junit] at org.junit.internal.runners.statements.RunAfters.evaluate(RunAfters.java:31)
    [junit] at org.junit.runners.BlockJUnit4ClassRunner.runChild(BlockJUnit4ClassRunner.java:76)
    [junit] at org.apache.lucene.util.LuceneTestCase$LuceneTestCaseRunner.runChild(LuceneTestCase.java:795)
    [junit] at org.apache.lucene.util.LuceneTestCase$LuceneTestCaseRunner.runChild(LuceneTestCase.java:768)
    [junit] at org.junit.runners.ParentRunner$3.run(ParentRunner.java:193)
    [junit] at org.junit.runners.ParentRunner$1.schedule(ParentRunner.java:52)
    [junit] at org.junit.runners.ParentRunner.runChildren(ParentRunner.java:191)
    [junit] at org.junit.runners.ParentRunner.access$000(ParentRunner.java:42)
    [junit] at org.junit.runners.ParentRunner$2.evaluate(ParentRunner.java:184)
    [junit] at org.junit.internal.runners.statements.RunBefores.evaluate(RunBefores.java:28)
    [junit] at org.junit.internal.runners.statements.RunAfters.evaluate(RunAfters.java:31)
    [junit] at org.junit.runners.ParentRunner.run(ParentRunner.java:236)
    [junit] at junit.framework.JUnit4TestAdapter.run(JUnit4TestAdapter.java:39)
    [junit] at org.apache.tools.ant.taskdefs.optional.junit.JUnitTestRunner.run(JUnitTestRunner.java:421)
    [junit] at org.apache.tools.ant.taskdefs.optional.junit.JUnitTestRunner.launch(JUnitTestRunner.java:912)
    [junit] at org.apache.tools.ant.taskdefs.optional.junit.JUnitTestRunner.main(JUnitTestRunner.java:743)
    [junit] Caused by: java.text.ParseException: Unparseable date: "1970-01-01 07:00:00"
    [junit] at java.text.DateFormat.parse(DateFormat.java:354)
    [junit] at org.apache.solr.handler.dataimport.FileListEntityProcessor.getDate(FileListEntityProcessor.java:165)
    [junit] ... 40 more
    [junit] ------------- ---------------- ---------------
    [junit] TEST org.apache.solr.handler.dataimport.TestDocBuilder2 FAILED
    [junit] Testsuite: org.apache.solr.handler.dataimport.TestEntityProcessorBase
    [junit] Tests run: 1, Failures: 0, Errors: 0, Time elapsed: 0.014 sec
    [junit]
    [junit] Testsuite: org.apache.solr.handler.dataimport.TestErrorHandling
    [junit] Tests run: 4, Failures: 0, Errors: 0, Time elapsed: 1.232 sec
    [junit]
    [junit] Testsuite: org.apache.solr.handler.dataimport.TestEvaluatorBag
    [junit] Tests run: 5, Failures: 0, Errors: 0, Time elapsed: 0.016 sec
    [junit]
    [junit] Testsuite: org.apache.solr.handler.dataimport.TestFieldReader
    [junit] Tests run: 1, Failures: 0, Errors: 0, Time elapsed: 0.012 sec
    [junit]
    [junit] Testsuite: org.apache.solr.handler.dataimport.TestFileListEntityProcessor
    [junit] Testcase: testNTOT(org.apache.solr.handler.dataimport.TestFileListEntityProcessor): Caused an ERROR
    [junit] Invalid expression for date
    [junit] org.apache.solr.handler.dataimport.DataImportHandlerException: Invalid expression for date
    [junit] at org.apache.solr.handler.dataimport.FileListEntityProcessor.getDate(FileListEntityProcessor.java:167)
    [junit] at org.apache.solr.handler.dataimport.FileListEntityProcessor.nextRow(FileListEntityProcessor.java:204)
    [junit] at org.apache.solr.handler.dataimport.TestFileListEntityProcessor.getFiles(TestFileListEntityProcessor.java:127)
    [junit] at org.apache.solr.handler.dataimport.TestFileListEntityProcessor.testNTOT(TestFileListEntityProcessor.java:166)
    [junit] at org.apache.lucene.util.LuceneTestCase$LuceneTestCaseRunner.runChild(LuceneTestCase.java:795)
    [junit] at org.apache.lucene.util.LuceneTestCase$LuceneTestCaseRunner.runChild(LuceneTestCase.java:768)
    [junit] Caused by: java.text.ParseException: Unparseable date: "2010-10-13 23:40:46"
    [junit] at java.text.DateFormat.parse(DateFormat.java:354)
    [junit] at org.apache.solr.handler.dataimport.FileListEntityProcessor.getDate(FileListEntityProcessor.java:165)
    [junit]
    [junit]
    [junit] Tests run: 4, Failures: 0, Errors: 1, Time elapsed: 0.024 sec
    [junit]
    [junit] ------------- Standard Output ---------------
    [junit] NOTE: reproduce with: ant test -Dtestcase=TestFileListEntityProcessor -Dtestmethod=testNTOT -Dtests.seed=-4128989598887463653:-2928111840742545064
    [junit] NOTE: test params are: codec=PreFlex, locale=de, timezone=America/Boise
    [junit] ------------- ---------------- ---------------
    [junit] TEST org.apache.solr.handler.dataimport.TestFileListEntityProcessor FAILED
    [junit] Testsuite: org.apache.solr.handler.dataimport.TestJdbcDataSource
    [junit] Tests run: 3, Failures: 0, Errors: 0, Time elapsed: 0.059 sec
    [junit]
    [junit] Testsuite: org.apache.solr.handler.dataimport.TestLineEntityProcessor
    [junit] Tests run: 4, Failures: 0, Errors: 0, Time elapsed: 0.014 sec
    [junit]
    [junit] ------------- Standard Output ---------------
    [junit]
    [junit]      rawLine=''
    [junit]      rawLine='# this is what the output from 'find . -ls; looks like, athough the format'
    [junit]      rawLine='# of the time stamp varies depending on the age of the file and your LANG '
    [junit]      rawLine='# env setting'
    [junit]      rawLine='412577   0 drwxr-xr-x  6 user group    204 1 Apr 10:53 /Volumes/spare/ts'
    [junit]      rawLine='412582   0 drwxr-xr-x 13 user group    442 1 Apr 10:18 /Volumes/spare/ts/config'
    [junit]      rawLine='412583  24 -rwxr-xr-x  1 user group   8318 1 Apr 11:10 /Volumes/spare/ts/config/dc.xsd'
    [junit]      rawLine='412584  32 -rwxr-xr-x  1 user group  12847 1 Apr 11:10 /Volumes/spare/ts/config/dcterms.xsd'
    [junit]      rawLine='412585   8 -rwxr-xr-x  1 user group   3156 1 Apr 11:10 /Volumes/spare/ts/config/s-deliver.css'
    [junit]      rawLine='412586 192 -rwxr-xr-x  1 user group  97764 1 Apr 11:10 /Volumes/spare/ts/config/s-deliver.xsl'
    [junit]      rawLine='412587 224 -rwxr-xr-x  1 user group 112700 1 Apr 11:10 /Volumes/spare/ts/config/sml-delivery-2.1.xsd'
    [junit]      rawLine='412588 208 -rwxr-xr-x  1 user group 103419 1 Apr 11:10 /Volumes/spare/ts/config/sml-delivery-norm-2.0.dtd'
    [junit]      rawLine='412589 248 -rwxr-xr-x  1 user group 125296 1 Apr 11:10 /Volumes/spare/ts/config/sml-delivery-norm-2.1.dtd'
    [junit]      rawLine='412590  72 -rwxr-xr-x  1 user group  36256 1 Apr 11:10 /Volumes/spare/ts/config/jm.xsd'
    [junit]      rawLine='412591   8 -rwxr-xr-x  1 user group    990 1 Apr 11:10 /Volumes/spare/ts/config/video.gif'
    [junit]      rawLine='412592   8 -rwxr-xr-x  1 user group   1498 1 Apr 11:10 /Volumes/spare/ts/config/xlink.xsd'
    [junit]      rawLine='412593   8 -rwxr-xr-x  1 user group   1155 1 Apr 11:10 /Volumes/spare/ts/config/xml.xsd'
    [junit]      rawLine='412594   0 drwxr-xr-x  4 user group    136 1 Apr 10:18 /Volumes/spare/ts/acm19'
    [junit]      rawLine='412621   0 drwxr-xr-x 57 user group   1938 1 Apr 10:18 /Volumes/spare/ts/acm19/data'
    [junit]      rawLine='412622  24 -rwxr-xr-x  1 user group   8894 1 Apr 11:09 /Volumes/spare/ts/acm19/data/00000510.xml'
    [junit]      rawLine='412623  32 -rwxr-xr-x  1 user group  14124 1 Apr 11:09 /Volumes/spare/ts/acm19/data/00000603.xml'
    [junit]      rawLine='412624  24 -rwxr-xr-x  1 user group  11976 1 Apr 11:09 /Volumes/spare/ts/acm19/data/00001292.xml'
    [junit]      rawLine='# tacked on an extra line to cause a file to be deleted.'
    [junit]      rawLine='DELETE /Volumes/spare/ts/acm19/data/00001292old.xml'
    [junit] ------------- ---------------- ---------------
    [junit] Testsuite: org.apache.solr.handler.dataimport.TestNumberFormatTransformer
    [junit] Tests run: 9, Failures: 0, Errors: 0, Time elapsed: 0.022 sec
    [junit]
    [junit] Testsuite: org.apache.solr.handler.dataimport.TestPlainTextEntityProcessor
    [junit] Tests run: 1, Failures: 0, Errors: 0, Time elapsed: 0.013 sec
    [junit]
    [junit] Testsuite: org.apache.solr.handler.dataimport.TestRegexTransformer
    [junit] Tests run: 5, Failures: 0, Errors: 0, Time elapsed: 0.012 sec
    [junit]
    [junit] Testsuite: org.apache.solr.handler.dataimport.TestScriptTransformer
    [junit] Tests run: 0, Failures: 0, Errors: 0, Time elapsed: 0.008 sec
    [junit]
    [junit] Testsuite: org.apache.solr.handler.dataimport.TestSqlEntityProcessor
    [junit] Tests run: 4, Failures: 0, Errors: 0, Time elapsed: 0.013 sec
    [junit]
    [junit]  xml response was: <?xml version="1.0" encoding="UTF-8"?>
    [junit] <response>
    [junit] <lst name="responseHeader"><int name="status">0</int><int name="QTime">2</int><lst name="params"><str name="start">0</str><str name="q">id:5</str><str name="qt">standard</str><str name="rows">20</str><str name="version">2.2</str></lst></lst><result name="response" numFound="0" start="0"/>
    [junit] </response>
    [junit]
    [junit]  request was: start=0&q=id:5&qt=standard&rows=20&version=2.2)
    [junit] Testsuite: org.apache.solr.handler.dataimport.TestSqlEntityProcessor2
    [junit] Testcase: testLastIndexTime(org.apache.solr.handler.dataimport.TestSqlEntityProcessor2): FAILED
    [junit] query failed XPath: //*[@numFound='1']
    [junit]  xml response was: <?xml version="1.0" encoding="UTF-8"?>
    [junit] <response>
    [junit] <lst name="responseHeader"><int name="status">0</int><int name="QTime">2</int><lst name="params"><str name="start">0</str><str name="q">id:5</str><str name="qt">standard</str><str name="rows">20</str><str name="version">2.2</str></lst></lst><result name="response" numFound="0" start="0"/>
    [junit] </response>
    [junit]
    [junit]  request was: start=0&q=id:5&qt=standard&rows=20&version=2.2
    [junit] junit.framework.AssertionFailedError: query failed XPath: //*[@numFound='1']
    [junit]  xml response was: <?xml version="1.0" encoding="UTF-8"?>
    [junit] <response>
    [junit] <lst name="responseHeader"><int name="status">0</int><int name="QTime">2</int><lst name="params"><str name="start">0</str><str name="q">id:5</str><str name="qt">standard</str><str name="rows">20</str><str name="version">2.2</str></lst></lst><result name="response" numFound="0" start="0"/>
    [junit] </response>
    [junit]
    [junit]  request was: start=0&q=id:5&qt=standard&rows=20&version=2.2
    [junit] at org.apache.lucene.util.LuceneTestCase$LuceneTestCaseRunner.runChild(LuceneTestCase.java:795)
    [junit] at org.apache.lucene.util.LuceneTestCase$LuceneTestCaseRunner.runChild(LuceneTestCase.java:768)
    [junit]  xml response was: <?xml version="1.0" encoding="UTF-8"?>
    [junit] <response>
    [junit] <lst name="responseHeader"><int name="status">0</int><int name="QTime">2</int><lst name="params"><str name="start">0</str><str name="q">id:5</str><str name="qt">standard</str><str name="rows">20</str><str name="version">2.2</str></lst></lst><result name="response" numFound="0" start="0"/>
    [junit] </response>
    [junit]
    [junit]  request was: start=0&q=id:5&qt=standard&rows=20&version=2.2
    [junit] at org.apache.solr.util.AbstractSolrTestCase.assertQ(AbstractSolrTestCase.java:237)
    [junit] at org.apache.solr.util.AbstractSolrTestCase.assertQ(AbstractSolrTestCase.java:227)
    [junit] at org.apache.solr.handler.dataimport.TestSqlEntityProcessor2.testLastIndexTime(TestSqlEntityProcessor2.java:218)
    [junit]
    [junit]
    [junit] Tests run: 7, Failures: 1, Errors: 0, Time elapsed: 1.731 sec
    [junit]
    [junit] ------------- Standard Output ---------------
    [junit] NOTE: reproduce with: ant test -Dtestcase=TestSqlEntityProcessor2 -Dtestmethod=testLastIndexTime -Dtests.seed=-8003811613601641372:-2652054644785688439
    [junit] NOTE: test params are: codec=MockVariableIntBlock(baseBlockSize=51), locale=be_BY, timezone=Asia/Choibalsan
    [junit] ------------- ---------------- ---------------
    [junit] TEST org.apache.solr.handler.dataimport.TestSqlEntityProcessor2 FAILED
    [junit] Testsuite: org.apache.solr.handler.dataimport.TestSqlEntityProcessorDelta
    [junit] Tests run: 8, Failures: 0, Errors: 0, Time elapsed: 1.974 sec
    [junit]
    [junit] Testsuite: org.apache.solr.handler.dataimport.TestSqlEntityProcessorDelta2
    [junit] Tests run: 8, Failures: 0, Errors: 0, Time elapsed: 1.85 sec
    [junit]
    [junit] Testsuite: org.apache.solr.handler.dataimport.TestTemplateString
    [junit] Tests run: 1, Failures: 0, Errors: 0, Time elapsed: 0.003 sec
    [junit]
    [junit] Testsuite: org.apache.solr.handler.dataimport.TestTemplateTransformer
    [junit] Tests run: 1, Failures: 0, Errors: 0, Time elapsed: 0.005 sec
    [junit]
    [junit] Testsuite: org.apache.solr.handler.dataimport.TestThreaded
    [junit] Tests run: 1, Failures: 0, Errors: 0, Time elapsed: 0.213 sec
    [junit]
    [junit] Testsuite: org.apache.solr.handler.dataimport.TestURLDataSource
    [junit] Tests run: 1, Failures: 0, Errors: 0, Time elapsed: 0.005 sec
    [junit]
    [junit] Testsuite: org.apache.solr.handler.dataimport.TestVariableResolver
    [junit] Tests run: 9, Failures: 0, Errors: 0, Time elapsed: 0.012 sec
    [junit]
    [junit] Testsuite: org.apache.solr.handler.dataimport.TestXPathEntityProcessor
    [junit] Tests run: 8, Failures: 0, Errors: 0, Time elapsed: 0.441 sec
    [junit]
    [junit] Testsuite: org.apache.solr.handler.dataimport.TestXPathRecordReader
    [junit] Tests run: 21, Failures: 0, Errors: 0, Time elapsed: 0.029 sec
    [junit]
    [junit] Tests FAILED

BUILD FAILED
/usr<https://hudson.apache.org/hudson/job/Solr-trunk/ws/checkout/solr/common-build.xml>:462: The following error occurred while executing this line:
/usr<https://hudson.apache.org/hudson/job/Solr-trunk/ws/checkout/solr/common-build.xml>:319: The following error occurred while executing this line:
/usr<https://hudson.apache.org/hudson/job/Solr-trunk/ws/checkout/solr/contrib/dataimporthandler/build.xml>:192: Tests failed!

Total time: 6 minutes 5 seconds
[TASKS] Skipping publisher since build result is FAILURE
Publishing Javadoc
Archiving artifacts
Recording test results
Publishing Clover coverage report...
No Clover report will be published due to a Build Failure


---------------------------------------------------------------------
To unsubscribe, e-mail: [hidden email]
For additional commands, e-mail: [hidden email]

Reply | Threaded
Open this post in threaded view
|

Build failed in Hudson: Solr-trunk #1280

Apache Jenkins Server
See <https://hudson.apache.org/hudson/job/Solr-trunk/1280/changes>

Changes:

[rmuir] SOLR-2002: minor cleanups to dih tests

------------------------------------------
[...truncated 15602 lines...]
    [junit] at org.apache.solr.handler.dataimport.XPathRecordReader$Node.handleStartElement(XPathRecordReader.java:340)
    [junit] at org.apache.solr.handler.dataimport.XPathRecordReader$Node.parse(XPathRecordReader.java:304)
    [junit] at org.apache.solr.handler.dataimport.XPathRecordReader$Node.access$200(XPathRecordReader.java:196)
    [junit] at org.apache.solr.handler.dataimport.XPathRecordReader.streamRecords(XPathRecordReader.java:178)
    [junit] ... 42 more
    [junit] 13/10/2010 11:40:26 ? org.apache.solr.handler.dataimport.DataImporter doFullImport
    [junit] SEVERE: Full Import failed
    [junit] org.apache.solr.handler.dataimport.DataImportHandlerException: Parsing failed for xml, url:test rows processed:2 last row: {id=2, desc=[test2], $forEach=/root/node} Processing Document # 1
    [junit] at org.apache.solr.handler.dataimport.DataImportHandlerException.wrapAndThrow(DataImportHandlerException.java:72)
    [junit] at org.apache.solr.handler.dataimport.XPathEntityProcessor.initQuery(XPathEntityProcessor.java:305)
    [junit] at org.apache.solr.handler.dataimport.XPathEntityProcessor.fetchNextRow(XPathEntityProcessor.java:201)
    [junit] at org.apache.solr.handler.dataimport.XPathEntityProcessor.nextRow(XPathEntityProcessor.java:181)
    [junit] at org.apache.solr.handler.dataimport.EntityProcessorWrapper.nextRow(EntityProcessorWrapper.java:233)
    [junit] at org.apache.solr.handler.dataimport.DocBuilder.buildDocument(DocBuilder.java:579)
    [junit] at org.apache.solr.handler.dataimport.DocBuilder.doFullDump(DocBuilder.java:260)
    [junit] at org.apache.solr.handler.dataimport.DocBuilder.execute(DocBuilder.java:184)
    [junit] at org.apache.solr.handler.dataimport.DataImporter.doFullImport(DataImporter.java:334)
    [junit] at org.apache.solr.handler.dataimport.DataImporter.runCmd(DataImporter.java:392)
    [junit] at org.apache.solr.handler.dataimport.DataImportHandler.handleRequestBody(DataImportHandler.java:203)
    [junit] at org.apache.solr.handler.RequestHandlerBase.handleRequest(RequestHandlerBase.java:131)
    [junit] at org.apache.solr.core.SolrCore.execute(SolrCore.java:1324)
    [junit] at org.apache.solr.util.TestHarness.queryAndResponse(TestHarness.java:334)
    [junit] at org.apache.solr.util.TestHarness.query(TestHarness.java:321)
    [junit] at org.apache.solr.handler.dataimport.AbstractDataImportHandlerTestCase.runFullImport(AbstractDataImportHandlerTestCase.java:81)
    [junit] at org.apache.solr.handler.dataimport.TestErrorHandling.testAbortOnError(TestErrorHandling.java:65)
    [junit] at sun.reflect.NativeMethodAccessorImpl.invoke0(Native Method)
    [junit] at sun.reflect.NativeMethodAccessorImpl.invoke(NativeMethodAccessorImpl.java:57)
    [junit] at sun.reflect.DelegatingMethodAccessorImpl.invoke(DelegatingMethodAccessorImpl.java:43)
    [junit] at java.lang.reflect.Method.invoke(Method.java:616)
    [junit] at org.junit.runners.model.FrameworkMethod$1.runReflectiveCall(FrameworkMethod.java:44)
    [junit] at org.junit.internal.runners.model.ReflectiveCallable.run(ReflectiveCallable.java:15)
    [junit] at org.junit.runners.model.FrameworkMethod.invokeExplosively(FrameworkMethod.java:41)
    [junit] at org.junit.internal.runners.statements.InvokeMethod.evaluate(InvokeMethod.java:20)
    [junit] at org.junit.rules.TestWatchman$1.evaluate(TestWatchman.java:48)
    [junit] at org.junit.internal.runners.statements.RunBefores.evaluate(RunBefores.java:28)
    [junit] at org.junit.internal.runners.statements.RunAfters.evaluate(RunAfters.java:31)
    [junit] at org.junit.runners.BlockJUnit4ClassRunner.runChild(BlockJUnit4ClassRunner.java:76)
    [junit] at org.apache.lucene.util.LuceneTestCase$LuceneTestCaseRunner.runChild(LuceneTestCase.java:795)
    [junit] at org.apache.lucene.util.LuceneTestCase$LuceneTestCaseRunner.runChild(LuceneTestCase.java:768)
    [junit] at org.junit.runners.ParentRunner$3.run(ParentRunner.java:193)
    [junit] at org.junit.runners.ParentRunner$1.schedule(ParentRunner.java:52)
    [junit] at org.junit.runners.ParentRunner.runChildren(ParentRunner.java:191)
    [junit] at org.junit.runners.ParentRunner.access$000(ParentRunner.java:42)
    [junit] at org.junit.runners.ParentRunner$2.evaluate(ParentRunner.java:184)
    [junit] at org.junit.internal.runners.statements.RunBefores.evaluate(RunBefores.java:28)
    [junit] at org.junit.internal.runners.statements.RunAfters.evaluate(RunAfters.java:31)
    [junit] at org.junit.runners.ParentRunner.run(ParentRunner.java:236)
    [junit] at junit.framework.JUnit4TestAdapter.run(JUnit4TestAdapter.java:39)
    [junit] at org.apache.tools.ant.taskdefs.optional.junit.JUnitTestRunner.run(JUnitTestRunner.java:421)
    [junit] at org.apache.tools.ant.taskdefs.optional.junit.JUnitTestRunner.launch(JUnitTestRunner.java:912)
    [junit] at org.apache.tools.ant.taskdefs.optional.junit.JUnitTestRunner.main(JUnitTestRunner.java:743)
    [junit] Caused by: java.lang.RuntimeException: com.ctc.wstx.exc.WstxParsingException: Unexpected close tag </id>; expected </node>.
    [junit]  at [row,col {unknown-source}]: [11,18]
    [junit] at org.apache.solr.handler.dataimport.XPathRecordReader.streamRecords(XPathRecordReader.java:181)
    [junit] at org.apache.solr.handler.dataimport.XPathEntityProcessor.initQuery(XPathEntityProcessor.java:295)
    [junit] ... 41 more
    [junit] Caused by: com.ctc.wstx.exc.WstxParsingException: Unexpected close tag </id>; expected </node>.
    [junit]  at [row,col {unknown-source}]: [11,18]
    [junit] at com.ctc.wstx.sr.StreamScanner.constructWfcException(StreamScanner.java:630)
    [junit] at com.ctc.wstx.sr.StreamScanner.throwParseError(StreamScanner.java:461)
    [junit] at com.ctc.wstx.sr.BasicStreamReader.reportWrongEndElem(BasicStreamReader.java:3258)
    [junit] at com.ctc.wstx.sr.BasicStreamReader.readEndElem(BasicStreamReader.java:3200)
    [junit] at com.ctc.wstx.sr.BasicStreamReader.nextFromTree(BasicStreamReader.java:2832)
    [junit] at com.ctc.wstx.sr.BasicStreamReader.next(BasicStreamReader.java:1019)
    [junit] at org.apache.solr.handler.dataimport.XPathRecordReader$Node.parse(XPathRecordReader.java:275)
    [junit] at org.apache.solr.handler.dataimport.XPathRecordReader$Node.handleStartElement(XPathRecordReader.java:340)
    [junit] at org.apache.solr.handler.dataimport.XPathRecordReader$Node.parse(XPathRecordReader.java:304)
    [junit] at org.apache.solr.handler.dataimport.XPathRecordReader$Node.handleStartElement(XPathRecordReader.java:340)
    [junit] at org.apache.solr.handler.dataimport.XPathRecordReader$Node.parse(XPathRecordReader.java:304)
    [junit] at org.apache.solr.handler.dataimport.XPathRecordReader$Node.access$200(XPathRecordReader.java:196)
    [junit] at org.apache.solr.handler.dataimport.XPathRecordReader.streamRecords(XPathRecordReader.java:178)
    [junit] ... 42 more
    [junit] ------------- ---------------- ---------------
    [junit] Testsuite: org.apache.solr.handler.dataimport.TestEvaluatorBag
    [junit] Tests run: 5, Failures: 0, Errors: 0, Time elapsed: 0.02 sec
    [junit]
    [junit] Testsuite: org.apache.solr.handler.dataimport.TestFieldReader
    [junit] Tests run: 1, Failures: 0, Errors: 0, Time elapsed: 0.022 sec
    [junit]
    [junit] Testsuite: org.apache.solr.handler.dataimport.TestFileListEntityProcessor
    [junit] Tests run: 4, Failures: 0, Errors: 0, Time elapsed: 0.023 sec
    [junit]
    [junit] Testsuite: org.apache.solr.handler.dataimport.TestJdbcDataSource
    [junit] Tests run: 3, Failures: 0, Errors: 0, Time elapsed: 0.073 sec
    [junit]
    [junit] Testsuite: org.apache.solr.handler.dataimport.TestLineEntityProcessor
    [junit] Tests run: 4, Failures: 0, Errors: 0, Time elapsed: 0.02 sec
    [junit]
    [junit] Testsuite: org.apache.solr.handler.dataimport.TestNumberFormatTransformer
    [junit] Tests run: 9, Failures: 0, Errors: 0, Time elapsed: 0.027 sec
    [junit]
    [junit] Testsuite: org.apache.solr.handler.dataimport.TestPlainTextEntityProcessor
    [junit] Tests run: 1, Failures: 0, Errors: 0, Time elapsed: 0.018 sec
    [junit]
    [junit] Testsuite: org.apache.solr.handler.dataimport.TestRegexTransformer
    [junit] Tests run: 5, Failures: 0, Errors: 0, Time elapsed: 0.015 sec
    [junit]
    [junit] Testsuite: org.apache.solr.handler.dataimport.TestScriptTransformer
    [junit] Tests run: 0, Failures: 0, Errors: 0, Time elapsed: 0.015 sec
    [junit]
    [junit] Testsuite: org.apache.solr.handler.dataimport.TestSqlEntityProcessor
    [junit] Tests run: 4, Failures: 0, Errors: 0, Time elapsed: 0.015 sec
    [junit]
    [junit] Testsuite: org.apache.solr.handler.dataimport.TestSqlEntityProcessor2
    [junit] Tests run: 7, Failures: 0, Errors: 0, Time elapsed: 0.79 sec
    [junit]
    [junit] Testsuite: org.apache.solr.handler.dataimport.TestSqlEntityProcessorDelta
    [junit] Tests run: 8, Failures: 0, Errors: 0, Time elapsed: 1.206 sec
    [junit]
    [junit] Testsuite: org.apache.solr.handler.dataimport.TestSqlEntityProcessorDelta2
    [junit] Tests run: 8, Failures: 0, Errors: 0, Time elapsed: 1.132 sec
    [junit]
    [junit] Testsuite: org.apache.solr.handler.dataimport.TestTemplateString
    [junit] Tests run: 1, Failures: 0, Errors: 0, Time elapsed: 0.008 sec
    [junit]
    [junit] Testsuite: org.apache.solr.handler.dataimport.TestTemplateTransformer
    [junit] Tests run: 1, Failures: 0, Errors: 0, Time elapsed: 0.008 sec
    [junit]
    [junit] Testsuite: org.apache.solr.handler.dataimport.TestThreaded
    [junit] Tests run: 1, Failures: 0, Errors: 0, Time elapsed: 0.364 sec
    [junit]
    [junit] Testsuite: org.apache.solr.handler.dataimport.TestURLDataSource
    [junit] Tests run: 1, Failures: 0, Errors: 0, Time elapsed: 0.007 sec
    [junit]
    [junit] Testsuite: org.apache.solr.handler.dataimport.TestVariableResolver
    [junit] Tests run: 9, Failures: 0, Errors: 0, Time elapsed: 0.022 sec
    [junit]
    [junit] Testsuite: org.apache.solr.handler.dataimport.TestXPathEntityProcessor
    [junit] Tests run: 8, Failures: 0, Errors: 0, Time elapsed: 0.501 sec
    [junit]
    [junit] Testsuite: org.apache.solr.handler.dataimport.TestXPathRecordReader
    [junit] Tests run: 21, Failures: 0, Errors: 0, Time elapsed: 0.043 sec
    [junit]

compileExtras:

compileExtrasTests:
    [mkdir] Created dir: /usr<https://hudson.apache.org/hudson/job/Solr-trunk/ws/checkout/solr/contrib/dataimporthandler/target/extras/test-classes>
    [javac] Compiling 2 source files to /usr<https://hudson.apache.org/hudson/job/Solr-trunk/ws/checkout/solr/contrib/dataimporthandler/target/extras/test-classes>

testExtras:
    [junit] Testsuite: org.apache.solr.handler.dataimport.TestMailEntityProcessor
    [junit] Tests run: 0, Failures: 0, Errors: 0, Time elapsed: 0.32 sec
    [junit]
    [junit] Testsuite: org.apache.solr.handler.dataimport.TestTikaEntityProcessor
    [junit] Tests run: 1, Failures: 0, Errors: 0, Time elapsed: 2.445 sec
    [junit]

test:

init:

init-forrest-entities:

compile-lucene:

compile-solrj:

compile:
    [javac] Compiling 1 source file to /usr<https://hudson.apache.org/hudson/job/Solr-trunk/ws/checkout/solr/build/solr>

compileTests:

make-manifest:

compile:

compileTests:
    [mkdir] Created dir: /usr<https://hudson.apache.org/hudson/job/Solr-trunk/ws/checkout/solr/contrib/extraction/build/test-classes>
    [javac] Compiling 1 source file to /usr<https://hudson.apache.org/hudson/job/Solr-trunk/ws/checkout/solr/contrib/extraction/build/test-classes>

test:
    [junit] Testsuite: org.apache.solr.handler.ExtractingRequestHandlerTest
    [junit] Tests run: 8, Failures: 0, Errors: 0, Time elapsed: 3.449 sec
    [junit]

test:

clover.check:

clover.setup:
[clover-setup] Clover Version 2.6.3, built on November 20 2009 (build-778)
[clover-setup] Loaded from: /home/hudson/tools/clover/clover2latest/clover-2.6.3.jar
[clover-setup] Clover: Open Source License registered to Apache.
[clover-setup] Clover is enabled with initstring '/usr<https://hudson.apache.org/hudson/job/Solr-trunk/ws/checkout/solr/build/tests/clover/db/solr_coverage.db'>

clover.info:

clover:

generate-clover-reports:
    [mkdir] Created dir: /usr<https://hudson.apache.org/hudson/job/Solr-trunk/ws/checkout/solr/build/tests/clover/reports>
[clover-report] Clover Version 2.6.3, built on November 20 2009 (build-778)
[clover-report] Loaded from: /home/hudson/tools/clover/clover2latest/clover-2.6.3.jar
[clover-report] Clover: Open Source License registered to Apache.
[clover-report] Loading coverage database from: '/usr<https://hudson.apache.org/hudson/job/Solr-trunk/ws/checkout/solr/build/tests/clover/db/solr_coverage.db'>
[clover-report] Loading coverage database from: '/usr<https://hudson.apache.org/hudson/job/Solr-trunk/ws/checkout/solr/build/tests/clover/db/solr_coverage.db'>
[clover-report] Writing report to '/usr<https://hudson.apache.org/hudson/job/Solr-trunk/ws/checkout/solr/build/tests/clover/reports/clover.xml'>
[clover-report] Writing HTML report to '/usr<https://hudson.apache.org/hudson/job/Solr-trunk/ws/checkout/solr/build/tests/clover/reports'>
[clover-report] Done. Processed 35 packages in 6292ms (179ms per package).

BUILD SUCCESSFUL
Total time: 7 minutes 0 seconds
[TASKS] Scanning workspace files for tasks...
Publishing Javadoc
Archiving artifacts
Recording test results
Publishing Clover coverage report...
Publishing Clover HTML report...
Publishing Clover XML report...
Publishing Clover coverage results...
FATAL: Unable to copy coverage from <https://hudson.apache.org/hudson/job/Solr-trunk/ws/checkout/solr/build/tests/clover/reports> to /home/hudson/hudson/jobs/Solr-trunk/builds/2010-10-13_16-12-10
hudson.util.IOException2: Cannot parse coverage results
        at hudson.plugins.clover.CloverCoverageParser.parse(CloverCoverageParser.java:89)
        at hudson.plugins.clover.CloverCoverageParser.parse(CloverCoverageParser.java:51)
        at hudson.plugins.clover.CloverPublisher.processCloverXml(CloverPublisher.java:202)
        at hudson.plugins.clover.CloverPublisher.perform(CloverPublisher.java:163)
        at hudson.tasks.BuildStepMonitor$3.perform(BuildStepMonitor.java:36)
        at hudson.model.AbstractBuild$AbstractRunner.perform(AbstractBuild.java:601)
        at hudson.model.AbstractBuild$AbstractRunner.performAllBuildSteps(AbstractBuild.java:580)
        at hudson.model.AbstractBuild$AbstractRunner.performAllBuildSteps(AbstractBuild.java:558)
        at hudson.model.Build$RunnerImpl.post2(Build.java:157)
        at hudson.model.AbstractBuild$AbstractRunner.post(AbstractBuild.java:528)
        at hudson.model.Run.run(Run.java:1303)
        at hudson.model.FreeStyleBuild.run(FreeStyleBuild.java:46)
        at hudson.model.ResourceController.execute(ResourceController.java:88)
        at hudson.model.Executor.run(Executor.java:140)
Caused by: org.xml.sax.SAXParseException: XML document structures must start and end within the same entity.
        at com.sun.org.apache.xerces.internal.parsers.AbstractSAXParser.parse(AbstractSAXParser.java:1231)
        at com.sun.org.apache.xerces.internal.jaxp.SAXParserImpl$JAXPSAXParser.parse(SAXParserImpl.java:522)
        at org.apache.commons.digester.Digester.parse(Digester.java:1666)
        at hudson.plugins.clover.CloverCoverageParser.parse(CloverCoverageParser.java:87)
        ... 13 more
ERROR: Publisher hudson.plugins.clover.CloverPublisher aborted due to exception
java.lang.NullPointerException
        at hudson.plugins.clover.CloverBuildAction.<init>(CloverBuildAction.java:133)
        at hudson.plugins.clover.CloverBuildAction.load(CloverBuildAction.java:265)
        at hudson.plugins.clover.CloverPublisher.processCloverXml(CloverPublisher.java:208)
        at hudson.plugins.clover.CloverPublisher.perform(CloverPublisher.java:163)
        at hudson.tasks.BuildStepMonitor$3.perform(BuildStepMonitor.java:36)
        at hudson.model.AbstractBuild$AbstractRunner.perform(AbstractBuild.java:601)
        at hudson.model.AbstractBuild$AbstractRunner.performAllBuildSteps(AbstractBuild.java:580)
        at hudson.model.AbstractBuild$AbstractRunner.performAllBuildSteps(AbstractBuild.java:558)
        at hudson.model.Build$RunnerImpl.post2(Build.java:157)
        at hudson.model.AbstractBuild$AbstractRunner.post(AbstractBuild.java:528)
        at hudson.model.Run.run(Run.java:1303)
        at hudson.model.FreeStyleBuild.run(FreeStyleBuild.java:46)
        at hudson.model.ResourceController.execute(ResourceController.java:88)
        at hudson.model.Executor.run(Executor.java:140)


---------------------------------------------------------------------
To unsubscribe, e-mail: [hidden email]
For additional commands, e-mail: [hidden email]

Reply | Threaded
Open this post in threaded view
|

Hudson build is back to normal : Solr-trunk #1281

Apache Jenkins Server
See <https://hudson.apache.org/hudson/job/Solr-trunk/1281/changes>



---------------------------------------------------------------------
To unsubscribe, e-mail: [hidden email]
For additional commands, e-mail: [hidden email]