Build failed in Jenkins: Lucene-Core-4x-Beasting #6934

classic Classic list List threaded Threaded
4 messages Options
Reply | Threaded
Open this post in threaded view
|

Build failed in Jenkins: Lucene-Core-4x-Beasting #6934

Charlie Cron
See <http://sierranevada.servebeer.com/job/Lucene-Core-4x-Beasting/6934/>

------------------------------------------
[...truncated 937 lines...]
   [junit4] Completed on J0 in 0.01s, 2 tests
   [junit4]  
   [junit4] Suite: org.apache.lucene.analysis.TestMockCharFilter
   [junit4] Completed on J1 in 0.01s, 1 test
   [junit4]  
   [junit4] Suite: org.apache.lucene.analysis.tokenattributes.TestSimpleAttributeImpl
   [junit4] Completed on J3 in 0.01s, 1 test
   [junit4]  
   [junit4] Suite: org.apache.lucene.util.TestNamedSPILoader
   [junit4] Completed on J0 in 0.01s, 3 tests
   [junit4]  
   [junit4] Suite: org.apache.lucene.TestAssertions
   [junit4] Completed on J1 in 0.01s, 1 test
   [junit4]  
   [junit4] Suite: org.apache.lucene.index.TestIndexWriterOnJRECrash
   [junit4] IGNOR/A 0.00s J3 | TestIndexWriterOnJRECrash.testNRTThreads
   [junit4]    > Assumption #1: 'nightly' test group is disabled (@Nightly)
   [junit4] Completed on J3 in 0.01s, 1 test, 1 skipped
   [junit4]  
   [junit4] Suite: org.apache.lucene.index.TestTerm
   [junit4] Completed on J0 in 0.01s, 1 test
   [junit4]  
   [junit4] Suite: org.apache.lucene.store.TestByteArrayDataInput
   [junit4] Completed on J1 in 0.01s, 1 test
   [junit4]  
   [junit4] Suite: org.apache.lucene.index.Test2BPostings
   [junit4] IGNOR/A 0.00s J3 | Test2BPostings.test
   [junit4]    > Assumption #1: 'nightly' test group is disabled (@Nightly)
   [junit4] Completed on J3 in 0.01s, 1 test, 1 skipped
   [junit4]  
   [junit4] Suite: org.apache.lucene.util.TestIntsRef
   [junit4] Completed on J1 in 0.08s, 2 tests
   [junit4]  
   [junit4] Suite: org.apache.lucene.codecs.lucene40.TestAllFilesHaveCodecHeader
   [junit4] Completed on J0 in 0.58s, 1 test
   [junit4]  
   [junit4] Unhandled exception in thread: Thread[pumper-events,5,main]
   [junit4] com.carrotsearch.ant.tasks.junit4.dependencies.com.google.gson.JsonIOException: java.io.IOException: java.lang.InterruptedException: sleep interrupted
   [junit4] JVM J2: stdout was not empty, see: <http://sierranevada.servebeer.com/job/Lucene-Core-4x-Beasting/ws/build/core/test/junit4-J2-102923295b6b893e7.sysout>
   [junit4] >>> JVM J2: stdout (verbatim) ----
   [junit4] at com.carrotsearch.ant.tasks.junit4.dependencies.com.google.gson.internal.Streams.parse(Streams.java:57)
   [junit4] at com.carrotsearch.ant.tasks.junit4.dependencies.com.google.gson.GsonToMiniGsonTypeAdapterFactory$3.read(GsonToMiniGsonTypeAdapterFactory.java:81)
   [junit4] at com.carrotsearch.ant.tasks.junit4.dependencies.com.google.gson.internal.bind.ReflectiveTypeAdapterFactory$1.read(ReflectiveTypeAdapterFactory.java:86)
   [junit4] at com.carrotsearch.ant.tasks.junit4.dependencies.com.google.gson.internal.bind.ReflectiveTypeAdapterFactory$Adapter.read(ReflectiveTypeAdapterFactory.java:170)
   [junit4] at com.carrotsearch.ant.tasks.junit4.dependencies.com.google.gson.Gson.fromJson(Gson.java:720)
   [junit4] 2012-06-25 14:03:31
   [junit4] Full thread dump Java HotSpot(TM) 64-Bit Server VM (19.1-b02 mixed mode):
   [junit4]
   [junit4] "Thread-65" daemon prio=10 tid=0x00007f4754192000 nid=0xeb5 in Object.wait() [0x00007f4794df6000]
   [junit4]    java.lang.Thread.State: WAITING (on object monitor)
   [junit4] at java.lang.Object.wait(Native Method)
   [junit4] - waiting on <0x00000000e04eab68> (a org.apache.lucene.index.DocumentsWriterStallControl)
   [junit4] at java.lang.Object.wait(Object.java:485)
   [junit4] at org.apache.lucene.index.DocumentsWriterStallControl.waitIfStalled(DocumentsWriterStallControl.java:75)
   [junit4] - locked <0x00000000e04eab68> (a org.apache.lucene.index.DocumentsWriterStallControl)
   [junit4] at org.apache.lucene.index.DocumentsWriterFlushControl.waitIfStalled(DocumentsWriterFlushControl.java:636)
   [junit4] at org.apache.lucene.index.DocumentsWriter.preUpdate(DocumentsWriter.java:301)
   [junit4] at org.apache.lucene.index.DocumentsWriter.updateDocument(DocumentsWriter.java:361)
   [junit4] at org.apache.lucene.index.IndexWriter.updateDocument(IndexWriter.java:1334)
   [junit4] at org.apache.lucene.index.IndexWriter.addDocument(IndexWriter.java:1085)
   [junit4] at org.apache.lucene.index.IndexWriter.addDocument(IndexWriter.java:1066)
   [junit4] at org.apache.lucene.index.TestIndexWriterReader$2.run(TestIndexWriterReader.java:823)
   [junit4]
   [junit4] "Thread-64" daemon prio=10 tid=0x00007f47540d2800 nid=0xeb4 in Object.wait() [0x00007f4794ef7000]
   [junit4]    java.lang.Thread.State: WAITING (on object monitor)
   [junit4] at java.lang.Object.wait(Native Method)
   [junit4] - waiting on <0x00000000e04eab68> (a org.apache.lucene.index.DocumentsWriterStallControl)
   [junit4] at java.lang.Object.wait(Object.java:485)
   [junit4] at org.apache.lucene.index.DocumentsWriterStallControl.waitIfStalled(DocumentsWriterStallControl.java:75)
   [junit4] - locked <0x00000000e04eab68> (a org.apache.lucene.index.DocumentsWriterStallControl)
   [junit4] at org.apache.lucene.index.DocumentsWriterFlushControl.waitIfStalled(DocumentsWriterFlushControl.java:636)
   [junit4] at org.apache.lucene.index.DocumentsWriter.preUpdate(DocumentsWriter.java:301)
   [junit4] at org.apache.lucene.index.DocumentsWriter.updateDocument(DocumentsWriter.java:361)
   [junit4] at org.apache.lucene.index.IndexWriter.updateDocument(IndexWriter.java:1334)
   [junit4] at org.apache.lucene.index.IndexWriter.addDocument(IndexWriter.java:1085)
   [junit4] at org.apache.lucene.index.IndexWriter.addDocument(IndexWriter.java:1066)
   [junit4] at org.apache.lucene.index.TestIndexWriterReader$2.run(TestIndexWriterReader.java:823)
   [junit4]
   [junit4] "Thread-63" daemon prio=10 tid=0x00007f4754042800 nid=0xeb3 in Object.wait() [0x00007f47946ef000]
   [junit4]    java.lang.Thread.State: WAITING (on object monitor)
   [junit4] at java.lang.Object.wait(Native Method)
   [junit4] - waiting on <0x00000000e04eab68> (a org.apache.lucene.index.DocumentsWriterStallControl)
   [junit4] at java.lang.Object.wait(Object.java:485)
   [junit4] at org.apache.lucene.index.DocumentsWriterStallControl.waitIfStalled(DocumentsWriterStallControl.java:75)
   [junit4] - locked <0x00000000e04eab68> (a org.apache.lucene.index.DocumentsWriterStallControl)
   [junit4] at org.apache.lucene.index.DocumentsWriterFlushControl.waitIfStalled(DocumentsWriterFlushControl.java:636)
   [junit4] at org.apache.lucene.index.DocumentsWriter.preUpdate(DocumentsWriter.java:301)
   [junit4] at org.apache.lucene.index.DocumentsWriter.updateDocument(DocumentsWriter.java:361)
   [junit4] at org.apache.lucene.index.IndexWriter.updateDocument(IndexWriter.java:1334)
   [junit4] at org.apache.lucene.index.IndexWriter.addDocument(IndexWriter.java:1085)
   [junit4] at org.apache.lucene.index.IndexWriter.addDocument(IndexWriter.java:1066)
   [junit4] at org.apache.lucene.index.TestIndexWriterReader$2.run(TestIndexWriterReader.java:823)
   [junit4]
   [junit4] "TEST-TestScope-org.apache.lucene.index.TestIndexWriterReader.testDuringAddDelete-seed#[61F406BA7C0B79FF]" prio=10 tid=0x00007f4798237800 nid=0xe9b in Object.wait() [0x00007f479c10d000]
   [junit4]    java.lang.Thread.State: WAITING (on object monitor)
   [junit4] at java.lang.Object.wait(Native Method)
   [junit4] - waiting on <0x00000000fc160188> (a org.apache.lucene.index.TestIndexWriterReader$2)
   [junit4] at java.lang.Thread.join(Thread.java:1186)
   [junit4] - locked <0x00000000fc160188> (a org.apache.lucene.index.TestIndexWriterReader$2)
   [junit4] at java.lang.Thread.join(Thread.java:1239)
   [junit4] at org.apache.lucene.index.TestIndexWriterReader.testDuringAddDelete(TestIndexWriterReader.java:855)
   [junit4] at sun.reflect.NativeMethodAccessorImpl.invoke0(Native Method)
   [junit4] at sun.reflect.NativeMethodAccessorImpl.invoke(NativeMethodAccessorImpl.java:39)
   [junit4] at sun.reflect.DelegatingMethodAccessorImpl.invoke(DelegatingMethodAccessorImpl.java:25)
   [junit4] at java.lang.reflect.Method.invoke(Method.java:597)
   [junit4] at com.carrotsearch.randomizedtesting.RandomizedRunner.invoke(RandomizedRunner.java:1969)
   [junit4] at com.carrotsearch.randomizedtesting.RandomizedRunner.access$1100(RandomizedRunner.java:132)
   [junit4] at com.carrotsearch.randomizedtesting.RandomizedRunner$6.evaluate(RandomizedRunner.java:814)
   [junit4] at com.carrotsearch.randomizedtesting.RandomizedRunner$7.evaluate(RandomizedRunner.java:875)
   [junit4] at com.carrotsearch.randomizedtesting.RandomizedRunner$8.evaluate(RandomizedRunner.java:889)
   [junit4] at org.apache.lucene.util.TestRuleSetupTeardownChained$1.evaluate(TestRuleSetupTeardownChained.java:50)
   [junit4] at org.apache.lucene.util.TestRuleFieldCacheSanity$1.evaluate(TestRuleFieldCacheSanity.java:32)
   [junit4] at org.apache.lucene.util.AbstractBeforeAfterRule$1.evaluate(AbstractBeforeAfterRule.java:45)
   [junit4] at com.carrotsearch.randomizedtesting.rules.SystemPropertiesInvariantRule$1.evaluate(SystemPropertiesInvariantRule.java:55)
   [junit4] at org.apache.lucene.util.TestRuleReportUncaughtExceptions$1.evaluate(TestRuleReportUncaughtExceptions.java:68)
   [junit4] at org.apache.lucene.util.TestRuleThreadAndTestName$1.evaluate(TestRuleThreadAndTestName.java:48)
   [junit4] at org.apache.lucene.util.TestRuleMarkFailure$1.evaluate(TestRuleMarkFailure.java:48)
   [junit4] at com.carrotsearch.randomizedtesting.RandomizedRunner.runSingleTest(RandomizedRunner.java:821)
   [junit4] at com.carrotsearch.randomizedtesting.RandomizedRunner.access$700(RandomizedRunner.java:132)
   [junit4] at com.carrotsearch.randomizedtesting.RandomizedRunner$3$1.run(RandomizedRunner.java:669)
   [junit4] at com.carrotsearch.randomizedtesting.RandomizedRunner$3.evaluate(RandomizedRunner.java:695)
   [junit4] at com.carrotsearch.randomizedtesting.RandomizedRunner$4.evaluate(RandomizedRunner.java:734)
   [junit4] at com.carrotsearch.randomizedtesting.RandomizedRunner$5.evaluate(RandomizedRunner.java:745)
   [junit4] at org.apache.lucene.util.AbstractBeforeAfterRule$1.evaluate(AbstractBeforeAfterRule.java:45)
   [junit4] at org.apache.lucene.util.TestRuleReportUncaughtExceptions$1.evaluate(TestRuleReportUncaughtExceptions.java:68)
   [junit4] at org.apache.lucene.util.TestRuleStoreClassName$1.evaluate(TestRuleStoreClassName.java:38)
   [junit4] at org.apache.lucene.util.TestRuleIcuHack$1.evaluate(TestRuleIcuHack.java:51)
   [junit4] at com.carrotsearch.randomizedtesting.rules.SystemPropertiesInvariantRule$1.evaluate(SystemPropertiesInvariantRule.java:55)
   [junit4] at org.apache.lucene.util.TestRuleNoInstanceHooksOverrides$1.evaluate(TestRuleNoInstanceHooksOverrides.java:53)
   [junit4] at org.apache.lucene.util.TestRuleNoStaticHooksShadowing$1.evaluate(TestRuleNoStaticHooksShadowing.java:52)
   [junit4] at org.apache.lucene.util.TestRuleAssertionsRequired$1.evaluate(TestRuleAssertionsRequired.java:36)
   [junit4] at org.apache.lucene.util.TestRuleMarkFailure$1.evaluate(TestRuleMarkFailure.java:48)
   [junit4] at org.apache.lucene.util.TestRuleIgnoreTestSuites$1.evaluate(TestRuleIgnoreTestSuites.java:56)
   [junit4] at com.carrotsearch.randomizedtesting.RandomizedRunner.runSuite(RandomizedRunner.java:605)
   [junit4] at com.carrotsearch.randomizedtesting.RandomizedRunner.access$400(RandomizedRunner.java:132)
   [junit4] at com.carrotsearch.randomizedtesting.RandomizedRunner$2.run(RandomizedRunner.java:551)
   [junit4]
   [junit4] "Low Memory Detector" daemon prio=10 tid=0x00007f479809c000 nid=0xd6f runnable [0x0000000000000000]
   [junit4]    java.lang.Thread.State: RUNNABLE
   [junit4]
   [junit4] "CompilerThread1" daemon prio=10 tid=0x00007f4798099800 nid=0xd6e waiting on condition [0x0000000000000000]
   [junit4]    java.lang.Thread.State: RUNNABLE
   [junit4]
   [junit4] "CompilerThread0" daemon prio=10 tid=0x00007f4798097000 nid=0xd6d waiting on condition [0x0000000000000000]
   [junit4]    java.lang.Thread.State: RUNNABLE
   [junit4]
   [junit4] "Signal Dispatcher" daemon prio=10 tid=0x00007f4798094800 nid=0xd6c waiting on condition [0x0000000000000000]
   [junit4]    java.lang.Thread.State: RUNNABLE
   [junit4]
   [junit4] "Finalizer" daemon prio=10 tid=0x00007f4798078000 nid=0xd5a in Object.wait() [0x00007f479ccf3000]
   [junit4]    java.lang.Thread.State: WAITING (on object monitor)
   [junit4] at java.lang.Object.wait(Native Method)
   [junit4] - waiting on <0x00000000e00606d8> (a java.lang.ref.ReferenceQueue$Lock)
   [junit4] at java.lang.ref.ReferenceQueue.remove(ReferenceQueue.java:118)
   [junit4] - locked <0x00000000e00606d8> (a java.lang.ref.ReferenceQueue$Lock)
   [junit4] at java.lang.ref.ReferenceQueue.remove(ReferenceQueue.java:134)
   [junit4] at java.lang.ref.Finalizer$FinalizerThread.run(Finalizer.java:159)
   [junit4]
   [junit4] "Reference Handler" daemon prio=10 tid=0x00007f4798076000 nid=0xd58 in Object.wait() [0x00007f479cdf4000]
   [junit4]    java.lang.Thread.State: WAITING (on object monitor)
   [junit4] at java.lang.Object.wait(Native Method)
   [junit4] - waiting on <0x00000000e0060698> (a java.lang.ref.Reference$Lock)
   [junit4] at java.lang.Object.wait(Object.java:485)
   [junit4] at java.lang.ref.Reference$ReferenceHandler.run(Reference.java:116)
   [junit4] - locked <0x00000000e0060698> (a java.lang.ref.Reference$Lock)
   [junit4]
   [junit4] "main" prio=10 tid=0x00007f479800a800 nid=0xd2a in Object.wait() [0x00007f479f39a000]
   [junit4]    java.lang.Thread.State: WAITING (on object monitor)
   [junit4] at java.lang.Object.wait(Native Method)
   [junit4] - waiting on <0x00000000e039bbf8> (a com.carrotsearch.randomizedtesting.RandomizedRunner$2)
   [junit4] at java.lang.Thread.join(Thread.java:1186)
   [junit4] - locked <0x00000000e039bbf8> (a com.carrotsearch.randomizedtesting.RandomizedRunner$2)
   [junit4] at java.lang.Thread.join(Thread.java:1239)
   [junit4] at com.carrotsearch.randomizedtesting.RandomizedRunner.runSuite(RandomizedRunner.java:561)
   [junit4] at com.carrotsearch.randomizedtesting.RandomizedRunner.run(RandomizedRunner.java:521)
   [junit4] at com.carrotsearch.ant.tasks.junit4.slave.SlaveMain.execute(SlaveMain.java:145)
   [junit4] at com.carrotsearch.ant.tasks.junit4.slave.SlaveMain.main(SlaveMain.java:238)
   [junit4] at com.carrotsearch.ant.tasks.junit4.slave.SlaveMainSafe.main(SlaveMainSafe.java:12)
   [junit4]
   [junit4] "VM Thread" prio=10 tid=0x00007f479806f800 nid=0xd56 runnable
   [junit4]
   [junit4] "GC task thread#0 (ParallelGC)" prio=10 tid=0x00007f479801d800 nid=0xd33 runnable
   [junit4]
   [junit4] "GC task thread#1 (ParallelGC)" prio=10 tid=0x00007f479801f000 nid=0xd34 runnable
   [junit4]
   [junit4] "GC task thread#2 (ParallelGC)" prio=10 tid=0x00007f4798021000 nid=0xd35 runnable
   [junit4]
   [junit4] "GC task thread#3 (ParallelGC)" prio=10 tid=0x00007f4798023000 nid=0xd36 runnable
   [junit4]
   [junit4] "GC task thread#4 (ParallelGC)" prio=10 tid=0x00007f4798024800 nid=0xd37 runnable
   [junit4]
   [junit4] "GC task thread#5 (ParallelGC)" prio=10 tid=0x00007f4798026800 nid=0xd38 runnable
   [junit4]
   [junit4] "GC task thread#6 (ParallelGC)" prio=10 tid=0x00007f4798028000 nid=0xd39 runnable
   [junit4]
   [junit4] "GC task thread#7 (ParallelGC)" prio=10 tid=0x00007f479802a000 nid=0xd3a runnable
   [junit4]
   [junit4] "VM Periodic Task Thread" prio=10 tid=0x00007f47980a6800 nid=0xd70 waiting on condition
   [junit4]
   [junit4] JNI global references: 1021
   [junit4]
   [junit4] Heap
   [junit4]  PSYoungGen      total 103872K, used 95119K [0x00000000f5560000, 0x00000000fd5a0000, 0x0000000100000000)
   [junit4]   eden space 101248K, 91% used [0x00000000f5560000,0x00000000fafbbd08,0x00000000fb840000)
   [junit4]   from space 2624K, 98% used [0x00000000fc150000,0x00000000fc3d8070,0x00000000fc3e0000)
   [junit4]   to   space 9280K, 0% used [0x00000000fb840000,0x00000000fb840000,0x00000000fc150000)
   [junit4]  PSOldGen        total 171008K, used 20869K [0x00000000e0000000, 0x00000000ea700000, 0x00000000f5560000)
   [junit4]   object space 171008K, 12% used [0x00000000e0000000,0x00000000e14614b0,0x00000000ea700000)
   [junit4]  PSPermGen       total 21248K, used 17334K [0x00000000dae00000, 0x00000000dc2c0000, 0x00000000e0000000)
   [junit4]   object space 21248K, 81% used [0x00000000dae00000,0x00000000dbeed8f0,0x00000000dc2c0000)
   [junit4] at com.carrotsearch.ant.tasks.junit4.events.Deserializer.deserialize(Deserializer.java:31)
   [junit4] <<< JVM J2: EOF ----
   [junit4] at com.carrotsearch.ant.tasks.junit4.LocalSlaveStreamHandler.pumpEvents(LocalSlaveStreamHandler.java:100)
   [junit4] at com.carrotsearch.ant.tasks.junit4.LocalSlaveStreamHandler$1.run(LocalSlaveStreamHandler.java:73)
   [junit4] at java.lang.Thread.run(Thread.java:662)
   [junit4] Caused by: java.io.IOException: java.lang.InterruptedException: sleep interrupted
   [junit4] at com.carrotsearch.ant.tasks.junit4.TailInputStream.read(TailInputStream.java:66)
   [junit4] at sun.nio.cs.StreamDecoder.readBytes(StreamDecoder.java:264)
   [junit4] at sun.nio.cs.StreamDecoder.implRead(StreamDecoder.java:306)
   [junit4] at sun.nio.cs.StreamDecoder.read(StreamDecoder.java:158)
   [junit4] at java.io.InputStreamReader.read(InputStreamReader.java:167)
   [junit4] at com.carrotsearch.ant.tasks.junit4.dependencies.com.google.gson.stream.JsonReader.fillBuffer(JsonReader.java:845)
   [junit4] at com.carrotsearch.ant.tasks.junit4.dependencies.com.google.gson.stream.JsonReader.nextString(JsonReader.java:1012)
   [junit4] at com.carrotsearch.ant.tasks.junit4.dependencies.com.google.gson.stream.JsonReader.nextInObject(JsonReader.java:755)
   [junit4] at com.carrotsearch.ant.tasks.junit4.dependencies.com.google.gson.stream.JsonReader.quickPeek(JsonReader.java:387)
   [junit4] at com.carrotsearch.ant.tasks.junit4.dependencies.com.google.gson.stream.JsonReader.hasNext(JsonReader.java:340)
   [junit4] at com.carrotsearch.ant.tasks.junit4.dependencies.com.google.gson.internal.bind.TypeAdapters$22.read(TypeAdapters.java:602)
   [junit4] at com.carrotsearch.ant.tasks.junit4.dependencies.com.google.gson.internal.bind.TypeAdapters$22.read(TypeAdapters.java:595)
   [junit4] at com.carrotsearch.ant.tasks.junit4.dependencies.com.google.gson.internal.bind.TypeAdapters$22.read(TypeAdapters.java:603)
   [junit4] at com.carrotsearch.ant.tasks.junit4.dependencies.com.google.gson.internal.bind.TypeAdapters$22.read(TypeAdapters.java:578)
   [junit4] at com.carrotsearch.ant.tasks.junit4.dependencies.com.google.gson.internal.Streams.parse(Streams.java:44)
   [junit4] ... 8 more
   [junit4] Caused by: java.lang.InterruptedException: sleep interrupted
   [junit4] at java.lang.Thread.sleep(Native Method)
   [junit4] at com.carrotsearch.ant.tasks.junit4.TailInputStream.read(TailInputStream.java:64)
   [junit4] ... 22 more
   [junit4] JVM J0:     0.41 ..    77.64 =    77.23s
   [junit4] JVM J1:     0.41 ..    77.24 =    76.84s
   [junit4] JVM J3:     0.41 ..    77.05 =    76.65s
   [junit4] Execution time total: 3 days 3 hours 34 minutes 13 seconds
   [junit4] ERROR: Forked JVM execution exception: 2, execution line: /usr/lib/jvm/java-6-sun-1.6.0.24/jre/bin/java -Dtests.prefix=tests -Dtests.seed=61F406BA7C0B79FF -Xmx512M -Dtests.iters= -Dtests.verbose=false -Dtests.infostream=false -Dtests.lockdir=<http://sierranevada.servebeer.com/job/Lucene-Core-4x-Beasting/ws/build> -Dtests.codec=random -Dtests.postingsformat=random -Dtests.locale=random -Dtests.timezone=random -Dtests.directory=random -Dtests.linedocsfile=europarl.lines.txt.gz -Dtests.luceneMatchVersion=4.0 -Dtests.cleanthreads=perMethod -Djava.util.logging.config.file=/dev/null -Dtests.nightly=false -Dtests.weekly=false -Dtests.slow=false -Dtests.asserts.gracious=false -Dtests.multiplier=1 -DtempDir=. -Dlucene.version=4.0-SNAPSHOT -Djetty.testMode=1 -Djetty.insecurerandom=1 -Dsolr.directoryFactory=org.apache.solr.core.MockDirectoryFactory -classpath <http://sierranevada.servebeer.com/job/Lucene-Core-4x-Beasting/ws/build/test-framework/classes/java>:<http://sierranevada.servebeer.com/job/Lucene-Core-4x-Beasting/ws/test-framework/lib/junit-4.10.jar>:<http://sierranevada.servebeer.com/job/Lucene-Core-4x-Beasting/ws/test-framework/lib/randomizedtesting-runner-1.5.0.jar>:<http://sierranevada.servebeer.com/job/Lucene-Core-4x-Beasting/ws/build/core/classes/java>:<http://sierranevada.servebeer.com/job/Lucene-Core-4x-Beasting/ws/build/core/classes/test>:/usr/local/apache-ant-1.8.2/lib/ant-launcher.jar:/home/rmuir/.ant/lib/apache-rat-0.8.jar:/home/rmuir/.ant/lib/ivy-2.2.0.jar:/usr/local/apache-ant-1.8.2/lib/ant-junit4.jar:/usr/local/apache-ant-1.8.2/lib/ant-apache-resolver.jar:/usr/local/apache-ant-1.8.2/lib/ant-jai.jar:/usr/local/apache-ant-1.8.2/lib/ant-commons-logging.jar:/usr/local/apache-ant-1.8.2/lib/ant-apache-bcel.jar:/usr/local/apache-ant-1.8.2/lib/ant-apache-xalan2.jar:/usr/local/apache-ant-1.8.2/lib/ant-apache-regexp.jar:/usr/local/apache-ant-1.8.2/lib/ant-apache-log4j.jar:/usr/local/apache-ant-1.8.2/lib/ant-junit.jar:/usr/local/apache-ant-1.8.2/lib/ant-jsch.jar:/usr/local/apache-ant-1.8.2/lib/ant-jmf.jar:/usr/local/apache-ant-1.8.2/lib/ant-swing.jar:/usr/local/apache-ant-1.8.2/lib/ant-antlr.jar:/usr/local/apache-ant-1.8.2/lib/ant.jar:/usr/local/apache-ant-1.8.2/lib/ant-javamail.jar:/usr/local/apache-ant-1.8.2/lib/ant-jdepend.jar:/usr/local/apache-ant-1.8.2/lib/ant-testutil.jar:/usr/local/apache-ant-1.8.2/lib/ant-commons-net.jar:/usr/local/apache-ant-1.8.2/lib/ant-apache-oro.jar:/usr/local/apache-ant-1.8.2/lib/ant-netrexx.jar:/usr/local/apache-ant-1.8.2/lib/ant-apache-bsf.jar:/usr/lib/jvm/java-6-sun-1.6.0.24/lib/tools.jar:<http://sierranevada.servebeer.com/job/Lucene-Core-4x-Beasting/ws/test-framework/lib/junit4-ant-1.5.0.jar> -ea:org.apache.lucene... -ea:org.apache.solr... com.carrotsearch.ant.tasks.junit4.slave.SlaveMainSafe -eventsfile <http://sierranevada.servebeer.com/job/Lucene-Core-4x-Beasting/ws/build/core/test/junit4-J2-102923295b6b893e7.events> @<http://sierranevada.servebeer.com/job/Lucene-Core-4x-Beasting/ws/build/core/test/junit4-J2-102923295b6b893e7.suites>

BUILD FAILED
<http://sierranevada.servebeer.com/job/Lucene-Core-4x-Beasting/ws/build.xml>:50: The following error occurred while executing this line:
<http://sierranevada.servebeer.com/job/Lucene-Core-4x-Beasting/ws/common-build.xml>:1036: The following error occurred while executing this line:
<http://sierranevada.servebeer.com/job/Lucene-Core-4x-Beasting/ws/common-build.xml>:757: At least one slave process threw an unexpected exception, first: Forked process exited with an error code: 143

Total time: 4534 minutes 19 seconds
Build step 'Invoke Ant' marked build as failure

---------------------------------------------------------------------
To unsubscribe, e-mail: [hidden email]
For additional commands, e-mail: [hidden email]

Reply | Threaded
Open this post in threaded view
|

Re: Build failed in Jenkins: Lucene-Core-4x-Beasting #6934

Robert Muir
I killed this after it was hung for 3 days. I'm not sure if its
related to the other hang Uwe opened an issue for, or perhaps even
fixed already.

On Mon, Jun 25, 2012 at 2:03 PM,  <[hidden email]> wrote:

> See <http://sierranevada.servebeer.com/job/Lucene-Core-4x-Beasting/6934/>
>
> ------------------------------------------
> [...truncated 937 lines...]
>   [junit4] Completed on J0 in 0.01s, 2 tests
>   [junit4]
>   [junit4] Suite: org.apache.lucene.analysis.TestMockCharFilter
>   [junit4] Completed on J1 in 0.01s, 1 test
>   [junit4]
>   [junit4] Suite: org.apache.lucene.analysis.tokenattributes.TestSimpleAttributeImpl
>   [junit4] Completed on J3 in 0.01s, 1 test
>   [junit4]
>   [junit4] Suite: org.apache.lucene.util.TestNamedSPILoader
>   [junit4] Completed on J0 in 0.01s, 3 tests
>   [junit4]
>   [junit4] Suite: org.apache.lucene.TestAssertions
>   [junit4] Completed on J1 in 0.01s, 1 test
>   [junit4]
>   [junit4] Suite: org.apache.lucene.index.TestIndexWriterOnJRECrash
>   [junit4] IGNOR/A 0.00s J3 | TestIndexWriterOnJRECrash.testNRTThreads
>   [junit4]    > Assumption #1: 'nightly' test group is disabled (@Nightly)
>   [junit4] Completed on J3 in 0.01s, 1 test, 1 skipped
>   [junit4]
>   [junit4] Suite: org.apache.lucene.index.TestTerm
>   [junit4] Completed on J0 in 0.01s, 1 test
>   [junit4]
>   [junit4] Suite: org.apache.lucene.store.TestByteArrayDataInput
>   [junit4] Completed on J1 in 0.01s, 1 test
>   [junit4]
>   [junit4] Suite: org.apache.lucene.index.Test2BPostings
>   [junit4] IGNOR/A 0.00s J3 | Test2BPostings.test
>   [junit4]    > Assumption #1: 'nightly' test group is disabled (@Nightly)
>   [junit4] Completed on J3 in 0.01s, 1 test, 1 skipped
>   [junit4]
>   [junit4] Suite: org.apache.lucene.util.TestIntsRef
>   [junit4] Completed on J1 in 0.08s, 2 tests
>   [junit4]
>   [junit4] Suite: org.apache.lucene.codecs.lucene40.TestAllFilesHaveCodecHeader
>   [junit4] Completed on J0 in 0.58s, 1 test
>   [junit4]
>   [junit4] Unhandled exception in thread: Thread[pumper-events,5,main]
>   [junit4] com.carrotsearch.ant.tasks.junit4.dependencies.com.google.gson.JsonIOException: java.io.IOException: java.lang.InterruptedException: sleep interrupted
>   [junit4] JVM J2: stdout was not empty, see: <http://sierranevada.servebeer.com/job/Lucene-Core-4x-Beasting/ws/build/core/test/junit4-J2-102923295b6b893e7.sysout>
>   [junit4] >>> JVM J2: stdout (verbatim) ----
>   [junit4]     at com.carrotsearch.ant.tasks.junit4.dependencies.com.google.gson.internal.Streams.parse(Streams.java:57)
>   [junit4]     at com.carrotsearch.ant.tasks.junit4.dependencies.com.google.gson.GsonToMiniGsonTypeAdapterFactory$3.read(GsonToMiniGsonTypeAdapterFactory.java:81)
>   [junit4]     at com.carrotsearch.ant.tasks.junit4.dependencies.com.google.gson.internal.bind.ReflectiveTypeAdapterFactory$1.read(ReflectiveTypeAdapterFactory.java:86)
>   [junit4]     at com.carrotsearch.ant.tasks.junit4.dependencies.com.google.gson.internal.bind.ReflectiveTypeAdapterFactory$Adapter.read(ReflectiveTypeAdapterFactory.java:170)
>   [junit4]     at com.carrotsearch.ant.tasks.junit4.dependencies.com.google.gson.Gson.fromJson(Gson.java:720)
>   [junit4] 2012-06-25 14:03:31
>   [junit4] Full thread dump Java HotSpot(TM) 64-Bit Server VM (19.1-b02 mixed mode):
>   [junit4]
>   [junit4] "Thread-65" daemon prio=10 tid=0x00007f4754192000 nid=0xeb5 in Object.wait() [0x00007f4794df6000]
>   [junit4]    java.lang.Thread.State: WAITING (on object monitor)
>   [junit4]     at java.lang.Object.wait(Native Method)
>   [junit4]     - waiting on <0x00000000e04eab68> (a org.apache.lucene.index.DocumentsWriterStallControl)
>   [junit4]     at java.lang.Object.wait(Object.java:485)
>   [junit4]     at org.apache.lucene.index.DocumentsWriterStallControl.waitIfStalled(DocumentsWriterStallControl.java:75)
>   [junit4]     - locked <0x00000000e04eab68> (a org.apache.lucene.index.DocumentsWriterStallControl)
>   [junit4]     at org.apache.lucene.index.DocumentsWriterFlushControl.waitIfStalled(DocumentsWriterFlushControl.java:636)
>   [junit4]     at org.apache.lucene.index.DocumentsWriter.preUpdate(DocumentsWriter.java:301)
>   [junit4]     at org.apache.lucene.index.DocumentsWriter.updateDocument(DocumentsWriter.java:361)
>   [junit4]     at org.apache.lucene.index.IndexWriter.updateDocument(IndexWriter.java:1334)
>   [junit4]     at org.apache.lucene.index.IndexWriter.addDocument(IndexWriter.java:1085)
>   [junit4]     at org.apache.lucene.index.IndexWriter.addDocument(IndexWriter.java:1066)
>   [junit4]     at org.apache.lucene.index.TestIndexWriterReader$2.run(TestIndexWriterReader.java:823)
>   [junit4]
>   [junit4] "Thread-64" daemon prio=10 tid=0x00007f47540d2800 nid=0xeb4 in Object.wait() [0x00007f4794ef7000]
>   [junit4]    java.lang.Thread.State: WAITING (on object monitor)
>   [junit4]     at java.lang.Object.wait(Native Method)
>   [junit4]     - waiting on <0x00000000e04eab68> (a org.apache.lucene.index.DocumentsWriterStallControl)
>   [junit4]     at java.lang.Object.wait(Object.java:485)
>   [junit4]     at org.apache.lucene.index.DocumentsWriterStallControl.waitIfStalled(DocumentsWriterStallControl.java:75)
>   [junit4]     - locked <0x00000000e04eab68> (a org.apache.lucene.index.DocumentsWriterStallControl)
>   [junit4]     at org.apache.lucene.index.DocumentsWriterFlushControl.waitIfStalled(DocumentsWriterFlushControl.java:636)
>   [junit4]     at org.apache.lucene.index.DocumentsWriter.preUpdate(DocumentsWriter.java:301)
>   [junit4]     at org.apache.lucene.index.DocumentsWriter.updateDocument(DocumentsWriter.java:361)
>   [junit4]     at org.apache.lucene.index.IndexWriter.updateDocument(IndexWriter.java:1334)
>   [junit4]     at org.apache.lucene.index.IndexWriter.addDocument(IndexWriter.java:1085)
>   [junit4]     at org.apache.lucene.index.IndexWriter.addDocument(IndexWriter.java:1066)
>   [junit4]     at org.apache.lucene.index.TestIndexWriterReader$2.run(TestIndexWriterReader.java:823)
>   [junit4]
>   [junit4] "Thread-63" daemon prio=10 tid=0x00007f4754042800 nid=0xeb3 in Object.wait() [0x00007f47946ef000]
>   [junit4]    java.lang.Thread.State: WAITING (on object monitor)
>   [junit4]     at java.lang.Object.wait(Native Method)
>   [junit4]     - waiting on <0x00000000e04eab68> (a org.apache.lucene.index.DocumentsWriterStallControl)
>   [junit4]     at java.lang.Object.wait(Object.java:485)
>   [junit4]     at org.apache.lucene.index.DocumentsWriterStallControl.waitIfStalled(DocumentsWriterStallControl.java:75)
>   [junit4]     - locked <0x00000000e04eab68> (a org.apache.lucene.index.DocumentsWriterStallControl)
>   [junit4]     at org.apache.lucene.index.DocumentsWriterFlushControl.waitIfStalled(DocumentsWriterFlushControl.java:636)
>   [junit4]     at org.apache.lucene.index.DocumentsWriter.preUpdate(DocumentsWriter.java:301)
>   [junit4]     at org.apache.lucene.index.DocumentsWriter.updateDocument(DocumentsWriter.java:361)
>   [junit4]     at org.apache.lucene.index.IndexWriter.updateDocument(IndexWriter.java:1334)
>   [junit4]     at org.apache.lucene.index.IndexWriter.addDocument(IndexWriter.java:1085)
>   [junit4]     at org.apache.lucene.index.IndexWriter.addDocument(IndexWriter.java:1066)
>   [junit4]     at org.apache.lucene.index.TestIndexWriterReader$2.run(TestIndexWriterReader.java:823)
>   [junit4]
>   [junit4] "TEST-TestScope-org.apache.lucene.index.TestIndexWriterReader.testDuringAddDelete-seed#[61F406BA7C0B79FF]" prio=10 tid=0x00007f4798237800 nid=0xe9b in Object.wait() [0x00007f479c10d000]
>   [junit4]    java.lang.Thread.State: WAITING (on object monitor)
>   [junit4]     at java.lang.Object.wait(Native Method)
>   [junit4]     - waiting on <0x00000000fc160188> (a org.apache.lucene.index.TestIndexWriterReader$2)
>   [junit4]     at java.lang.Thread.join(Thread.java:1186)
>   [junit4]     - locked <0x00000000fc160188> (a org.apache.lucene.index.TestIndexWriterReader$2)
>   [junit4]     at java.lang.Thread.join(Thread.java:1239)
>   [junit4]     at org.apache.lucene.index.TestIndexWriterReader.testDuringAddDelete(TestIndexWriterReader.java:855)
>   [junit4]     at sun.reflect.NativeMethodAccessorImpl.invoke0(Native Method)
>   [junit4]     at sun.reflect.NativeMethodAccessorImpl.invoke(NativeMethodAccessorImpl.java:39)
>   [junit4]     at sun.reflect.DelegatingMethodAccessorImpl.invoke(DelegatingMethodAccessorImpl.java:25)
>   [junit4]     at java.lang.reflect.Method.invoke(Method.java:597)
>   [junit4]     at com.carrotsearch.randomizedtesting.RandomizedRunner.invoke(RandomizedRunner.java:1969)
>   [junit4]     at com.carrotsearch.randomizedtesting.RandomizedRunner.access$1100(RandomizedRunner.java:132)
>   [junit4]     at com.carrotsearch.randomizedtesting.RandomizedRunner$6.evaluate(RandomizedRunner.java:814)
>   [junit4]     at com.carrotsearch.randomizedtesting.RandomizedRunner$7.evaluate(RandomizedRunner.java:875)
>   [junit4]     at com.carrotsearch.randomizedtesting.RandomizedRunner$8.evaluate(RandomizedRunner.java:889)
>   [junit4]     at org.apache.lucene.util.TestRuleSetupTeardownChained$1.evaluate(TestRuleSetupTeardownChained.java:50)
>   [junit4]     at org.apache.lucene.util.TestRuleFieldCacheSanity$1.evaluate(TestRuleFieldCacheSanity.java:32)
>   [junit4]     at org.apache.lucene.util.AbstractBeforeAfterRule$1.evaluate(AbstractBeforeAfterRule.java:45)
>   [junit4]     at com.carrotsearch.randomizedtesting.rules.SystemPropertiesInvariantRule$1.evaluate(SystemPropertiesInvariantRule.java:55)
>   [junit4]     at org.apache.lucene.util.TestRuleReportUncaughtExceptions$1.evaluate(TestRuleReportUncaughtExceptions.java:68)
>   [junit4]     at org.apache.lucene.util.TestRuleThreadAndTestName$1.evaluate(TestRuleThreadAndTestName.java:48)
>   [junit4]     at org.apache.lucene.util.TestRuleMarkFailure$1.evaluate(TestRuleMarkFailure.java:48)
>   [junit4]     at com.carrotsearch.randomizedtesting.RandomizedRunner.runSingleTest(RandomizedRunner.java:821)
>   [junit4]     at com.carrotsearch.randomizedtesting.RandomizedRunner.access$700(RandomizedRunner.java:132)
>   [junit4]     at com.carrotsearch.randomizedtesting.RandomizedRunner$3$1.run(RandomizedRunner.java:669)
>   [junit4]     at com.carrotsearch.randomizedtesting.RandomizedRunner$3.evaluate(RandomizedRunner.java:695)
>   [junit4]     at com.carrotsearch.randomizedtesting.RandomizedRunner$4.evaluate(RandomizedRunner.java:734)
>   [junit4]     at com.carrotsearch.randomizedtesting.RandomizedRunner$5.evaluate(RandomizedRunner.java:745)
>   [junit4]     at org.apache.lucene.util.AbstractBeforeAfterRule$1.evaluate(AbstractBeforeAfterRule.java:45)
>   [junit4]     at org.apache.lucene.util.TestRuleReportUncaughtExceptions$1.evaluate(TestRuleReportUncaughtExceptions.java:68)
>   [junit4]     at org.apache.lucene.util.TestRuleStoreClassName$1.evaluate(TestRuleStoreClassName.java:38)
>   [junit4]     at org.apache.lucene.util.TestRuleIcuHack$1.evaluate(TestRuleIcuHack.java:51)
>   [junit4]     at com.carrotsearch.randomizedtesting.rules.SystemPropertiesInvariantRule$1.evaluate(SystemPropertiesInvariantRule.java:55)
>   [junit4]     at org.apache.lucene.util.TestRuleNoInstanceHooksOverrides$1.evaluate(TestRuleNoInstanceHooksOverrides.java:53)
>   [junit4]     at org.apache.lucene.util.TestRuleNoStaticHooksShadowing$1.evaluate(TestRuleNoStaticHooksShadowing.java:52)
>   [junit4]     at org.apache.lucene.util.TestRuleAssertionsRequired$1.evaluate(TestRuleAssertionsRequired.java:36)
>   [junit4]     at org.apache.lucene.util.TestRuleMarkFailure$1.evaluate(TestRuleMarkFailure.java:48)
>   [junit4]     at org.apache.lucene.util.TestRuleIgnoreTestSuites$1.evaluate(TestRuleIgnoreTestSuites.java:56)
>   [junit4]     at com.carrotsearch.randomizedtesting.RandomizedRunner.runSuite(RandomizedRunner.java:605)
>   [junit4]     at com.carrotsearch.randomizedtesting.RandomizedRunner.access$400(RandomizedRunner.java:132)
>   [junit4]     at com.carrotsearch.randomizedtesting.RandomizedRunner$2.run(RandomizedRunner.java:551)
>   [junit4]
>   [junit4] "Low Memory Detector" daemon prio=10 tid=0x00007f479809c000 nid=0xd6f runnable [0x0000000000000000]
>   [junit4]    java.lang.Thread.State: RUNNABLE
>   [junit4]
>   [junit4] "CompilerThread1" daemon prio=10 tid=0x00007f4798099800 nid=0xd6e waiting on condition [0x0000000000000000]
>   [junit4]    java.lang.Thread.State: RUNNABLE
>   [junit4]
>   [junit4] "CompilerThread0" daemon prio=10 tid=0x00007f4798097000 nid=0xd6d waiting on condition [0x0000000000000000]
>   [junit4]    java.lang.Thread.State: RUNNABLE
>   [junit4]
>   [junit4] "Signal Dispatcher" daemon prio=10 tid=0x00007f4798094800 nid=0xd6c waiting on condition [0x0000000000000000]
>   [junit4]    java.lang.Thread.State: RUNNABLE
>   [junit4]
>   [junit4] "Finalizer" daemon prio=10 tid=0x00007f4798078000 nid=0xd5a in Object.wait() [0x00007f479ccf3000]
>   [junit4]    java.lang.Thread.State: WAITING (on object monitor)
>   [junit4]     at java.lang.Object.wait(Native Method)
>   [junit4]     - waiting on <0x00000000e00606d8> (a java.lang.ref.ReferenceQueue$Lock)
>   [junit4]     at java.lang.ref.ReferenceQueue.remove(ReferenceQueue.java:118)
>   [junit4]     - locked <0x00000000e00606d8> (a java.lang.ref.ReferenceQueue$Lock)
>   [junit4]     at java.lang.ref.ReferenceQueue.remove(ReferenceQueue.java:134)
>   [junit4]     at java.lang.ref.Finalizer$FinalizerThread.run(Finalizer.java:159)
>   [junit4]
>   [junit4] "Reference Handler" daemon prio=10 tid=0x00007f4798076000 nid=0xd58 in Object.wait() [0x00007f479cdf4000]
>   [junit4]    java.lang.Thread.State: WAITING (on object monitor)
>   [junit4]     at java.lang.Object.wait(Native Method)
>   [junit4]     - waiting on <0x00000000e0060698> (a java.lang.ref.Reference$Lock)
>   [junit4]     at java.lang.Object.wait(Object.java:485)
>   [junit4]     at java.lang.ref.Reference$ReferenceHandler.run(Reference.java:116)
>   [junit4]     - locked <0x00000000e0060698> (a java.lang.ref.Reference$Lock)
>   [junit4]
>   [junit4] "main" prio=10 tid=0x00007f479800a800 nid=0xd2a in Object.wait() [0x00007f479f39a000]
>   [junit4]    java.lang.Thread.State: WAITING (on object monitor)
>   [junit4]     at java.lang.Object.wait(Native Method)
>   [junit4]     - waiting on <0x00000000e039bbf8> (a com.carrotsearch.randomizedtesting.RandomizedRunner$2)
>   [junit4]     at java.lang.Thread.join(Thread.java:1186)
>   [junit4]     - locked <0x00000000e039bbf8> (a com.carrotsearch.randomizedtesting.RandomizedRunner$2)
>   [junit4]     at java.lang.Thread.join(Thread.java:1239)
>   [junit4]     at com.carrotsearch.randomizedtesting.RandomizedRunner.runSuite(RandomizedRunner.java:561)
>   [junit4]     at com.carrotsearch.randomizedtesting.RandomizedRunner.run(RandomizedRunner.java:521)
>   [junit4]     at com.carrotsearch.ant.tasks.junit4.slave.SlaveMain.execute(SlaveMain.java:145)
>   [junit4]     at com.carrotsearch.ant.tasks.junit4.slave.SlaveMain.main(SlaveMain.java:238)
>   [junit4]     at com.carrotsearch.ant.tasks.junit4.slave.SlaveMainSafe.main(SlaveMainSafe.java:12)
>   [junit4]
>   [junit4] "VM Thread" prio=10 tid=0x00007f479806f800 nid=0xd56 runnable
>   [junit4]
>   [junit4] "GC task thread#0 (ParallelGC)" prio=10 tid=0x00007f479801d800 nid=0xd33 runnable
>   [junit4]
>   [junit4] "GC task thread#1 (ParallelGC)" prio=10 tid=0x00007f479801f000 nid=0xd34 runnable
>   [junit4]
>   [junit4] "GC task thread#2 (ParallelGC)" prio=10 tid=0x00007f4798021000 nid=0xd35 runnable
>   [junit4]
>   [junit4] "GC task thread#3 (ParallelGC)" prio=10 tid=0x00007f4798023000 nid=0xd36 runnable
>   [junit4]
>   [junit4] "GC task thread#4 (ParallelGC)" prio=10 tid=0x00007f4798024800 nid=0xd37 runnable
>   [junit4]
>   [junit4] "GC task thread#5 (ParallelGC)" prio=10 tid=0x00007f4798026800 nid=0xd38 runnable
>   [junit4]
>   [junit4] "GC task thread#6 (ParallelGC)" prio=10 tid=0x00007f4798028000 nid=0xd39 runnable
>   [junit4]
>   [junit4] "GC task thread#7 (ParallelGC)" prio=10 tid=0x00007f479802a000 nid=0xd3a runnable
>   [junit4]
>   [junit4] "VM Periodic Task Thread" prio=10 tid=0x00007f47980a6800 nid=0xd70 waiting on condition
>   [junit4]
>   [junit4] JNI global references: 1021
>   [junit4]
>   [junit4] Heap
>   [junit4]  PSYoungGen      total 103872K, used 95119K [0x00000000f5560000, 0x00000000fd5a0000, 0x0000000100000000)
>   [junit4]   eden space 101248K, 91% used [0x00000000f5560000,0x00000000fafbbd08,0x00000000fb840000)
>   [junit4]   from space 2624K, 98% used [0x00000000fc150000,0x00000000fc3d8070,0x00000000fc3e0000)
>   [junit4]   to   space 9280K, 0% used [0x00000000fb840000,0x00000000fb840000,0x00000000fc150000)
>   [junit4]  PSOldGen        total 171008K, used 20869K [0x00000000e0000000, 0x00000000ea700000, 0x00000000f5560000)
>   [junit4]   object space 171008K, 12% used [0x00000000e0000000,0x00000000e14614b0,0x00000000ea700000)
>   [junit4]  PSPermGen       total 21248K, used 17334K [0x00000000dae00000, 0x00000000dc2c0000, 0x00000000e0000000)
>   [junit4]   object space 21248K, 81% used [0x00000000dae00000,0x00000000dbeed8f0,0x00000000dc2c0000)
>   [junit4]     at com.carrotsearch.ant.tasks.junit4.events.Deserializer.deserialize(Deserializer.java:31)
>   [junit4] <<< JVM J2: EOF ----
>   [junit4]     at com.carrotsearch.ant.tasks.junit4.LocalSlaveStreamHandler.pumpEvents(LocalSlaveStreamHandler.java:100)
>   [junit4]     at com.carrotsearch.ant.tasks.junit4.LocalSlaveStreamHandler$1.run(LocalSlaveStreamHandler.java:73)
>   [junit4]     at java.lang.Thread.run(Thread.java:662)
>   [junit4] Caused by: java.io.IOException: java.lang.InterruptedException: sleep interrupted
>   [junit4]     at com.carrotsearch.ant.tasks.junit4.TailInputStream.read(TailInputStream.java:66)
>   [junit4]     at sun.nio.cs.StreamDecoder.readBytes(StreamDecoder.java:264)
>   [junit4]     at sun.nio.cs.StreamDecoder.implRead(StreamDecoder.java:306)
>   [junit4]     at sun.nio.cs.StreamDecoder.read(StreamDecoder.java:158)
>   [junit4]     at java.io.InputStreamReader.read(InputStreamReader.java:167)
>   [junit4]     at com.carrotsearch.ant.tasks.junit4.dependencies.com.google.gson.stream.JsonReader.fillBuffer(JsonReader.java:845)
>   [junit4]     at com.carrotsearch.ant.tasks.junit4.dependencies.com.google.gson.stream.JsonReader.nextString(JsonReader.java:1012)
>   [junit4]     at com.carrotsearch.ant.tasks.junit4.dependencies.com.google.gson.stream.JsonReader.nextInObject(JsonReader.java:755)
>   [junit4]     at com.carrotsearch.ant.tasks.junit4.dependencies.com.google.gson.stream.JsonReader.quickPeek(JsonReader.java:387)
>   [junit4]     at com.carrotsearch.ant.tasks.junit4.dependencies.com.google.gson.stream.JsonReader.hasNext(JsonReader.java:340)
>   [junit4]     at com.carrotsearch.ant.tasks.junit4.dependencies.com.google.gson.internal.bind.TypeAdapters$22.read(TypeAdapters.java:602)
>   [junit4]     at com.carrotsearch.ant.tasks.junit4.dependencies.com.google.gson.internal.bind.TypeAdapters$22.read(TypeAdapters.java:595)
>   [junit4]     at com.carrotsearch.ant.tasks.junit4.dependencies.com.google.gson.internal.bind.TypeAdapters$22.read(TypeAdapters.java:603)
>   [junit4]     at com.carrotsearch.ant.tasks.junit4.dependencies.com.google.gson.internal.bind.TypeAdapters$22.read(TypeAdapters.java:578)
>   [junit4]     at com.carrotsearch.ant.tasks.junit4.dependencies.com.google.gson.internal.Streams.parse(Streams.java:44)
>   [junit4]     ... 8 more
>   [junit4] Caused by: java.lang.InterruptedException: sleep interrupted
>   [junit4]     at java.lang.Thread.sleep(Native Method)
>   [junit4]     at com.carrotsearch.ant.tasks.junit4.TailInputStream.read(TailInputStream.java:64)
>   [junit4]     ... 22 more
>   [junit4] JVM J0:     0.41 ..    77.64 =    77.23s
>   [junit4] JVM J1:     0.41 ..    77.24 =    76.84s
>   [junit4] JVM J3:     0.41 ..    77.05 =    76.65s
>   [junit4] Execution time total: 3 days 3 hours 34 minutes 13 seconds
>   [junit4] ERROR: Forked JVM execution exception: 2, execution line: /usr/lib/jvm/java-6-sun-1.6.0.24/jre/bin/java -Dtests.prefix=tests -Dtests.seed=61F406BA7C0B79FF -Xmx512M -Dtests.iters= -Dtests.verbose=false -Dtests.infostream=false -Dtests.lockdir=<http://sierranevada.servebeer.com/job/Lucene-Core-4x-Beasting/ws/build> -Dtests.codec=random -Dtests.postingsformat=random -Dtests.locale=random -Dtests.timezone=random -Dtests.directory=random -Dtests.linedocsfile=europarl.lines.txt.gz -Dtests.luceneMatchVersion=4.0 -Dtests.cleanthreads=perMethod -Djava.util.logging.config.file=/dev/null -Dtests.nightly=false -Dtests.weekly=false -Dtests.slow=false -Dtests.asserts.gracious=false -Dtests.multiplier=1 -DtempDir=. -Dlucene.version=4.0-SNAPSHOT -Djetty.testMode=1 -Djetty.insecurerandom=1 -Dsolr.directoryFactory=org.apache.solr.core.MockDirectoryFactory -classpath <http://sierranevada.servebeer.com/job/Lucene-Core-4x-Beasting/ws/build/test-framework/classes/java>:<http://sierranevada.servebeer.com/job/Lucene-Core-4x-Beasting/ws/test-framework/lib/junit-4.10.jar>:<http://sierranevada.servebeer.com/job/Lucene-Core-4x-Beasting/ws/test-framework/lib/randomizedtesting-runner-1.5.0.jar>:<http://sierranevada.servebeer.com/job/Lucene-Core-4x-Beasting/ws/build/core/classes/java>:<http://sierranevada.servebeer.com/job/Lucene-Core-4x-Beasting/ws/build/core/classes/test>:/usr/local/apache-ant-1.8.2/lib/ant-launcher.jar:/home/rmuir/.ant/lib/apache-rat-0.8.jar:/home/rmuir/.ant/lib/ivy-2.2.0.jar:/usr/local/apache-ant-1.8.2/lib/ant-junit4.jar:/usr/local/apache-ant-1.8.2/lib/ant-apache-resolver.jar:/usr/local/apache-ant-1.8.2/lib/ant-jai.jar:/usr/local/apache-ant-1.8.2/lib/ant-commons-logging.jar:/usr/local/apache-ant-1.8.2/lib/ant-apache-bcel.jar:/usr/local/apache-ant-1.8.2/lib/ant-apache-xalan2.jar:/usr/local/apache-ant-1.8.2/lib/ant-apache-regexp.jar:/usr/local/apache-ant-1.8.2/lib/ant-apache-log4j.jar:/usr/local/apache-ant-1.8.2/lib/ant-junit.jar:/usr/local/apache-ant-1.8.2/lib/ant-jsch.jar:/usr/local/apache-ant-1.8.2/lib/ant-jmf.jar:/usr/local/apache-ant-1.8.2/lib/ant-swing.jar:/usr/local/apache-ant-1.8.2/lib/ant-antlr.jar:/usr/local/apache-ant-1.8.2/lib/ant.jar:/usr/local/apache-ant-1.8.2/lib/ant-javamail.jar:/usr/local/apache-ant-1.8.2/lib/ant-jdepend.jar:/usr/local/apache-ant-1.8.2/lib/ant-testutil.jar:/usr/local/apache-ant-1.8.2/lib/ant-commons-net.jar:/usr/local/apache-ant-1.8.2/lib/ant-apache-oro.jar:/usr/local/apache-ant-1.8.2/lib/ant-netrexx.jar:/usr/local/apache-ant-1.8.2/lib/ant-apache-bsf.jar:/usr/lib/jvm/java-6-sun-1.6.0.24/lib/tools.jar:<http://sierranevada.servebeer.com/job/Lucene-Core-4x-Beasting/ws/test-framework/lib/junit4-ant-1.5.0.jar> -ea:org.apache.lucene... -ea:org.apache.solr... com.carrotsearch.ant.tasks.junit4.slave.SlaveMainSafe -eventsfile <http://sierranevada.servebeer.com/job/Lucene-Core-4x-Beasting/ws/build/core/test/junit4-J2-102923295b6b893e7.events> @<http://sierranevada.servebeer.com/job/Lucene-Core-4x-Beasting/ws/build/core/test/junit4-J2-102923295b6b893e7.suites>
>
> BUILD FAILED
> <http://sierranevada.servebeer.com/job/Lucene-Core-4x-Beasting/ws/build.xml>:50: The following error occurred while executing this line:
> <http://sierranevada.servebeer.com/job/Lucene-Core-4x-Beasting/ws/common-build.xml>:1036: The following error occurred while executing this line:
> <http://sierranevada.servebeer.com/job/Lucene-Core-4x-Beasting/ws/common-build.xml>:757: At least one slave process threw an unexpected exception, first: Forked process exited with an error code: 143
>
> Total time: 4534 minutes 19 seconds
> Build step 'Invoke Ant' marked build as failure
>
> ---------------------------------------------------------------------
> To unsubscribe, e-mail: [hidden email]
> For additional commands, e-mail: [hidden email]
>



--
lucidimagination.com

---------------------------------------------------------------------
To unsubscribe, e-mail: [hidden email]
For additional commands, e-mail: [hidden email]

Reply | Threaded
Open this post in threaded view
|

Re: Build failed in Jenkins: Lucene-Core-4x-Beasting #6934

Robert Muir
This checkout was from r1352901 by the way

On Mon, Jun 25, 2012 at 2:04 PM, Robert Muir <[hidden email]> wrote:

> I killed this after it was hung for 3 days. I'm not sure if its
> related to the other hang Uwe opened an issue for, or perhaps even
> fixed already.
>
> On Mon, Jun 25, 2012 at 2:03 PM,  <[hidden email]> wrote:
>> See <http://sierranevada.servebeer.com/job/Lucene-Core-4x-Beasting/6934/>
>>
>> ------------------------------------------
>> [...truncated 937 lines...]
>>   [junit4] Completed on J0 in 0.01s, 2 tests
>>   [junit4]
>>   [junit4] Suite: org.apache.lucene.analysis.TestMockCharFilter
>>   [junit4] Completed on J1 in 0.01s, 1 test
>>   [junit4]
>>   [junit4] Suite: org.apache.lucene.analysis.tokenattributes.TestSimpleAttributeImpl
>>   [junit4] Completed on J3 in 0.01s, 1 test
>>   [junit4]
>>   [junit4] Suite: org.apache.lucene.util.TestNamedSPILoader
>>   [junit4] Completed on J0 in 0.01s, 3 tests
>>   [junit4]
>>   [junit4] Suite: org.apache.lucene.TestAssertions
>>   [junit4] Completed on J1 in 0.01s, 1 test
>>   [junit4]
>>   [junit4] Suite: org.apache.lucene.index.TestIndexWriterOnJRECrash
>>   [junit4] IGNOR/A 0.00s J3 | TestIndexWriterOnJRECrash.testNRTThreads
>>   [junit4]    > Assumption #1: 'nightly' test group is disabled (@Nightly)
>>   [junit4] Completed on J3 in 0.01s, 1 test, 1 skipped
>>   [junit4]
>>   [junit4] Suite: org.apache.lucene.index.TestTerm
>>   [junit4] Completed on J0 in 0.01s, 1 test
>>   [junit4]
>>   [junit4] Suite: org.apache.lucene.store.TestByteArrayDataInput
>>   [junit4] Completed on J1 in 0.01s, 1 test
>>   [junit4]
>>   [junit4] Suite: org.apache.lucene.index.Test2BPostings
>>   [junit4] IGNOR/A 0.00s J3 | Test2BPostings.test
>>   [junit4]    > Assumption #1: 'nightly' test group is disabled (@Nightly)
>>   [junit4] Completed on J3 in 0.01s, 1 test, 1 skipped
>>   [junit4]
>>   [junit4] Suite: org.apache.lucene.util.TestIntsRef
>>   [junit4] Completed on J1 in 0.08s, 2 tests
>>   [junit4]
>>   [junit4] Suite: org.apache.lucene.codecs.lucene40.TestAllFilesHaveCodecHeader
>>   [junit4] Completed on J0 in 0.58s, 1 test
>>   [junit4]
>>   [junit4] Unhandled exception in thread: Thread[pumper-events,5,main]
>>   [junit4] com.carrotsearch.ant.tasks.junit4.dependencies.com.google.gson.JsonIOException: java.io.IOException: java.lang.InterruptedException: sleep interrupted
>>   [junit4] JVM J2: stdout was not empty, see: <http://sierranevada.servebeer.com/job/Lucene-Core-4x-Beasting/ws/build/core/test/junit4-J2-102923295b6b893e7.sysout>
>>   [junit4] >>> JVM J2: stdout (verbatim) ----
>>   [junit4]     at com.carrotsearch.ant.tasks.junit4.dependencies.com.google.gson.internal.Streams.parse(Streams.java:57)
>>   [junit4]     at com.carrotsearch.ant.tasks.junit4.dependencies.com.google.gson.GsonToMiniGsonTypeAdapterFactory$3.read(GsonToMiniGsonTypeAdapterFactory.java:81)
>>   [junit4]     at com.carrotsearch.ant.tasks.junit4.dependencies.com.google.gson.internal.bind.ReflectiveTypeAdapterFactory$1.read(ReflectiveTypeAdapterFactory.java:86)
>>   [junit4]     at com.carrotsearch.ant.tasks.junit4.dependencies.com.google.gson.internal.bind.ReflectiveTypeAdapterFactory$Adapter.read(ReflectiveTypeAdapterFactory.java:170)
>>   [junit4]     at com.carrotsearch.ant.tasks.junit4.dependencies.com.google.gson.Gson.fromJson(Gson.java:720)
>>   [junit4] 2012-06-25 14:03:31
>>   [junit4] Full thread dump Java HotSpot(TM) 64-Bit Server VM (19.1-b02 mixed mode):
>>   [junit4]
>>   [junit4] "Thread-65" daemon prio=10 tid=0x00007f4754192000 nid=0xeb5 in Object.wait() [0x00007f4794df6000]
>>   [junit4]    java.lang.Thread.State: WAITING (on object monitor)
>>   [junit4]     at java.lang.Object.wait(Native Method)
>>   [junit4]     - waiting on <0x00000000e04eab68> (a org.apache.lucene.index.DocumentsWriterStallControl)
>>   [junit4]     at java.lang.Object.wait(Object.java:485)
>>   [junit4]     at org.apache.lucene.index.DocumentsWriterStallControl.waitIfStalled(DocumentsWriterStallControl.java:75)
>>   [junit4]     - locked <0x00000000e04eab68> (a org.apache.lucene.index.DocumentsWriterStallControl)
>>   [junit4]     at org.apache.lucene.index.DocumentsWriterFlushControl.waitIfStalled(DocumentsWriterFlushControl.java:636)
>>   [junit4]     at org.apache.lucene.index.DocumentsWriter.preUpdate(DocumentsWriter.java:301)
>>   [junit4]     at org.apache.lucene.index.DocumentsWriter.updateDocument(DocumentsWriter.java:361)
>>   [junit4]     at org.apache.lucene.index.IndexWriter.updateDocument(IndexWriter.java:1334)
>>   [junit4]     at org.apache.lucene.index.IndexWriter.addDocument(IndexWriter.java:1085)
>>   [junit4]     at org.apache.lucene.index.IndexWriter.addDocument(IndexWriter.java:1066)
>>   [junit4]     at org.apache.lucene.index.TestIndexWriterReader$2.run(TestIndexWriterReader.java:823)
>>   [junit4]
>>   [junit4] "Thread-64" daemon prio=10 tid=0x00007f47540d2800 nid=0xeb4 in Object.wait() [0x00007f4794ef7000]
>>   [junit4]    java.lang.Thread.State: WAITING (on object monitor)
>>   [junit4]     at java.lang.Object.wait(Native Method)
>>   [junit4]     - waiting on <0x00000000e04eab68> (a org.apache.lucene.index.DocumentsWriterStallControl)
>>   [junit4]     at java.lang.Object.wait(Object.java:485)
>>   [junit4]     at org.apache.lucene.index.DocumentsWriterStallControl.waitIfStalled(DocumentsWriterStallControl.java:75)
>>   [junit4]     - locked <0x00000000e04eab68> (a org.apache.lucene.index.DocumentsWriterStallControl)
>>   [junit4]     at org.apache.lucene.index.DocumentsWriterFlushControl.waitIfStalled(DocumentsWriterFlushControl.java:636)
>>   [junit4]     at org.apache.lucene.index.DocumentsWriter.preUpdate(DocumentsWriter.java:301)
>>   [junit4]     at org.apache.lucene.index.DocumentsWriter.updateDocument(DocumentsWriter.java:361)
>>   [junit4]     at org.apache.lucene.index.IndexWriter.updateDocument(IndexWriter.java:1334)
>>   [junit4]     at org.apache.lucene.index.IndexWriter.addDocument(IndexWriter.java:1085)
>>   [junit4]     at org.apache.lucene.index.IndexWriter.addDocument(IndexWriter.java:1066)
>>   [junit4]     at org.apache.lucene.index.TestIndexWriterReader$2.run(TestIndexWriterReader.java:823)
>>   [junit4]
>>   [junit4] "Thread-63" daemon prio=10 tid=0x00007f4754042800 nid=0xeb3 in Object.wait() [0x00007f47946ef000]
>>   [junit4]    java.lang.Thread.State: WAITING (on object monitor)
>>   [junit4]     at java.lang.Object.wait(Native Method)
>>   [junit4]     - waiting on <0x00000000e04eab68> (a org.apache.lucene.index.DocumentsWriterStallControl)
>>   [junit4]     at java.lang.Object.wait(Object.java:485)
>>   [junit4]     at org.apache.lucene.index.DocumentsWriterStallControl.waitIfStalled(DocumentsWriterStallControl.java:75)
>>   [junit4]     - locked <0x00000000e04eab68> (a org.apache.lucene.index.DocumentsWriterStallControl)
>>   [junit4]     at org.apache.lucene.index.DocumentsWriterFlushControl.waitIfStalled(DocumentsWriterFlushControl.java:636)
>>   [junit4]     at org.apache.lucene.index.DocumentsWriter.preUpdate(DocumentsWriter.java:301)
>>   [junit4]     at org.apache.lucene.index.DocumentsWriter.updateDocument(DocumentsWriter.java:361)
>>   [junit4]     at org.apache.lucene.index.IndexWriter.updateDocument(IndexWriter.java:1334)
>>   [junit4]     at org.apache.lucene.index.IndexWriter.addDocument(IndexWriter.java:1085)
>>   [junit4]     at org.apache.lucene.index.IndexWriter.addDocument(IndexWriter.java:1066)
>>   [junit4]     at org.apache.lucene.index.TestIndexWriterReader$2.run(TestIndexWriterReader.java:823)
>>   [junit4]
>>   [junit4] "TEST-TestScope-org.apache.lucene.index.TestIndexWriterReader.testDuringAddDelete-seed#[61F406BA7C0B79FF]" prio=10 tid=0x00007f4798237800 nid=0xe9b in Object.wait() [0x00007f479c10d000]
>>   [junit4]    java.lang.Thread.State: WAITING (on object monitor)
>>   [junit4]     at java.lang.Object.wait(Native Method)
>>   [junit4]     - waiting on <0x00000000fc160188> (a org.apache.lucene.index.TestIndexWriterReader$2)
>>   [junit4]     at java.lang.Thread.join(Thread.java:1186)
>>   [junit4]     - locked <0x00000000fc160188> (a org.apache.lucene.index.TestIndexWriterReader$2)
>>   [junit4]     at java.lang.Thread.join(Thread.java:1239)
>>   [junit4]     at org.apache.lucene.index.TestIndexWriterReader.testDuringAddDelete(TestIndexWriterReader.java:855)
>>   [junit4]     at sun.reflect.NativeMethodAccessorImpl.invoke0(Native Method)
>>   [junit4]     at sun.reflect.NativeMethodAccessorImpl.invoke(NativeMethodAccessorImpl.java:39)
>>   [junit4]     at sun.reflect.DelegatingMethodAccessorImpl.invoke(DelegatingMethodAccessorImpl.java:25)
>>   [junit4]     at java.lang.reflect.Method.invoke(Method.java:597)
>>   [junit4]     at com.carrotsearch.randomizedtesting.RandomizedRunner.invoke(RandomizedRunner.java:1969)
>>   [junit4]     at com.carrotsearch.randomizedtesting.RandomizedRunner.access$1100(RandomizedRunner.java:132)
>>   [junit4]     at com.carrotsearch.randomizedtesting.RandomizedRunner$6.evaluate(RandomizedRunner.java:814)
>>   [junit4]     at com.carrotsearch.randomizedtesting.RandomizedRunner$7.evaluate(RandomizedRunner.java:875)
>>   [junit4]     at com.carrotsearch.randomizedtesting.RandomizedRunner$8.evaluate(RandomizedRunner.java:889)
>>   [junit4]     at org.apache.lucene.util.TestRuleSetupTeardownChained$1.evaluate(TestRuleSetupTeardownChained.java:50)
>>   [junit4]     at org.apache.lucene.util.TestRuleFieldCacheSanity$1.evaluate(TestRuleFieldCacheSanity.java:32)
>>   [junit4]     at org.apache.lucene.util.AbstractBeforeAfterRule$1.evaluate(AbstractBeforeAfterRule.java:45)
>>   [junit4]     at com.carrotsearch.randomizedtesting.rules.SystemPropertiesInvariantRule$1.evaluate(SystemPropertiesInvariantRule.java:55)
>>   [junit4]     at org.apache.lucene.util.TestRuleReportUncaughtExceptions$1.evaluate(TestRuleReportUncaughtExceptions.java:68)
>>   [junit4]     at org.apache.lucene.util.TestRuleThreadAndTestName$1.evaluate(TestRuleThreadAndTestName.java:48)
>>   [junit4]     at org.apache.lucene.util.TestRuleMarkFailure$1.evaluate(TestRuleMarkFailure.java:48)
>>   [junit4]     at com.carrotsearch.randomizedtesting.RandomizedRunner.runSingleTest(RandomizedRunner.java:821)
>>   [junit4]     at com.carrotsearch.randomizedtesting.RandomizedRunner.access$700(RandomizedRunner.java:132)
>>   [junit4]     at com.carrotsearch.randomizedtesting.RandomizedRunner$3$1.run(RandomizedRunner.java:669)
>>   [junit4]     at com.carrotsearch.randomizedtesting.RandomizedRunner$3.evaluate(RandomizedRunner.java:695)
>>   [junit4]     at com.carrotsearch.randomizedtesting.RandomizedRunner$4.evaluate(RandomizedRunner.java:734)
>>   [junit4]     at com.carrotsearch.randomizedtesting.RandomizedRunner$5.evaluate(RandomizedRunner.java:745)
>>   [junit4]     at org.apache.lucene.util.AbstractBeforeAfterRule$1.evaluate(AbstractBeforeAfterRule.java:45)
>>   [junit4]     at org.apache.lucene.util.TestRuleReportUncaughtExceptions$1.evaluate(TestRuleReportUncaughtExceptions.java:68)
>>   [junit4]     at org.apache.lucene.util.TestRuleStoreClassName$1.evaluate(TestRuleStoreClassName.java:38)
>>   [junit4]     at org.apache.lucene.util.TestRuleIcuHack$1.evaluate(TestRuleIcuHack.java:51)
>>   [junit4]     at com.carrotsearch.randomizedtesting.rules.SystemPropertiesInvariantRule$1.evaluate(SystemPropertiesInvariantRule.java:55)
>>   [junit4]     at org.apache.lucene.util.TestRuleNoInstanceHooksOverrides$1.evaluate(TestRuleNoInstanceHooksOverrides.java:53)
>>   [junit4]     at org.apache.lucene.util.TestRuleNoStaticHooksShadowing$1.evaluate(TestRuleNoStaticHooksShadowing.java:52)
>>   [junit4]     at org.apache.lucene.util.TestRuleAssertionsRequired$1.evaluate(TestRuleAssertionsRequired.java:36)
>>   [junit4]     at org.apache.lucene.util.TestRuleMarkFailure$1.evaluate(TestRuleMarkFailure.java:48)
>>   [junit4]     at org.apache.lucene.util.TestRuleIgnoreTestSuites$1.evaluate(TestRuleIgnoreTestSuites.java:56)
>>   [junit4]     at com.carrotsearch.randomizedtesting.RandomizedRunner.runSuite(RandomizedRunner.java:605)
>>   [junit4]     at com.carrotsearch.randomizedtesting.RandomizedRunner.access$400(RandomizedRunner.java:132)
>>   [junit4]     at com.carrotsearch.randomizedtesting.RandomizedRunner$2.run(RandomizedRunner.java:551)
>>   [junit4]
>>   [junit4] "Low Memory Detector" daemon prio=10 tid=0x00007f479809c000 nid=0xd6f runnable [0x0000000000000000]
>>   [junit4]    java.lang.Thread.State: RUNNABLE
>>   [junit4]
>>   [junit4] "CompilerThread1" daemon prio=10 tid=0x00007f4798099800 nid=0xd6e waiting on condition [0x0000000000000000]
>>   [junit4]    java.lang.Thread.State: RUNNABLE
>>   [junit4]
>>   [junit4] "CompilerThread0" daemon prio=10 tid=0x00007f4798097000 nid=0xd6d waiting on condition [0x0000000000000000]
>>   [junit4]    java.lang.Thread.State: RUNNABLE
>>   [junit4]
>>   [junit4] "Signal Dispatcher" daemon prio=10 tid=0x00007f4798094800 nid=0xd6c waiting on condition [0x0000000000000000]
>>   [junit4]    java.lang.Thread.State: RUNNABLE
>>   [junit4]
>>   [junit4] "Finalizer" daemon prio=10 tid=0x00007f4798078000 nid=0xd5a in Object.wait() [0x00007f479ccf3000]
>>   [junit4]    java.lang.Thread.State: WAITING (on object monitor)
>>   [junit4]     at java.lang.Object.wait(Native Method)
>>   [junit4]     - waiting on <0x00000000e00606d8> (a java.lang.ref.ReferenceQueue$Lock)
>>   [junit4]     at java.lang.ref.ReferenceQueue.remove(ReferenceQueue.java:118)
>>   [junit4]     - locked <0x00000000e00606d8> (a java.lang.ref.ReferenceQueue$Lock)
>>   [junit4]     at java.lang.ref.ReferenceQueue.remove(ReferenceQueue.java:134)
>>   [junit4]     at java.lang.ref.Finalizer$FinalizerThread.run(Finalizer.java:159)
>>   [junit4]
>>   [junit4] "Reference Handler" daemon prio=10 tid=0x00007f4798076000 nid=0xd58 in Object.wait() [0x00007f479cdf4000]
>>   [junit4]    java.lang.Thread.State: WAITING (on object monitor)
>>   [junit4]     at java.lang.Object.wait(Native Method)
>>   [junit4]     - waiting on <0x00000000e0060698> (a java.lang.ref.Reference$Lock)
>>   [junit4]     at java.lang.Object.wait(Object.java:485)
>>   [junit4]     at java.lang.ref.Reference$ReferenceHandler.run(Reference.java:116)
>>   [junit4]     - locked <0x00000000e0060698> (a java.lang.ref.Reference$Lock)
>>   [junit4]
>>   [junit4] "main" prio=10 tid=0x00007f479800a800 nid=0xd2a in Object.wait() [0x00007f479f39a000]
>>   [junit4]    java.lang.Thread.State: WAITING (on object monitor)
>>   [junit4]     at java.lang.Object.wait(Native Method)
>>   [junit4]     - waiting on <0x00000000e039bbf8> (a com.carrotsearch.randomizedtesting.RandomizedRunner$2)
>>   [junit4]     at java.lang.Thread.join(Thread.java:1186)
>>   [junit4]     - locked <0x00000000e039bbf8> (a com.carrotsearch.randomizedtesting.RandomizedRunner$2)
>>   [junit4]     at java.lang.Thread.join(Thread.java:1239)
>>   [junit4]     at com.carrotsearch.randomizedtesting.RandomizedRunner.runSuite(RandomizedRunner.java:561)
>>   [junit4]     at com.carrotsearch.randomizedtesting.RandomizedRunner.run(RandomizedRunner.java:521)
>>   [junit4]     at com.carrotsearch.ant.tasks.junit4.slave.SlaveMain.execute(SlaveMain.java:145)
>>   [junit4]     at com.carrotsearch.ant.tasks.junit4.slave.SlaveMain.main(SlaveMain.java:238)
>>   [junit4]     at com.carrotsearch.ant.tasks.junit4.slave.SlaveMainSafe.main(SlaveMainSafe.java:12)
>>   [junit4]
>>   [junit4] "VM Thread" prio=10 tid=0x00007f479806f800 nid=0xd56 runnable
>>   [junit4]
>>   [junit4] "GC task thread#0 (ParallelGC)" prio=10 tid=0x00007f479801d800 nid=0xd33 runnable
>>   [junit4]
>>   [junit4] "GC task thread#1 (ParallelGC)" prio=10 tid=0x00007f479801f000 nid=0xd34 runnable
>>   [junit4]
>>   [junit4] "GC task thread#2 (ParallelGC)" prio=10 tid=0x00007f4798021000 nid=0xd35 runnable
>>   [junit4]
>>   [junit4] "GC task thread#3 (ParallelGC)" prio=10 tid=0x00007f4798023000 nid=0xd36 runnable
>>   [junit4]
>>   [junit4] "GC task thread#4 (ParallelGC)" prio=10 tid=0x00007f4798024800 nid=0xd37 runnable
>>   [junit4]
>>   [junit4] "GC task thread#5 (ParallelGC)" prio=10 tid=0x00007f4798026800 nid=0xd38 runnable
>>   [junit4]
>>   [junit4] "GC task thread#6 (ParallelGC)" prio=10 tid=0x00007f4798028000 nid=0xd39 runnable
>>   [junit4]
>>   [junit4] "GC task thread#7 (ParallelGC)" prio=10 tid=0x00007f479802a000 nid=0xd3a runnable
>>   [junit4]
>>   [junit4] "VM Periodic Task Thread" prio=10 tid=0x00007f47980a6800 nid=0xd70 waiting on condition
>>   [junit4]
>>   [junit4] JNI global references: 1021
>>   [junit4]
>>   [junit4] Heap
>>   [junit4]  PSYoungGen      total 103872K, used 95119K [0x00000000f5560000, 0x00000000fd5a0000, 0x0000000100000000)
>>   [junit4]   eden space 101248K, 91% used [0x00000000f5560000,0x00000000fafbbd08,0x00000000fb840000)
>>   [junit4]   from space 2624K, 98% used [0x00000000fc150000,0x00000000fc3d8070,0x00000000fc3e0000)
>>   [junit4]   to   space 9280K, 0% used [0x00000000fb840000,0x00000000fb840000,0x00000000fc150000)
>>   [junit4]  PSOldGen        total 171008K, used 20869K [0x00000000e0000000, 0x00000000ea700000, 0x00000000f5560000)
>>   [junit4]   object space 171008K, 12% used [0x00000000e0000000,0x00000000e14614b0,0x00000000ea700000)
>>   [junit4]  PSPermGen       total 21248K, used 17334K [0x00000000dae00000, 0x00000000dc2c0000, 0x00000000e0000000)
>>   [junit4]   object space 21248K, 81% used [0x00000000dae00000,0x00000000dbeed8f0,0x00000000dc2c0000)
>>   [junit4]     at com.carrotsearch.ant.tasks.junit4.events.Deserializer.deserialize(Deserializer.java:31)
>>   [junit4] <<< JVM J2: EOF ----
>>   [junit4]     at com.carrotsearch.ant.tasks.junit4.LocalSlaveStreamHandler.pumpEvents(LocalSlaveStreamHandler.java:100)
>>   [junit4]     at com.carrotsearch.ant.tasks.junit4.LocalSlaveStreamHandler$1.run(LocalSlaveStreamHandler.java:73)
>>   [junit4]     at java.lang.Thread.run(Thread.java:662)
>>   [junit4] Caused by: java.io.IOException: java.lang.InterruptedException: sleep interrupted
>>   [junit4]     at com.carrotsearch.ant.tasks.junit4.TailInputStream.read(TailInputStream.java:66)
>>   [junit4]     at sun.nio.cs.StreamDecoder.readBytes(StreamDecoder.java:264)
>>   [junit4]     at sun.nio.cs.StreamDecoder.implRead(StreamDecoder.java:306)
>>   [junit4]     at sun.nio.cs.StreamDecoder.read(StreamDecoder.java:158)
>>   [junit4]     at java.io.InputStreamReader.read(InputStreamReader.java:167)
>>   [junit4]     at com.carrotsearch.ant.tasks.junit4.dependencies.com.google.gson.stream.JsonReader.fillBuffer(JsonReader.java:845)
>>   [junit4]     at com.carrotsearch.ant.tasks.junit4.dependencies.com.google.gson.stream.JsonReader.nextString(JsonReader.java:1012)
>>   [junit4]     at com.carrotsearch.ant.tasks.junit4.dependencies.com.google.gson.stream.JsonReader.nextInObject(JsonReader.java:755)
>>   [junit4]     at com.carrotsearch.ant.tasks.junit4.dependencies.com.google.gson.stream.JsonReader.quickPeek(JsonReader.java:387)
>>   [junit4]     at com.carrotsearch.ant.tasks.junit4.dependencies.com.google.gson.stream.JsonReader.hasNext(JsonReader.java:340)
>>   [junit4]     at com.carrotsearch.ant.tasks.junit4.dependencies.com.google.gson.internal.bind.TypeAdapters$22.read(TypeAdapters.java:602)
>>   [junit4]     at com.carrotsearch.ant.tasks.junit4.dependencies.com.google.gson.internal.bind.TypeAdapters$22.read(TypeAdapters.java:595)
>>   [junit4]     at com.carrotsearch.ant.tasks.junit4.dependencies.com.google.gson.internal.bind.TypeAdapters$22.read(TypeAdapters.java:603)
>>   [junit4]     at com.carrotsearch.ant.tasks.junit4.dependencies.com.google.gson.internal.bind.TypeAdapters$22.read(TypeAdapters.java:578)
>>   [junit4]     at com.carrotsearch.ant.tasks.junit4.dependencies.com.google.gson.internal.Streams.parse(Streams.java:44)
>>   [junit4]     ... 8 more
>>   [junit4] Caused by: java.lang.InterruptedException: sleep interrupted
>>   [junit4]     at java.lang.Thread.sleep(Native Method)
>>   [junit4]     at com.carrotsearch.ant.tasks.junit4.TailInputStream.read(TailInputStream.java:64)
>>   [junit4]     ... 22 more
>>   [junit4] JVM J0:     0.41 ..    77.64 =    77.23s
>>   [junit4] JVM J1:     0.41 ..    77.24 =    76.84s
>>   [junit4] JVM J3:     0.41 ..    77.05 =    76.65s
>>   [junit4] Execution time total: 3 days 3 hours 34 minutes 13 seconds
>>   [junit4] ERROR: Forked JVM execution exception: 2, execution line: /usr/lib/jvm/java-6-sun-1.6.0.24/jre/bin/java -Dtests.prefix=tests -Dtests.seed=61F406BA7C0B79FF -Xmx512M -Dtests.iters= -Dtests.verbose=false -Dtests.infostream=false -Dtests.lockdir=<http://sierranevada.servebeer.com/job/Lucene-Core-4x-Beasting/ws/build> -Dtests.codec=random -Dtests.postingsformat=random -Dtests.locale=random -Dtests.timezone=random -Dtests.directory=random -Dtests.linedocsfile=europarl.lines.txt.gz -Dtests.luceneMatchVersion=4.0 -Dtests.cleanthreads=perMethod -Djava.util.logging.config.file=/dev/null -Dtests.nightly=false -Dtests.weekly=false -Dtests.slow=false -Dtests.asserts.gracious=false -Dtests.multiplier=1 -DtempDir=. -Dlucene.version=4.0-SNAPSHOT -Djetty.testMode=1 -Djetty.insecurerandom=1 -Dsolr.directoryFactory=org.apache.solr.core.MockDirectoryFactory -classpath <http://sierranevada.servebeer.com/job/Lucene-Core-4x-Beasting/ws/build/test-framework/classes/java>:<http://sierranevada.servebeer.com/job/Lucene-Core-4x-Beasting/ws/test-framework/lib/junit-4.10.jar>:<http://sierranevada.servebeer.com/job/Lucene-Core-4x-Beasting/ws/test-framework/lib/randomizedtesting-runner-1.5.0.jar>:<http://sierranevada.servebeer.com/job/Lucene-Core-4x-Beasting/ws/build/core/classes/java>:<http://sierranevada.servebeer.com/job/Lucene-Core-4x-Beasting/ws/build/core/classes/test>:/usr/local/apache-ant-1.8.2/lib/ant-launcher.jar:/home/rmuir/.ant/lib/apache-rat-0.8.jar:/home/rmuir/.ant/lib/ivy-2.2.0.jar:/usr/local/apache-ant-1.8.2/lib/ant-junit4.jar:/usr/local/apache-ant-1.8.2/lib/ant-apache-resolver.jar:/usr/local/apache-ant-1.8.2/lib/ant-jai.jar:/usr/local/apache-ant-1.8.2/lib/ant-commons-logging.jar:/usr/local/apache-ant-1.8.2/lib/ant-apache-bcel.jar:/usr/local/apache-ant-1.8.2/lib/ant-apache-xalan2.jar:/usr/local/apache-ant-1.8.2/lib/ant-apache-regexp.jar:/usr/local/apache-ant-1.8.2/lib/ant-apache-log4j.jar:/usr/local/apache-ant-1.8.2/lib/ant-junit.jar:/usr/local/apache-ant-1.8.2/lib/ant-jsch.jar:/usr/local/apache-ant-1.8.2/lib/ant-jmf.jar:/usr/local/apache-ant-1.8.2/lib/ant-swing.jar:/usr/local/apache-ant-1.8.2/lib/ant-antlr.jar:/usr/local/apache-ant-1.8.2/lib/ant.jar:/usr/local/apache-ant-1.8.2/lib/ant-javamail.jar:/usr/local/apache-ant-1.8.2/lib/ant-jdepend.jar:/usr/local/apache-ant-1.8.2/lib/ant-testutil.jar:/usr/local/apache-ant-1.8.2/lib/ant-commons-net.jar:/usr/local/apache-ant-1.8.2/lib/ant-apache-oro.jar:/usr/local/apache-ant-1.8.2/lib/ant-netrexx.jar:/usr/local/apache-ant-1.8.2/lib/ant-apache-bsf.jar:/usr/lib/jvm/java-6-sun-1.6.0.24/lib/tools.jar:<http://sierranevada.servebeer.com/job/Lucene-Core-4x-Beasting/ws/test-framework/lib/junit4-ant-1.5.0.jar> -ea:org.apache.lucene... -ea:org.apache.solr... com.carrotsearch.ant.tasks.junit4.slave.SlaveMainSafe -eventsfile <http://sierranevada.servebeer.com/job/Lucene-Core-4x-Beasting/ws/build/core/test/junit4-J2-102923295b6b893e7.events> @<http://sierranevada.servebeer.com/job/Lucene-Core-4x-Beasting/ws/build/core/test/junit4-J2-102923295b6b893e7.suites>
>>
>> BUILD FAILED
>> <http://sierranevada.servebeer.com/job/Lucene-Core-4x-Beasting/ws/build.xml>:50: The following error occurred while executing this line:
>> <http://sierranevada.servebeer.com/job/Lucene-Core-4x-Beasting/ws/common-build.xml>:1036: The following error occurred while executing this line:
>> <http://sierranevada.servebeer.com/job/Lucene-Core-4x-Beasting/ws/common-build.xml>:757: At least one slave process threw an unexpected exception, first: Forked process exited with an error code: 143
>>
>> Total time: 4534 minutes 19 seconds
>> Build step 'Invoke Ant' marked build as failure
>>
>> ---------------------------------------------------------------------
>> To unsubscribe, e-mail: [hidden email]
>> For additional commands, e-mail: [hidden email]
>>
>
>
>
> --
> lucidimagination.com



--
lucidimagination.com

---------------------------------------------------------------------
To unsubscribe, e-mail: [hidden email]
For additional commands, e-mail: [hidden email]

Reply | Threaded
Open this post in threaded view
|

Re: Build failed in Jenkins: Lucene-Core-4x-Beasting #6934

Simon Willnauer
In reply to this post by Robert Muir
I committed a fix in r1353443 I posted on
https://issues.apache.org/jira/browse/LUCENE-4158

simon

On Mon, Jun 25, 2012 at 8:04 PM, Robert Muir <[hidden email]> wrote:

> I killed this after it was hung for 3 days. I'm not sure if its
> related to the other hang Uwe opened an issue for, or perhaps even
> fixed already.
>
> On Mon, Jun 25, 2012 at 2:03 PM,  <[hidden email]> wrote:
>> See <http://sierranevada.servebeer.com/job/Lucene-Core-4x-Beasting/6934/>
>>
>> ------------------------------------------
>> [...truncated 937 lines...]
>>   [junit4] Completed on J0 in 0.01s, 2 tests
>>   [junit4]
>>   [junit4] Suite: org.apache.lucene.analysis.TestMockCharFilter
>>   [junit4] Completed on J1 in 0.01s, 1 test
>>   [junit4]
>>   [junit4] Suite: org.apache.lucene.analysis.tokenattributes.TestSimpleAttributeImpl
>>   [junit4] Completed on J3 in 0.01s, 1 test
>>   [junit4]
>>   [junit4] Suite: org.apache.lucene.util.TestNamedSPILoader
>>   [junit4] Completed on J0 in 0.01s, 3 tests
>>   [junit4]
>>   [junit4] Suite: org.apache.lucene.TestAssertions
>>   [junit4] Completed on J1 in 0.01s, 1 test
>>   [junit4]
>>   [junit4] Suite: org.apache.lucene.index.TestIndexWriterOnJRECrash
>>   [junit4] IGNOR/A 0.00s J3 | TestIndexWriterOnJRECrash.testNRTThreads
>>   [junit4]    > Assumption #1: 'nightly' test group is disabled (@Nightly)
>>   [junit4] Completed on J3 in 0.01s, 1 test, 1 skipped
>>   [junit4]
>>   [junit4] Suite: org.apache.lucene.index.TestTerm
>>   [junit4] Completed on J0 in 0.01s, 1 test
>>   [junit4]
>>   [junit4] Suite: org.apache.lucene.store.TestByteArrayDataInput
>>   [junit4] Completed on J1 in 0.01s, 1 test
>>   [junit4]
>>   [junit4] Suite: org.apache.lucene.index.Test2BPostings
>>   [junit4] IGNOR/A 0.00s J3 | Test2BPostings.test
>>   [junit4]    > Assumption #1: 'nightly' test group is disabled (@Nightly)
>>   [junit4] Completed on J3 in 0.01s, 1 test, 1 skipped
>>   [junit4]
>>   [junit4] Suite: org.apache.lucene.util.TestIntsRef
>>   [junit4] Completed on J1 in 0.08s, 2 tests
>>   [junit4]
>>   [junit4] Suite: org.apache.lucene.codecs.lucene40.TestAllFilesHaveCodecHeader
>>   [junit4] Completed on J0 in 0.58s, 1 test
>>   [junit4]
>>   [junit4] Unhandled exception in thread: Thread[pumper-events,5,main]
>>   [junit4] com.carrotsearch.ant.tasks.junit4.dependencies.com.google.gson.JsonIOException: java.io.IOException: java.lang.InterruptedException: sleep interrupted
>>   [junit4] JVM J2: stdout was not empty, see: <http://sierranevada.servebeer.com/job/Lucene-Core-4x-Beasting/ws/build/core/test/junit4-J2-102923295b6b893e7.sysout>
>>   [junit4] >>> JVM J2: stdout (verbatim) ----
>>   [junit4]     at com.carrotsearch.ant.tasks.junit4.dependencies.com.google.gson.internal.Streams.parse(Streams.java:57)
>>   [junit4]     at com.carrotsearch.ant.tasks.junit4.dependencies.com.google.gson.GsonToMiniGsonTypeAdapterFactory$3.read(GsonToMiniGsonTypeAdapterFactory.java:81)
>>   [junit4]     at com.carrotsearch.ant.tasks.junit4.dependencies.com.google.gson.internal.bind.ReflectiveTypeAdapterFactory$1.read(ReflectiveTypeAdapterFactory.java:86)
>>   [junit4]     at com.carrotsearch.ant.tasks.junit4.dependencies.com.google.gson.internal.bind.ReflectiveTypeAdapterFactory$Adapter.read(ReflectiveTypeAdapterFactory.java:170)
>>   [junit4]     at com.carrotsearch.ant.tasks.junit4.dependencies.com.google.gson.Gson.fromJson(Gson.java:720)
>>   [junit4] 2012-06-25 14:03:31
>>   [junit4] Full thread dump Java HotSpot(TM) 64-Bit Server VM (19.1-b02 mixed mode):
>>   [junit4]
>>   [junit4] "Thread-65" daemon prio=10 tid=0x00007f4754192000 nid=0xeb5 in Object.wait() [0x00007f4794df6000]
>>   [junit4]    java.lang.Thread.State: WAITING (on object monitor)
>>   [junit4]     at java.lang.Object.wait(Native Method)
>>   [junit4]     - waiting on <0x00000000e04eab68> (a org.apache.lucene.index.DocumentsWriterStallControl)
>>   [junit4]     at java.lang.Object.wait(Object.java:485)
>>   [junit4]     at org.apache.lucene.index.DocumentsWriterStallControl.waitIfStalled(DocumentsWriterStallControl.java:75)
>>   [junit4]     - locked <0x00000000e04eab68> (a org.apache.lucene.index.DocumentsWriterStallControl)
>>   [junit4]     at org.apache.lucene.index.DocumentsWriterFlushControl.waitIfStalled(DocumentsWriterFlushControl.java:636)
>>   [junit4]     at org.apache.lucene.index.DocumentsWriter.preUpdate(DocumentsWriter.java:301)
>>   [junit4]     at org.apache.lucene.index.DocumentsWriter.updateDocument(DocumentsWriter.java:361)
>>   [junit4]     at org.apache.lucene.index.IndexWriter.updateDocument(IndexWriter.java:1334)
>>   [junit4]     at org.apache.lucene.index.IndexWriter.addDocument(IndexWriter.java:1085)
>>   [junit4]     at org.apache.lucene.index.IndexWriter.addDocument(IndexWriter.java:1066)
>>   [junit4]     at org.apache.lucene.index.TestIndexWriterReader$2.run(TestIndexWriterReader.java:823)
>>   [junit4]
>>   [junit4] "Thread-64" daemon prio=10 tid=0x00007f47540d2800 nid=0xeb4 in Object.wait() [0x00007f4794ef7000]
>>   [junit4]    java.lang.Thread.State: WAITING (on object monitor)
>>   [junit4]     at java.lang.Object.wait(Native Method)
>>   [junit4]     - waiting on <0x00000000e04eab68> (a org.apache.lucene.index.DocumentsWriterStallControl)
>>   [junit4]     at java.lang.Object.wait(Object.java:485)
>>   [junit4]     at org.apache.lucene.index.DocumentsWriterStallControl.waitIfStalled(DocumentsWriterStallControl.java:75)
>>   [junit4]     - locked <0x00000000e04eab68> (a org.apache.lucene.index.DocumentsWriterStallControl)
>>   [junit4]     at org.apache.lucene.index.DocumentsWriterFlushControl.waitIfStalled(DocumentsWriterFlushControl.java:636)
>>   [junit4]     at org.apache.lucene.index.DocumentsWriter.preUpdate(DocumentsWriter.java:301)
>>   [junit4]     at org.apache.lucene.index.DocumentsWriter.updateDocument(DocumentsWriter.java:361)
>>   [junit4]     at org.apache.lucene.index.IndexWriter.updateDocument(IndexWriter.java:1334)
>>   [junit4]     at org.apache.lucene.index.IndexWriter.addDocument(IndexWriter.java:1085)
>>   [junit4]     at org.apache.lucene.index.IndexWriter.addDocument(IndexWriter.java:1066)
>>   [junit4]     at org.apache.lucene.index.TestIndexWriterReader$2.run(TestIndexWriterReader.java:823)
>>   [junit4]
>>   [junit4] "Thread-63" daemon prio=10 tid=0x00007f4754042800 nid=0xeb3 in Object.wait() [0x00007f47946ef000]
>>   [junit4]    java.lang.Thread.State: WAITING (on object monitor)
>>   [junit4]     at java.lang.Object.wait(Native Method)
>>   [junit4]     - waiting on <0x00000000e04eab68> (a org.apache.lucene.index.DocumentsWriterStallControl)
>>   [junit4]     at java.lang.Object.wait(Object.java:485)
>>   [junit4]     at org.apache.lucene.index.DocumentsWriterStallControl.waitIfStalled(DocumentsWriterStallControl.java:75)
>>   [junit4]     - locked <0x00000000e04eab68> (a org.apache.lucene.index.DocumentsWriterStallControl)
>>   [junit4]     at org.apache.lucene.index.DocumentsWriterFlushControl.waitIfStalled(DocumentsWriterFlushControl.java:636)
>>   [junit4]     at org.apache.lucene.index.DocumentsWriter.preUpdate(DocumentsWriter.java:301)
>>   [junit4]     at org.apache.lucene.index.DocumentsWriter.updateDocument(DocumentsWriter.java:361)
>>   [junit4]     at org.apache.lucene.index.IndexWriter.updateDocument(IndexWriter.java:1334)
>>   [junit4]     at org.apache.lucene.index.IndexWriter.addDocument(IndexWriter.java:1085)
>>   [junit4]     at org.apache.lucene.index.IndexWriter.addDocument(IndexWriter.java:1066)
>>   [junit4]     at org.apache.lucene.index.TestIndexWriterReader$2.run(TestIndexWriterReader.java:823)
>>   [junit4]
>>   [junit4] "TEST-TestScope-org.apache.lucene.index.TestIndexWriterReader.testDuringAddDelete-seed#[61F406BA7C0B79FF]" prio=10 tid=0x00007f4798237800 nid=0xe9b in Object.wait() [0x00007f479c10d000]
>>   [junit4]    java.lang.Thread.State: WAITING (on object monitor)
>>   [junit4]     at java.lang.Object.wait(Native Method)
>>   [junit4]     - waiting on <0x00000000fc160188> (a org.apache.lucene.index.TestIndexWriterReader$2)
>>   [junit4]     at java.lang.Thread.join(Thread.java:1186)
>>   [junit4]     - locked <0x00000000fc160188> (a org.apache.lucene.index.TestIndexWriterReader$2)
>>   [junit4]     at java.lang.Thread.join(Thread.java:1239)
>>   [junit4]     at org.apache.lucene.index.TestIndexWriterReader.testDuringAddDelete(TestIndexWriterReader.java:855)
>>   [junit4]     at sun.reflect.NativeMethodAccessorImpl.invoke0(Native Method)
>>   [junit4]     at sun.reflect.NativeMethodAccessorImpl.invoke(NativeMethodAccessorImpl.java:39)
>>   [junit4]     at sun.reflect.DelegatingMethodAccessorImpl.invoke(DelegatingMethodAccessorImpl.java:25)
>>   [junit4]     at java.lang.reflect.Method.invoke(Method.java:597)
>>   [junit4]     at com.carrotsearch.randomizedtesting.RandomizedRunner.invoke(RandomizedRunner.java:1969)
>>   [junit4]     at com.carrotsearch.randomizedtesting.RandomizedRunner.access$1100(RandomizedRunner.java:132)
>>   [junit4]     at com.carrotsearch.randomizedtesting.RandomizedRunner$6.evaluate(RandomizedRunner.java:814)
>>   [junit4]     at com.carrotsearch.randomizedtesting.RandomizedRunner$7.evaluate(RandomizedRunner.java:875)
>>   [junit4]     at com.carrotsearch.randomizedtesting.RandomizedRunner$8.evaluate(RandomizedRunner.java:889)
>>   [junit4]     at org.apache.lucene.util.TestRuleSetupTeardownChained$1.evaluate(TestRuleSetupTeardownChained.java:50)
>>   [junit4]     at org.apache.lucene.util.TestRuleFieldCacheSanity$1.evaluate(TestRuleFieldCacheSanity.java:32)
>>   [junit4]     at org.apache.lucene.util.AbstractBeforeAfterRule$1.evaluate(AbstractBeforeAfterRule.java:45)
>>   [junit4]     at com.carrotsearch.randomizedtesting.rules.SystemPropertiesInvariantRule$1.evaluate(SystemPropertiesInvariantRule.java:55)
>>   [junit4]     at org.apache.lucene.util.TestRuleReportUncaughtExceptions$1.evaluate(TestRuleReportUncaughtExceptions.java:68)
>>   [junit4]     at org.apache.lucene.util.TestRuleThreadAndTestName$1.evaluate(TestRuleThreadAndTestName.java:48)
>>   [junit4]     at org.apache.lucene.util.TestRuleMarkFailure$1.evaluate(TestRuleMarkFailure.java:48)
>>   [junit4]     at com.carrotsearch.randomizedtesting.RandomizedRunner.runSingleTest(RandomizedRunner.java:821)
>>   [junit4]     at com.carrotsearch.randomizedtesting.RandomizedRunner.access$700(RandomizedRunner.java:132)
>>   [junit4]     at com.carrotsearch.randomizedtesting.RandomizedRunner$3$1.run(RandomizedRunner.java:669)
>>   [junit4]     at com.carrotsearch.randomizedtesting.RandomizedRunner$3.evaluate(RandomizedRunner.java:695)
>>   [junit4]     at com.carrotsearch.randomizedtesting.RandomizedRunner$4.evaluate(RandomizedRunner.java:734)
>>   [junit4]     at com.carrotsearch.randomizedtesting.RandomizedRunner$5.evaluate(RandomizedRunner.java:745)
>>   [junit4]     at org.apache.lucene.util.AbstractBeforeAfterRule$1.evaluate(AbstractBeforeAfterRule.java:45)
>>   [junit4]     at org.apache.lucene.util.TestRuleReportUncaughtExceptions$1.evaluate(TestRuleReportUncaughtExceptions.java:68)
>>   [junit4]     at org.apache.lucene.util.TestRuleStoreClassName$1.evaluate(TestRuleStoreClassName.java:38)
>>   [junit4]     at org.apache.lucene.util.TestRuleIcuHack$1.evaluate(TestRuleIcuHack.java:51)
>>   [junit4]     at com.carrotsearch.randomizedtesting.rules.SystemPropertiesInvariantRule$1.evaluate(SystemPropertiesInvariantRule.java:55)
>>   [junit4]     at org.apache.lucene.util.TestRuleNoInstanceHooksOverrides$1.evaluate(TestRuleNoInstanceHooksOverrides.java:53)
>>   [junit4]     at org.apache.lucene.util.TestRuleNoStaticHooksShadowing$1.evaluate(TestRuleNoStaticHooksShadowing.java:52)
>>   [junit4]     at org.apache.lucene.util.TestRuleAssertionsRequired$1.evaluate(TestRuleAssertionsRequired.java:36)
>>   [junit4]     at org.apache.lucene.util.TestRuleMarkFailure$1.evaluate(TestRuleMarkFailure.java:48)
>>   [junit4]     at org.apache.lucene.util.TestRuleIgnoreTestSuites$1.evaluate(TestRuleIgnoreTestSuites.java:56)
>>   [junit4]     at com.carrotsearch.randomizedtesting.RandomizedRunner.runSuite(RandomizedRunner.java:605)
>>   [junit4]     at com.carrotsearch.randomizedtesting.RandomizedRunner.access$400(RandomizedRunner.java:132)
>>   [junit4]     at com.carrotsearch.randomizedtesting.RandomizedRunner$2.run(RandomizedRunner.java:551)
>>   [junit4]
>>   [junit4] "Low Memory Detector" daemon prio=10 tid=0x00007f479809c000 nid=0xd6f runnable [0x0000000000000000]
>>   [junit4]    java.lang.Thread.State: RUNNABLE
>>   [junit4]
>>   [junit4] "CompilerThread1" daemon prio=10 tid=0x00007f4798099800 nid=0xd6e waiting on condition [0x0000000000000000]
>>   [junit4]    java.lang.Thread.State: RUNNABLE
>>   [junit4]
>>   [junit4] "CompilerThread0" daemon prio=10 tid=0x00007f4798097000 nid=0xd6d waiting on condition [0x0000000000000000]
>>   [junit4]    java.lang.Thread.State: RUNNABLE
>>   [junit4]
>>   [junit4] "Signal Dispatcher" daemon prio=10 tid=0x00007f4798094800 nid=0xd6c waiting on condition [0x0000000000000000]
>>   [junit4]    java.lang.Thread.State: RUNNABLE
>>   [junit4]
>>   [junit4] "Finalizer" daemon prio=10 tid=0x00007f4798078000 nid=0xd5a in Object.wait() [0x00007f479ccf3000]
>>   [junit4]    java.lang.Thread.State: WAITING (on object monitor)
>>   [junit4]     at java.lang.Object.wait(Native Method)
>>   [junit4]     - waiting on <0x00000000e00606d8> (a java.lang.ref.ReferenceQueue$Lock)
>>   [junit4]     at java.lang.ref.ReferenceQueue.remove(ReferenceQueue.java:118)
>>   [junit4]     - locked <0x00000000e00606d8> (a java.lang.ref.ReferenceQueue$Lock)
>>   [junit4]     at java.lang.ref.ReferenceQueue.remove(ReferenceQueue.java:134)
>>   [junit4]     at java.lang.ref.Finalizer$FinalizerThread.run(Finalizer.java:159)
>>   [junit4]
>>   [junit4] "Reference Handler" daemon prio=10 tid=0x00007f4798076000 nid=0xd58 in Object.wait() [0x00007f479cdf4000]
>>   [junit4]    java.lang.Thread.State: WAITING (on object monitor)
>>   [junit4]     at java.lang.Object.wait(Native Method)
>>   [junit4]     - waiting on <0x00000000e0060698> (a java.lang.ref.Reference$Lock)
>>   [junit4]     at java.lang.Object.wait(Object.java:485)
>>   [junit4]     at java.lang.ref.Reference$ReferenceHandler.run(Reference.java:116)
>>   [junit4]     - locked <0x00000000e0060698> (a java.lang.ref.Reference$Lock)
>>   [junit4]
>>   [junit4] "main" prio=10 tid=0x00007f479800a800 nid=0xd2a in Object.wait() [0x00007f479f39a000]
>>   [junit4]    java.lang.Thread.State: WAITING (on object monitor)
>>   [junit4]     at java.lang.Object.wait(Native Method)
>>   [junit4]     - waiting on <0x00000000e039bbf8> (a com.carrotsearch.randomizedtesting.RandomizedRunner$2)
>>   [junit4]     at java.lang.Thread.join(Thread.java:1186)
>>   [junit4]     - locked <0x00000000e039bbf8> (a com.carrotsearch.randomizedtesting.RandomizedRunner$2)
>>   [junit4]     at java.lang.Thread.join(Thread.java:1239)
>>   [junit4]     at com.carrotsearch.randomizedtesting.RandomizedRunner.runSuite(RandomizedRunner.java:561)
>>   [junit4]     at com.carrotsearch.randomizedtesting.RandomizedRunner.run(RandomizedRunner.java:521)
>>   [junit4]     at com.carrotsearch.ant.tasks.junit4.slave.SlaveMain.execute(SlaveMain.java:145)
>>   [junit4]     at com.carrotsearch.ant.tasks.junit4.slave.SlaveMain.main(SlaveMain.java:238)
>>   [junit4]     at com.carrotsearch.ant.tasks.junit4.slave.SlaveMainSafe.main(SlaveMainSafe.java:12)
>>   [junit4]
>>   [junit4] "VM Thread" prio=10 tid=0x00007f479806f800 nid=0xd56 runnable
>>   [junit4]
>>   [junit4] "GC task thread#0 (ParallelGC)" prio=10 tid=0x00007f479801d800 nid=0xd33 runnable
>>   [junit4]
>>   [junit4] "GC task thread#1 (ParallelGC)" prio=10 tid=0x00007f479801f000 nid=0xd34 runnable
>>   [junit4]
>>   [junit4] "GC task thread#2 (ParallelGC)" prio=10 tid=0x00007f4798021000 nid=0xd35 runnable
>>   [junit4]
>>   [junit4] "GC task thread#3 (ParallelGC)" prio=10 tid=0x00007f4798023000 nid=0xd36 runnable
>>   [junit4]
>>   [junit4] "GC task thread#4 (ParallelGC)" prio=10 tid=0x00007f4798024800 nid=0xd37 runnable
>>   [junit4]
>>   [junit4] "GC task thread#5 (ParallelGC)" prio=10 tid=0x00007f4798026800 nid=0xd38 runnable
>>   [junit4]
>>   [junit4] "GC task thread#6 (ParallelGC)" prio=10 tid=0x00007f4798028000 nid=0xd39 runnable
>>   [junit4]
>>   [junit4] "GC task thread#7 (ParallelGC)" prio=10 tid=0x00007f479802a000 nid=0xd3a runnable
>>   [junit4]
>>   [junit4] "VM Periodic Task Thread" prio=10 tid=0x00007f47980a6800 nid=0xd70 waiting on condition
>>   [junit4]
>>   [junit4] JNI global references: 1021
>>   [junit4]
>>   [junit4] Heap
>>   [junit4]  PSYoungGen      total 103872K, used 95119K [0x00000000f5560000, 0x00000000fd5a0000, 0x0000000100000000)
>>   [junit4]   eden space 101248K, 91% used [0x00000000f5560000,0x00000000fafbbd08,0x00000000fb840000)
>>   [junit4]   from space 2624K, 98% used [0x00000000fc150000,0x00000000fc3d8070,0x00000000fc3e0000)
>>   [junit4]   to   space 9280K, 0% used [0x00000000fb840000,0x00000000fb840000,0x00000000fc150000)
>>   [junit4]  PSOldGen        total 171008K, used 20869K [0x00000000e0000000, 0x00000000ea700000, 0x00000000f5560000)
>>   [junit4]   object space 171008K, 12% used [0x00000000e0000000,0x00000000e14614b0,0x00000000ea700000)
>>   [junit4]  PSPermGen       total 21248K, used 17334K [0x00000000dae00000, 0x00000000dc2c0000, 0x00000000e0000000)
>>   [junit4]   object space 21248K, 81% used [0x00000000dae00000,0x00000000dbeed8f0,0x00000000dc2c0000)
>>   [junit4]     at com.carrotsearch.ant.tasks.junit4.events.Deserializer.deserialize(Deserializer.java:31)
>>   [junit4] <<< JVM J2: EOF ----
>>   [junit4]     at com.carrotsearch.ant.tasks.junit4.LocalSlaveStreamHandler.pumpEvents(LocalSlaveStreamHandler.java:100)
>>   [junit4]     at com.carrotsearch.ant.tasks.junit4.LocalSlaveStreamHandler$1.run(LocalSlaveStreamHandler.java:73)
>>   [junit4]     at java.lang.Thread.run(Thread.java:662)
>>   [junit4] Caused by: java.io.IOException: java.lang.InterruptedException: sleep interrupted
>>   [junit4]     at com.carrotsearch.ant.tasks.junit4.TailInputStream.read(TailInputStream.java:66)
>>   [junit4]     at sun.nio.cs.StreamDecoder.readBytes(StreamDecoder.java:264)
>>   [junit4]     at sun.nio.cs.StreamDecoder.implRead(StreamDecoder.java:306)
>>   [junit4]     at sun.nio.cs.StreamDecoder.read(StreamDecoder.java:158)
>>   [junit4]     at java.io.InputStreamReader.read(InputStreamReader.java:167)
>>   [junit4]     at com.carrotsearch.ant.tasks.junit4.dependencies.com.google.gson.stream.JsonReader.fillBuffer(JsonReader.java:845)
>>   [junit4]     at com.carrotsearch.ant.tasks.junit4.dependencies.com.google.gson.stream.JsonReader.nextString(JsonReader.java:1012)
>>   [junit4]     at com.carrotsearch.ant.tasks.junit4.dependencies.com.google.gson.stream.JsonReader.nextInObject(JsonReader.java:755)
>>   [junit4]     at com.carrotsearch.ant.tasks.junit4.dependencies.com.google.gson.stream.JsonReader.quickPeek(JsonReader.java:387)
>>   [junit4]     at com.carrotsearch.ant.tasks.junit4.dependencies.com.google.gson.stream.JsonReader.hasNext(JsonReader.java:340)
>>   [junit4]     at com.carrotsearch.ant.tasks.junit4.dependencies.com.google.gson.internal.bind.TypeAdapters$22.read(TypeAdapters.java:602)
>>   [junit4]     at com.carrotsearch.ant.tasks.junit4.dependencies.com.google.gson.internal.bind.TypeAdapters$22.read(TypeAdapters.java:595)
>>   [junit4]     at com.carrotsearch.ant.tasks.junit4.dependencies.com.google.gson.internal.bind.TypeAdapters$22.read(TypeAdapters.java:603)
>>   [junit4]     at com.carrotsearch.ant.tasks.junit4.dependencies.com.google.gson.internal.bind.TypeAdapters$22.read(TypeAdapters.java:578)
>>   [junit4]     at com.carrotsearch.ant.tasks.junit4.dependencies.com.google.gson.internal.Streams.parse(Streams.java:44)
>>   [junit4]     ... 8 more
>>   [junit4] Caused by: java.lang.InterruptedException: sleep interrupted
>>   [junit4]     at java.lang.Thread.sleep(Native Method)
>>   [junit4]     at com.carrotsearch.ant.tasks.junit4.TailInputStream.read(TailInputStream.java:64)
>>   [junit4]     ... 22 more
>>   [junit4] JVM J0:     0.41 ..    77.64 =    77.23s
>>   [junit4] JVM J1:     0.41 ..    77.24 =    76.84s
>>   [junit4] JVM J3:     0.41 ..    77.05 =    76.65s
>>   [junit4] Execution time total: 3 days 3 hours 34 minutes 13 seconds
>>   [junit4] ERROR: Forked JVM execution exception: 2, execution line: /usr/lib/jvm/java-6-sun-1.6.0.24/jre/bin/java -Dtests.prefix=tests -Dtests.seed=61F406BA7C0B79FF -Xmx512M -Dtests.iters= -Dtests.verbose=false -Dtests.infostream=false -Dtests.lockdir=<http://sierranevada.servebeer.com/job/Lucene-Core-4x-Beasting/ws/build> -Dtests.codec=random -Dtests.postingsformat=random -Dtests.locale=random -Dtests.timezone=random -Dtests.directory=random -Dtests.linedocsfile=europarl.lines.txt.gz -Dtests.luceneMatchVersion=4.0 -Dtests.cleanthreads=perMethod -Djava.util.logging.config.file=/dev/null -Dtests.nightly=false -Dtests.weekly=false -Dtests.slow=false -Dtests.asserts.gracious=false -Dtests.multiplier=1 -DtempDir=. -Dlucene.version=4.0-SNAPSHOT -Djetty.testMode=1 -Djetty.insecurerandom=1 -Dsolr.directoryFactory=org.apache.solr.core.MockDirectoryFactory -classpath <http://sierranevada.servebeer.com/job/Lucene-Core-4x-Beasting/ws/build/test-framework/classes/java>:<http://sierranevada.servebeer.com/job/Lucene-Core-4x-Beasting/ws/test-framework/lib/junit-4.10.jar>:<http://sierranevada.servebeer.com/job/Lucene-Core-4x-Beasting/ws/test-framework/lib/randomizedtesting-runner-1.5.0.jar>:<http://sierranevada.servebeer.com/job/Lucene-Core-4x-Beasting/ws/build/core/classes/java>:<http://sierranevada.servebeer.com/job/Lucene-Core-4x-Beasting/ws/build/core/classes/test>:/usr/local/apache-ant-1.8.2/lib/ant-launcher.jar:/home/rmuir/.ant/lib/apache-rat-0.8.jar:/home/rmuir/.ant/lib/ivy-2.2.0.jar:/usr/local/apache-ant-1.8.2/lib/ant-junit4.jar:/usr/local/apache-ant-1.8.2/lib/ant-apache-resolver.jar:/usr/local/apache-ant-1.8.2/lib/ant-jai.jar:/usr/local/apache-ant-1.8.2/lib/ant-commons-logging.jar:/usr/local/apache-ant-1.8.2/lib/ant-apache-bcel.jar:/usr/local/apache-ant-1.8.2/lib/ant-apache-xalan2.jar:/usr/local/apache-ant-1.8.2/lib/ant-apache-regexp.jar:/usr/local/apache-ant-1.8.2/lib/ant-apache-log4j.jar:/usr/local/apache-ant-1.8.2/lib/ant-junit.jar:/usr/local/apache-ant-1.8.2/lib/ant-jsch.jar:/usr/local/apache-ant-1.8.2/lib/ant-jmf.jar:/usr/local/apache-ant-1.8.2/lib/ant-swing.jar:/usr/local/apache-ant-1.8.2/lib/ant-antlr.jar:/usr/local/apache-ant-1.8.2/lib/ant.jar:/usr/local/apache-ant-1.8.2/lib/ant-javamail.jar:/usr/local/apache-ant-1.8.2/lib/ant-jdepend.jar:/usr/local/apache-ant-1.8.2/lib/ant-testutil.jar:/usr/local/apache-ant-1.8.2/lib/ant-commons-net.jar:/usr/local/apache-ant-1.8.2/lib/ant-apache-oro.jar:/usr/local/apache-ant-1.8.2/lib/ant-netrexx.jar:/usr/local/apache-ant-1.8.2/lib/ant-apache-bsf.jar:/usr/lib/jvm/java-6-sun-1.6.0.24/lib/tools.jar:<http://sierranevada.servebeer.com/job/Lucene-Core-4x-Beasting/ws/test-framework/lib/junit4-ant-1.5.0.jar> -ea:org.apache.lucene... -ea:org.apache.solr... com.carrotsearch.ant.tasks.junit4.slave.SlaveMainSafe -eventsfile <http://sierranevada.servebeer.com/job/Lucene-Core-4x-Beasting/ws/build/core/test/junit4-J2-102923295b6b893e7.events> @<http://sierranevada.servebeer.com/job/Lucene-Core-4x-Beasting/ws/build/core/test/junit4-J2-102923295b6b893e7.suites>
>>
>> BUILD FAILED
>> <http://sierranevada.servebeer.com/job/Lucene-Core-4x-Beasting/ws/build.xml>:50: The following error occurred while executing this line:
>> <http://sierranevada.servebeer.com/job/Lucene-Core-4x-Beasting/ws/common-build.xml>:1036: The following error occurred while executing this line:
>> <http://sierranevada.servebeer.com/job/Lucene-Core-4x-Beasting/ws/common-build.xml>:757: At least one slave process threw an unexpected exception, first: Forked process exited with an error code: 143
>>
>> Total time: 4534 minutes 19 seconds
>> Build step 'Invoke Ant' marked build as failure
>>
>> ---------------------------------------------------------------------
>> To unsubscribe, e-mail: [hidden email]
>> For additional commands, e-mail: [hidden email]
>>
>
>
>
> --
> lucidimagination.com
>
> ---------------------------------------------------------------------
> To unsubscribe, e-mail: [hidden email]
> For additional commands, e-mail: [hidden email]
>

---------------------------------------------------------------------
To unsubscribe, e-mail: [hidden email]
For additional commands, e-mail: [hidden email]