Build failed in Jenkins: Nutch-trunk #3626

classic Classic list List threaded Threaded
2 messages Options
Reply | Threaded
Open this post in threaded view
|

Build failed in Jenkins: Nutch-trunk #3626

Apache Jenkins Server-2
See <https://builds.apache.org/job/Nutch-trunk/3626/display/redirect?page=changes>

Changes:

[snagel] NUTCH-2722 Fetch dependencies via https - change repository URLs to

------------------------------------------
[...truncated 46.95 KB...]
[ivy:resolve] ................. (93kB)
[ivy:resolve] .. (0kB)
[ivy:resolve] [SUCCESSFUL ] javax.servlet#javax.servlet-api;3.1.0!javax.servlet-api.jar (105ms)
[ivy:resolve] downloading https://repo1.maven.org/maven2/com/fasterxml/jackson/core/jackson-annotations/2.9.0/jackson-annotations-2.9.0.jar ...
[ivy:resolve] ................ (64kB)
[ivy:resolve] .. (0kB)
[ivy:resolve] [SUCCESSFUL ] com.fasterxml.jackson.core#jackson-annotations;2.9.0!jackson-annotations.jar(bundle) (103ms)
[ivy:resolve] downloading https://repo1.maven.org/maven2/com/fasterxml/jackson/core/jackson-core/2.9.7/jackson-core-2.9.7.jar ...
[ivy:resolve] ............................... (316kB)
[ivy:resolve] .. (0kB)
[ivy:resolve] [SUCCESSFUL ] com.fasterxml.jackson.core#jackson-core;2.9.7!jackson-core.jar(bundle) (118ms)
[ivy:resolve] downloading https://repo1.maven.org/maven2/com/fasterxml/jackson/jaxrs/jackson-jaxrs-base/2.9.7/jackson-jaxrs-base-2.9.7.jar ...
[ivy:resolve] .............. (31kB)
[ivy:resolve] .. (0kB)
[ivy:resolve] [SUCCESSFUL ] com.fasterxml.jackson.jaxrs#jackson-jaxrs-base;2.9.7!jackson-jaxrs-base.jar(bundle) (101ms)
[ivy:resolve] downloading https://repo1.maven.org/maven2/com/fasterxml/jackson/module/jackson-module-jaxb-annotations/2.9.7/jackson-module-jaxb-annotations-2.9.7.jar ...
[ivy:resolve] .............. (32kB)
[ivy:resolve] .. (0kB)
[ivy:resolve] [SUCCESSFUL ] com.fasterxml.jackson.module#jackson-module-jaxb-annotations;2.9.7!jackson-module-jaxb-annotations.jar(bundle) (101ms)
[ivy:resolve] downloading https://repo1.maven.org/maven2/org/htmlparser/htmlparser/1.6/htmlparser-1.6.jar ...
[ivy:resolve] .............................. (281kB)
[ivy:resolve] .. (0kB)
[ivy:resolve] [SUCCESSFUL ] org.htmlparser#htmlparser;1.6!htmlparser.jar (180ms)
[ivy:resolve] downloading https://repo1.maven.org/maven2/com/googlecode/juniversalchardet/juniversalchardet/1.0.3/juniversalchardet-1.0.3.jar ...
[ivy:resolve] ......................... (215kB)
[ivy:resolve] .. (0kB)
[ivy:resolve] [SUCCESSFUL ] com.googlecode.juniversalchardet#juniversalchardet;1.0.3!juniversalchardet.jar (112ms)
[ivy:resolve] downloading https://repo1.maven.org/maven2/org/springframework/spring-aop/4.0.9.RELEASE/spring-aop-4.0.9.RELEASE.jar ...
[ivy:resolve] ................................. (344kB)
[ivy:resolve] .. (0kB)
[ivy:resolve] [SUCCESSFUL ] org.springframework#spring-aop;4.0.9.RELEASE!spring-aop.jar (121ms)
[ivy:resolve] downloading https://repo1.maven.org/maven2/org/springframework/spring-beans/4.0.9.RELEASE/spring-beans-4.0.9.RELEASE.jar ...
[ivy:resolve] ..................................................... (656kB)
[ivy:resolve] .. (0kB)
[ivy:resolve] [SUCCESSFUL ] org.springframework#spring-beans;4.0.9.RELEASE!spring-beans.jar (135ms)
[ivy:resolve] downloading https://repo1.maven.org/maven2/org/springframework/spring-expression/4.0.9.RELEASE/spring-expression-4.0.9.RELEASE.jar ...
[ivy:resolve] ........................ (200kB)
[ivy:resolve] .. (0kB)
[ivy:resolve] [SUCCESSFUL ] org.springframework#spring-expression;4.0.9.RELEASE!spring-expression.jar (112ms)
[ivy:resolve] downloading https://repo1.maven.org/maven2/com/j256/ormlite/ormlite-core/5.1/ormlite-core-5.1.jar ...
[ivy:resolve] ................................ (322kB)
[ivy:resolve] .. (0kB)
[ivy:resolve] [SUCCESSFUL ] com.j256.ormlite#ormlite-core;5.1!ormlite-core.jar (120ms)
[ivy:resolve] downloading https://repo1.maven.org/maven2/org/apache/wicket/wicket-util/6.17.0/wicket-util-6.17.0.jar ...
[ivy:resolve] ..................................... (414kB)
[ivy:resolve] .. (0kB)
[ivy:resolve] [SUCCESSFUL ] org.apache.wicket#wicket-util;6.17.0!wicket-util.jar (127ms)
[ivy:resolve] downloading https://repo1.maven.org/maven2/org/apache/wicket/wicket-request/6.17.0/wicket-request-6.17.0.jar ...
[ivy:resolve] ................. (84kB)
[ivy:resolve] .. (0kB)
[ivy:resolve] [SUCCESSFUL ] org.apache.wicket#wicket-request;6.17.0!wicket-request.jar (173ms)
[ivy:resolve] downloading https://repo1.maven.org/maven2/org/apache/wicket/wicket-ioc/6.17.0/wicket-ioc-6.17.0.jar ...
[ivy:resolve] .......... (21kB)
[ivy:resolve] .. (0kB)
[ivy:resolve] [SUCCESSFUL ] org.apache.wicket#wicket-ioc;6.17.0!wicket-ioc.jar (99ms)
[ivy:resolve] downloading https://repo1.maven.org/maven2/cglib/cglib/2.2.2/cglib-2.2.2.jar ...
[ivy:resolve] ............................. (280kB)
[ivy:resolve] .. (0kB)
[ivy:resolve] [SUCCESSFUL ] cglib#cglib;2.2.2!cglib.jar (117ms)
[ivy:resolve] downloading https://repo1.maven.org/maven2/asm/asm/3.3.1/asm-3.3.1.jar ...
[ivy:resolve] .............. (42kB)
[ivy:resolve] .. (0kB)
[ivy:resolve] [SUCCESSFUL ] asm#asm;3.3.1!asm.jar (101ms)
[ivy:resolve] downloading https://repo1.maven.org/maven2/de/agilecoders/wicket/jquery-selectors/0.0.3/jquery-selectors-0.0.3.jar ...
[ivy:resolve] ............ (26kB)
[ivy:resolve] .. (0kB)
[ivy:resolve] [SUCCESSFUL ] de.agilecoders.wicket#jquery-selectors;0.0.3!jquery-selectors.jar (100ms)
[ivy:resolve] downloading https://repo1.maven.org/maven2/de/agilecoders/wicket/webjars/wicket-webjars/0.4.0/wicket-webjars-0.4.0.jar ...
[ivy:resolve] ................ (37kB)
[ivy:resolve] .. (0kB)
[ivy:resolve] [SUCCESSFUL ] de.agilecoders.wicket.webjars#wicket-webjars;0.4.0!wicket-webjars.jar (101ms)
[ivy:resolve] downloading https://repo1.maven.org/maven2/org/webjars/bootstrap/3.0.3/bootstrap-3.0.3.jar ...
[ivy:resolve] ........................ (196kB)
[ivy:resolve] .. (0kB)
[ivy:resolve] [SUCCESSFUL ] org.webjars#bootstrap;3.0.3!bootstrap.jar (112ms)
[ivy:resolve] downloading https://repo1.maven.org/maven2/org/webjars/modernizr/2.6.2-1/modernizr-2.6.2-1.jar ...
[ivy:resolve] ........... (24kB)
[ivy:resolve] .. (0kB)
[ivy:resolve] [SUCCESSFUL ] org.webjars#modernizr;2.6.2-1!modernizr.jar (100ms)
[ivy:resolve] downloading https://repo1.maven.org/maven2/joda-time/joda-time/2.3/joda-time-2.3.jar ...
[ivy:resolve] ............................................... (567kB)
[ivy:resolve] .. (0kB)
[ivy:resolve] [SUCCESSFUL ] joda-time#joda-time;2.3!joda-time.jar (136ms)
[ivy:resolve] downloading https://repo1.maven.org/maven2/org/apache/wicket/wicket-extensions/6.13.0/wicket-extensions-6.13.0.jar ...
[ivy:resolve] ................................................................................................ (1343kB)
[ivy:resolve] .. (0kB)
[ivy:resolve] [SUCCESSFUL ] org.apache.wicket#wicket-extensions;6.13.0!wicket-extensions.jar (180ms)
[ivy:resolve] downloading https://repo1.maven.org/maven2/de/agilecoders/maven/maven-parent-config/0.3.4/maven-parent-config-0.3.4.jar ...
[ivy:resolve] .... (5kB)
[ivy:resolve] .. (0kB)
[ivy:resolve] [SUCCESSFUL ] de.agilecoders.maven#maven-parent-config;0.3.4!maven-parent-config.jar (98ms)
[ivy:resolve] downloading https://repo1.maven.org/maven2/org/reflections/reflections/0.9.8/reflections-0.9.8.jar ...
[ivy:resolve] .................. (100kB)
[ivy:resolve] .. (0kB)
[ivy:resolve] [SUCCESSFUL ] org.reflections#reflections;0.9.8!reflections.jar (105ms)
[ivy:resolve] downloading https://repo1.maven.org/maven2/javassist/javassist/3.12.1.GA/javassist-3.12.1.GA.jar ...
[ivy:resolve] ................................................... (629kB)
[ivy:resolve] .. (0kB)
[ivy:resolve] [SUCCESSFUL ] javassist#javassist;3.12.1.GA!javassist.jar (139ms)
[ivy:resolve] downloading https://repo1.maven.org/maven2/dom4j/dom4j/1.6.1/dom4j-1.6.1.jar ...
[ivy:resolve] ............................... (306kB)
[ivy:resolve] .. (0kB)
[ivy:resolve] [SUCCESSFUL ] dom4j#dom4j;1.6.1!dom4j.jar (121ms)
[ivy:resolve] downloading https://repo1.maven.org/maven2/org/webjars/jquery/2.0.3-1/jquery-2.0.3-1.jar ...
[ivy:resolve] ..................... (151kB)
[ivy:resolve] .. (0kB)
[ivy:resolve] [SUCCESSFUL ] org.webjars#jquery;2.0.3-1!jquery.jar (109ms)
[ivy:resolve] downloading https://repo1.maven.org/maven2/com/google/javascript/closure-compiler/v20130603/closure-compiler-v20130603.jar ...
[ivy:resolve] ..................................................................................................................................................................................................................................... (3475kB)
[ivy:resolve] .. (0kB)
[ivy:resolve] [SUCCESSFUL ] com.google.javascript#closure-compiler;v20130603!closure-compiler.jar (281ms)
[ivy:resolve] downloading https://repo1.maven.org/maven2/org/webjars/jquerypp/1.0.1/jquerypp-1.0.1.jar ...
[ivy:resolve] ..................................................... (653kB)
[ivy:resolve] .. (0kB)
[ivy:resolve] [SUCCESSFUL ] org.webjars#jquerypp;1.0.1!jquerypp.jar (148ms)
[ivy:resolve] downloading https://repo1.maven.org/maven2/org/webjars/jquery-ui/1.10.2-1/jquery-ui-1.10.2-1.jar ...
[ivy:resolve] ................................................. (604kB)
[ivy:resolve] .. (0kB)
[ivy:resolve] [SUCCESSFUL ] org.webjars#jquery-ui;1.10.2-1!jquery-ui.jar (138ms)
[ivy:resolve] downloading https://repo1.maven.org/maven2/org/webjars/typeaheadjs/0.9.3/typeaheadjs-0.9.3.jar ...
[ivy:resolve] ......... (19kB)
[ivy:resolve] .. (0kB)
[ivy:resolve] [SUCCESSFUL ] org.webjars#typeaheadjs;0.9.3!typeaheadjs.jar (99ms)
[ivy:resolve] downloading https://repo1.maven.org/maven2/args4j/args4j/2.0.16/args4j-2.0.16.jar ...
[ivy:resolve] ............... (54kB)
[ivy:resolve] .. (0kB)
[ivy:resolve] [SUCCESSFUL ] args4j#args4j;2.0.16!args4j.jar (102ms)
[ivy:resolve] downloading https://repo1.maven.org/maven2/org/apache/commons/commons-jexl/2.1.1/commons-jexl-2.1.1.jar ...
[ivy:resolve] ............................ (261kB)
[ivy:resolve] .. (0kB)
[ivy:resolve] [SUCCESSFUL ] org.apache.commons#commons-jexl;2.1.1!commons-jexl.jar (116ms)
[ivy:resolve] downloading https://repo1.maven.org/maven2/com/tdunning/t-digest/3.2/t-digest-3.2.jar ...
[ivy:resolve] ............... (50kB)
[ivy:resolve] .. (0kB)
[ivy:resolve] [SUCCESSFUL ] com.tdunning#t-digest;3.2!t-digest.jar (101ms)
[ivy:resolve] downloading https://repo1.maven.org/maven2/org/apache/tika/tika-core/1.20/tika-core-1.20.jar ...
[ivy:resolve] ...................................................... (683kB)
[ivy:resolve] .. (0kB)
[ivy:resolve] [SUCCESSFUL ] org.apache.tika#tika-core;1.20!tika-core.jar(bundle) (141ms)
[ivy:resolve] downloading https://repo1.maven.org/maven2/com/ibm/icu/icu4j/61.1/icu4j-61.1.jar ...
[ivy:resolve] .......................................................................................................................................................................................................................................................................................................................................................................................................................................................................................................................................................................................................................................................................................................................................................................................... (12039kB)
[ivy:resolve] .. (0kB)
[ivy:resolve] [SUCCESSFUL ] com.ibm.icu#icu4j;61.1!icu4j.jar (713ms)
[ivy:resolve] downloading https://repo1.maven.org/maven2/xerces/xmlParserAPIs/2.6.2/xmlParserAPIs-2.6.2.jar ...
[ivy:resolve] ................... (121kB)
[ivy:resolve] .. (0kB)
[ivy:resolve] [SUCCESSFUL ] xerces#xmlParserAPIs;2.6.2!xmlParserAPIs.jar (107ms)
[ivy:resolve] downloading https://repo1.maven.org/maven2/com/github/crawler-commons/crawler-commons/1.0/crawler-commons-1.0.jar ...
[ivy:resolve] ....................... (175kB)
[ivy:resolve] .. (0kB)
[ivy:resolve] [SUCCESSFUL ] com.github.crawler-commons#crawler-commons;1.0!crawler-commons.jar (179ms)
[ivy:resolve] downloading https://repo1.maven.org/maven2/com/martinkl/warc/warc-hadoop/0.1.0/warc-hadoop-0.1.0.jar ...
[ivy:resolve] ......... (20kB)
[ivy:resolve] .. (0kB)
[ivy:resolve] [SUCCESSFUL ] com.martinkl.warc#warc-hadoop;0.1.0!warc-hadoop.jar (169ms)
[ivy:resolve] downloading https://repo1.maven.org/maven2/org/apache/httpcomponents/httpcore-nio/4.4.9/httpcore-nio-4.4.9.jar ...
[ivy:resolve] .................................. (356kB)
[ivy:resolve] .. (0kB)
[ivy:resolve] [SUCCESSFUL ] org.apache.httpcomponents#httpcore-nio;4.4.9!httpcore-nio.jar (121ms)
[ivy:resolve] downloading https://repo1.maven.org/maven2/de/vandermeer/asciitable/0.3.2/asciitable-0.3.2.jar ...
[ivy:resolve] .............. (34kB)
[ivy:resolve] .. (0kB)
[ivy:resolve] [SUCCESSFUL ] de.vandermeer#asciitable;0.3.2!asciitable.jar (102ms)
[ivy:resolve] downloading https://repo1.maven.org/maven2/xml-apis/xml-apis/1.4.01/xml-apis-1.4.01.jar ...
[ivy:resolve] ......................... (215kB)
[ivy:resolve] .. (0kB)
[ivy:resolve] [SUCCESSFUL ] xml-apis#xml-apis;1.4.01!xml-apis.jar (113ms)
[ivy:resolve] downloading https://repo1.maven.org/maven2/org/checkerframework/checker-compat-qual/2.0.0/checker-compat-qual-2.0.0.jar ...
[ivy:resolve] ............. (30kB)
[ivy:resolve] .. (0kB)
[ivy:resolve] [SUCCESSFUL ] org.checkerframework#checker-compat-qual;2.0.0!checker-compat-qual.jar (101ms)
[ivy:resolve] downloading https://repo1.maven.org/maven2/com/google/errorprone/error_prone_annotations/2.1.3/error_prone_annotations-2.1.3.jar ...
[ivy:resolve] ...... (13kB)
[ivy:resolve] .. (0kB)
[ivy:resolve] [SUCCESSFUL ] com.google.errorprone#error_prone_annotations;2.1.3!error_prone_annotations.jar (101ms)
[ivy:resolve] downloading https://repo1.maven.org/maven2/com/google/j2objc/j2objc-annotations/1.1/j2objc-annotations-1.1.jar ...
[ivy:resolve] ..... (8kB)
[ivy:resolve] .. (0kB)
[ivy:resolve] [SUCCESSFUL ] com.google.j2objc#j2objc-annotations;1.1!j2objc-annotations.jar (98ms)
[ivy:resolve] downloading https://repo1.maven.org/maven2/org/codehaus/mojo/animal-sniffer-annotations/1.14/animal-sniffer-annotations-1.14.jar ...
[ivy:resolve] ... (3kB)
[ivy:resolve] .. (0kB)
[ivy:resolve] [SUCCESSFUL ] org.codehaus.mojo#animal-sniffer-annotations;1.14!animal-sniffer-annotations.jar (98ms)
[ivy:resolve] downloading https://repo1.maven.org/maven2/org/apache/hadoop/hadoop-client/2.2.0/hadoop-client-2.2.0.jar ...
[ivy:resolve] ... (2kB)
[ivy:resolve] .. (0kB)
[ivy:resolve] [SUCCESSFUL ] org.apache.hadoop#hadoop-client;2.2.0!hadoop-client.jar (98ms)
[ivy:resolve] downloading https://repo1.maven.org/maven2/org/apache/hadoop/hadoop-mapreduce-client-app/2.2.0/hadoop-mapreduce-client-app-2.2.0.jar ...
[ivy:resolve] ......................................... (470kB)
[ivy:resolve] .. (0kB)
[ivy:resolve] [SUCCESSFUL ] org.apache.hadoop#hadoop-mapreduce-client-app;2.2.0!hadoop-mapreduce-client-app.jar (129ms)
[ivy:resolve] downloading https://repo1.maven.org/maven2/de/vandermeer/ascii-utf-themes/0.0.1/ascii-utf-themes-0.0.1.jar ...
[ivy:resolve] .................... (137kB)
[ivy:resolve] .. (0kB)
[ivy:resolve] [SUCCESSFUL ] de.vandermeer#ascii-utf-themes;0.0.1!ascii-utf-themes.jar (107ms)
[ivy:resolve] downloading https://repo1.maven.org/maven2/de/vandermeer/char-translation/0.0.2/char-translation-0.0.2.jar ...
[ivy:resolve] .................... (133kB)
[ivy:resolve] .. (0kB)
[ivy:resolve] [SUCCESSFUL ] de.vandermeer#char-translation;0.0.2!char-translation.jar (107ms)
[ivy:resolve] downloading https://repo1.maven.org/maven2/de/vandermeer/skb-interfaces/0.0.1/skb-interfaces-0.0.1.jar ...
[ivy:resolve] .......................... (232kB)
[ivy:resolve] .. (0kB)
[ivy:resolve] [SUCCESSFUL ] de.vandermeer#skb-interfaces;0.0.1!skb-interfaces.jar (115ms)
[ivy:resolve] downloading https://repo1.maven.org/maven2/org/antlr/ST4/4.0.8/ST4-4.0.8.jar ...
[ivy:resolve] .......................... (233kB)
[ivy:resolve] .. (0kB)
[ivy:resolve] [SUCCESSFUL ] org.antlr#ST4;4.0.8!ST4.jar (112ms)
[ivy:resolve] downloading https://repo1.maven.org/maven2/org/antlr/antlr4/4.5.1/antlr4-4.5.1.jar ...
[ivy:resolve] ...................................................................................................... (1444kB)
[ivy:resolve] .. (0kB)
[ivy:resolve] [SUCCESSFUL ] org.antlr#antlr4;4.5.1!antlr4.jar (192ms)
[ivy:resolve] downloading https://repo1.maven.org/maven2/org/antlr/antlr-runtime/3.5.2/antlr-runtime-3.5.2.jar ...
[ivy:resolve] ...................... (163kB)
[ivy:resolve] .. (0kB)
[ivy:resolve] [SUCCESSFUL ] org.antlr#antlr-runtime;3.5.2!antlr-runtime.jar (108ms)
[ivy:resolve]
[ivy:resolve] :: problems summary ::
[ivy:resolve] :::: WARNINGS
[ivy:resolve] [FAILED     ] javax.ws.rs#javax.ws.rs-api;2.1.1!javax.ws.rs-api.${packaging.type}:  (0ms)
[ivy:resolve] ==== local: tried
[ivy:resolve]  /home/jenkins/.ivy2/local/javax.ws.rs/javax.ws.rs-api/2.1.1/${packaging.type}s/javax.ws.rs-api.${packaging.type}
[ivy:resolve] ==== maven2: tried
[ivy:resolve]  https://repo1.maven.org/maven2/javax/ws/rs/javax.ws.rs-api/2.1.1/javax.ws.rs-api-2.1.1.${packaging.type}
[ivy:resolve] ==== apache-snapshot: tried
[ivy:resolve]  https://repository.apache.org/content/repositories/snapshots/javax/ws/rs/javax.ws.rs-api/2.1.1/javax.ws.rs-api-2.1.1.${packaging.type}
[ivy:resolve] ==== sonatype: tried
[ivy:resolve]  https://oss.sonatype.org/content/repositories/releases/javax/ws/rs/javax.ws.rs-api/2.1.1/javax.ws.rs-api-2.1.1.${packaging.type}
[ivy:resolve] ::::::::::::::::::::::::::::::::::::::::::::::
[ivy:resolve] ::              FAILED DOWNLOADS            ::
[ivy:resolve] :: ^ see resolution messages for details  ^ ::
[ivy:resolve] ::::::::::::::::::::::::::::::::::::::::::::::
[ivy:resolve] :: javax.ws.rs#javax.ws.rs-api;2.1.1!javax.ws.rs-api.${packaging.type}
[ivy:resolve] ::::::::::::::::::::::::::::::::::::::::::::::
[ivy:resolve]
[ivy:resolve] :: USE VERBOSE OR DEBUG MESSAGE LEVEL FOR MORE DETAILS

BUILD FAILED
<https://builds.apache.org/job/Nutch-trunk/ws/build.xml>:545: impossible to resolve dependencies:
        resolve failed - see output for details

Total time: 2 minutes 54 seconds
Build step 'Invoke Ant' marked build as failure
Publishing Javadoc
INFO: Starting to record.
INFO: Processing JUnit
ERROR: Step ?Publish xUnit test result report? failed: [JUnit] - No test report file(s) were found with the pattern 'build/test/TEST-*.xml' relative to '<https://builds.apache.org/job/Nutch-trunk/ws/'> for the testing framework 'JUnit'.
Did you enter a pattern relative to (and within) the workspace directory?
Did you generate the result report(s) for 'JUnit'?"
[JIRA] Updating issue NUTCH-2722
Reply | Threaded
Open this post in threaded view
|

Jenkins build is back to normal : Nutch-trunk #3627

Apache Jenkins Server-2