Build failed in Jenkins: Nutch-trunk #3643

classic Classic list List threaded Threaded
3 messages Options
Reply | Threaded
Open this post in threaded view
|

Build failed in Jenkins: Nutch-trunk #3643

Apache Jenkins Server-2
See <https://builds.apache.org/job/Nutch-trunk/3643/display/redirect?page=changes>

Changes:

[r0ann3l] NUTCH-2654: Obsolete configuration deleted

[r0ann3l] NUTCH-2654: schema.xml moved to indexer-solr folder.

[r0ann3l] NUTCH-2654: a note about the new location of schema.xml file

------------------------------------------
[...truncated 624.68 KB...]
deps-test-compile:

compile-test:
    [javac] Compiling 1 source file to <https://builds.apache.org/job/Nutch-trunk/ws/build/urlnormalizer-basic/test>

jar:

deps-test:

deploy:

copy-generated-lib:

test:
     [echo] Testing plugin: urlnormalizer-basic
    [junit] Running org.apache.nutch.net.urlnormalizer.ajax.TestAjaxURLNormalizer
    [junit] Tests run: 2, Failures: 0, Errors: 0, Skipped: 0, Time elapsed: 0.059 sec

init:

init-plugin:

deps-jar:

clean-lib:

resolve-default:
[ivy:resolve] :: loading settings :: file = <https://builds.apache.org/job/Nutch-trunk/ws/ivy/ivysettings.xml>

compile:
     [echo] Compiling plugin: urlnormalizer-host

deps-test-compile:

compile-test:
    [javac] Compiling 1 source file to <https://builds.apache.org/job/Nutch-trunk/ws/build/urlnormalizer-host/test>

jar:

deps-test:

deploy:

copy-generated-lib:

test:
     [echo] Testing plugin: urlnormalizer-host
    [junit] Running org.apache.nutch.net.urlnormalizer.basic.TestBasicURLNormalizer
    [junit] Tests run: 4, Failures: 0, Errors: 0, Skipped: 0, Time elapsed: 0.37 sec

init:

init-plugin:

deps-jar:

clean-lib:

resolve-default:
[ivy:resolve] :: loading settings :: file = <https://builds.apache.org/job/Nutch-trunk/ws/ivy/ivysettings.xml>

compile:
     [echo] Compiling plugin: urlnormalizer-pass

deps-test-compile:

compile-test:
    [javac] Compiling 1 source file to <https://builds.apache.org/job/Nutch-trunk/ws/build/urlnormalizer-pass/test>

jar:
    [junit] Running org.apache.nutch.net.urlnormalizer.host.TestHostURLNormalizer

deps-test:

deploy:

copy-generated-lib:

test:
     [echo] Testing plugin: urlnormalizer-pass
    [junit] Tests run: 1, Failures: 0, Errors: 0, Skipped: 0, Time elapsed: 0.536 sec

init:

init-plugin:

deps-jar:

clean-lib:

resolve-default:
[ivy:resolve] :: loading settings :: file = <https://builds.apache.org/job/Nutch-trunk/ws/ivy/ivysettings.xml>

compile:
     [echo] Compiling plugin: urlnormalizer-protocol

deps-test-compile:

compile-test:
    [javac] Compiling 1 source file to <https://builds.apache.org/job/Nutch-trunk/ws/build/urlnormalizer-protocol/test>

jar:

deps-test:

deploy:

copy-generated-lib:

test:
     [echo] Testing plugin: urlnormalizer-protocol
    [junit] Running org.apache.nutch.net.urlnormalizer.pass.TestPassURLNormalizer
    [junit] Tests run: 1, Failures: 0, Errors: 0, Skipped: 0, Time elapsed: 0.317 sec

init:

init-plugin:

deps-jar:

clean-lib:

resolve-default:
[ivy:resolve] :: loading settings :: file = <https://builds.apache.org/job/Nutch-trunk/ws/ivy/ivysettings.xml>

compile:
     [echo] Compiling plugin: urlnormalizer-querystring

deps-test-compile:

compile-test:
    [javac] Compiling 1 source file to <https://builds.apache.org/job/Nutch-trunk/ws/build/urlnormalizer-querystring/test>

jar:

deps-test:

deploy:

copy-generated-lib:

test:
     [echo] Testing plugin: urlnormalizer-querystring
    [junit] Running org.apache.nutch.net.urlnormalizer.protocol.TestProtocolURLNormalizer
    [junit] Tests run: 1, Failures: 0, Errors: 0, Skipped: 0, Time elapsed: 0.569 sec

init:

init-plugin:

deps-jar:

clean-lib:

resolve-default:
[ivy:resolve] :: loading settings :: file = <https://builds.apache.org/job/Nutch-trunk/ws/ivy/ivysettings.xml>

compile:
     [echo] Compiling plugin: urlnormalizer-regex

deps-test-compile:

compile-test:
    [javac] Compiling 1 source file to <https://builds.apache.org/job/Nutch-trunk/ws/build/urlnormalizer-regex/test>
    [junit] Running org.apache.nutch.net.urlnormalizer.querystring.TestQuerystringURLNormalizer

jar:

deps-test:

init:

init-plugin:

clean-lib:

resolve-default:
[ivy:resolve] :: loading settings :: file = <https://builds.apache.org/job/Nutch-trunk/ws/ivy/ivysettings.xml>

compile:

jar:

deps-test:

deploy:

copy-generated-lib:

deploy:

copy-generated-lib:

test:
     [echo] Testing plugin: urlnormalizer-regex
    [junit] Tests run: 1, Failures: 0, Errors: 0, Skipped: 0, Time elapsed: 0.315 sec

init:

init-plugin:

deps-jar:

clean-lib:

resolve-default:
[ivy:resolve] :: loading settings :: file = <https://builds.apache.org/job/Nutch-trunk/ws/ivy/ivysettings.xml>

compile:
     [echo] Compiling plugin: urlnormalizer-slash

deps-test-compile:

compile-test:
    [javac] Compiling 1 source file to <https://builds.apache.org/job/Nutch-trunk/ws/build/urlnormalizer-slash/test>

jar:

deps-test:

deploy:

copy-generated-lib:

test:
     [echo] Testing plugin: urlnormalizer-slash
    [junit] Running org.apache.nutch.net.urlnormalizer.regex.TestRegexURLNormalizer
    [junit] Running org.apache.nutch.net.urlnormalizer.slash.TestSlashURLNormalizer
    [junit] Tests run: 2, Failures: 0, Errors: 0, Skipped: 0, Time elapsed: 0.44 sec
    [junit] Tests run: 1, Failures: 0, Errors: 0, Skipped: 0, Time elapsed: 0.579 sec

BUILD FAILED
<https://builds.apache.org/job/Nutch-trunk/ws/build.xml>:529: The following error occurred while executing this line:
<https://builds.apache.org/job/Nutch-trunk/ws/src/plugin/build.xml>:143: The following error occurred while executing this line:
<https://builds.apache.org/job/Nutch-trunk/ws/src/plugin/build-plugin.xml>:223: Tests failed!

Total time: 9 minutes 39 seconds
Build step 'Invoke Ant' marked build as failure
Publishing Javadoc
INFO: Starting to record.
INFO: Processing JUnit
INFO: [JUnit] - 36 test report file(s) were found with the pattern 'build/test/TEST-*.xml' relative to '<https://builds.apache.org/job/Nutch-trunk/ws/'> for the testing framework 'JUnit'.
INFO: Processing JUnit
INFO: [JUnit] - 93 test report file(s) were found with the pattern 'build/**/test/TEST-*.xml' relative to '<https://builds.apache.org/job/Nutch-trunk/ws/'> for the testing framework 'JUnit'.
INFO: Check 'Failed Tests' threshold.
INFO: Check 'Skipped Tests' threshold.
INFO: Setting the build status to FAILURE
INFO: Stopping recording.
[JIRA] Updating issue NUTCH-2654
Reply | Threaded
Open this post in threaded view
|

Build failed in Jenkins: Nutch-trunk #3644

Apache Jenkins Server-2
See <https://builds.apache.org/job/Nutch-trunk/3644/display/redirect?page=changes>

Changes:

[snagel] NUTCH-1982 Make Git ignore IDE project files and add note about IDE

------------------------------------------
[...truncated 842.57 KB...]
     [echo] Testing plugin: urlnormalizer-protocol
    [junit] #
    [junit] # There is insufficient memory for the Java Runtime Environment to continue.
    [junit] # Cannot create GC thread. Out of system resources.
    [junit] # An error report file with more information is saved as:
    [junit] # <https://builds.apache.org/job/Nutch-trunk/ws/hs_err_pid31493.log>
    [junit] Running org.apache.nutch.net.urlnormalizer.protocol.TestProtocolURLNormalizer
    [junit] Tests run: 1, Failures: 0, Errors: 1, Skipped: 0, Time elapsed: 0 sec
    [junit] Test org.apache.nutch.net.urlnormalizer.protocol.TestProtocolURLNormalizer FAILED (crashed)

init:

init-plugin:

deps-jar:

clean-lib:

resolve-default:
[ivy:resolve] :: loading settings :: file = <https://builds.apache.org/job/Nutch-trunk/ws/ivy/ivysettings.xml>

compile:
     [echo] Compiling plugin: urlnormalizer-querystring

deps-test-compile:

compile-test:
    [javac] Compiling 1 source file to <https://builds.apache.org/job/Nutch-trunk/ws/build/urlnormalizer-querystring/test>

jar:

deps-test:

deploy:

copy-generated-lib:

test:
     [echo] Testing plugin: urlnormalizer-querystring
    [junit] #
    [junit] # There is insufficient memory for the Java Runtime Environment to continue.
    [junit] # Cannot create GC thread. Out of system resources.
    [junit] # An error report file with more information is saved as:
    [junit] # <https://builds.apache.org/job/Nutch-trunk/ws/hs_err_pid32010.log>
    [junit] Running org.apache.nutch.net.urlnormalizer.querystring.TestQuerystringURLNormalizer
    [junit] Tests run: 1, Failures: 0, Errors: 1, Skipped: 0, Time elapsed: 0 sec
    [junit] Test org.apache.nutch.net.urlnormalizer.querystring.TestQuerystringURLNormalizer FAILED (crashed)

init:

init-plugin:

deps-jar:

clean-lib:

resolve-default:
[ivy:resolve] :: loading settings :: file = <https://builds.apache.org/job/Nutch-trunk/ws/ivy/ivysettings.xml>

compile:
     [echo] Compiling plugin: urlnormalizer-regex

deps-test-compile:

compile-test:
    [javac] Compiling 1 source file to <https://builds.apache.org/job/Nutch-trunk/ws/build/urlnormalizer-regex/test>

jar:

deps-test:

init:

init-plugin:

clean-lib:

resolve-default:
[ivy:resolve] :: loading settings :: file = <https://builds.apache.org/job/Nutch-trunk/ws/ivy/ivysettings.xml>

compile:

jar:

deps-test:

deploy:

copy-generated-lib:

deploy:

copy-generated-lib:

test:
     [echo] Testing plugin: urlnormalizer-regex
    [junit] Tests run: 1, Failures: 0, Errors: 0, Skipped: 0, Time elapsed: 7.146 sec
    [junit] Error occurred during initialization of VM
    [junit] java.lang.OutOfMemoryError: unable to create new native thread
    [junit] Error occurred during initialization of VM
    [junit] java.lang.OutOfMemoryError: unable to create new native thread
    [junit] at java.lang.Thread.start0(Native Method)
    [junit] at java.lang.Thread.start(Thread.java:717)
    [junit] at java.lang.ref.Finalizer.<clinit>(Finalizer.java:233)
    [junit]
    [junit] Running org.apache.nutch.parse.tika.TestPdfParser
    [junit] Tests run: 1, Failures: 0, Errors: 1, Skipped: 0, Time elapsed: 0 sec
    [junit] Test org.apache.nutch.parse.tika.TestPdfParser FAILED (crashed)
    [junit] Running org.apache.nutch.net.urlnormalizer.regex.TestRegexURLNormalizer
    [junit] Tests run: 1, Failures: 0, Errors: 1, Skipped: 0, Time elapsed: 0 sec
    [junit] Test org.apache.nutch.net.urlnormalizer.regex.TestRegexURLNormalizer FAILED (crashed)

init:

init-plugin:

deps-jar:

clean-lib:

resolve-default:
[ivy:resolve] :: loading settings :: file = <https://builds.apache.org/job/Nutch-trunk/ws/ivy/ivysettings.xml>

compile:
     [echo] Compiling plugin: urlnormalizer-slash

deps-test-compile:

compile-test:
    [javac] Compiling 1 source file to <https://builds.apache.org/job/Nutch-trunk/ws/build/urlnormalizer-slash/test>

jar:

deps-test:

deploy:

copy-generated-lib:

test:
     [echo] Testing plugin: urlnormalizer-slash
    [junit] #
    [junit] # There is insufficient memory for the Java Runtime Environment to continue.
    [junit] # Cannot create GC thread. Out of system resources.
    [junit] # An error report file with more information is saved as:
    [junit] # <https://builds.apache.org/job/Nutch-trunk/ws/hs_err_pid1871.log>
    [junit] Running org.apache.nutch.net.urlnormalizer.slash.TestSlashURLNormalizer
    [junit] Tests run: 1, Failures: 0, Errors: 1, Skipped: 0, Time elapsed: 0 sec
    [junit] Test org.apache.nutch.net.urlnormalizer.slash.TestSlashURLNormalizer FAILED (crashed)
    [junit] Running org.apache.nutch.parse.tika.TestRTFParser
    [junit] Tests run: 1, Failures: 0, Errors: 0, Skipped: 1, Time elapsed: 0.134 sec
    [junit] Running org.apache.nutch.parse.tika.TestRobotsMetaProcessor
    [junit] Tests run: 1, Failures: 0, Errors: 0, Skipped: 0, Time elapsed: 8.429 sec

BUILD FAILED
<https://builds.apache.org/job/Nutch-trunk/ws/build.xml>:529: The following error occurred while executing this line:
<https://builds.apache.org/job/Nutch-trunk/ws/src/plugin/build.xml>:115:
The following error occurred while executing this line:
<https://builds.apache.org/job/Nutch-trunk/ws/src/plugin/build-plugin.xml>:223: Tests failed!
The following error occurred while executing this line:
<https://builds.apache.org/job/Nutch-trunk/ws/src/plugin/build-plugin.xml>:223: Tests failed!
The following error occurred while executing this line:
<https://builds.apache.org/job/Nutch-trunk/ws/src/plugin/build-plugin.xml>:223: Tests failed!
The following error occurred while executing this line:
<https://builds.apache.org/job/Nutch-trunk/ws/src/plugin/build-plugin.xml>:223: Tests failed!
The following error occurred while executing this line:
<https://builds.apache.org/job/Nutch-trunk/ws/src/plugin/build-plugin.xml>:223: Tests failed!
The following error occurred while executing this line:
<https://builds.apache.org/job/Nutch-trunk/ws/src/plugin/build-plugin.xml>:223: Tests failed!
The following error occurred while executing this line:
<https://builds.apache.org/job/Nutch-trunk/ws/src/plugin/build-plugin.xml>:223: Tests failed!
The following error occurred while executing this line:
<https://builds.apache.org/job/Nutch-trunk/ws/src/plugin/build-plugin.xml>:223: Tests failed!
The following error occurred while executing this line:
<https://builds.apache.org/job/Nutch-trunk/ws/src/plugin/build-plugin.xml>:223: Tests failed!
The following error occurred while executing this line:
<https://builds.apache.org/job/Nutch-trunk/ws/src/plugin/build-plugin.xml>:223: Tests failed!
The following error occurred while executing this line:
<https://builds.apache.org/job/Nutch-trunk/ws/src/plugin/build-plugin.xml>:208: java.lang.OutOfMemoryError: unable to create new native thread
The following error occurred while executing this line:
<https://builds.apache.org/job/Nutch-trunk/ws/src/plugin/build-plugin.xml>:223: Tests failed!
The following error occurred while executing this line:
<https://builds.apache.org/job/Nutch-trunk/ws/src/plugin/build-plugin.xml>:223: Tests failed!
The following error occurred while executing this line:
<https://builds.apache.org/job/Nutch-trunk/ws/src/plugin/build-plugin.xml>:223: Tests failed!
The following error occurred while executing this line:
<https://builds.apache.org/job/Nutch-trunk/ws/src/plugin/build-plugin.xml>:223: Tests failed!
The following error occurred while executing this line:
<https://builds.apache.org/job/Nutch-trunk/ws/src/plugin/build-plugin.xml>:223: Tests failed!
The following error occurred while executing this line:
<https://builds.apache.org/job/Nutch-trunk/ws/src/plugin/build-plugin.xml>:223: Tests failed!
The following error occurred while executing this line:
<https://builds.apache.org/job/Nutch-trunk/ws/src/plugin/build-plugin.xml>:223: Tests failed!
The following error occurred while executing this line:
<https://builds.apache.org/job/Nutch-trunk/ws/src/plugin/build-plugin.xml>:223: Tests failed!
The following error occurred while executing this line:
<https://builds.apache.org/job/Nutch-trunk/ws/src/plugin/build-plugin.xml>:223: Tests failed!
The following error occurred while executing this line:
<https://builds.apache.org/job/Nutch-trunk/ws/src/plugin/build-plugin.xml>:223: Tests failed!
The following error occurred while executing this line:
<https://builds.apache.org/job/Nutch-trunk/ws/src/plugin/build-plugin.xml>:223: Tests failed!
The following error occurred while executing this line:
<https://builds.apache.org/job/Nutch-trunk/ws/src/plugin/build-plugin.xml>:223: Tests failed!
The following error occurred while executing this line:
<https://builds.apache.org/job/Nutch-trunk/ws/src/plugin/build-plugin.xml>:223: Tests failed!
The following error occurred while executing this line:
<https://builds.apache.org/job/Nutch-trunk/ws/src/plugin/build-plugin.xml>:223: Tests failed!
The following error occurred while executing this line:
<https://builds.apache.org/job/Nutch-trunk/ws/src/plugin/build-plugin.xml>:223: Tests failed!
The following error occurred while executing this line:
<https://builds.apache.org/job/Nutch-trunk/ws/src/plugin/build-plugin.xml>:223: Tests failed!
The following error occurred while executing this line:
<https://builds.apache.org/job/Nutch-trunk/ws/src/plugin/build-plugin.xml>:223: Tests failed!
The following error occurred while executing this line:
<https://builds.apache.org/job/Nutch-trunk/ws/src/plugin/build-plugin.xml>:223: Tests failed!
The following error occurred while executing this line:
<https://builds.apache.org/job/Nutch-trunk/ws/src/plugin/build-plugin.xml>:223: Tests failed!
The following error occurred while executing this line:
<https://builds.apache.org/job/Nutch-trunk/ws/src/plugin/build-plugin.xml>:223: Tests failed!
The following error occurred while executing this line:
<https://builds.apache.org/job/Nutch-trunk/ws/src/plugin/build-plugin.xml>:223: Tests failed!
The following error occurred while executing this line:
<https://builds.apache.org/job/Nutch-trunk/ws/src/plugin/build-plugin.xml>:223: Tests failed!
The following error occurred while executing this line:
<https://builds.apache.org/job/Nutch-trunk/ws/src/plugin/build-plugin.xml>:223: Tests failed!
The following error occurred while executing this line:
<https://builds.apache.org/job/Nutch-trunk/ws/src/plugin/build-plugin.xml>:223: Tests failed!
The following error occurred while executing this line:
<https://builds.apache.org/job/Nutch-trunk/ws/src/plugin/build-plugin.xml>:223: Tests failed!
The following error occurred while executing this line:
<https://builds.apache.org/job/Nutch-trunk/ws/src/plugin/build-plugin.xml>:223: Tests failed!
The following error occurred while executing this line:
<https://builds.apache.org/job/Nutch-trunk/ws/src/plugin/build-plugin.xml>:223: Tests failed!
The following error occurred while executing this line:
<https://builds.apache.org/job/Nutch-trunk/ws/src/plugin/build-plugin.xml>:223: Tests failed!

Total time: 19 minutes 43 seconds
Build step 'Invoke Ant' marked build as failure
Publishing Javadoc
INFO: Starting to record.
INFO: Processing JUnit
INFO: [JUnit] - 36 test report file(s) were found with the pattern 'build/test/TEST-*.xml' relative to '<https://builds.apache.org/job/Nutch-trunk/ws/'> for the testing framework 'JUnit'.
INFO: Processing JUnit
INFO: [JUnit] - 93 test report file(s) were found with the pattern 'build/**/test/TEST-*.xml' relative to '<https://builds.apache.org/job/Nutch-trunk/ws/'> for the testing framework 'JUnit'.
INFO: Check 'Failed Tests' threshold.
INFO: Check 'Skipped Tests' threshold.
INFO: Setting the build status to FAILURE
INFO: Stopping recording.
[JIRA] Updating issue NUTCH-1982
Reply | Threaded
Open this post in threaded view
|

Jenkins build is back to normal : Nutch-trunk #3645

Apache Jenkins Server-2