Build failed in Jenkins: Tika-trunk #818

classic Classic list List threaded Threaded
10 messages Options
Reply | Threaded
Open this post in threaded view
|

Build failed in Jenkins: Tika-trunk #818

Apache Jenkins Server-2
See <https://builds.apache.org/job/Tika-trunk/818/changes>

Changes:

[maxcom] TIKA-593 - enable jax-rs network server module

------------------------------------------
[...truncated 731 lines...]
[INFO] --- maven-install-plugin:2.3.1:install (default-install) @ tika-bundle ---
[INFO] Installing <https://builds.apache.org/job/Tika-trunk/ws/trunk/tika-bundle/pom.xml> to /home/hudson/hudson-slave/maven-repositories/0/org/apache/tika/tika-bundle/1.2-SNAPSHOT/tika-bundle-1.2-SNAPSHOT.pom
[INFO] [INFO] Local OBR update disabled (enable with -DobrRepository)

[INFO] --- maven-bundle-plugin:2.3.4:install (default-install) @ tika-bundle ---
[INFO] Downloading: https://repository.apache.org/content/repositories/snapshots/org/apache/tika/tika-bundle/1.2-SNAPSHOT/maven-metadata.xml

[INFO] --- maven-deploy-plugin:2.6:deploy (default-deploy) @ tika-bundle ---
Downloaded: https://repository.apache.org/content/repositories/snapshots/org/apache/tika/tika-bundle/1.2-SNAPSHOT/maven-metadata.xml (770 B at 2.1 KB/sec)
Uploading: https://repository.apache.org/content/repositories/snapshots/org/apache/tika/tika-bundle/1.2-SNAPSHOT/tika-bundle-1.2-20120326.112226-10.jar
Uploaded: https://repository.apache.org/content/repositories/snapshots/org/apache/tika/tika-bundle/1.2-SNAPSHOT/tika-bundle-1.2-20120326.112226-10.jar (21661 KB at 3040.9 KB/sec)
Uploading: https://repository.apache.org/content/repositories/snapshots/org/apache/tika/tika-bundle/1.2-SNAPSHOT/tika-bundle-1.2-20120326.112226-10.pom
Uploaded: https://repository.apache.org/content/repositories/snapshots/org/apache/tika/tika-bundle/1.2-SNAPSHOT/tika-bundle-1.2-20120326.112226-10.pom (8 KB at 43.9 KB/sec)
Downloading: https://repository.apache.org/content/repositories/snapshots/org/apache/tika/tika-bundle/maven-metadata.xml
Downloaded: https://repository.apache.org/content/repositories/snapshots/org/apache/tika/tika-bundle/maven-metadata.xml (363 B at 1.7 KB/sec)
Uploading: https://repository.apache.org/content/repositories/snapshots/org/apache/tika/tika-bundle/1.2-SNAPSHOT/maven-metadata.xml
Uploaded: https://repository.apache.org/content/repositories/snapshots/org/apache/tika/tika-bundle/1.2-SNAPSHOT/maven-metadata.xml (773 B at 2.7 KB/sec)
Uploading: https://repository.apache.org/content/repositories/snapshots/org/apache/tika/tika-bundle/maven-metadata.xml
Uploaded: https://repository.apache.org/content/repositories/snapshots/org/apache/tika/tika-bundle/maven-metadata.xml (342 B at 1.8 KB/sec)
[INFO] [INFO] Remote OBR update disabled (enable with -DremoteOBR)

[INFO] --- maven-bundle-plugin:2.3.4:deploy (default-deploy) @ tika-bundle ---
[JENKINS] Archiving <https://builds.apache.org/job/Tika-trunk/ws/trunk/tika-bundle/pom.xml> to /home/hudson/hudson/jobs/Tika-trunk/modules/org.apache.tika$tika-bundle/builds/2012-03-26_11-08-00/archive/org.apache.tika/tika-bundle/1.2-SNAPSHOT/tika-bundle-1.2-SNAPSHOT.pom
[JENKINS] Archiving <https://builds.apache.org/job/Tika-trunk/ws/trunk/tika-bundle/target/tika-bundle-1.2-SNAPSHOT.jar> to /home/hudson/hudson/jobs/Tika-trunk/modules/org.apache.tika$tika-bundle/builds/2012-03-26_11-08-00/archive/org.apache.tika/tika-bundle/1.2-20120326.112226-10/tika-bundle-1.2-20120326.112226-10.jar
[INFO]                                                                        
[INFO] ------------------------------------------------------------------------
[INFO] Building Apache Tika server 1.2-SNAPSHOT
[INFO] ------------------------------------------------------------------------
Downloading: http://download.java.net/maven/2/javax/ws/rs/jsr311-api/1.1/jsr311-api-1.1.pom
Downloaded: http://download.java.net/maven/2/javax/ws/rs/jsr311-api/1.1/jsr311-api-1.1.pom (6 KB at 4.4 KB/sec)
Downloading: http://download.java.net/maven/2/com/sun/jersey/jersey-test-framework/jersey-test-framework-grizzly/1.7/jersey-test-framework-grizzly-1.7.pom
Downloaded: http://download.java.net/maven/2/com/sun/jersey/jersey-test-framework/jersey-test-framework-grizzly/1.7/jersey-test-framework-grizzly-1.7.pom (6 KB at 34.7 KB/sec)
Downloading: http://download.java.net/maven/2/com/sun/jersey/jersey-test-framework/1.7/jersey-test-framework-1.7.pom
Downloaded: http://download.java.net/maven/2/com/sun/jersey/jersey-test-framework/1.7/jersey-test-framework-1.7.pom (3 KB at 19.7 KB/sec)
Downloading: http://download.java.net/maven/2/com/sun/grizzly/grizzly-servlet-webserver/1.9.31/grizzly-servlet-webserver-1.9.31.pom
Downloading: http://repo1.maven.org/maven2/com/sun/grizzly/grizzly-servlet-webserver/1.9.31/grizzly-servlet-webserver-1.9.31.pom
Downloaded: http://repo1.maven.org/maven2/com/sun/grizzly/grizzly-servlet-webserver/1.9.31/grizzly-servlet-webserver-1.9.31.pom (7 KB at 16.5 KB/sec)
Downloading: http://download.java.net/maven/2/com/sun/grizzly/grizzly-project/1.9.31/grizzly-project-1.9.31.pom
Downloading: http://repo1.maven.org/maven2/com/sun/grizzly/grizzly-project/1.9.31/grizzly-project-1.9.31.pom
Downloaded: http://repo1.maven.org/maven2/com/sun/grizzly/grizzly-project/1.9.31/grizzly-project-1.9.31.pom (20 KB at 48.9 KB/sec)
Downloading: http://download.java.net/maven/2/com/sun/grizzly/grizzly-http/1.9.31/grizzly-http-1.9.31.pom
Downloading: http://repo1.maven.org/maven2/com/sun/grizzly/grizzly-http/1.9.31/grizzly-http-1.9.31.pom
Downloaded: http://repo1.maven.org/maven2/com/sun/grizzly/grizzly-http/1.9.31/grizzly-http-1.9.31.pom (5 KB at 12.4 KB/sec)
Downloading: http://download.java.net/maven/2/com/sun/grizzly/grizzly-framework/1.9.31/grizzly-framework-1.9.31.pom
Downloading: http://repo1.maven.org/maven2/com/sun/grizzly/grizzly-framework/1.9.31/grizzly-framework-1.9.31.pom
Downloaded: http://repo1.maven.org/maven2/com/sun/grizzly/grizzly-framework/1.9.31/grizzly-framework-1.9.31.pom (6 KB at 11.3 KB/sec)
Downloading: http://download.java.net/maven/2/com/sun/grizzly/grizzly-utils/1.9.31/grizzly-utils-1.9.31.pom
Downloading: http://repo1.maven.org/maven2/com/sun/grizzly/grizzly-utils/1.9.31/grizzly-utils-1.9.31.pom
Downloaded: http://repo1.maven.org/maven2/com/sun/grizzly/grizzly-utils/1.9.31/grizzly-utils-1.9.31.pom (7 KB at 20.2 KB/sec)
Downloading: http://download.java.net/maven/2/com/sun/grizzly/grizzly-lzma/1.9.31/grizzly-lzma-1.9.31.pom
Downloading: http://repo1.maven.org/maven2/com/sun/grizzly/grizzly-lzma/1.9.31/grizzly-lzma-1.9.31.pom
Downloaded: http://repo1.maven.org/maven2/com/sun/grizzly/grizzly-lzma/1.9.31/grizzly-lzma-1.9.31.pom (5 KB at 10.2 KB/sec)
Downloading: http://download.java.net/maven/2/com/sun/grizzly/grizzly-rcm/1.9.31/grizzly-rcm-1.9.31.pom
Downloading: http://repo1.maven.org/maven2/com/sun/grizzly/grizzly-rcm/1.9.31/grizzly-rcm-1.9.31.pom
Downloaded: http://repo1.maven.org/maven2/com/sun/grizzly/grizzly-rcm/1.9.31/grizzly-rcm-1.9.31.pom (5 KB at 10.8 KB/sec)
Downloading: http://download.java.net/maven/2/com/sun/grizzly/grizzly-portunif/1.9.31/grizzly-portunif-1.9.31.pom
Downloading: http://repo1.maven.org/maven2/com/sun/grizzly/grizzly-portunif/1.9.31/grizzly-portunif-1.9.31.pom
Downloaded: http://repo1.maven.org/maven2/com/sun/grizzly/grizzly-portunif/1.9.31/grizzly-portunif-1.9.31.pom (5 KB at 10.9 KB/sec)
Downloading: http://download.java.net/maven/2/com/sun/grizzly/grizzly-http-servlet/1.9.31/grizzly-http-servlet-1.9.31.pom
Downloading: http://repo1.maven.org/maven2/com/sun/grizzly/grizzly-http-servlet/1.9.31/grizzly-http-servlet-1.9.31.pom
Downloaded: http://repo1.maven.org/maven2/com/sun/grizzly/grizzly-http-servlet/1.9.31/grizzly-http-servlet-1.9.31.pom (6 KB at 13.0 KB/sec)
Downloading: http://download.java.net/maven/2/com/sun/jersey/jersey-test-framework/jersey-test-framework-core/1.7/jersey-test-framework-core-1.7.pom
Downloaded: http://download.java.net/maven/2/com/sun/jersey/jersey-test-framework/jersey-test-framework-core/1.7/jersey-test-framework-core-1.7.pom (7 KB at 24.9 KB/sec)
Downloading: http://download.java.net/maven/2/com/sun/jersey/jersey-grizzly/1.7/jersey-grizzly-1.7.pom
Downloaded: http://download.java.net/maven/2/com/sun/jersey/jersey-grizzly/1.7/jersey-grizzly-1.7.pom (7 KB at 38.9 KB/sec)
Downloading: http://download.java.net/maven/2/org/eclipse/jetty/jetty-server/8.0.0.M3/jetty-server-8.0.0.M3.pom
Downloading: http://repo1.maven.org/maven2/org/eclipse/jetty/jetty-server/8.0.0.M3/jetty-server-8.0.0.M3.pom
Downloaded: http://repo1.maven.org/maven2/org/eclipse/jetty/jetty-server/8.0.0.M3/jetty-server-8.0.0.M3.pom (4 KB at 11.3 KB/sec)
Downloading: http://download.java.net/maven/2/org/eclipse/jetty/jetty-project/8.0.0.M3/jetty-project-8.0.0.M3.pom
Downloading: http://repo1.maven.org/maven2/org/eclipse/jetty/jetty-project/8.0.0.M3/jetty-project-8.0.0.M3.pom
Downloaded: http://repo1.maven.org/maven2/org/eclipse/jetty/jetty-project/8.0.0.M3/jetty-project-8.0.0.M3.pom (20 KB at 48.9 KB/sec)
Downloading: http://download.java.net/maven/2/org/eclipse/jetty/jetty-parent/17/jetty-parent-17.pom
Downloading: http://repo1.maven.org/maven2/org/eclipse/jetty/jetty-parent/17/jetty-parent-17.pom
Downloaded: http://repo1.maven.org/maven2/org/eclipse/jetty/jetty-parent/17/jetty-parent-17.pom (17 KB at 39.9 KB/sec)
Downloading: http://download.java.net/maven/2/org/eclipse/jetty/jetty-continuation/8.0.0.M3/jetty-continuation-8.0.0.M3.pom
Downloading: http://repo1.maven.org/maven2/org/eclipse/jetty/jetty-continuation/8.0.0.M3/jetty-continuation-8.0.0.M3.pom
Downloaded: http://repo1.maven.org/maven2/org/eclipse/jetty/jetty-continuation/8.0.0.M3/jetty-continuation-8.0.0.M3.pom (3 KB at 7.4 KB/sec)
Downloading: http://download.java.net/maven/2/org/eclipse/jetty/jetty-http/8.0.0.M3/jetty-http-8.0.0.M3.pom
Downloading: http://repo1.maven.org/maven2/org/eclipse/jetty/jetty-http/8.0.0.M3/jetty-http-8.0.0.M3.pom
Downloaded: http://repo1.maven.org/maven2/org/eclipse/jetty/jetty-http/8.0.0.M3/jetty-http-8.0.0.M3.pom (3 KB at 6.3 KB/sec)
Downloading: http://download.java.net/maven/2/org/eclipse/jetty/jetty-io/8.0.0.M3/jetty-io-8.0.0.M3.pom
Downloading: http://repo1.maven.org/maven2/org/eclipse/jetty/jetty-io/8.0.0.M3/jetty-io-8.0.0.M3.pom
Downloaded: http://repo1.maven.org/maven2/org/eclipse/jetty/jetty-io/8.0.0.M3/jetty-io-8.0.0.M3.pom (3 KB at 5.6 KB/sec)
Downloading: http://download.java.net/maven/2/org/eclipse/jetty/jetty-util/8.0.0.M3/jetty-util-8.0.0.M3.pom
Downloading: http://repo1.maven.org/maven2/org/eclipse/jetty/jetty-util/8.0.0.M3/jetty-util-8.0.0.M3.pom
Downloaded: http://repo1.maven.org/maven2/org/eclipse/jetty/jetty-util/8.0.0.M3/jetty-util-8.0.0.M3.pom (4 KB at 7.7 KB/sec)
Downloading: http://download.java.net/maven/2/org/eclipse/jetty/jetty-servlet/8.0.0.M3/jetty-servlet-8.0.0.M3.pom
Downloading: http://repo1.maven.org/maven2/org/eclipse/jetty/jetty-servlet/8.0.0.M3/jetty-servlet-8.0.0.M3.pom
Downloaded: http://repo1.maven.org/maven2/org/eclipse/jetty/jetty-servlet/8.0.0.M3/jetty-servlet-8.0.0.M3.pom (3 KB at 6.4 KB/sec)
Downloading: http://download.java.net/maven/2/org/eclipse/jetty/jetty-security/8.0.0.M3/jetty-security-8.0.0.M3.pom
Downloading: http://repo1.maven.org/maven2/org/eclipse/jetty/jetty-security/8.0.0.M3/jetty-security-8.0.0.M3.pom
Downloaded: http://repo1.maven.org/maven2/org/eclipse/jetty/jetty-security/8.0.0.M3/jetty-security-8.0.0.M3.pom (3 KB at 6.8 KB/sec)
Downloading: http://download.java.net/maven/2/net/sf/opencsv/opencsv/2.0/opencsv-2.0.pom
Downloading: http://repo1.maven.org/maven2/net/sf/opencsv/opencsv/2.0/opencsv-2.0.pom
Downloaded: http://repo1.maven.org/maven2/net/sf/opencsv/opencsv/2.0/opencsv-2.0.pom (6 KB at 17.4 KB/sec)
Downloading: http://download.java.net/maven/2/javax/ws/rs/jsr311-api/1.1/jsr311-api-1.1.jar
Downloading: http://download.java.net/maven/2/com/sun/jersey/jersey-test-framework/jersey-test-framework-grizzly/1.7/jersey-test-framework-grizzly-1.7.jar
Downloading: http://download.java.net/maven/2/com/sun/grizzly/grizzly-servlet-webserver/1.9.31/grizzly-servlet-webserver-1.9.31.jar
Downloading: http://download.java.net/maven/2/com/sun/grizzly/grizzly-http/1.9.31/grizzly-http-1.9.31.jar
Downloading: http://download.java.net/maven/2/com/sun/grizzly/grizzly-framework/1.9.31/grizzly-framework-1.9.31.jar
Downloading: http://download.java.net/maven/2/com/sun/grizzly/grizzly-rcm/1.9.31/grizzly-rcm-1.9.31.jar
Downloading: http://download.java.net/maven/2/com/sun/grizzly/grizzly-portunif/1.9.31/grizzly-portunif-1.9.31.jar
Downloading: http://download.java.net/maven/2/com/sun/grizzly/grizzly-utils/1.9.31/grizzly-utils-1.9.31.jar
Downloading: http://download.java.net/maven/2/com/sun/grizzly/grizzly-lzma/1.9.31/grizzly-lzma-1.9.31.jar
Downloading: http://download.java.net/maven/2/com/sun/grizzly/grizzly-http-servlet/1.9.31/grizzly-http-servlet-1.9.31.jar
Downloading: http://download.java.net/maven/2/com/sun/jersey/jersey-test-framework/jersey-test-framework-core/1.7/jersey-test-framework-core-1.7.jar
Downloaded: http://download.java.net/maven/2/com/sun/jersey/jersey-test-framework/jersey-test-framework-grizzly/1.7/jersey-test-framework-grizzly-1.7.jar (13 KB at 45.0 KB/sec)
Downloading: http://download.java.net/maven/2/com/sun/jersey/jersey-grizzly/1.7/jersey-grizzly-1.7.jar
Downloading: http://download.java.net/maven/2/org/eclipse/jetty/jetty-server/8.0.0.M3/jetty-server-8.0.0.M3.jar
Downloading: http://download.java.net/maven/2/org/eclipse/jetty/jetty-continuation/8.0.0.M3/jetty-continuation-8.0.0.M3.jar
Downloaded: http://download.java.net/maven/2/javax/ws/rs/jsr311-api/1.1/jsr311-api-1.1.jar (46 KB at 119.8 KB/sec)
Downloading: http://download.java.net/maven/2/org/eclipse/jetty/jetty-http/8.0.0.M3/jetty-http-8.0.0.M3.jar
Downloading: http://download.java.net/maven/2/org/eclipse/jetty/jetty-io/8.0.0.M3/jetty-io-8.0.0.M3.jar
Downloading: http://download.java.net/maven/2/org/eclipse/jetty/jetty-util/8.0.0.M3/jetty-util-8.0.0.M3.jar
Downloading: http://download.java.net/maven/2/org/eclipse/jetty/jetty-servlet/8.0.0.M3/jetty-servlet-8.0.0.M3.jar
Downloaded: http://download.java.net/maven/2/com/sun/jersey/jersey-grizzly/1.7/jersey-grizzly-1.7.jar (18 KB at 114.3 KB/sec)
Downloading: http://download.java.net/maven/2/org/eclipse/jetty/jetty-security/8.0.0.M3/jetty-security-8.0.0.M3.jar
Downloading: http://download.java.net/maven/2/net/sf/opencsv/opencsv/2.0/opencsv-2.0.jar
Downloaded: http://download.java.net/maven/2/com/sun/jersey/jersey-test-framework/jersey-test-framework-core/1.7/jersey-test-framework-core-1.7.jar (28 KB at 92.5 KB/sec)
Downloading: http://repo1.maven.org/maven2/com/sun/grizzly/grizzly-servlet-webserver/1.9.31/grizzly-servlet-webserver-1.9.31.jar
Downloading: http://repo1.maven.org/maven2/com/sun/grizzly/grizzly-http/1.9.31/grizzly-http-1.9.31.jar
Downloading: http://repo1.maven.org/maven2/com/sun/grizzly/grizzly-framework/1.9.31/grizzly-framework-1.9.31.jar
Downloading: http://repo1.maven.org/maven2/com/sun/grizzly/grizzly-rcm/1.9.31/grizzly-rcm-1.9.31.jar
Downloading: http://repo1.maven.org/maven2/com/sun/grizzly/grizzly-portunif/1.9.31/grizzly-portunif-1.9.31.jar
Downloaded: http://repo1.maven.org/maven2/com/sun/grizzly/grizzly-http/1.9.31/grizzly-http-1.9.31.jar (175 KB at 131.7 KB/sec)
Downloading: http://repo1.maven.org/maven2/com/sun/grizzly/grizzly-utils/1.9.31/grizzly-utils-1.9.31.jar
Downloaded: http://repo1.maven.org/maven2/com/sun/grizzly/grizzly-servlet-webserver/1.9.31/grizzly-servlet-webserver-1.9.31.jar (1096 KB at 695.1 KB/sec)
Downloading: http://repo1.maven.org/maven2/com/sun/grizzly/grizzly-lzma/1.9.31/grizzly-lzma-1.9.31.jar
Downloaded: http://repo1.maven.org/maven2/com/sun/grizzly/grizzly-rcm/1.9.31/grizzly-rcm-1.9.31.jar (11 KB at 5.6 KB/sec)
Downloading: http://repo1.maven.org/maven2/com/sun/grizzly/grizzly-http-servlet/1.9.31/grizzly-http-servlet-1.9.31.jar
Downloaded: http://repo1.maven.org/maven2/com/sun/grizzly/grizzly-framework/1.9.31/grizzly-framework-1.9.31.jar (239 KB at 114.1 KB/sec)
Downloading: http://repo1.maven.org/maven2/org/eclipse/jetty/jetty-server/8.0.0.M3/jetty-server-8.0.0.M3.jar
Downloaded: http://repo1.maven.org/maven2/com/sun/grizzly/grizzly-portunif/1.9.31/grizzly-portunif-1.9.31.jar (20 KB at 8.2 KB/sec)
Downloading: http://repo1.maven.org/maven2/org/eclipse/jetty/jetty-continuation/8.0.0.M3/jetty-continuation-8.0.0.M3.jar
Downloaded: http://repo1.maven.org/maven2/com/sun/grizzly/grizzly-lzma/1.9.31/grizzly-lzma-1.9.31.jar (55 KB at 24.1 KB/sec)
Downloading: http://repo1.maven.org/maven2/org/eclipse/jetty/jetty-http/8.0.0.M3/jetty-http-8.0.0.M3.jar
Downloaded: http://repo1.maven.org/maven2/com/sun/grizzly/grizzly-utils/1.9.31/grizzly-utils-1.9.31.jar (490 KB at 178.0 KB/sec)
Downloading: http://repo1.maven.org/maven2/org/eclipse/jetty/jetty-io/8.0.0.M3/jetty-io-8.0.0.M3.jar
Downloaded: http://repo1.maven.org/maven2/com/sun/grizzly/grizzly-http-servlet/1.9.31/grizzly-http-servlet-1.9.31.jar (49 KB at 19.4 KB/sec)
Downloading: http://repo1.maven.org/maven2/org/eclipse/jetty/jetty-util/8.0.0.M3/jetty-util-8.0.0.M3.jar
Downloaded: http://repo1.maven.org/maven2/org/eclipse/jetty/jetty-continuation/8.0.0.M3/jetty-continuation-8.0.0.M3.jar (21 KB at 9.3 KB/sec)
Downloading: http://repo1.maven.org/maven2/org/eclipse/jetty/jetty-servlet/8.0.0.M3/jetty-servlet-8.0.0.M3.jar
Downloaded: http://repo1.maven.org/maven2/org/eclipse/jetty/jetty-server/8.0.0.M3/jetty-server-8.0.0.M3.jar (307 KB at 112.3 KB/sec)
Downloading: http://repo1.maven.org/maven2/org/eclipse/jetty/jetty-security/8.0.0.M3/jetty-security-8.0.0.M3.jar
Downloaded: http://repo1.maven.org/maven2/org/eclipse/jetty/jetty-http/8.0.0.M3/jetty-http-8.0.0.M3.jar (111 KB at 44.5 KB/sec)
Downloading: http://repo1.maven.org/maven2/net/sf/opencsv/opencsv/2.0/opencsv-2.0.jar
Downloaded: http://repo1.maven.org/maven2/org/eclipse/jetty/jetty-io/8.0.0.M3/jetty-io-8.0.0.M3.jar (92 KB at 36.8 KB/sec)
Downloaded: http://repo1.maven.org/maven2/org/eclipse/jetty/jetty-util/8.0.0.M3/jetty-util-8.0.0.M3.jar (222 KB at 88.6 KB/sec)
Downloaded: http://repo1.maven.org/maven2/org/eclipse/jetty/jetty-servlet/8.0.0.M3/jetty-servlet-8.0.0.M3.jar (85 KB at 33.7 KB/sec)
Downloaded: http://repo1.maven.org/maven2/org/eclipse/jetty/jetty-security/8.0.0.M3/jetty-security-8.0.0.M3.jar (85 KB at 30.7 KB/sec)
Downloaded: http://repo1.maven.org/maven2/net/sf/opencsv/opencsv/2.0/opencsv-2.0.jar (15 KB at 10.0 KB/sec)
[INFO]
[INFO] --- maven-clean-plugin:2.4.1:clean (default-clean) @ tika-server ---
[TASKS] Scanning folder '<https://builds.apache.org/job/Tika-trunk/ws/trunk/tika-server'> for files matching the pattern '**/*.java' - excludes:
[TASKS] Found 11 files to scan for tasks
Found 0 open tasks.
[INFO]
[INFO] --- maven-remote-resources-plugin:1.2.1:process (default) @ tika-server ---
[debug] execute contextualize
[INFO] [INFO] Using 'UTF-8' encoding to copy filtered resources.
[INFO] Copying 2 resources
[INFO] Copying 3 resources

[INFO] --- maven-resources-plugin:2.5:resources (default-resources) @ tika-server ---
[INFO]
[INFO] --- maven-compiler-plugin:2.3.2:compile (default-compile) @ tika-server ---
[INFO] Compiling 8 source files to <https://builds.apache.org/job/Tika-trunk/ws/trunk/tika-server/target/classes>
[INFO] -------------------------------------------------------------
[ERROR] COMPILATION ERROR :
[INFO] -------------------------------------------------------------
[ERROR] <https://builds.apache.org/job/Tika-trunk/ws/trunk/tika-server/src/main/java/org/apache/tika/server/TikaResource.java>:[82,-1] cannot access javax.ws.rs.core.HttpHeaders
bad class file: /home/hudson/hudson-slave/maven-repositories/0/com/sun/jersey/jersey-core/1.7/jersey-core-1.7.jar(javax/ws/rs/core/HttpHeaders.class)
class file has wrong version 50.0, should be 49.0
[ERROR] <https://builds.apache.org/job/Tika-trunk/ws/trunk/tika-server/src/main/java/org/apache/tika/server/TikaResource.java>:[46,-1] cannot access javax.ws.rs.Path
bad class file: /home/hudson/hudson-slave/maven-repositories/0/com/sun/jersey/jersey-core/1.7/jersey-core-1.7.jar(javax/ws/rs/Path.class)
class file has wrong version 50.0, should be 49.0
[INFO] 2 errors
[INFO] -------------------------------------------------------------
[JENKINS] Archiving <https://builds.apache.org/job/Tika-trunk/ws/trunk/tika-server/pom.xml> to /home/hudson/hudson/jobs/Tika-trunk/modules/org.apache.tika$tika-server/builds/2012-03-26_11-08-00/archive/org.apache.tika/tika-server/1.2-SNAPSHOT/tika-server-1.2-SNAPSHOT.pom
[INFO] ------------------------------------------------------------------------
[INFO] Reactor Summary:
[INFO]
[INFO] Apache Tika parent ................................ SUCCESS [2:08.171s]
[INFO] Apache Tika core .................................. SUCCESS [2:39.134s]
[INFO] Apache Tika parsers ............................... SUCCESS [2:04.674s]
[INFO] Apache Tika application ........................... SUCCESS [50.205s]
[INFO] Apache Tika OSGi bundle ........................... SUCCESS [49.874s]
[INFO] Apache Tika server ................................ FAILURE [29.261s]
[INFO] Apache Tika ....................................... SKIPPED
[INFO] ------------------------------------------------------------------------
[INFO] BUILD FAILURE
[INFO] ------------------------------------------------------------------------
[INFO] Total time: 19:55.772s
[INFO] Finished at: Mon Mar 26 11:28:53 UTC 2012
[INFO] Final Memory: 40M/353M
[INFO] ------------------------------------------------------------------------
Waiting for Jenkins to finish collecting data
mavenExecutionResult exceptions not empty
message : Failed to execute goal org.apache.maven.plugins:maven-compiler-plugin:2.3.2:compile (default-compile) on project tika-server: Compilation failure
cause : Compilation failure
Stack trace :
org.apache.maven.lifecycle.LifecycleExecutionException: Failed to execute goal org.apache.maven.plugins:maven-compiler-plugin:2.3.2:compile (default-compile) on project tika-server: Compilation failure
        at org.apache.maven.lifecycle.internal.MojoExecutor.execute(MojoExecutor.java:213)
        at org.apache.maven.lifecycle.internal.MojoExecutor.execute(MojoExecutor.java:153)
        at org.apache.maven.lifecycle.internal.MojoExecutor.execute(MojoExecutor.java:145)
        at org.apache.maven.lifecycle.internal.LifecycleModuleBuilder.buildProject(LifecycleModuleBuilder.java:84)
        at org.apache.maven.lifecycle.internal.LifecycleModuleBuilder.buildProject(LifecycleModuleBuilder.java:59)
        at org.apache.maven.lifecycle.internal.LifecycleStarter.singleThreadedBuild(LifecycleStarter.java:183)
        at org.apache.maven.lifecycle.internal.LifecycleStarter.execute(LifecycleStarter.java:161)
        at org.apache.maven.DefaultMaven.doExecute(DefaultMaven.java:319)
        at org.apache.maven.DefaultMaven.execute(DefaultMaven.java:156)
        at org.jvnet.hudson.maven3.launcher.Maven3Launcher.main(Maven3Launcher.java:79)
        at sun.reflect.NativeMethodAccessorImpl.invoke0(Native Method)
        at sun.reflect.NativeMethodAccessorImpl.invoke(NativeMethodAccessorImpl.java:39)
        at sun.reflect.DelegatingMethodAccessorImpl.invoke(DelegatingMethodAccessorImpl.java:25)
        at java.lang.reflect.Method.invoke(Method.java:592)
        at org.codehaus.plexus.classworlds.launcher.Launcher.launchStandard(Launcher.java:329)
        at org.codehaus.plexus.classworlds.launcher.Launcher.launch(Launcher.java:239)
        at org.jvnet.hudson.maven3.agent.Maven3Main.launch(Maven3Main.java:158)
        at hudson.maven.Maven3Builder.call(Maven3Builder.java:104)
        at hudson.maven.Maven3Builder.call(Maven3Builder.java:70)
        at hudson.remoting.UserRequest.perform(UserRequest.java:118)
        at hudson.remoting.UserRequest.perform(UserRequest.java:48)
        at hudson.remoting.Request$2.run(Request.java:287)
        at hudson.remoting.InterceptingExecutorService$1.call(InterceptingExecutorService.java:72)
        at java.util.concurrent.FutureTask$Sync.innerRun(FutureTask.java:269)
        at java.util.concurrent.FutureTask.run(FutureTask.java:123)
        at java.util.concurrent.ThreadPoolExecutor$Worker.runTask(ThreadPoolExecutor.java:651)
        at java.util.concurrent.ThreadPoolExecutor$Worker.run(ThreadPoolExecutor.java:676)
        at java.lang.Thread.run(Thread.java:595)
Caused by: org.apache.maven.plugin.CompilationFailureException: Compilation failure
        at org.apache.maven.plugin.AbstractCompilerMojo.execute(AbstractCompilerMojo.java:656)
        at org.apache.maven.plugin.CompilerMojo.execute(CompilerMojo.java:128)
        at org.apache.maven.plugin.DefaultBuildPluginManager.executeMojo(DefaultBuildPluginManager.java:101)
        at org.apache.maven.lifecycle.internal.MojoExecutor.execute(MojoExecutor.java:209)
        ... 27 more
[TASKS] Aggregating results of Apache Tika parent
[TASKS] Using set difference to compute new warnings
[TASKS] Aggregating results of Apache Tika core
[TASKS] Using set difference to compute new warnings
[TASKS] Aggregating results of Apache Tika parsers
[TASKS] Using set difference to compute new warnings
[TASKS] Aggregating results of Apache Tika application
[TASKS] Using set difference to compute new warnings
[TASKS] Aggregating results of Apache Tika OSGi bundle
[TASKS] Using set difference to compute new warnings
[TASKS] Aggregating results of Apache Tika server
[TASKS] Using set difference to compute new warnings
channel stopped
Reply | Threaded
Open this post in threaded view
|

Build failed in Jenkins: Tika-trunk #819

Apache Jenkins Server-2
See <https://builds.apache.org/job/Tika-trunk/819/changes>

Changes:

[maxcom] tika-server: remove java.net repository

------------------------------------------
[...truncated 676 lines...]

Tests run: 0, Failures: 0, Errors: 0, Skipped: 0

[JENKINS] Recording test results[INFO] Unpacking /home/jenkins/jenkins-slave/maven-repositories/1/edu/ucar/netcdf/4.2-min/netcdf-4.2-min.jar to
  <https://builds.apache.org/job/Tika-trunk/ws/trunk/tika-bundle/target/classes>
   with includes null and excludes:ucar/nc2/iosp/fysat/Fysat*.class,
                ucar/nc2/dataset/transform/VOceanSG1*class,
                ucar/unidata/geoloc/vertical/OceanSG*.class,
                META-INF/**,CHANGES,README

[INFO]
[INFO] --- maven-dependency-plugin:2.1:unpack-dependencies (default) @ tika-bundle ---
[INFO]
[INFO] --- maven-bundle-plugin:2.3.4:bundle (default-bundle) @ tika-bundle ---
[INFO]
[INFO] --- maven-site-plugin:3.0:attach-descriptor (attach-descriptor) @ tika-bundle ---
[INFO] [INFO] No excludes

[INFO] --- apache-rat-plugin:0.7:check (default) @ tika-bundle ---
[PMD] No report found for mojo check
[INFO] Installing <https://builds.apache.org/job/Tika-trunk/ws/trunk/tika-bundle/target/tika-bundle-1.2-SNAPSHOT.jar> to /home/jenkins/jenkins-slave/maven-repositories/1/org/apache/tika/tika-bundle/1.2-SNAPSHOT/tika-bundle-1.2-SNAPSHOT.jar
[INFO]
[INFO] --- maven-install-plugin:2.3.1:install (default-install) @ tika-bundle ---
[INFO] Installing <https://builds.apache.org/job/Tika-trunk/ws/trunk/tika-bundle/pom.xml> to /home/jenkins/jenkins-slave/maven-repositories/1/org/apache/tika/tika-bundle/1.2-SNAPSHOT/tika-bundle-1.2-SNAPSHOT.pom
[INFO] [INFO] Local OBR update disabled (enable with -DobrRepository)

[INFO] --- maven-bundle-plugin:2.3.4:install (default-install) @ tika-bundle ---
[INFO] Downloading: https://repository.apache.org/content/repositories/snapshots/org/apache/tika/tika-bundle/1.2-SNAPSHOT/maven-metadata.xml

[INFO] --- maven-deploy-plugin:2.6:deploy (default-deploy) @ tika-bundle ---
Downloaded: https://repository.apache.org/content/repositories/snapshots/org/apache/tika/tika-bundle/1.2-SNAPSHOT/maven-metadata.xml (773 B at 2.6 KB/sec)
Uploading: https://repository.apache.org/content/repositories/snapshots/org/apache/tika/tika-bundle/1.2-SNAPSHOT/tika-bundle-1.2-20120326.122612-11.jar
Uploaded: https://repository.apache.org/content/repositories/snapshots/org/apache/tika/tika-bundle/1.2-SNAPSHOT/tika-bundle-1.2-20120326.122612-11.jar (21661 KB at 3381.2 KB/sec)
Uploading: https://repository.apache.org/content/repositories/snapshots/org/apache/tika/tika-bundle/1.2-SNAPSHOT/tika-bundle-1.2-20120326.122612-11.pom
Uploaded: https://repository.apache.org/content/repositories/snapshots/org/apache/tika/tika-bundle/1.2-SNAPSHOT/tika-bundle-1.2-20120326.122612-11.pom (8 KB at 46.2 KB/sec)
Downloading: https://repository.apache.org/content/repositories/snapshots/org/apache/tika/tika-bundle/maven-metadata.xml
Downloaded: https://repository.apache.org/content/repositories/snapshots/org/apache/tika/tika-bundle/maven-metadata.xml (342 B at 1.5 KB/sec)
Uploading: https://repository.apache.org/content/repositories/snapshots/org/apache/tika/tika-bundle/1.2-SNAPSHOT/maven-metadata.xml
Uploaded: https://repository.apache.org/content/repositories/snapshots/org/apache/tika/tika-bundle/1.2-SNAPSHOT/maven-metadata.xml (773 B at 3.7 KB/sec)
Uploading: https://repository.apache.org/content/repositories/snapshots/org/apache/tika/tika-bundle/maven-metadata.xml
Uploaded: https://repository.apache.org/content/repositories/snapshots/org/apache/tika/tika-bundle/maven-metadata.xml (342 B at 2.2 KB/sec)
[INFO] [INFO] Remote OBR update disabled (enable with -DremoteOBR)

[INFO] --- maven-bundle-plugin:2.3.4:deploy (default-deploy) @ tika-bundle ---
[JENKINS] Archiving <https://builds.apache.org/job/Tika-trunk/ws/trunk/tika-bundle/pom.xml> to /home/hudson/hudson/jobs/Tika-trunk/modules/org.apache.tika$tika-bundle/builds/2012-03-26_12-04-53/archive/org.apache.tika/tika-bundle/1.2-SNAPSHOT/tika-bundle-1.2-SNAPSHOT.pom
[JENKINS] Archiving <https://builds.apache.org/job/Tika-trunk/ws/trunk/tika-bundle/target/tika-bundle-1.2-SNAPSHOT.jar> to /home/hudson/hudson/jobs/Tika-trunk/modules/org.apache.tika$tika-bundle/builds/2012-03-26_12-04-53/archive/org.apache.tika/tika-bundle/1.2-20120326.122612-11/tika-bundle-1.2-20120326.122612-11.jar
[INFO]                                                                        
Downloading: http://repo1.maven.org/maven2/javax/ws/rs/jsr311-api/1.1/jsr311-api-1.1.pom
Downloaded: http://repo1.maven.org/maven2/javax/ws/rs/jsr311-api/1.1/jsr311-api-1.1.pom (6 KB at 14.4 KB/sec)
Downloading: http://repo1.maven.org/maven2/com/sun/jersey/jersey-test-framework/jersey-test-framework-grizzly/1.7/jersey-test-framework-grizzly-1.7.pom
Downloaded: http://repo1.maven.org/maven2/com/sun/jersey/jersey-test-framework/jersey-test-framework-grizzly/1.7/jersey-test-framework-grizzly-1.7.pom (6 KB at 11.1 KB/sec)
Downloading: http://repo1.maven.org/maven2/com/sun/jersey/jersey-test-framework/1.7/jersey-test-framework-1.7.pom
Downloaded: http://repo1.maven.org/maven2/com/sun/jersey/jersey-test-framework/1.7/jersey-test-framework-1.7.pom (3 KB at 6.5 KB/sec)
Downloading: http://repo1.maven.org/maven2/com/sun/grizzly/grizzly-servlet-webserver/1.9.31/grizzly-servlet-webserver-1.9.31.pom
Downloaded: http://repo1.maven.org/maven2/com/sun/grizzly/grizzly-servlet-webserver/1.9.31/grizzly-servlet-webserver-1.9.31.pom (7 KB at 12.5 KB/sec)
Downloading: http://repo1.maven.org/maven2/com/sun/grizzly/grizzly-project/1.9.31/grizzly-project-1.9.31.pom
Downloaded: http://repo1.maven.org/maven2/com/sun/grizzly/grizzly-project/1.9.31/grizzly-project-1.9.31.pom (20 KB at 38.3 KB/sec)
Downloading: http://repo1.maven.org/maven2/com/sun/grizzly/grizzly-http/1.9.31/grizzly-http-1.9.31.pom
Downloaded: http://repo1.maven.org/maven2/com/sun/grizzly/grizzly-http/1.9.31/grizzly-http-1.9.31.pom (5 KB at 9.4 KB/sec)
Downloading: http://repo1.maven.org/maven2/com/sun/grizzly/grizzly-framework/1.9.31/grizzly-framework-1.9.31.pom
Downloaded: http://repo1.maven.org/maven2/com/sun/grizzly/grizzly-framework/1.9.31/grizzly-framework-1.9.31.pom (6 KB at 10.6 KB/sec)
Downloading: http://repo1.maven.org/maven2/com/sun/grizzly/grizzly-utils/1.9.31/grizzly-utils-1.9.31.pom
Downloaded: http://repo1.maven.org/maven2/com/sun/grizzly/grizzly-utils/1.9.31/grizzly-utils-1.9.31.pom (7 KB at 13.0 KB/sec)
Downloading: http://repo1.maven.org/maven2/com/sun/grizzly/grizzly-lzma/1.9.31/grizzly-lzma-1.9.31.pom
Downloaded: http://repo1.maven.org/maven2/com/sun/grizzly/grizzly-lzma/1.9.31/grizzly-lzma-1.9.31.pom (5 KB at 8.4 KB/sec)
Downloading: http://repo1.maven.org/maven2/com/sun/grizzly/grizzly-rcm/1.9.31/grizzly-rcm-1.9.31.pom
Downloaded: http://repo1.maven.org/maven2/com/sun/grizzly/grizzly-rcm/1.9.31/grizzly-rcm-1.9.31.pom (5 KB at 8.6 KB/sec)
Downloading: http://repo1.maven.org/maven2/com/sun/grizzly/grizzly-portunif/1.9.31/grizzly-portunif-1.9.31.pom
[INFO] ------------------------------------------------------------------------
[INFO] Building Apache Tika server 1.2-SNAPSHOT
[INFO] ------------------------------------------------------------------------
Downloaded: http://repo1.maven.org/maven2/com/sun/grizzly/grizzly-portunif/1.9.31/grizzly-portunif-1.9.31.pom (5 KB at 8.7 KB/sec)
Downloading: http://repo1.maven.org/maven2/com/sun/grizzly/grizzly-http-servlet/1.9.31/grizzly-http-servlet-1.9.31.pom
Downloaded: http://repo1.maven.org/maven2/com/sun/grizzly/grizzly-http-servlet/1.9.31/grizzly-http-servlet-1.9.31.pom (6 KB at 11.2 KB/sec)
Downloading: http://repo1.maven.org/maven2/com/sun/jersey/jersey-test-framework/jersey-test-framework-core/1.7/jersey-test-framework-core-1.7.pom
Downloaded: http://repo1.maven.org/maven2/com/sun/jersey/jersey-test-framework/jersey-test-framework-core/1.7/jersey-test-framework-core-1.7.pom (7 KB at 13.0 KB/sec)
Downloading: http://repo1.maven.org/maven2/com/sun/jersey/jersey-grizzly/1.7/jersey-grizzly-1.7.pom
Downloaded: http://repo1.maven.org/maven2/com/sun/jersey/jersey-grizzly/1.7/jersey-grizzly-1.7.pom (7 KB at 15.1 KB/sec)
Downloading: http://repo1.maven.org/maven2/org/eclipse/jetty/jetty-server/8.0.0.M3/jetty-server-8.0.0.M3.pom
Downloaded: http://repo1.maven.org/maven2/org/eclipse/jetty/jetty-server/8.0.0.M3/jetty-server-8.0.0.M3.pom (4 KB at 7.6 KB/sec)
Downloading: http://repo1.maven.org/maven2/org/eclipse/jetty/jetty-project/8.0.0.M3/jetty-project-8.0.0.M3.pom
Downloaded: http://repo1.maven.org/maven2/org/eclipse/jetty/jetty-project/8.0.0.M3/jetty-project-8.0.0.M3.pom (20 KB at 38.7 KB/sec)
Downloading: http://repo1.maven.org/maven2/org/eclipse/jetty/jetty-parent/17/jetty-parent-17.pom
Downloaded: http://repo1.maven.org/maven2/org/eclipse/jetty/jetty-parent/17/jetty-parent-17.pom (17 KB at 32.3 KB/sec)
Downloading: http://repo1.maven.org/maven2/org/eclipse/jetty/jetty-continuation/8.0.0.M3/jetty-continuation-8.0.0.M3.pom
Downloaded: http://repo1.maven.org/maven2/org/eclipse/jetty/jetty-continuation/8.0.0.M3/jetty-continuation-8.0.0.M3.pom (3 KB at 5.9 KB/sec)
Downloading: http://repo1.maven.org/maven2/org/eclipse/jetty/jetty-http/8.0.0.M3/jetty-http-8.0.0.M3.pom
Downloaded: http://repo1.maven.org/maven2/org/eclipse/jetty/jetty-http/8.0.0.M3/jetty-http-8.0.0.M3.pom (3 KB at 4.8 KB/sec)
Downloading: http://repo1.maven.org/maven2/org/eclipse/jetty/jetty-io/8.0.0.M3/jetty-io-8.0.0.M3.pom
Downloaded: http://repo1.maven.org/maven2/org/eclipse/jetty/jetty-io/8.0.0.M3/jetty-io-8.0.0.M3.pom (3 KB at 4.2 KB/sec)
Downloading: http://repo1.maven.org/maven2/org/eclipse/jetty/jetty-util/8.0.0.M3/jetty-util-8.0.0.M3.pom
Downloaded: http://repo1.maven.org/maven2/org/eclipse/jetty/jetty-util/8.0.0.M3/jetty-util-8.0.0.M3.pom (4 KB at 5.6 KB/sec)
Downloading: http://repo1.maven.org/maven2/org/eclipse/jetty/jetty-servlet/8.0.0.M3/jetty-servlet-8.0.0.M3.pom
Downloaded: http://repo1.maven.org/maven2/org/eclipse/jetty/jetty-servlet/8.0.0.M3/jetty-servlet-8.0.0.M3.pom (3 KB at 5.8 KB/sec)
Downloading: http://repo1.maven.org/maven2/org/eclipse/jetty/jetty-security/8.0.0.M3/jetty-security-8.0.0.M3.pom
Downloaded: http://repo1.maven.org/maven2/org/eclipse/jetty/jetty-security/8.0.0.M3/jetty-security-8.0.0.M3.pom (3 KB at 5.4 KB/sec)
Downloading: http://repo1.maven.org/maven2/net/sf/opencsv/opencsv/2.0/opencsv-2.0.pom
Downloaded: http://repo1.maven.org/maven2/net/sf/opencsv/opencsv/2.0/opencsv-2.0.pom (6 KB at 11.3 KB/sec)
Downloading: http://repo1.maven.org/maven2/javax/ws/rs/jsr311-api/1.1/jsr311-api-1.1.jar
Downloading: http://repo1.maven.org/maven2/com/sun/jersey/jersey-test-framework/jersey-test-framework-grizzly/1.7/jersey-test-framework-grizzly-1.7.jar
Downloading: http://repo1.maven.org/maven2/com/sun/grizzly/grizzly-servlet-webserver/1.9.31/grizzly-servlet-webserver-1.9.31.jar
Downloading: http://repo1.maven.org/maven2/com/sun/grizzly/grizzly-http/1.9.31/grizzly-http-1.9.31.jar
Downloading: http://repo1.maven.org/maven2/com/sun/grizzly/grizzly-framework/1.9.31/grizzly-framework-1.9.31.jar
Downloaded: http://repo1.maven.org/maven2/javax/ws/rs/jsr311-api/1.1/jsr311-api-1.1.jar (45 KB at 30.3 KB/sec)
Downloading: http://repo1.maven.org/maven2/com/sun/grizzly/grizzly-rcm/1.9.31/grizzly-rcm-1.9.31.jar
Downloaded: http://repo1.maven.org/maven2/com/sun/jersey/jersey-test-framework/jersey-test-framework-grizzly/1.7/jersey-test-framework-grizzly-1.7.jar (13 KB at 7.3 KB/sec)
Downloading: http://repo1.maven.org/maven2/com/sun/grizzly/grizzly-portunif/1.9.31/grizzly-portunif-1.9.31.jar
Downloaded: http://repo1.maven.org/maven2/com/sun/grizzly/grizzly-framework/1.9.31/grizzly-framework-1.9.31.jar (239 KB at 121.1 KB/sec)
Downloading: http://repo1.maven.org/maven2/com/sun/grizzly/grizzly-utils/1.9.31/grizzly-utils-1.9.31.jar
Downloaded: http://repo1.maven.org/maven2/com/sun/grizzly/grizzly-servlet-webserver/1.9.31/grizzly-servlet-webserver-1.9.31.jar (1096 KB at 477.1 KB/sec)
Downloading: http://repo1.maven.org/maven2/com/sun/grizzly/grizzly-lzma/1.9.31/grizzly-lzma-1.9.31.jar
Downloaded: http://repo1.maven.org/maven2/com/sun/grizzly/grizzly-http/1.9.31/grizzly-http-1.9.31.jar (175 KB at 63.5 KB/sec)
Downloading: http://repo1.maven.org/maven2/com/sun/grizzly/grizzly-http-servlet/1.9.31/grizzly-http-servlet-1.9.31.jar
Downloaded: http://repo1.maven.org/maven2/com/sun/grizzly/grizzly-rcm/1.9.31/grizzly-rcm-1.9.31.jar (11 KB at 4.5 KB/sec)
Downloading: http://repo1.maven.org/maven2/com/sun/jersey/jersey-test-framework/jersey-test-framework-core/1.7/jersey-test-framework-core-1.7.jar
Downloaded: http://repo1.maven.org/maven2/com/sun/grizzly/grizzly-portunif/1.9.31/grizzly-portunif-1.9.31.jar (20 KB at 7.7 KB/sec)
Downloading: http://repo1.maven.org/maven2/com/sun/jersey/jersey-grizzly/1.7/jersey-grizzly-1.7.jar
Downloaded: http://repo1.maven.org/maven2/com/sun/grizzly/grizzly-lzma/1.9.31/grizzly-lzma-1.9.31.jar (55 KB at 24.6 KB/sec)
Downloading: http://repo1.maven.org/maven2/org/eclipse/jetty/jetty-server/8.0.0.M3/jetty-server-8.0.0.M3.jar
Downloaded: http://repo1.maven.org/maven2/com/sun/grizzly/grizzly-utils/1.9.31/grizzly-utils-1.9.31.jar (490 KB at 162.5 KB/sec)
Downloading: http://repo1.maven.org/maven2/org/eclipse/jetty/jetty-continuation/8.0.0.M3/jetty-continuation-8.0.0.M3.jar
Downloaded: http://repo1.maven.org/maven2/com/sun/grizzly/grizzly-http-servlet/1.9.31/grizzly-http-servlet-1.9.31.jar (49 KB at 19.5 KB/sec)
Downloading: http://repo1.maven.org/maven2/org/eclipse/jetty/jetty-http/8.0.0.M3/jetty-http-8.0.0.M3.jar
Downloaded: http://repo1.maven.org/maven2/com/sun/jersey/jersey-test-framework/jersey-test-framework-core/1.7/jersey-test-framework-core-1.7.jar (28 KB at 12.1 KB/sec)
Downloading: http://repo1.maven.org/maven2/org/eclipse/jetty/jetty-io/8.0.0.M3/jetty-io-8.0.0.M3.jar
Downloaded: http://repo1.maven.org/maven2/com/sun/jersey/jersey-grizzly/1.7/jersey-grizzly-1.7.jar (18 KB at 7.0 KB/sec)
Downloading: http://repo1.maven.org/maven2/org/eclipse/jetty/jetty-util/8.0.0.M3/jetty-util-8.0.0.M3.jar
Downloaded: http://repo1.maven.org/maven2/org/eclipse/jetty/jetty-server/8.0.0.M3/jetty-server-8.0.0.M3.jar (307 KB at 111.3 KB/sec)
Downloading: http://repo1.maven.org/maven2/org/eclipse/jetty/jetty-servlet/8.0.0.M3/jetty-servlet-8.0.0.M3.jar
Downloaded: http://repo1.maven.org/maven2/org/eclipse/jetty/jetty-continuation/8.0.0.M3/jetty-continuation-8.0.0.M3.jar (21 KB at 8.3 KB/sec)
Downloading: http://repo1.maven.org/maven2/org/eclipse/jetty/jetty-security/8.0.0.M3/jetty-security-8.0.0.M3.jar
Downloaded: http://repo1.maven.org/maven2/org/eclipse/jetty/jetty-http/8.0.0.M3/jetty-http-8.0.0.M3.jar (111 KB at 40.4 KB/sec)
Downloading: http://repo1.maven.org/maven2/net/sf/opencsv/opencsv/2.0/opencsv-2.0.jar
Downloaded: http://repo1.maven.org/maven2/org/eclipse/jetty/jetty-io/8.0.0.M3/jetty-io-8.0.0.M3.jar (92 KB at 36.6 KB/sec)
Downloaded: http://repo1.maven.org/maven2/org/eclipse/jetty/jetty-util/8.0.0.M3/jetty-util-8.0.0.M3.jar (222 KB at 89.5 KB/sec)
Downloaded: http://repo1.maven.org/maven2/org/eclipse/jetty/jetty-servlet/8.0.0.M3/jetty-servlet-8.0.0.M3.jar (85 KB at 37.8 KB/sec)
Downloaded: http://repo1.maven.org/maven2/org/eclipse/jetty/jetty-security/8.0.0.M3/jetty-security-8.0.0.M3.jar (85 KB at 37.3 KB/sec)
Downloaded: http://repo1.maven.org/maven2/net/sf/opencsv/opencsv/2.0/opencsv-2.0.jar (15 KB at 7.3 KB/sec)
[INFO]
[INFO] --- maven-clean-plugin:2.4.1:clean (default-clean) @ tika-server ---
[TASKS] Scanning folder '<https://builds.apache.org/job/Tika-trunk/ws/trunk/tika-server'> for files matching the pattern '**/*.java' - excludes:
[TASKS] Found 11 files to scan for tasks
Found 0 open tasks.
[INFO]
[INFO] --- maven-remote-resources-plugin:1.2.1:process (default) @ tika-server ---
[debug] execute contextualize
[INFO] [INFO] Using 'UTF-8' encoding to copy filtered resources.
[INFO] Copying 2 resources
[INFO] Copying 3 resources

[INFO] --- maven-resources-plugin:2.5:resources (default-resources) @ tika-server ---
[INFO] [INFO] Compiling 8 source files to <https://builds.apache.org/job/Tika-trunk/ws/trunk/tika-server/target/classes>

[INFO] --- maven-compiler-plugin:2.3.2:compile (default-compile) @ tika-server ---
[INFO] -------------------------------------------------------------
[ERROR] COMPILATION ERROR :
[INFO] -------------------------------------------------------------
[ERROR] <https://builds.apache.org/job/Tika-trunk/ws/trunk/tika-server/src/main/java/org/apache/tika/server/TarWriter.java>:[23,-1] cannot access javax.ws.rs.Produces
bad class file: /home/jenkins/jenkins-slave/maven-repositories/1/com/sun/jersey/jersey-core/1.7/jersey-core-1.7.jar(javax/ws/rs/Produces.class)
class file has wrong version 50.0, should be 49.0
[INFO] 1 error
[INFO] -------------------------------------------------------------
[JENKINS] Archiving <https://builds.apache.org/job/Tika-trunk/ws/trunk/tika-server/pom.xml> to /home/hudson/hudson/jobs/Tika-trunk/modules/org.apache.tika$tika-server/builds/2012-03-26_12-04-53/archive/org.apache.tika/tika-server/1.2-SNAPSHOT/tika-server-1.2-SNAPSHOT.pom
[INFO] ------------------------------------------------------------------------
[INFO] Reactor Summary:
[INFO]
[INFO] Apache Tika parent ................................ SUCCESS [1:43.875s]
[INFO] Apache Tika core .................................. SUCCESS [4:24.498s]
[INFO] Apache Tika parsers ............................... SUCCESS [4:59.511s]
[INFO] Apache Tika application ........................... SUCCESS [1:32.106s]
[INFO] Apache Tika OSGi bundle ........................... SUCCESS [56.547s]
[INFO] Apache Tika server ................................ FAILURE [24.302s]
[INFO] Apache Tika ....................................... SKIPPED
[INFO] ------------------------------------------------------------------------
[INFO] BUILD FAILURE
[INFO] ------------------------------------------------------------------------
[INFO] Total time: 27:22.040s
[INFO] Finished at: Mon Mar 26 12:32:48 UTC 2012
[INFO] Final Memory: 41M/343M
[INFO] ------------------------------------------------------------------------
Waiting for Jenkins to finish collecting data
mavenExecutionResult exceptions not empty
message : Failed to execute goal org.apache.maven.plugins:maven-compiler-plugin:2.3.2:compile (default-compile) on project tika-server: Compilation failure
<https://builds.apache.org/job/Tika-trunk/ws/trunk/tika-server/src/main/java/org/apache/tika/server/TarWriter.java>:[23,-1] cannot access javax.ws.rs.Produces
bad class file: /home/jenkins/jenkins-slave/maven-repositories/1/com/sun/jersey/jersey-core/1.7/jersey-core-1.7.jar(javax/ws/rs/Produces.class)
class file has wrong version 50.0, should be 49.0

cause : Compilation failure
<https://builds.apache.org/job/Tika-trunk/ws/trunk/tika-server/src/main/java/org/apache/tika/server/TarWriter.java>:[23,-1] cannot access javax.ws.rs.Produces
bad class file: /home/jenkins/jenkins-slave/maven-repositories/1/com/sun/jersey/jersey-core/1.7/jersey-core-1.7.jar(javax/ws/rs/Produces.class)
class file has wrong version 50.0, should be 49.0

Stack trace :
org.apache.maven.lifecycle.LifecycleExecutionException: Failed to execute goal org.apache.maven.plugins:maven-compiler-plugin:2.3.2:compile (default-compile) on project tika-server: Compilation failure
<https://builds.apache.org/job/Tika-trunk/ws/trunk/tika-server/src/main/java/org/apache/tika/server/TarWriter.java>:[23,-1] cannot access javax.ws.rs.Produces
bad class file: /home/jenkins/jenkins-slave/maven-repositories/1/com/sun/jersey/jersey-core/1.7/jersey-core-1.7.jar(javax/ws/rs/Produces.class)
class file has wrong version 50.0, should be 49.0

        at org.apache.maven.lifecycle.internal.MojoExecutor.execute(MojoExecutor.java:213)
        at org.apache.maven.lifecycle.internal.MojoExecutor.execute(MojoExecutor.java:153)
        at org.apache.maven.lifecycle.internal.MojoExecutor.execute(MojoExecutor.java:145)
        at org.apache.maven.lifecycle.internal.LifecycleModuleBuilder.buildProject(LifecycleModuleBuilder.java:84)
        at org.apache.maven.lifecycle.internal.LifecycleModuleBuilder.buildProject(LifecycleModuleBuilder.java:59)
        at org.apache.maven.lifecycle.internal.LifecycleStarter.singleThreadedBuild(LifecycleStarter.java:183)
        at org.apache.maven.lifecycle.internal.LifecycleStarter.execute(LifecycleStarter.java:161)
        at org.apache.maven.DefaultMaven.doExecute(DefaultMaven.java:319)
        at org.apache.maven.DefaultMaven.execute(DefaultMaven.java:156)
        at org.jvnet.hudson.maven3.launcher.Maven3Launcher.main(Maven3Launcher.java:79)
        at sun.reflect.NativeMethodAccessorImpl.invoke0(Native Method)
        at sun.reflect.NativeMethodAccessorImpl.invoke(NativeMethodAccessorImpl.java:39)
        at sun.reflect.DelegatingMethodAccessorImpl.invoke(DelegatingMethodAccessorImpl.java:25)
        at java.lang.reflect.Method.invoke(Method.java:592)
        at org.codehaus.plexus.classworlds.launcher.Launcher.launchStandard(Launcher.java:329)
        at org.codehaus.plexus.classworlds.launcher.Launcher.launch(Launcher.java:239)
        at org.jvnet.hudson.maven3.agent.Maven3Main.launch(Maven3Main.java:158)
        at hudson.maven.Maven3Builder.call(Maven3Builder.java:104)
        at hudson.maven.Maven3Builder.call(Maven3Builder.java:70)
        at hudson.remoting.UserRequest.perform(UserRequest.java:118)
        at hudson.remoting.UserRequest.perform(UserRequest.java:48)
        at hudson.remoting.Request$2.run(Request.java:287)
        at hudson.remoting.InterceptingExecutorService$1.call(InterceptingExecutorService.java:72)
        at java.util.concurrent.FutureTask$Sync.innerRun(FutureTask.java:269)
        at java.util.concurrent.FutureTask.run(FutureTask.java:123)
        at java.util.concurrent.ThreadPoolExecutor$Worker.runTask(ThreadPoolExecutor.java:651)
        at java.util.concurrent.ThreadPoolExecutor$Worker.run(ThreadPoolExecutor.java:676)
        at java.lang.Thread.run(Thread.java:595)
Caused by: org.apache.maven.plugin.CompilationFailureException: Compilation failure
<https://builds.apache.org/job/Tika-trunk/ws/trunk/tika-server/src/main/java/org/apache/tika/server/TarWriter.java>:[23,-1] cannot access javax.ws.rs.Produces
bad class file: /home/jenkins/jenkins-slave/maven-repositories/1/com/sun/jersey/jersey-core/1.7/jersey-core-1.7.jar(javax/ws/rs/Produces.class)
class file has wrong version 50.0, should be 49.0

        at org.apache.maven.plugin.AbstractCompilerMojo.execute(AbstractCompilerMojo.java:656)
        at org.apache.maven.plugin.CompilerMojo.execute(CompilerMojo.java:128)
        at org.apache.maven.plugin.DefaultBuildPluginManager.executeMojo(DefaultBuildPluginManager.java:101)
        at org.apache.maven.lifecycle.internal.MojoExecutor.execute(MojoExecutor.java:209)
        ... 27 more
[TASKS] Aggregating results of Apache Tika parent
[TASKS] Using set difference to compute new warnings
[TASKS] Aggregating results of Apache Tika core
[TASKS] Using set difference to compute new warnings
[TASKS] Aggregating results of Apache Tika parsers
[TASKS] Using set difference to compute new warnings
[TASKS] Aggregating results of Apache Tika application
[TASKS] Using set difference to compute new warnings
[TASKS] Aggregating results of Apache Tika OSGi bundle
[TASKS] Using set difference to compute new warnings
[TASKS] Aggregating results of Apache Tika server
[TASKS] Using set difference to compute new warnings
channel stopped
Reply | Threaded
Open this post in threaded view
|

Build failed in Jenkins: Tika-trunk #820

Apache Jenkins Server-2
See <https://builds.apache.org/job/Tika-trunk/820/changes>

Changes:

[maxcom] tika-server: update java version because jersey-core requires java6

------------------------------------------
[...truncated 697 lines...]
Downloading: http://repo1.maven.org/maven2/com/sun/jersey/jersey-grizzly/1.7/jersey-grizzly-1.7.jar
Downloaded: http://repo1.maven.org/maven2/com/sun/grizzly/grizzly-lzma/1.9.31/grizzly-lzma-1.9.31.jar (55 KB at 23.9 KB/sec)
Downloading: http://repo1.maven.org/maven2/org/eclipse/jetty/jetty-server/8.0.0.M3/jetty-server-8.0.0.M3.jar
Downloaded: http://repo1.maven.org/maven2/com/sun/grizzly/grizzly-utils/1.9.31/grizzly-utils-1.9.31.jar (490 KB at 164.2 KB/sec)
Downloading: http://repo1.maven.org/maven2/org/eclipse/jetty/jetty-continuation/8.0.0.M3/jetty-continuation-8.0.0.M3.jar
Downloaded: http://repo1.maven.org/maven2/com/sun/grizzly/grizzly-http-servlet/1.9.31/grizzly-http-servlet-1.9.31.jar (49 KB at 17.6 KB/sec)
Downloading: http://repo1.maven.org/maven2/org/eclipse/jetty/jetty-http/8.0.0.M3/jetty-http-8.0.0.M3.jar
Downloaded: http://repo1.maven.org/maven2/com/sun/jersey/jersey-test-framework/jersey-test-framework-core/1.7/jersey-test-framework-core-1.7.jar (28 KB at 12.1 KB/sec)
Downloading: http://repo1.maven.org/maven2/org/eclipse/jetty/jetty-io/8.0.0.M3/jetty-io-8.0.0.M3.jar
Downloaded: http://repo1.maven.org/maven2/com/sun/jersey/jersey-grizzly/1.7/jersey-grizzly-1.7.jar (18 KB at 8.6 KB/sec)
Downloading: http://repo1.maven.org/maven2/org/eclipse/jetty/jetty-util/8.0.0.M3/jetty-util-8.0.0.M3.jar
Downloaded: http://repo1.maven.org/maven2/org/eclipse/jetty/jetty-continuation/8.0.0.M3/jetty-continuation-8.0.0.M3.jar (21 KB at 9.3 KB/sec)
Downloading: http://repo1.maven.org/maven2/org/eclipse/jetty/jetty-servlet/8.0.0.M3/jetty-servlet-8.0.0.M3.jar
Downloaded: http://repo1.maven.org/maven2/org/eclipse/jetty/jetty-server/8.0.0.M3/jetty-server-8.0.0.M3.jar (307 KB at 110.9 KB/sec)
Downloading: http://repo1.maven.org/maven2/org/eclipse/jetty/jetty-security/8.0.0.M3/jetty-security-8.0.0.M3.jar
Downloaded: http://repo1.maven.org/maven2/org/eclipse/jetty/jetty-http/8.0.0.M3/jetty-http-8.0.0.M3.jar (111 KB at 44.2 KB/sec)
Downloading: http://repo1.maven.org/maven2/net/sf/opencsv/opencsv/2.0/opencsv-2.0.jar
Downloaded: http://repo1.maven.org/maven2/org/eclipse/jetty/jetty-io/8.0.0.M3/jetty-io-8.0.0.M3.jar (92 KB at 33.5 KB/sec)
Downloaded: http://repo1.maven.org/maven2/org/eclipse/jetty/jetty-util/8.0.0.M3/jetty-util-8.0.0.M3.jar (222 KB at 80.5 KB/sec)
Downloaded: http://repo1.maven.org/maven2/org/eclipse/jetty/jetty-servlet/8.0.0.M3/jetty-servlet-8.0.0.M3.jar (85 KB at 37.5 KB/sec)
Downloaded: http://repo1.maven.org/maven2/org/eclipse/jetty/jetty-security/8.0.0.M3/jetty-security-8.0.0.M3.jar (85 KB at 37.9 KB/sec)
Downloaded: http://repo1.maven.org/maven2/net/sf/opencsv/opencsv/2.0/opencsv-2.0.jar (15 KB at 7.5 KB/sec)
[INFO] Deleting <https://builds.apache.org/job/Tika-trunk/ws/trunk/tika-server/target>
[INFO]
[INFO] --- maven-clean-plugin:2.4.1:clean (default-clean) @ tika-server ---
[TASKS] Scanning folder '<https://builds.apache.org/job/Tika-trunk/ws/trunk/tika-server'> for files matching the pattern '**/*.java' - excludes:
[TASKS] Found 11 files to scan for tasks
Found 0 open tasks.
[INFO]
[INFO] --- maven-remote-resources-plugin:1.2.1:process (default) @ tika-server ---
[debug] execute contextualize
[INFO] [INFO] Using 'UTF-8' encoding to copy filtered resources.
[INFO] Copying 2 resources
[INFO] Copying 3 resources

[INFO] --- maven-resources-plugin:2.5:resources (default-resources) @ tika-server ---
[INFO] [INFO] Compiling 8 source files to <https://builds.apache.org/job/Tika-trunk/ws/trunk/tika-server/target/classes>

[INFO] --- maven-compiler-plugin:2.3.2:compile (default-compile) @ tika-server ---
[INFO] -------------------------------------------------------------
[ERROR] COMPILATION ERROR :
[INFO] -------------------------------------------------------------
[ERROR] Failure executing javac, but could not parse the error:
javac: invalid flag: -s
Usage: javac <options> <source files>
where possible options include:
  -g                         Generate all debugging info
  -g:none                    Generate no debugging info
  -g:{lines,vars,source}     Generate only some debugging info
  -nowarn                    Generate no warnings
  -verbose                   Output messages about what the compiler is doing
  -deprecation               Output source locations where deprecated APIs are used
  -classpath <path>          Specify where to find user class files
  -cp <path>                 Specify where to find user class files
  -sourcepath <path>         Specify where to find input source files
  -bootclasspath <path>      Override location of bootstrap class files
  -extdirs <dirs>            Override location of installed extensions
  -endorseddirs <dirs>       Override location of endorsed standards path
  -d <directory>             Specify where to place generated class files
  -encoding <encoding>       Specify character encoding used by source files
  -source <release>          Provide source compatibility with specified release
  -target <release>          Generate class files for specific VM version
  -version                   Version information
  -help                      Print a synopsis of standard options
  -X                         Print a synopsis of nonstandard options
  -J<flag>                   Pass <flag> directly to the runtime system


[INFO] 1 error
[INFO] -------------------------------------------------------------
[JENKINS] Archiving <https://builds.apache.org/job/Tika-trunk/ws/trunk/tika-server/pom.xml> to /home/hudson/hudson/jobs/Tika-trunk/modules/org.apache.tika$tika-server/builds/2012-03-26_13-06-44/archive/org.apache.tika/tika-server/1.2-SNAPSHOT/tika-server-1.2-SNAPSHOT.pom
[INFO] ------------------------------------------------------------------------
[INFO] Reactor Summary:
[INFO]
[INFO] Apache Tika parent ................................ SUCCESS [1:07.852s]
[INFO] Apache Tika core .................................. SUCCESS [1:19.353s]
[INFO] Apache Tika parsers ............................... SUCCESS [1:54.020s]
[INFO] Apache Tika application ........................... SUCCESS [49.644s]
[INFO] Apache Tika OSGi bundle ........................... SUCCESS [1:19.796s]
[INFO] Apache Tika server ................................ FAILURE [24.075s]
[INFO] Apache Tika ....................................... SKIPPED
[INFO] ------------------------------------------------------------------------
[INFO] BUILD FAILURE
[INFO] ------------------------------------------------------------------------
[INFO] Total time: 23:11.721s
[INFO] Finished at: Mon Mar 26 13:30:40 UTC 2012
[INFO] Final Memory: 40M/375M
[INFO] ------------------------------------------------------------------------
Waiting for Jenkins to finish collecting data
mavenExecutionResult exceptions not empty
message : Failed to execute goal org.apache.maven.plugins:maven-compiler-plugin:2.3.2:compile (default-compile) on project tika-server: Compilation failure
Failure executing javac, but could not parse the error:
javac: invalid flag: -s
Usage: javac <options> <source files>
where possible options include:
  -g                         Generate all debugging info
  -g:none                    Generate no debugging info
  -g:{lines,vars,source}     Generate only some debugging info
  -nowarn                    Generate no warnings
  -verbose                   Output messages about what the compiler is doing
  -deprecation               Output source locations where deprecated APIs are used
  -classpath <path>          Specify where to find user class files
  -cp <path>                 Specify where to find user class files
  -sourcepath <path>         Specify where to find input source files
  -bootclasspath <path>      Override location of bootstrap class files
  -extdirs <dirs>            Override location of installed extensions
  -endorseddirs <dirs>       Override location of endorsed standards path
  -d <directory>             Specify where to place generated class files
  -encoding <encoding>       Specify character encoding used by source files
  -source <release>          Provide source compatibility with specified release
  -target <release>          Generate class files for specific VM version
  -version                   Version information
  -help                      Print a synopsis of standard options
  -X                         Print a synopsis of nonstandard options
  -J<flag>                   Pass <flag> directly to the runtime system



cause : Compilation failure
Failure executing javac, but could not parse the error:
javac: invalid flag: -s
Usage: javac <options> <source files>
where possible options include:
  -g                         Generate all debugging info
  -g:none                    Generate no debugging info
  -g:{lines,vars,source}     Generate only some debugging info
  -nowarn                    Generate no warnings
  -verbose                   Output messages about what the compiler is doing
  -deprecation               Output source locations where deprecated APIs are used
  -classpath <path>          Specify where to find user class files
  -cp <path>                 Specify where to find user class files
  -sourcepath <path>         Specify where to find input source files
  -bootclasspath <path>      Override location of bootstrap class files
  -extdirs <dirs>            Override location of installed extensions
  -endorseddirs <dirs>       Override location of endorsed standards path
  -d <directory>             Specify where to place generated class files
  -encoding <encoding>       Specify character encoding used by source files
  -source <release>          Provide source compatibility with specified release
  -target <release>          Generate class files for specific VM version
  -version                   Version information
  -help                      Print a synopsis of standard options
  -X                         Print a synopsis of nonstandard options
  -J<flag>                   Pass <flag> directly to the runtime system



Stack trace :
org.apache.maven.lifecycle.LifecycleExecutionException: Failed to execute goal org.apache.maven.plugins:maven-compiler-plugin:2.3.2:compile (default-compile) on project tika-server: Compilation failure
Failure executing javac, but could not parse the error:
javac: invalid flag: -s
Usage: javac <options> <source files>
where possible options include:
  -g                         Generate all debugging info
  -g:none                    Generate no debugging info
  -g:{lines,vars,source}     Generate only some debugging info
  -nowarn                    Generate no warnings
  -verbose                   Output messages about what the compiler is doing
  -deprecation               Output source locations where deprecated APIs are used
  -classpath <path>          Specify where to find user class files
  -cp <path>                 Specify where to find user class files
  -sourcepath <path>         Specify where to find input source files
  -bootclasspath <path>      Override location of bootstrap class files
  -extdirs <dirs>            Override location of installed extensions
  -endorseddirs <dirs>       Override location of endorsed standards path
  -d <directory>             Specify where to place generated class files
  -encoding <encoding>       Specify character encoding used by source files
  -source <release>          Provide source compatibility with specified release
  -target <release>          Generate class files for specific VM version
  -version                   Version information
  -help                      Print a synopsis of standard options
  -X                         Print a synopsis of nonstandard options
  -J<flag>                   Pass <flag> directly to the runtime system



        at org.apache.maven.lifecycle.internal.MojoExecutor.execute(MojoExecutor.java:213)
        at org.apache.maven.lifecycle.internal.MojoExecutor.execute(MojoExecutor.java:153)
        at org.apache.maven.lifecycle.internal.MojoExecutor.execute(MojoExecutor.java:145)
        at org.apache.maven.lifecycle.internal.LifecycleModuleBuilder.buildProject(LifecycleModuleBuilder.java:84)
        at org.apache.maven.lifecycle.internal.LifecycleModuleBuilder.buildProject(LifecycleModuleBuilder.java:59)
        at org.apache.maven.lifecycle.internal.LifecycleStarter.singleThreadedBuild(LifecycleStarter.java:183)
        at org.apache.maven.lifecycle.internal.LifecycleStarter.execute(LifecycleStarter.java:161)
        at org.apache.maven.DefaultMaven.doExecute(DefaultMaven.java:319)
        at org.apache.maven.DefaultMaven.execute(DefaultMaven.java:156)
        at org.jvnet.hudson.maven3.launcher.Maven3Launcher.main(Maven3Launcher.java:79)
        at sun.reflect.NativeMethodAccessorImpl.invoke0(Native Method)
        at sun.reflect.NativeMethodAccessorImpl.invoke(NativeMethodAccessorImpl.java:39)
        at sun.reflect.DelegatingMethodAccessorImpl.invoke(DelegatingMethodAccessorImpl.java:25)
        at java.lang.reflect.Method.invoke(Method.java:592)
        at org.codehaus.plexus.classworlds.launcher.Launcher.launchStandard(Launcher.java:329)
        at org.codehaus.plexus.classworlds.launcher.Launcher.launch(Launcher.java:239)
        at org.jvnet.hudson.maven3.agent.Maven3Main.launch(Maven3Main.java:158)
        at hudson.maven.Maven3Builder.call(Maven3Builder.java:104)
        at hudson.maven.Maven3Builder.call(Maven3Builder.java:70)
        at hudson.remoting.UserRequest.perform(UserRequest.java:118)
        at hudson.remoting.UserRequest.perform(UserRequest.java:48)
        at hudson.remoting.Request$2.run(Request.java:287)
        at hudson.remoting.InterceptingExecutorService$1.call(InterceptingExecutorService.java:72)
        at java.util.concurrent.FutureTask$Sync.innerRun(FutureTask.java:269)
        at java.util.concurrent.FutureTask.run(FutureTask.java:123)
        at java.util.concurrent.ThreadPoolExecutor$Worker.runTask(ThreadPoolExecutor.java:651)
        at java.util.concurrent.ThreadPoolExecutor$Worker.run(ThreadPoolExecutor.java:676)
        at java.lang.Thread.run(Thread.java:595)
Caused by: org.apache.maven.plugin.CompilationFailureException: Compilation failure
Failure executing javac, but could not parse the error:
javac: invalid flag: -s
Usage: javac <options> <source files>
where possible options include:
  -g                         Generate all debugging info
  -g:none                    Generate no debugging info
  -g:{lines,vars,source}     Generate only some debugging info
  -nowarn                    Generate no warnings
  -verbose                   Output messages about what the compiler is doing
  -deprecation               Output source locations where deprecated APIs are used
  -classpath <path>          Specify where to find user class files
  -cp <path>                 Specify where to find user class files
  -sourcepath <path>         Specify where to find input source files
  -bootclasspath <path>      Override location of bootstrap class files
  -extdirs <dirs>            Override location of installed extensions
  -endorseddirs <dirs>       Override location of endorsed standards path
  -d <directory>             Specify where to place generated class files
  -encoding <encoding>       Specify character encoding used by source files
  -source <release>          Provide source compatibility with specified release
  -target <release>          Generate class files for specific VM version
  -version                   Version information
  -help                      Print a synopsis of standard options
  -X                         Print a synopsis of nonstandard options
  -J<flag>                   Pass <flag> directly to the runtime system



        at org.apache.maven.plugin.AbstractCompilerMojo.execute(AbstractCompilerMojo.java:656)
        at org.apache.maven.plugin.CompilerMojo.execute(CompilerMojo.java:128)
        at org.apache.maven.plugin.DefaultBuildPluginManager.executeMojo(DefaultBuildPluginManager.java:101)
        at org.apache.maven.lifecycle.internal.MojoExecutor.execute(MojoExecutor.java:209)
        ... 27 more
[TASKS] Aggregating results of Apache Tika parent
[TASKS] Using set difference to compute new warnings
[TASKS] Aggregating results of Apache Tika core
[TASKS] Using set difference to compute new warnings
[TASKS] Aggregating results of Apache Tika parsers
[TASKS] Using set difference to compute new warnings
[TASKS] Aggregating results of Apache Tika application
[TASKS] Using set difference to compute new warnings
[TASKS] Aggregating results of Apache Tika OSGi bundle
[TASKS] Using set difference to compute new warnings
[TASKS] Aggregating results of Apache Tika server
[TASKS] Using set difference to compute new warnings
channel stopped
Reply | Threaded
Open this post in threaded view
|

Re: Build failed in Jenkins: Tika-trunk #820

Maxim Valyanskiy
Hello!

Can we use Java 6, maybe just for tika-server component? Current version of Jersey requires it.

best wishes, Max

26.03.2012, в 17:30, Apache Jenkins Server написал(а):

> See <https://builds.apache.org/job/Tika-trunk/820/changes>
>
> Changes:
>
> [maxcom] tika-server: update java version because jersey-core requires java6
>
> ------------------------------------------
> [...truncated 697 lines...]
> Downloading: http://repo1.maven.org/maven2/com/sun/jersey/jersey-grizzly/1.7/jersey-grizzly-1.7.jar
> Downloaded: http://repo1.maven.org/maven2/com/sun/grizzly/grizzly-lzma/1.9.31/grizzly-lzma-1.9.31.jar (55 KB at 23.9 KB/sec)
> Downloading: http://repo1.maven.org/maven2/org/eclipse/jetty/jetty-server/8.0.0.M3/jetty-server-8.0.0.M3.jar
> Downloaded: http://repo1.maven.org/maven2/com/sun/grizzly/grizzly-utils/1.9.31/grizzly-utils-1.9.31.jar (490 KB at 164.2 KB/sec)
> Downloading: http://repo1.maven.org/maven2/org/eclipse/jetty/jetty-continuation/8.0.0.M3/jetty-continuation-8.0.0.M3.jar
> Downloaded: http://repo1.maven.org/maven2/com/sun/grizzly/grizzly-http-servlet/1.9.31/grizzly-http-servlet-1.9.31.jar (49 KB at 17.6 KB/sec)
> Downloading: http://repo1.maven.org/maven2/org/eclipse/jetty/jetty-http/8.0.0.M3/jetty-http-8.0.0.M3.jar
> Downloaded: http://repo1.maven.org/maven2/com/sun/jersey/jersey-test-framework/jersey-test-framework-core/1.7/jersey-test-framework-core-1.7.jar (28 KB at 12.1 KB/sec)
> Downloading: http://repo1.maven.org/maven2/org/eclipse/jetty/jetty-io/8.0.0.M3/jetty-io-8.0.0.M3.jar
> Downloaded: http://repo1.maven.org/maven2/com/sun/jersey/jersey-grizzly/1.7/jersey-grizzly-1.7.jar (18 KB at 8.6 KB/sec)
> Downloading: http://repo1.maven.org/maven2/org/eclipse/jetty/jetty-util/8.0.0.M3/jetty-util-8.0.0.M3.jar
> Downloaded: http://repo1.maven.org/maven2/org/eclipse/jetty/jetty-continuation/8.0.0.M3/jetty-continuation-8.0.0.M3.jar (21 KB at 9.3 KB/sec)
> Downloading: http://repo1.maven.org/maven2/org/eclipse/jetty/jetty-servlet/8.0.0.M3/jetty-servlet-8.0.0.M3.jar
> Downloaded: http://repo1.maven.org/maven2/org/eclipse/jetty/jetty-server/8.0.0.M3/jetty-server-8.0.0.M3.jar (307 KB at 110.9 KB/sec)
> Downloading: http://repo1.maven.org/maven2/org/eclipse/jetty/jetty-security/8.0.0.M3/jetty-security-8.0.0.M3.jar
> Downloaded: http://repo1.maven.org/maven2/org/eclipse/jetty/jetty-http/8.0.0.M3/jetty-http-8.0.0.M3.jar (111 KB at 44.2 KB/sec)
> Downloading: http://repo1.maven.org/maven2/net/sf/opencsv/opencsv/2.0/opencsv-2.0.jar
> Downloaded: http://repo1.maven.org/maven2/org/eclipse/jetty/jetty-io/8.0.0.M3/jetty-io-8.0.0.M3.jar (92 KB at 33.5 KB/sec)
> Downloaded: http://repo1.maven.org/maven2/org/eclipse/jetty/jetty-util/8.0.0.M3/jetty-util-8.0.0.M3.jar (222 KB at 80.5 KB/sec)
> Downloaded: http://repo1.maven.org/maven2/org/eclipse/jetty/jetty-servlet/8.0.0.M3/jetty-servlet-8.0.0.M3.jar (85 KB at 37.5 KB/sec)
> Downloaded: http://repo1.maven.org/maven2/org/eclipse/jetty/jetty-security/8.0.0.M3/jetty-security-8.0.0.M3.jar (85 KB at 37.9 KB/sec)
> Downloaded: http://repo1.maven.org/maven2/net/sf/opencsv/opencsv/2.0/opencsv-2.0.jar (15 KB at 7.5 KB/sec)
> [INFO] Deleting <https://builds.apache.org/job/Tika-trunk/ws/trunk/tika-server/target>
> [INFO]
> [INFO] --- maven-clean-plugin:2.4.1:clean (default-clean) @ tika-server ---
> [TASKS] Scanning folder '<https://builds.apache.org/job/Tika-trunk/ws/trunk/tika-server'> for files matching the pattern '**/*.java' - excludes:
> [TASKS] Found 11 files to scan for tasks
> Found 0 open tasks.
> [INFO]
> [INFO] --- maven-remote-resources-plugin:1.2.1:process (default) @ tika-server ---
> [debug] execute contextualize
> [INFO] [INFO] Using 'UTF-8' encoding to copy filtered resources.
> [INFO] Copying 2 resources
> [INFO] Copying 3 resources
>
> [INFO] --- maven-resources-plugin:2.5:resources (default-resources) @ tika-server ---
> [INFO] [INFO] Compiling 8 source files to <https://builds.apache.org/job/Tika-trunk/ws/trunk/tika-server/target/classes>
>
> [INFO] --- maven-compiler-plugin:2.3.2:compile (default-compile) @ tika-server ---
> [INFO] -------------------------------------------------------------
> [ERROR] COMPILATION ERROR :
> [INFO] -------------------------------------------------------------
> [ERROR] Failure executing javac, but could not parse the error:
> javac: invalid flag: -s
> Usage: javac <options> <source files>
> where possible options include:
>  -g                         Generate all debugging info
>  -g:none                    Generate no debugging info
>  -g:{lines,vars,source}     Generate only some debugging info
>  -nowarn                    Generate no warnings
>  -verbose                   Output messages about what the compiler is doing
>  -deprecation               Output source locations where deprecated APIs are used
>  -classpath <path>          Specify where to find user class files
>  -cp <path>                 Specify where to find user class files
>  -sourcepath <path>         Specify where to find input source files
>  -bootclasspath <path>      Override location of bootstrap class files
>  -extdirs <dirs>            Override location of installed extensions
>  -endorseddirs <dirs>       Override location of endorsed standards path
>  -d <directory>             Specify where to place generated class files
>  -encoding <encoding>       Specify character encoding used by source files
>  -source <release>          Provide source compatibility with specified release
>  -target <release>          Generate class files for specific VM version
>  -version                   Version information
>  -help                      Print a synopsis of standard options
>  -X                         Print a synopsis of nonstandard options
>  -J<flag>                   Pass <flag> directly to the runtime system
>
>
> [INFO] 1 error
> [INFO] -------------------------------------------------------------
> [JENKINS] Archiving <https://builds.apache.org/job/Tika-trunk/ws/trunk/tika-server/pom.xml> to /home/hudson/hudson/jobs/Tika-trunk/modules/org.apache.tika$tika-server/builds/2012-03-26_13-06-44/archive/org.apache.tika/tika-server/1.2-SNAPSHOT/tika-server-1.2-SNAPSHOT.pom
> [INFO] ------------------------------------------------------------------------
> [INFO] Reactor Summary:
> [INFO]
> [INFO] Apache Tika parent ................................ SUCCESS [1:07.852s]
> [INFO] Apache Tika core .................................. SUCCESS [1:19.353s]
> [INFO] Apache Tika parsers ............................... SUCCESS [1:54.020s]
> [INFO] Apache Tika application ........................... SUCCESS [49.644s]
> [INFO] Apache Tika OSGi bundle ........................... SUCCESS [1:19.796s]
> [INFO] Apache Tika server ................................ FAILURE [24.075s]
> [INFO] Apache Tika ....................................... SKIPPED
> [INFO] ------------------------------------------------------------------------
> [INFO] BUILD FAILURE
> [INFO] ------------------------------------------------------------------------
> [INFO] Total time: 23:11.721s
> [INFO] Finished at: Mon Mar 26 13:30:40 UTC 2012
> [INFO] Final Memory: 40M/375M
> [INFO] ------------------------------------------------------------------------
> Waiting for Jenkins to finish collecting data
> mavenExecutionResult exceptions not empty
> message : Failed to execute goal org.apache.maven.plugins:maven-compiler-plugin:2.3.2:compile (default-compile) on project tika-server: Compilation failure
> Failure executing javac, but could not parse the error:
> javac: invalid flag: -s
> Usage: javac <options> <source files>
> where possible options include:
>  -g                         Generate all debugging info
>  -g:none                    Generate no debugging info
>  -g:{lines,vars,source}     Generate only some debugging info
>  -nowarn                    Generate no warnings
>  -verbose                   Output messages about what the compiler is doing
>  -deprecation               Output source locations where deprecated APIs are used
>  -classpath <path>          Specify where to find user class files
>  -cp <path>                 Specify where to find user class files
>  -sourcepath <path>         Specify where to find input source files
>  -bootclasspath <path>      Override location of bootstrap class files
>  -extdirs <dirs>            Override location of installed extensions
>  -endorseddirs <dirs>       Override location of endorsed standards path
>  -d <directory>             Specify where to place generated class files
>  -encoding <encoding>       Specify character encoding used by source files
>  -source <release>          Provide source compatibility with specified release
>  -target <release>          Generate class files for specific VM version
>  -version                   Version information
>  -help                      Print a synopsis of standard options
>  -X                         Print a synopsis of nonstandard options
>  -J<flag>                   Pass <flag> directly to the runtime system
>
>
>
> cause : Compilation failure
> Failure executing javac, but could not parse the error:
> javac: invalid flag: -s
> Usage: javac <options> <source files>
> where possible options include:
>  -g                         Generate all debugging info
>  -g:none                    Generate no debugging info
>  -g:{lines,vars,source}     Generate only some debugging info
>  -nowarn                    Generate no warnings
>  -verbose                   Output messages about what the compiler is doing
>  -deprecation               Output source locations where deprecated APIs are used
>  -classpath <path>          Specify where to find user class files
>  -cp <path>                 Specify where to find user class files
>  -sourcepath <path>         Specify where to find input source files
>  -bootclasspath <path>      Override location of bootstrap class files
>  -extdirs <dirs>            Override location of installed extensions
>  -endorseddirs <dirs>       Override location of endorsed standards path
>  -d <directory>             Specify where to place generated class files
>  -encoding <encoding>       Specify character encoding used by source files
>  -source <release>          Provide source compatibility with specified release
>  -target <release>          Generate class files for specific VM version
>  -version                   Version information
>  -help                      Print a synopsis of standard options
>  -X                         Print a synopsis of nonstandard options
>  -J<flag>                   Pass <flag> directly to the runtime system
>
>
>
> Stack trace :
> org.apache.maven.lifecycle.LifecycleExecutionException: Failed to execute goal org.apache.maven.plugins:maven-compiler-plugin:2.3.2:compile (default-compile) on project tika-server: Compilation failure
> Failure executing javac, but could not parse the error:
> javac: invalid flag: -s
> Usage: javac <options> <source files>
> where possible options include:
>  -g                         Generate all debugging info
>  -g:none                    Generate no debugging info
>  -g:{lines,vars,source}     Generate only some debugging info
>  -nowarn                    Generate no warnings
>  -verbose                   Output messages about what the compiler is doing
>  -deprecation               Output source locations where deprecated APIs are used
>  -classpath <path>          Specify where to find user class files
>  -cp <path>                 Specify where to find user class files
>  -sourcepath <path>         Specify where to find input source files
>  -bootclasspath <path>      Override location of bootstrap class files
>  -extdirs <dirs>            Override location of installed extensions
>  -endorseddirs <dirs>       Override location of endorsed standards path
>  -d <directory>             Specify where to place generated class files
>  -encoding <encoding>       Specify character encoding used by source files
>  -source <release>          Provide source compatibility with specified release
>  -target <release>          Generate class files for specific VM version
>  -version                   Version information
>  -help                      Print a synopsis of standard options
>  -X                         Print a synopsis of nonstandard options
>  -J<flag>                   Pass <flag> directly to the runtime system
>
>
>
> at org.apache.maven.lifecycle.internal.MojoExecutor.execute(MojoExecutor.java:213)
> at org.apache.maven.lifecycle.internal.MojoExecutor.execute(MojoExecutor.java:153)
> at org.apache.maven.lifecycle.internal.MojoExecutor.execute(MojoExecutor.java:145)
> at org.apache.maven.lifecycle.internal.LifecycleModuleBuilder.buildProject(LifecycleModuleBuilder.java:84)
> at org.apache.maven.lifecycle.internal.LifecycleModuleBuilder.buildProject(LifecycleModuleBuilder.java:59)
> at org.apache.maven.lifecycle.internal.LifecycleStarter.singleThreadedBuild(LifecycleStarter.java:183)
> at org.apache.maven.lifecycle.internal.LifecycleStarter.execute(LifecycleStarter.java:161)
> at org.apache.maven.DefaultMaven.doExecute(DefaultMaven.java:319)
> at org.apache.maven.DefaultMaven.execute(DefaultMaven.java:156)
> at org.jvnet.hudson.maven3.launcher.Maven3Launcher.main(Maven3Launcher.java:79)
> at sun.reflect.NativeMethodAccessorImpl.invoke0(Native Method)
> at sun.reflect.NativeMethodAccessorImpl.invoke(NativeMethodAccessorImpl.java:39)
> at sun.reflect.DelegatingMethodAccessorImpl.invoke(DelegatingMethodAccessorImpl.java:25)
> at java.lang.reflect.Method.invoke(Method.java:592)
> at org.codehaus.plexus.classworlds.launcher.Launcher.launchStandard(Launcher.java:329)
> at org.codehaus.plexus.classworlds.launcher.Launcher.launch(Launcher.java:239)
> at org.jvnet.hudson.maven3.agent.Maven3Main.launch(Maven3Main.java:158)
> at hudson.maven.Maven3Builder.call(Maven3Builder.java:104)
> at hudson.maven.Maven3Builder.call(Maven3Builder.java:70)
> at hudson.remoting.UserRequest.perform(UserRequest.java:118)
> at hudson.remoting.UserRequest.perform(UserRequest.java:48)
> at hudson.remoting.Request$2.run(Request.java:287)
> at hudson.remoting.InterceptingExecutorService$1.call(InterceptingExecutorService.java:72)
> at java.util.concurrent.FutureTask$Sync.innerRun(FutureTask.java:269)
> at java.util.concurrent.FutureTask.run(FutureTask.java:123)
> at java.util.concurrent.ThreadPoolExecutor$Worker.runTask(ThreadPoolExecutor.java:651)
> at java.util.concurrent.ThreadPoolExecutor$Worker.run(ThreadPoolExecutor.java:676)
> at java.lang.Thread.run(Thread.java:595)
> Caused by: org.apache.maven.plugin.CompilationFailureException: Compilation failure
> Failure executing javac, but could not parse the error:
> javac: invalid flag: -s
> Usage: javac <options> <source files>
> where possible options include:
>  -g                         Generate all debugging info
>  -g:none                    Generate no debugging info
>  -g:{lines,vars,source}     Generate only some debugging info
>  -nowarn                    Generate no warnings
>  -verbose                   Output messages about what the compiler is doing
>  -deprecation               Output source locations where deprecated APIs are used
>  -classpath <path>          Specify where to find user class files
>  -cp <path>                 Specify where to find user class files
>  -sourcepath <path>         Specify where to find input source files
>  -bootclasspath <path>      Override location of bootstrap class files
>  -extdirs <dirs>            Override location of installed extensions
>  -endorseddirs <dirs>       Override location of endorsed standards path
>  -d <directory>             Specify where to place generated class files
>  -encoding <encoding>       Specify character encoding used by source files
>  -source <release>          Provide source compatibility with specified release
>  -target <release>          Generate class files for specific VM version
>  -version                   Version information
>  -help                      Print a synopsis of standard options
>  -X                         Print a synopsis of nonstandard options
>  -J<flag>                   Pass <flag> directly to the runtime system
>
>
>
> at org.apache.maven.plugin.AbstractCompilerMojo.execute(AbstractCompilerMojo.java:656)
> at org.apache.maven.plugin.CompilerMojo.execute(CompilerMojo.java:128)
> at org.apache.maven.plugin.DefaultBuildPluginManager.executeMojo(DefaultBuildPluginManager.java:101)
> at org.apache.maven.lifecycle.internal.MojoExecutor.execute(MojoExecutor.java:209)
> ... 27 more
> [TASKS] Aggregating results of Apache Tika parent
> [TASKS] Using set difference to compute new warnings
> [TASKS] Aggregating results of Apache Tika core
> [TASKS] Using set difference to compute new warnings
> [TASKS] Aggregating results of Apache Tika parsers
> [TASKS] Using set difference to compute new warnings
> [TASKS] Aggregating results of Apache Tika application
> [TASKS] Using set difference to compute new warnings
> [TASKS] Aggregating results of Apache Tika OSGi bundle
> [TASKS] Using set difference to compute new warnings
> [TASKS] Aggregating results of Apache Tika server
> [TASKS] Using set difference to compute new warnings
> channel stopped

Reply | Threaded
Open this post in threaded view
|

Re: Build failed in Jenkins: Tika-trunk #820

Mattmann, Chris A (3010)
Hi Max,

I will hopefully have a patch in the next day or so that migrates us to CXF with little to no changes
(except for the Server and test components of tika-server, as you mentioned). I think this will help
out in this regard.

Cheers,
Chris

On Mar 26, 2012, at 9:26 AM, Maxim Valyanskiy wrote:

> Hello!
>
> Can we use Java 6, maybe just for tika-server component? Current version of Jersey requires it.
>
> best wishes, Max
>
> 26.03.2012, в 17:30, Apache Jenkins Server написал(а):
>
>> See <https://builds.apache.org/job/Tika-trunk/820/changes>
>>
>> Changes:
>>
>> [maxcom] tika-server: update java version because jersey-core requires java6
>>
>> ------------------------------------------
>> [...truncated 697 lines...]
>> Downloading: http://repo1.maven.org/maven2/com/sun/jersey/jersey-grizzly/1.7/jersey-grizzly-1.7.jar
>> Downloaded: http://repo1.maven.org/maven2/com/sun/grizzly/grizzly-lzma/1.9.31/grizzly-lzma-1.9.31.jar (55 KB at 23.9 KB/sec)
>> Downloading: http://repo1.maven.org/maven2/org/eclipse/jetty/jetty-server/8.0.0.M3/jetty-server-8.0.0.M3.jar
>> Downloaded: http://repo1.maven.org/maven2/com/sun/grizzly/grizzly-utils/1.9.31/grizzly-utils-1.9.31.jar (490 KB at 164.2 KB/sec)
>> Downloading: http://repo1.maven.org/maven2/org/eclipse/jetty/jetty-continuation/8.0.0.M3/jetty-continuation-8.0.0.M3.jar
>> Downloaded: http://repo1.maven.org/maven2/com/sun/grizzly/grizzly-http-servlet/1.9.31/grizzly-http-servlet-1.9.31.jar (49 KB at 17.6 KB/sec)
>> Downloading: http://repo1.maven.org/maven2/org/eclipse/jetty/jetty-http/8.0.0.M3/jetty-http-8.0.0.M3.jar
>> Downloaded: http://repo1.maven.org/maven2/com/sun/jersey/jersey-test-framework/jersey-test-framework-core/1.7/jersey-test-framework-core-1.7.jar (28 KB at 12.1 KB/sec)
>> Downloading: http://repo1.maven.org/maven2/org/eclipse/jetty/jetty-io/8.0.0.M3/jetty-io-8.0.0.M3.jar
>> Downloaded: http://repo1.maven.org/maven2/com/sun/jersey/jersey-grizzly/1.7/jersey-grizzly-1.7.jar (18 KB at 8.6 KB/sec)
>> Downloading: http://repo1.maven.org/maven2/org/eclipse/jetty/jetty-util/8.0.0.M3/jetty-util-8.0.0.M3.jar
>> Downloaded: http://repo1.maven.org/maven2/org/eclipse/jetty/jetty-continuation/8.0.0.M3/jetty-continuation-8.0.0.M3.jar (21 KB at 9.3 KB/sec)
>> Downloading: http://repo1.maven.org/maven2/org/eclipse/jetty/jetty-servlet/8.0.0.M3/jetty-servlet-8.0.0.M3.jar
>> Downloaded: http://repo1.maven.org/maven2/org/eclipse/jetty/jetty-server/8.0.0.M3/jetty-server-8.0.0.M3.jar (307 KB at 110.9 KB/sec)
>> Downloading: http://repo1.maven.org/maven2/org/eclipse/jetty/jetty-security/8.0.0.M3/jetty-security-8.0.0.M3.jar
>> Downloaded: http://repo1.maven.org/maven2/org/eclipse/jetty/jetty-http/8.0.0.M3/jetty-http-8.0.0.M3.jar (111 KB at 44.2 KB/sec)
>> Downloading: http://repo1.maven.org/maven2/net/sf/opencsv/opencsv/2.0/opencsv-2.0.jar
>> Downloaded: http://repo1.maven.org/maven2/org/eclipse/jetty/jetty-io/8.0.0.M3/jetty-io-8.0.0.M3.jar (92 KB at 33.5 KB/sec)
>> Downloaded: http://repo1.maven.org/maven2/org/eclipse/jetty/jetty-util/8.0.0.M3/jetty-util-8.0.0.M3.jar (222 KB at 80.5 KB/sec)
>> Downloaded: http://repo1.maven.org/maven2/org/eclipse/jetty/jetty-servlet/8.0.0.M3/jetty-servlet-8.0.0.M3.jar (85 KB at 37.5 KB/sec)
>> Downloaded: http://repo1.maven.org/maven2/org/eclipse/jetty/jetty-security/8.0.0.M3/jetty-security-8.0.0.M3.jar (85 KB at 37.9 KB/sec)
>> Downloaded: http://repo1.maven.org/maven2/net/sf/opencsv/opencsv/2.0/opencsv-2.0.jar (15 KB at 7.5 KB/sec)
>> [INFO] Deleting <https://builds.apache.org/job/Tika-trunk/ws/trunk/tika-server/target>
>> [INFO]
>> [INFO] --- maven-clean-plugin:2.4.1:clean (default-clean) @ tika-server ---
>> [TASKS] Scanning folder '<https://builds.apache.org/job/Tika-trunk/ws/trunk/tika-server'> for files matching the pattern '**/*.java' - excludes:
>> [TASKS] Found 11 files to scan for tasks
>> Found 0 open tasks.
>> [INFO]
>> [INFO] --- maven-remote-resources-plugin:1.2.1:process (default) @ tika-server ---
>> [debug] execute contextualize
>> [INFO] [INFO] Using 'UTF-8' encoding to copy filtered resources.
>> [INFO] Copying 2 resources
>> [INFO] Copying 3 resources
>>
>> [INFO] --- maven-resources-plugin:2.5:resources (default-resources) @ tika-server ---
>> [INFO] [INFO] Compiling 8 source files to <https://builds.apache.org/job/Tika-trunk/ws/trunk/tika-server/target/classes>
>>
>> [INFO] --- maven-compiler-plugin:2.3.2:compile (default-compile) @ tika-server ---
>> [INFO] -------------------------------------------------------------
>> [ERROR] COMPILATION ERROR :
>> [INFO] -------------------------------------------------------------
>> [ERROR] Failure executing javac, but could not parse the error:
>> javac: invalid flag: -s
>> Usage: javac <options> <source files>
>> where possible options include:
>> -g                         Generate all debugging info
>> -g:none                    Generate no debugging info
>> -g:{lines,vars,source}     Generate only some debugging info
>> -nowarn                    Generate no warnings
>> -verbose                   Output messages about what the compiler is doing
>> -deprecation               Output source locations where deprecated APIs are used
>> -classpath <path>          Specify where to find user class files
>> -cp <path>                 Specify where to find user class files
>> -sourcepath <path>         Specify where to find input source files
>> -bootclasspath <path>      Override location of bootstrap class files
>> -extdirs <dirs>            Override location of installed extensions
>> -endorseddirs <dirs>       Override location of endorsed standards path
>> -d <directory>             Specify where to place generated class files
>> -encoding <encoding>       Specify character encoding used by source files
>> -source <release>          Provide source compatibility with specified release
>> -target <release>          Generate class files for specific VM version
>> -version                   Version information
>> -help                      Print a synopsis of standard options
>> -X                         Print a synopsis of nonstandard options
>> -J<flag>                   Pass <flag> directly to the runtime system
>>
>>
>> [INFO] 1 error
>> [INFO] -------------------------------------------------------------
>> [JENKINS] Archiving <https://builds.apache.org/job/Tika-trunk/ws/trunk/tika-server/pom.xml> to /home/hudson/hudson/jobs/Tika-trunk/modules/org.apache.tika$tika-server/builds/2012-03-26_13-06-44/archive/org.apache.tika/tika-server/1.2-SNAPSHOT/tika-server-1.2-SNAPSHOT.pom
>> [INFO] ------------------------------------------------------------------------
>> [INFO] Reactor Summary:
>> [INFO]
>> [INFO] Apache Tika parent ................................ SUCCESS [1:07.852s]
>> [INFO] Apache Tika core .................................. SUCCESS [1:19.353s]
>> [INFO] Apache Tika parsers ............................... SUCCESS [1:54.020s]
>> [INFO] Apache Tika application ........................... SUCCESS [49.644s]
>> [INFO] Apache Tika OSGi bundle ........................... SUCCESS [1:19.796s]
>> [INFO] Apache Tika server ................................ FAILURE [24.075s]
>> [INFO] Apache Tika ....................................... SKIPPED
>> [INFO] ------------------------------------------------------------------------
>> [INFO] BUILD FAILURE
>> [INFO] ------------------------------------------------------------------------
>> [INFO] Total time: 23:11.721s
>> [INFO] Finished at: Mon Mar 26 13:30:40 UTC 2012
>> [INFO] Final Memory: 40M/375M
>> [INFO] ------------------------------------------------------------------------
>> Waiting for Jenkins to finish collecting data
>> mavenExecutionResult exceptions not empty
>> message : Failed to execute goal org.apache.maven.plugins:maven-compiler-plugin:2.3.2:compile (default-compile) on project tika-server: Compilation failure
>> Failure executing javac, but could not parse the error:
>> javac: invalid flag: -s
>> Usage: javac <options> <source files>
>> where possible options include:
>> -g                         Generate all debugging info
>> -g:none                    Generate no debugging info
>> -g:{lines,vars,source}     Generate only some debugging info
>> -nowarn                    Generate no warnings
>> -verbose                   Output messages about what the compiler is doing
>> -deprecation               Output source locations where deprecated APIs are used
>> -classpath <path>          Specify where to find user class files
>> -cp <path>                 Specify where to find user class files
>> -sourcepath <path>         Specify where to find input source files
>> -bootclasspath <path>      Override location of bootstrap class files
>> -extdirs <dirs>            Override location of installed extensions
>> -endorseddirs <dirs>       Override location of endorsed standards path
>> -d <directory>             Specify where to place generated class files
>> -encoding <encoding>       Specify character encoding used by source files
>> -source <release>          Provide source compatibility with specified release
>> -target <release>          Generate class files for specific VM version
>> -version                   Version information
>> -help                      Print a synopsis of standard options
>> -X                         Print a synopsis of nonstandard options
>> -J<flag>                   Pass <flag> directly to the runtime system
>>
>>
>>
>> cause : Compilation failure
>> Failure executing javac, but could not parse the error:
>> javac: invalid flag: -s
>> Usage: javac <options> <source files>
>> where possible options include:
>> -g                         Generate all debugging info
>> -g:none                    Generate no debugging info
>> -g:{lines,vars,source}     Generate only some debugging info
>> -nowarn                    Generate no warnings
>> -verbose                   Output messages about what the compiler is doing
>> -deprecation               Output source locations where deprecated APIs are used
>> -classpath <path>          Specify where to find user class files
>> -cp <path>                 Specify where to find user class files
>> -sourcepath <path>         Specify where to find input source files
>> -bootclasspath <path>      Override location of bootstrap class files
>> -extdirs <dirs>            Override location of installed extensions
>> -endorseddirs <dirs>       Override location of endorsed standards path
>> -d <directory>             Specify where to place generated class files
>> -encoding <encoding>       Specify character encoding used by source files
>> -source <release>          Provide source compatibility with specified release
>> -target <release>          Generate class files for specific VM version
>> -version                   Version information
>> -help                      Print a synopsis of standard options
>> -X                         Print a synopsis of nonstandard options
>> -J<flag>                   Pass <flag> directly to the runtime system
>>
>>
>>
>> Stack trace :
>> org.apache.maven.lifecycle.LifecycleExecutionException: Failed to execute goal org.apache.maven.plugins:maven-compiler-plugin:2.3.2:compile (default-compile) on project tika-server: Compilation failure
>> Failure executing javac, but could not parse the error:
>> javac: invalid flag: -s
>> Usage: javac <options> <source files>
>> where possible options include:
>> -g                         Generate all debugging info
>> -g:none                    Generate no debugging info
>> -g:{lines,vars,source}     Generate only some debugging info
>> -nowarn                    Generate no warnings
>> -verbose                   Output messages about what the compiler is doing
>> -deprecation               Output source locations where deprecated APIs are used
>> -classpath <path>          Specify where to find user class files
>> -cp <path>                 Specify where to find user class files
>> -sourcepath <path>         Specify where to find input source files
>> -bootclasspath <path>      Override location of bootstrap class files
>> -extdirs <dirs>            Override location of installed extensions
>> -endorseddirs <dirs>       Override location of endorsed standards path
>> -d <directory>             Specify where to place generated class files
>> -encoding <encoding>       Specify character encoding used by source files
>> -source <release>          Provide source compatibility with specified release
>> -target <release>          Generate class files for specific VM version
>> -version                   Version information
>> -help                      Print a synopsis of standard options
>> -X                         Print a synopsis of nonstandard options
>> -J<flag>                   Pass <flag> directly to the runtime system
>>
>>
>>
>>      at org.apache.maven.lifecycle.internal.MojoExecutor.execute(MojoExecutor.java:213)
>>      at org.apache.maven.lifecycle.internal.MojoExecutor.execute(MojoExecutor.java:153)
>>      at org.apache.maven.lifecycle.internal.MojoExecutor.execute(MojoExecutor.java:145)
>>      at org.apache.maven.lifecycle.internal.LifecycleModuleBuilder.buildProject(LifecycleModuleBuilder.java:84)
>>      at org.apache.maven.lifecycle.internal.LifecycleModuleBuilder.buildProject(LifecycleModuleBuilder.java:59)
>>      at org.apache.maven.lifecycle.internal.LifecycleStarter.singleThreadedBuild(LifecycleStarter.java:183)
>>      at org.apache.maven.lifecycle.internal.LifecycleStarter.execute(LifecycleStarter.java:161)
>>      at org.apache.maven.DefaultMaven.doExecute(DefaultMaven.java:319)
>>      at org.apache.maven.DefaultMaven.execute(DefaultMaven.java:156)
>>      at org.jvnet.hudson.maven3.launcher.Maven3Launcher.main(Maven3Launcher.java:79)
>>      at sun.reflect.NativeMethodAccessorImpl.invoke0(Native Method)
>>      at sun.reflect.NativeMethodAccessorImpl.invoke(NativeMethodAccessorImpl.java:39)
>>      at sun.reflect.DelegatingMethodAccessorImpl.invoke(DelegatingMethodAccessorImpl.java:25)
>>      at java.lang.reflect.Method.invoke(Method.java:592)
>>      at org.codehaus.plexus.classworlds.launcher.Launcher.launchStandard(Launcher.java:329)
>>      at org.codehaus.plexus.classworlds.launcher.Launcher.launch(Launcher.java:239)
>>      at org.jvnet.hudson.maven3.agent.Maven3Main.launch(Maven3Main.java:158)
>>      at hudson.maven.Maven3Builder.call(Maven3Builder.java:104)
>>      at hudson.maven.Maven3Builder.call(Maven3Builder.java:70)
>>      at hudson.remoting.UserRequest.perform(UserRequest.java:118)
>>      at hudson.remoting.UserRequest.perform(UserRequest.java:48)
>>      at hudson.remoting.Request$2.run(Request.java:287)
>>      at hudson.remoting.InterceptingExecutorService$1.call(InterceptingExecutorService.java:72)
>>      at java.util.concurrent.FutureTask$Sync.innerRun(FutureTask.java:269)
>>      at java.util.concurrent.FutureTask.run(FutureTask.java:123)
>>      at java.util.concurrent.ThreadPoolExecutor$Worker.runTask(ThreadPoolExecutor.java:651)
>>      at java.util.concurrent.ThreadPoolExecutor$Worker.run(ThreadPoolExecutor.java:676)
>>      at java.lang.Thread.run(Thread.java:595)
>> Caused by: org.apache.maven.plugin.CompilationFailureException: Compilation failure
>> Failure executing javac, but could not parse the error:
>> javac: invalid flag: -s
>> Usage: javac <options> <source files>
>> where possible options include:
>> -g                         Generate all debugging info
>> -g:none                    Generate no debugging info
>> -g:{lines,vars,source}     Generate only some debugging info
>> -nowarn                    Generate no warnings
>> -verbose                   Output messages about what the compiler is doing
>> -deprecation               Output source locations where deprecated APIs are used
>> -classpath <path>          Specify where to find user class files
>> -cp <path>                 Specify where to find user class files
>> -sourcepath <path>         Specify where to find input source files
>> -bootclasspath <path>      Override location of bootstrap class files
>> -extdirs <dirs>            Override location of installed extensions
>> -endorseddirs <dirs>       Override location of endorsed standards path
>> -d <directory>             Specify where to place generated class files
>> -encoding <encoding>       Specify character encoding used by source files
>> -source <release>          Provide source compatibility with specified release
>> -target <release>          Generate class files for specific VM version
>> -version                   Version information
>> -help                      Print a synopsis of standard options
>> -X                         Print a synopsis of nonstandard options
>> -J<flag>                   Pass <flag> directly to the runtime system
>>
>>
>>
>>      at org.apache.maven.plugin.AbstractCompilerMojo.execute(AbstractCompilerMojo.java:656)
>>      at org.apache.maven.plugin.CompilerMojo.execute(CompilerMojo.java:128)
>>      at org.apache.maven.plugin.DefaultBuildPluginManager.executeMojo(DefaultBuildPluginManager.java:101)
>>      at org.apache.maven.lifecycle.internal.MojoExecutor.execute(MojoExecutor.java:209)
>>      ... 27 more
>> [TASKS] Aggregating results of Apache Tika parent
>> [TASKS] Using set difference to compute new warnings
>> [TASKS] Aggregating results of Apache Tika core
>> [TASKS] Using set difference to compute new warnings
>> [TASKS] Aggregating results of Apache Tika parsers
>> [TASKS] Using set difference to compute new warnings
>> [TASKS] Aggregating results of Apache Tika application
>> [TASKS] Using set difference to compute new warnings
>> [TASKS] Aggregating results of Apache Tika OSGi bundle
>> [TASKS] Using set difference to compute new warnings
>> [TASKS] Aggregating results of Apache Tika server
>> [TASKS] Using set difference to compute new warnings
>> channel stopped
>


++++++++++++++++++++++++++++++++++++++++++++++++++++++++++++++++++
Chris Mattmann, Ph.D.
Senior Computer Scientist
NASA Jet Propulsion Laboratory Pasadena, CA 91109 USA
Office: 171-266B, Mailstop: 171-246
Email: [hidden email]
WWW:   http://sunset.usc.edu/~mattmann/
++++++++++++++++++++++++++++++++++++++++++++++++++++++++++++++++++
Adjunct Assistant Professor, Computer Science Department
University of Southern California, Los Angeles, CA 90089 USA
++++++++++++++++++++++++++++++++++++++++++++++++++++++++++++++++++

Reply | Threaded
Open this post in threaded view
|

Build failed in Jenkins: Tika-trunk #821

Apache Jenkins Server-2
In reply to this post by Apache Jenkins Server-2
See <https://builds.apache.org/job/Tika-trunk/821/changes>

Changes:

[jukka] TIKA-884: Dynamic loading of Parser and Detector services

Decouple loading of dynamic and static services

[jukka] TIKA-866: Invalid configuration file causes OutOfMemoryException

Clear up system properties after tests.

------------------------------------------
[...truncated 632 lines...]
[INFO]                                                                        
[INFO] ------------------------------------------------------------------------
[INFO] Building Apache Tika server 1.2-SNAPSHOT
[INFO] ------------------------------------------------------------------------
Downloading: http://repo1.maven.org/maven2/javax/ws/rs/jsr311-api/1.1/jsr311-api-1.1.pom
Downloaded: http://repo1.maven.org/maven2/javax/ws/rs/jsr311-api/1.1/jsr311-api-1.1.pom (0 B at 0.0 KB/sec)
Downloading: http://repo1.maven.org/maven2/com/sun/jersey/jersey-test-framework/jersey-test-framework-grizzly/1.7/jersey-test-framework-grizzly-1.7.pom
Downloaded: http://repo1.maven.org/maven2/com/sun/jersey/jersey-test-framework/jersey-test-framework-grizzly/1.7/jersey-test-framework-grizzly-1.7.pom (0 B at 0.0 KB/sec)
Downloading: http://repo1.maven.org/maven2/com/sun/jersey/jersey-test-framework/1.7/jersey-test-framework-1.7.pom
Downloaded: http://repo1.maven.org/maven2/com/sun/jersey/jersey-test-framework/1.7/jersey-test-framework-1.7.pom (0 B at 0.0 KB/sec)
Downloading: http://repo1.maven.org/maven2/com/sun/jersey/jersey-test-framework/jersey-test-framework-core/1.7/jersey-test-framework-core-1.7.pom
Downloaded: http://repo1.maven.org/maven2/com/sun/jersey/jersey-test-framework/jersey-test-framework-core/1.7/jersey-test-framework-core-1.7.pom (0 B at 0.0 KB/sec)
Downloading: http://repo1.maven.org/maven2/com/sun/jersey/jersey-grizzly/1.7/jersey-grizzly-1.7.pom
Downloaded: http://repo1.maven.org/maven2/com/sun/jersey/jersey-grizzly/1.7/jersey-grizzly-1.7.pom (0 B at 0.0 KB/sec)
Downloading: http://repo1.maven.org/maven2/javax/ws/rs/jsr311-api/1.1/jsr311-api-1.1.jar
Downloading: http://repo1.maven.org/maven2/com/sun/jersey/jersey-test-framework/jersey-test-framework-grizzly/1.7/jersey-test-framework-grizzly-1.7.jar
Downloading: http://repo1.maven.org/maven2/com/sun/jersey/jersey-test-framework/jersey-test-framework-core/1.7/jersey-test-framework-core-1.7.jar
Downloading: http://repo1.maven.org/maven2/com/sun/jersey/jersey-grizzly/1.7/jersey-grizzly-1.7.jar
Downloaded: http://repo1.maven.org/maven2/javax/ws/rs/jsr311-api/1.1/jsr311-api-1.1.jar (0 B at 0.0 KB/sec)
Downloaded: http://repo1.maven.org/maven2/com/sun/jersey/jersey-test-framework/jersey-test-framework-core/1.7/jersey-test-framework-core-1.7.jar (0 B at 0.0 KB/sec)
Downloaded: http://repo1.maven.org/maven2/com/sun/jersey/jersey-test-framework/jersey-test-framework-grizzly/1.7/jersey-test-framework-grizzly-1.7.jar (0 B at 0.0 KB/sec)
Downloaded: http://repo1.maven.org/maven2/com/sun/jersey/jersey-grizzly/1.7/jersey-grizzly-1.7.jar (0 B at 0.0 KB/sec)
[INFO] [INFO] Deleting <https://builds.apache.org/job/Tika-trunk/ws/trunk/tika-server/target>

[INFO] --- maven-clean-plugin:2.4.1:clean (default-clean) @ tika-server ---
[TASKS] Scanning folder '<https://builds.apache.org/job/Tika-trunk/ws/trunk/tika-server'> for files matching the pattern '**/*.java' - excludes:
[TASKS] Found 11 files to scan for tasks
Found 0 open tasks.
[INFO]
[INFO] --- maven-remote-resources-plugin:1.2.1:process (default) @ tika-server ---
[debug] execute contextualize
[INFO] [INFO] Using 'UTF-8' encoding to copy filtered resources.
[INFO] Copying 2 resources
[INFO] Copying 3 resources

[INFO] --- maven-resources-plugin:2.5:resources (default-resources) @ tika-server ---
[INFO] [INFO] Compiling 8 source files to <https://builds.apache.org/job/Tika-trunk/ws/trunk/tika-server/target/classes>

[INFO] --- maven-compiler-plugin:2.3.2:compile (default-compile) @ tika-server ---
[INFO] -------------------------------------------------------------
[ERROR] COMPILATION ERROR :
[INFO] -------------------------------------------------------------
[ERROR] Failure executing javac, but could not parse the error:
javac: invalid flag: -s
Usage: javac <options> <source files>
where possible options include:
  -g                         Generate all debugging info
  -g:none                    Generate no debugging info
  -g:{lines,vars,source}     Generate only some debugging info
  -nowarn                    Generate no warnings
  -verbose                   Output messages about what the compiler is doing
  -deprecation               Output source locations where deprecated APIs are used
  -classpath <path>          Specify where to find user class files
  -cp <path>                 Specify where to find user class files
  -sourcepath <path>         Specify where to find input source files
  -bootclasspath <path>      Override location of bootstrap class files
  -extdirs <dirs>            Override location of installed extensions
  -endorseddirs <dirs>       Override location of endorsed standards path
  -d <directory>             Specify where to place generated class files
  -encoding <encoding>       Specify character encoding used by source files
  -source <release>          Provide source compatibility with specified release
  -target <release>          Generate class files for specific VM version
  -version                   Version information
  -help                      Print a synopsis of standard options
  -X                         Print a synopsis of nonstandard options
  -J<flag>                   Pass <flag> directly to the runtime system


[INFO] 1 error
[INFO] -------------------------------------------------------------
[JENKINS] Archiving <https://builds.apache.org/job/Tika-trunk/ws/trunk/tika-server/pom.xml> to /home/hudson/hudson/jobs/Tika-trunk/modules/org.apache.tika$tika-server/builds/2012-03-27_18-11-11/archive/org.apache.tika/tika-server/1.2-SNAPSHOT/tika-server-1.2-SNAPSHOT.pom
[INFO] ------------------------------------------------------------------------
[INFO] Reactor Summary:
[INFO]
[INFO] Apache Tika parent ................................ SUCCESS [39.504s]
[INFO] Apache Tika core .................................. SUCCESS [37.976s]
[INFO] Apache Tika parsers ............................... SUCCESS [1:04.983s]
[INFO] Apache Tika application ........................... SUCCESS [40.178s]
[INFO] Apache Tika OSGi bundle ........................... SUCCESS [31.433s]
[INFO] Apache Tika server ................................ FAILURE [5.357s]
[INFO] Apache Tika ....................................... SKIPPED
[INFO] ------------------------------------------------------------------------
[INFO] BUILD FAILURE
[INFO] ------------------------------------------------------------------------
[INFO] Total time: 8:19.781s
[INFO] Finished at: Tue Mar 27 18:20:01 UTC 2012
[INFO] Final Memory: 46M/359M
[INFO] ------------------------------------------------------------------------
Waiting for Jenkins to finish collecting data
mavenExecutionResult exceptions not empty
message : Failed to execute goal org.apache.maven.plugins:maven-compiler-plugin:2.3.2:compile (default-compile) on project tika-server: Compilation failure
Failure executing javac, but could not parse the error:
javac: invalid flag: -s
Usage: javac <options> <source files>
where possible options include:
  -g                         Generate all debugging info
  -g:none                    Generate no debugging info
  -g:{lines,vars,source}     Generate only some debugging info
  -nowarn                    Generate no warnings
  -verbose                   Output messages about what the compiler is doing
  -deprecation               Output source locations where deprecated APIs are used
  -classpath <path>          Specify where to find user class files
  -cp <path>                 Specify where to find user class files
  -sourcepath <path>         Specify where to find input source files
  -bootclasspath <path>      Override location of bootstrap class files
  -extdirs <dirs>            Override location of installed extensions
  -endorseddirs <dirs>       Override location of endorsed standards path
  -d <directory>             Specify where to place generated class files
  -encoding <encoding>       Specify character encoding used by source files
  -source <release>          Provide source compatibility with specified release
  -target <release>          Generate class files for specific VM version
  -version                   Version information
  -help                      Print a synopsis of standard options
  -X                         Print a synopsis of nonstandard options
  -J<flag>                   Pass <flag> directly to the runtime system



cause : Compilation failure
Failure executing javac, but could not parse the error:
javac: invalid flag: -s
Usage: javac <options> <source files>
where possible options include:
  -g                         Generate all debugging info
  -g:none                    Generate no debugging info
  -g:{lines,vars,source}     Generate only some debugging info
  -nowarn                    Generate no warnings
  -verbose                   Output messages about what the compiler is doing
  -deprecation               Output source locations where deprecated APIs are used
  -classpath <path>          Specify where to find user class files
  -cp <path>                 Specify where to find user class files
  -sourcepath <path>         Specify where to find input source files
  -bootclasspath <path>      Override location of bootstrap class files
  -extdirs <dirs>            Override location of installed extensions
  -endorseddirs <dirs>       Override location of endorsed standards path
  -d <directory>             Specify where to place generated class files
  -encoding <encoding>       Specify character encoding used by source files
  -source <release>          Provide source compatibility with specified release
  -target <release>          Generate class files for specific VM version
  -version                   Version information
  -help                      Print a synopsis of standard options
  -X                         Print a synopsis of nonstandard options
  -J<flag>                   Pass <flag> directly to the runtime system



Stack trace :
org.apache.maven.lifecycle.LifecycleExecutionException: Failed to execute goal org.apache.maven.plugins:maven-compiler-plugin:2.3.2:compile (default-compile) on project tika-server: Compilation failure
Failure executing javac, but could not parse the error:
javac: invalid flag: -s
Usage: javac <options> <source files>
where possible options include:
  -g                         Generate all debugging info
  -g:none                    Generate no debugging info
  -g:{lines,vars,source}     Generate only some debugging info
  -nowarn                    Generate no warnings
  -verbose                   Output messages about what the compiler is doing
  -deprecation               Output source locations where deprecated APIs are used
  -classpath <path>          Specify where to find user class files
  -cp <path>                 Specify where to find user class files
  -sourcepath <path>         Specify where to find input source files
  -bootclasspath <path>      Override location of bootstrap class files
  -extdirs <dirs>            Override location of installed extensions
  -endorseddirs <dirs>       Override location of endorsed standards path
  -d <directory>             Specify where to place generated class files
  -encoding <encoding>       Specify character encoding used by source files
  -source <release>          Provide source compatibility with specified release
  -target <release>          Generate class files for specific VM version
  -version                   Version information
  -help                      Print a synopsis of standard options
  -X                         Print a synopsis of nonstandard options
  -J<flag>                   Pass <flag> directly to the runtime system



        at org.apache.maven.lifecycle.internal.MojoExecutor.execute(MojoExecutor.java:213)
        at org.apache.maven.lifecycle.internal.MojoExecutor.execute(MojoExecutor.java:153)
        at org.apache.maven.lifecycle.internal.MojoExecutor.execute(MojoExecutor.java:145)
        at org.apache.maven.lifecycle.internal.LifecycleModuleBuilder.buildProject(LifecycleModuleBuilder.java:84)
        at org.apache.maven.lifecycle.internal.LifecycleModuleBuilder.buildProject(LifecycleModuleBuilder.java:59)
        at org.apache.maven.lifecycle.internal.LifecycleStarter.singleThreadedBuild(LifecycleStarter.java:183)
        at org.apache.maven.lifecycle.internal.LifecycleStarter.execute(LifecycleStarter.java:161)
        at org.apache.maven.DefaultMaven.doExecute(DefaultMaven.java:319)
        at org.apache.maven.DefaultMaven.execute(DefaultMaven.java:156)
        at org.jvnet.hudson.maven3.launcher.Maven3Launcher.main(Maven3Launcher.java:79)
        at sun.reflect.NativeMethodAccessorImpl.invoke0(Native Method)
        at sun.reflect.NativeMethodAccessorImpl.invoke(NativeMethodAccessorImpl.java:39)
        at sun.reflect.DelegatingMethodAccessorImpl.invoke(DelegatingMethodAccessorImpl.java:25)
        at java.lang.reflect.Method.invoke(Method.java:592)
        at org.codehaus.plexus.classworlds.launcher.Launcher.launchStandard(Launcher.java:329)
        at org.codehaus.plexus.classworlds.launcher.Launcher.launch(Launcher.java:239)
        at org.jvnet.hudson.maven3.agent.Maven3Main.launch(Maven3Main.java:158)
        at hudson.maven.Maven3Builder.call(Maven3Builder.java:104)
        at hudson.maven.Maven3Builder.call(Maven3Builder.java:70)
        at hudson.remoting.UserRequest.perform(UserRequest.java:118)
        at hudson.remoting.UserRequest.perform(UserRequest.java:48)
        at hudson.remoting.Request$2.run(Request.java:287)
        at hudson.remoting.InterceptingExecutorService$1.call(InterceptingExecutorService.java:72)
        at java.util.concurrent.FutureTask$Sync.innerRun(FutureTask.java:269)
        at java.util.concurrent.FutureTask.run(FutureTask.java:123)
        at java.util.concurrent.ThreadPoolExecutor$Worker.runTask(ThreadPoolExecutor.java:651)
        at java.util.concurrent.ThreadPoolExecutor$Worker.run(ThreadPoolExecutor.java:676)
        at java.lang.Thread.run(Thread.java:595)
Caused by: org.apache.maven.plugin.CompilationFailureException: Compilation failure
Failure executing javac, but could not parse the error:
javac: invalid flag: -s
Usage: javac <options> <source files>
where possible options include:
  -g                         Generate all debugging info
  -g:none                    Generate no debugging info
  -g:{lines,vars,source}     Generate only some debugging info
  -nowarn                    Generate no warnings
  -verbose                   Output messages about what the compiler is doing
  -deprecation               Output source locations where deprecated APIs are used
  -classpath <path>          Specify where to find user class files
  -cp <path>                 Specify where to find user class files
  -sourcepath <path>         Specify where to find input source files
  -bootclasspath <path>      Override location of bootstrap class files
  -extdirs <dirs>            Override location of installed extensions
  -endorseddirs <dirs>       Override location of endorsed standards path
  -d <directory>             Specify where to place generated class files
  -encoding <encoding>       Specify character encoding used by source files
  -source <release>          Provide source compatibility with specified release
  -target <release>          Generate class files for specific VM version
  -version                   Version information
  -help                      Print a synopsis of standard options
  -X                         Print a synopsis of nonstandard options
  -J<flag>                   Pass <flag> directly to the runtime system



        at org.apache.maven.plugin.AbstractCompilerMojo.execute(AbstractCompilerMojo.java:656)
        at org.apache.maven.plugin.CompilerMojo.execute(CompilerMojo.java:128)
        at org.apache.maven.plugin.DefaultBuildPluginManager.executeMojo(DefaultBuildPluginManager.java:101)
        at org.apache.maven.lifecycle.internal.MojoExecutor.execute(MojoExecutor.java:209)
        ... 27 more
[TASKS] Aggregating results of Apache Tika parent
[TASKS] Using set difference to compute new warnings
[TASKS] Aggregating results of Apache Tika core
[TASKS] Using set difference to compute new warnings
[TASKS] Aggregating results of Apache Tika parsers
[TASKS] Using set difference to compute new warnings
[TASKS] Aggregating results of Apache Tika application
[TASKS] Using set difference to compute new warnings
[TASKS] Aggregating results of Apache Tika OSGi bundle
[TASKS] Using set difference to compute new warnings
[TASKS] Aggregating results of Apache Tika server
[TASKS] Using set difference to compute new warnings
channel stopped
Reply | Threaded
Open this post in threaded view
|

Build failed in Jenkins: Tika-trunk #822

Apache Jenkins Server-2
See <https://builds.apache.org/job/Tika-trunk/822/changes>

Changes:

[mattmann] - ignore

[mattmann] - progress towards TIKA-593: replace Jersey with CXF. Checking in to reduce the need to review patches. Disabled 3 tests for now that aren't passing. Will work with Max to make them pass.

------------------------------------------
[...truncated 652 lines...]
Downloading: http://repo1.maven.org/maven2/org/apache/cxf/cxf-rt-transports-http/2.5.2/cxf-rt-transports-http-2.5.2.pom
Downloaded: http://repo1.maven.org/maven2/org/apache/cxf/cxf-rt-transports-http/2.5.2/cxf-rt-transports-http-2.5.2.pom (5 KB at 10.4 KB/sec)
Downloading: http://repo1.maven.org/maven2/org/apache/cxf/cxf-rt-transports-common/2.5.2/cxf-rt-transports-common-2.5.2.pom
Downloaded: http://repo1.maven.org/maven2/org/apache/cxf/cxf-rt-transports-common/2.5.2/cxf-rt-transports-common-2.5.2.pom (3 KB at 4.8 KB/sec)
Downloading: http://repo1.maven.org/maven2/org/apache/cxf/cxf-rt-transports-http-jetty/2.5.2/cxf-rt-transports-http-jetty-2.5.2.pom
Downloaded: http://repo1.maven.org/maven2/org/apache/cxf/cxf-rt-transports-http-jetty/2.5.2/cxf-rt-transports-http-jetty-2.5.2.pom (6 KB at 15.0 KB/sec)
Downloading: http://repo1.maven.org/maven2/org/apache/cxf/cxf-rt-frontend-jaxrs/2.5.2/cxf-rt-frontend-jaxrs-2.5.2.jar
Downloading: http://repo1.maven.org/maven2/org/apache/cxf/cxf-common-utilities/2.5.2/cxf-common-utilities-2.5.2.jar
Downloading: http://repo1.maven.org/maven2/org/apache/cxf/cxf-api/2.5.2/cxf-api-2.5.2.jar
Downloading: http://repo1.maven.org/maven2/org/apache/cxf/cxf-rt-core/2.5.2/cxf-rt-core-2.5.2.jar
Downloading: http://repo1.maven.org/maven2/org/apache/cxf/cxf-rt-bindings-xml/2.5.2/cxf-rt-bindings-xml-2.5.2.jar
Downloaded: http://repo1.maven.org/maven2/org/apache/cxf/cxf-rt-frontend-jaxrs/2.5.2/cxf-rt-frontend-jaxrs-2.5.2.jar (589 KB at 450.4 KB/sec)
Downloading: http://repo1.maven.org/maven2/org/apache/cxf/cxf-rt-transports-http/2.5.2/cxf-rt-transports-http-2.5.2.jar
Downloaded: http://repo1.maven.org/maven2/org/apache/cxf/cxf-common-utilities/2.5.2/cxf-common-utilities-2.5.2.jar (342 KB at 219.7 KB/sec)
Downloading: http://repo1.maven.org/maven2/org/apache/cxf/cxf-rt-transports-common/2.5.2/cxf-rt-transports-common-2.5.2.jar
Downloaded: http://repo1.maven.org/maven2/org/apache/cxf/cxf-rt-core/2.5.2/cxf-rt-core-2.5.2.jar (535 KB at 288.3 KB/sec)
Downloading: http://repo1.maven.org/maven2/org/apache/cxf/cxf-rt-transports-http-jetty/2.5.2/cxf-rt-transports-http-jetty-2.5.2.jar
Downloaded: http://repo1.maven.org/maven2/org/apache/cxf/cxf-rt-bindings-xml/2.5.2/cxf-rt-bindings-xml-2.5.2.jar (37 KB at 17.7 KB/sec)
Downloaded: http://repo1.maven.org/maven2/org/apache/cxf/cxf-api/2.5.2/cxf-api-2.5.2.jar (355 KB at 138.7 KB/sec)
Downloaded: http://repo1.maven.org/maven2/org/apache/cxf/cxf-rt-transports-http/2.5.2/cxf-rt-transports-http-2.5.2.jar (206 KB at 102.8 KB/sec)
Downloaded: http://repo1.maven.org/maven2/org/apache/cxf/cxf-rt-transports-common/2.5.2/cxf-rt-transports-common-2.5.2.jar (18 KB at 8.9 KB/sec)
Downloaded: http://repo1.maven.org/maven2/org/apache/cxf/cxf-rt-transports-http-jetty/2.5.2/cxf-rt-transports-http-jetty-2.5.2.jar (68 KB at 34.5 KB/sec)
[INFO] Deleting <https://builds.apache.org/job/Tika-trunk/ws/trunk/tika-server/target>
[INFO]
[INFO] --- maven-clean-plugin:2.4.1:clean (default-clean) @ tika-server ---
[TASKS] Scanning folder '<https://builds.apache.org/job/Tika-trunk/ws/trunk/tika-server'> for files matching the pattern '**/*.java' - excludes:
[TASKS] Found 12 files to scan for tasks
Found 3 open tasks.
[INFO]
[INFO] --- maven-remote-resources-plugin:1.2.1:process (default) @ tika-server ---
[debug] execute contextualize
[INFO] [INFO] Using 'UTF-8' encoding to copy filtered resources.
[INFO] Copying 2 resources
[INFO] Copying 3 resources

[INFO] --- maven-resources-plugin:2.5:resources (default-resources) @ tika-server ---
[INFO] [INFO] Compiling 8 source files to <https://builds.apache.org/job/Tika-trunk/ws/trunk/tika-server/target/classes>

[INFO] --- maven-compiler-plugin:2.3.2:compile (default-compile) @ tika-server ---
[INFO] -------------------------------------------------------------
[ERROR] COMPILATION ERROR :
[INFO] -------------------------------------------------------------
[ERROR] Failure executing javac, but could not parse the error:
javac: invalid flag: -s
Usage: javac <options> <source files>
where possible options include:
  -g                         Generate all debugging info
  -g:none                    Generate no debugging info
  -g:{lines,vars,source}     Generate only some debugging info
  -nowarn                    Generate no warnings
  -verbose                   Output messages about what the compiler is doing
  -deprecation               Output source locations where deprecated APIs are used
  -classpath <path>          Specify where to find user class files
  -cp <path>                 Specify where to find user class files
  -sourcepath <path>         Specify where to find input source files
  -bootclasspath <path>      Override location of bootstrap class files
  -extdirs <dirs>            Override location of installed extensions
  -endorseddirs <dirs>       Override location of endorsed standards path
  -d <directory>             Specify where to place generated class files
  -encoding <encoding>       Specify character encoding used by source files
  -source <release>          Provide source compatibility with specified release
  -target <release>          Generate class files for specific VM version
  -version                   Version information
  -help                      Print a synopsis of standard options
  -X                         Print a synopsis of nonstandard options
  -J<flag>                   Pass <flag> directly to the runtime system


[INFO] 1 error
[INFO] -------------------------------------------------------------
[JENKINS] Archiving <https://builds.apache.org/job/Tika-trunk/ws/trunk/tika-server/pom.xml> to /home/hudson/hudson/jobs/Tika-trunk/modules/org.apache.tika$tika-server/builds/2012-03-27_19-02-56/archive/org.apache.tika/tika-server/1.2-SNAPSHOT/tika-server-1.2-SNAPSHOT.pom
[INFO] ------------------------------------------------------------------------
[INFO] Reactor Summary:
[INFO]
[INFO] Apache Tika parent ................................ SUCCESS [34.521s]
[INFO] Apache Tika core .................................. SUCCESS [38.490s]
[INFO] Apache Tika parsers ............................... SUCCESS [1:02.159s]
[INFO] Apache Tika application ........................... SUCCESS [37.256s]
[INFO] Apache Tika OSGi bundle ........................... SUCCESS [27.423s]
[INFO] Apache Tika server ................................ FAILURE [10.799s]
[INFO] Apache Tika ....................................... SKIPPED
[INFO] ------------------------------------------------------------------------
[INFO] BUILD FAILURE
[INFO] ------------------------------------------------------------------------
[INFO] Total time: 8:18.586s
[INFO] Finished at: Tue Mar 27 19:11:33 UTC 2012
[INFO] Final Memory: 46M/364M
[INFO] ------------------------------------------------------------------------
Waiting for Jenkins to finish collecting data
mavenExecutionResult exceptions not empty
message : Failed to execute goal org.apache.maven.plugins:maven-compiler-plugin:2.3.2:compile (default-compile) on project tika-server: Compilation failure
Failure executing javac, but could not parse the error:
javac: invalid flag: -s
Usage: javac <options> <source files>
where possible options include:
  -g                         Generate all debugging info
  -g:none                    Generate no debugging info
  -g:{lines,vars,source}     Generate only some debugging info
  -nowarn                    Generate no warnings
  -verbose                   Output messages about what the compiler is doing
  -deprecation               Output source locations where deprecated APIs are used
  -classpath <path>          Specify where to find user class files
  -cp <path>                 Specify where to find user class files
  -sourcepath <path>         Specify where to find input source files
  -bootclasspath <path>      Override location of bootstrap class files
  -extdirs <dirs>            Override location of installed extensions
  -endorseddirs <dirs>       Override location of endorsed standards path
  -d <directory>             Specify where to place generated class files
  -encoding <encoding>       Specify character encoding used by source files
  -source <release>          Provide source compatibility with specified release
  -target <release>          Generate class files for specific VM version
  -version                   Version information
  -help                      Print a synopsis of standard options
  -X                         Print a synopsis of nonstandard options
  -J<flag>                   Pass <flag> directly to the runtime system



cause : Compilation failure
Failure executing javac, but could not parse the error:
javac: invalid flag: -s
Usage: javac <options> <source files>
where possible options include:
  -g                         Generate all debugging info
  -g:none                    Generate no debugging info
  -g:{lines,vars,source}     Generate only some debugging info
  -nowarn                    Generate no warnings
  -verbose                   Output messages about what the compiler is doing
  -deprecation               Output source locations where deprecated APIs are used
  -classpath <path>          Specify where to find user class files
  -cp <path>                 Specify where to find user class files
  -sourcepath <path>         Specify where to find input source files
  -bootclasspath <path>      Override location of bootstrap class files
  -extdirs <dirs>            Override location of installed extensions
  -endorseddirs <dirs>       Override location of endorsed standards path
  -d <directory>             Specify where to place generated class files
  -encoding <encoding>       Specify character encoding used by source files
  -source <release>          Provide source compatibility with specified release
  -target <release>          Generate class files for specific VM version
  -version                   Version information
  -help                      Print a synopsis of standard options
  -X                         Print a synopsis of nonstandard options
  -J<flag>                   Pass <flag> directly to the runtime system



Stack trace :
org.apache.maven.lifecycle.LifecycleExecutionException: Failed to execute goal org.apache.maven.plugins:maven-compiler-plugin:2.3.2:compile (default-compile) on project tika-server: Compilation failure
Failure executing javac, but could not parse the error:
javac: invalid flag: -s
Usage: javac <options> <source files>
where possible options include:
  -g                         Generate all debugging info
  -g:none                    Generate no debugging info
  -g:{lines,vars,source}     Generate only some debugging info
  -nowarn                    Generate no warnings
  -verbose                   Output messages about what the compiler is doing
  -deprecation               Output source locations where deprecated APIs are used
  -classpath <path>          Specify where to find user class files
  -cp <path>                 Specify where to find user class files
  -sourcepath <path>         Specify where to find input source files
  -bootclasspath <path>      Override location of bootstrap class files
  -extdirs <dirs>            Override location of installed extensions
  -endorseddirs <dirs>       Override location of endorsed standards path
  -d <directory>             Specify where to place generated class files
  -encoding <encoding>       Specify character encoding used by source files
  -source <release>          Provide source compatibility with specified release
  -target <release>          Generate class files for specific VM version
  -version                   Version information
  -help                      Print a synopsis of standard options
  -X                         Print a synopsis of nonstandard options
  -J<flag>                   Pass <flag> directly to the runtime system



        at org.apache.maven.lifecycle.internal.MojoExecutor.execute(MojoExecutor.java:213)
        at org.apache.maven.lifecycle.internal.MojoExecutor.execute(MojoExecutor.java:153)
        at org.apache.maven.lifecycle.internal.MojoExecutor.execute(MojoExecutor.java:145)
        at org.apache.maven.lifecycle.internal.LifecycleModuleBuilder.buildProject(LifecycleModuleBuilder.java:84)
        at org.apache.maven.lifecycle.internal.LifecycleModuleBuilder.buildProject(LifecycleModuleBuilder.java:59)
        at org.apache.maven.lifecycle.internal.LifecycleStarter.singleThreadedBuild(LifecycleStarter.java:183)
        at org.apache.maven.lifecycle.internal.LifecycleStarter.execute(LifecycleStarter.java:161)
        at org.apache.maven.DefaultMaven.doExecute(DefaultMaven.java:319)
        at org.apache.maven.DefaultMaven.execute(DefaultMaven.java:156)
        at org.jvnet.hudson.maven3.launcher.Maven3Launcher.main(Maven3Launcher.java:79)
        at sun.reflect.NativeMethodAccessorImpl.invoke0(Native Method)
        at sun.reflect.NativeMethodAccessorImpl.invoke(NativeMethodAccessorImpl.java:39)
        at sun.reflect.DelegatingMethodAccessorImpl.invoke(DelegatingMethodAccessorImpl.java:25)
        at java.lang.reflect.Method.invoke(Method.java:592)
        at org.codehaus.plexus.classworlds.launcher.Launcher.launchStandard(Launcher.java:329)
        at org.codehaus.plexus.classworlds.launcher.Launcher.launch(Launcher.java:239)
        at org.jvnet.hudson.maven3.agent.Maven3Main.launch(Maven3Main.java:158)
        at hudson.maven.Maven3Builder.call(Maven3Builder.java:104)
        at hudson.maven.Maven3Builder.call(Maven3Builder.java:70)
        at hudson.remoting.UserRequest.perform(UserRequest.java:118)
        at hudson.remoting.UserRequest.perform(UserRequest.java:48)
        at hudson.remoting.Request$2.run(Request.java:287)
        at hudson.remoting.InterceptingExecutorService$1.call(InterceptingExecutorService.java:72)
        at java.util.concurrent.FutureTask$Sync.innerRun(FutureTask.java:269)
        at java.util.concurrent.FutureTask.run(FutureTask.java:123)
        at java.util.concurrent.ThreadPoolExecutor$Worker.runTask(ThreadPoolExecutor.java:651)
        at java.util.concurrent.ThreadPoolExecutor$Worker.run(ThreadPoolExecutor.java:676)
        at java.lang.Thread.run(Thread.java:595)
Caused by: org.apache.maven.plugin.CompilationFailureException: Compilation failure
Failure executing javac, but could not parse the error:
javac: invalid flag: -s
Usage: javac <options> <source files>
where possible options include:
  -g                         Generate all debugging info
  -g:none                    Generate no debugging info
  -g:{lines,vars,source}     Generate only some debugging info
  -nowarn                    Generate no warnings
  -verbose                   Output messages about what the compiler is doing
  -deprecation               Output source locations where deprecated APIs are used
  -classpath <path>          Specify where to find user class files
  -cp <path>                 Specify where to find user class files
  -sourcepath <path>         Specify where to find input source files
  -bootclasspath <path>      Override location of bootstrap class files
  -extdirs <dirs>            Override location of installed extensions
  -endorseddirs <dirs>       Override location of endorsed standards path
  -d <directory>             Specify where to place generated class files
  -encoding <encoding>       Specify character encoding used by source files
  -source <release>          Provide source compatibility with specified release
  -target <release>          Generate class files for specific VM version
  -version                   Version information
  -help                      Print a synopsis of standard options
  -X                         Print a synopsis of nonstandard options
  -J<flag>                   Pass <flag> directly to the runtime system



        at org.apache.maven.plugin.AbstractCompilerMojo.execute(AbstractCompilerMojo.java:656)
        at org.apache.maven.plugin.CompilerMojo.execute(CompilerMojo.java:128)
        at org.apache.maven.plugin.DefaultBuildPluginManager.executeMojo(DefaultBuildPluginManager.java:101)
        at org.apache.maven.lifecycle.internal.MojoExecutor.execute(MojoExecutor.java:209)
        ... 27 more
[TASKS] Aggregating results of Apache Tika parent
[TASKS] Using set difference to compute new warnings
[TASKS] Aggregating results of Apache Tika core
[TASKS] Using set difference to compute new warnings
[TASKS] Aggregating results of Apache Tika parsers
[TASKS] Using set difference to compute new warnings
[TASKS] Aggregating results of Apache Tika application
[TASKS] Using set difference to compute new warnings
[TASKS] Aggregating results of Apache Tika OSGi bundle
[TASKS] Using set difference to compute new warnings
[TASKS] Aggregating results of Apache Tika server
[TASKS] Using set difference to compute new warnings
channel stopped
Reply | Threaded
Open this post in threaded view
|

Re: Build failed in Jenkins: Tika-trunk #821

Jukka Zitting
In reply to this post by Apache Jenkins Server-2
Hi,

On Tue, Mar 27, 2012 at 8:20 PM, Apache Jenkins Server
<[hidden email]> wrote:
> [INFO] --- maven-compiler-plugin:2.3.2:compile (default-compile) @ tika-server ---
> [INFO] -------------------------------------------------------------
> [ERROR] COMPILATION ERROR :
> [INFO] -------------------------------------------------------------
> [ERROR] Failure executing javac, but could not parse the error:
> javac: invalid flag: -s

Is this a result of tika-server requiring Java 6 instead of 5? If yes,
perhaps we should move tika-server to a separate java6 profile that's
only activated when the build is run in a Java 6+ environment.

BR,

Jukka Zitting
Reply | Threaded
Open this post in threaded view
|

Re: Build failed in Jenkins: Tika-trunk #821

Mattmann, Chris A (3010)
Hey Jukka,

I rolled it back to 1.5 on the Maven settings, so let's see if it compiles with 1.5.

Cheers,
Chris

On Mar 27, 2012, at 3:17 PM, Jukka Zitting wrote:

> Hi,
>
> On Tue, Mar 27, 2012 at 8:20 PM, Apache Jenkins Server
> <[hidden email]> wrote:
>> [INFO] --- maven-compiler-plugin:2.3.2:compile (default-compile) @ tika-server ---
>> [INFO] -------------------------------------------------------------
>> [ERROR] COMPILATION ERROR :
>> [INFO] -------------------------------------------------------------
>> [ERROR] Failure executing javac, but could not parse the error:
>> javac: invalid flag: -s
>
> Is this a result of tika-server requiring Java 6 instead of 5? If yes,
> perhaps we should move tika-server to a separate java6 profile that's
> only activated when the build is run in a Java 6+ environment.
>
> BR,
>
> Jukka Zitting


++++++++++++++++++++++++++++++++++++++++++++++++++++++++++++++++++
Chris Mattmann, Ph.D.
Senior Computer Scientist
NASA Jet Propulsion Laboratory Pasadena, CA 91109 USA
Office: 171-266B, Mailstop: 171-246
Email: [hidden email]
WWW:   http://sunset.usc.edu/~mattmann/
++++++++++++++++++++++++++++++++++++++++++++++++++++++++++++++++++
Adjunct Assistant Professor, Computer Science Department
University of Southern California, Los Angeles, CA 90089 USA
++++++++++++++++++++++++++++++++++++++++++++++++++++++++++++++++++

Reply | Threaded
Open this post in threaded view
|

Jenkins build is back to normal : Tika-trunk #823

Apache Jenkins Server-2
In reply to this post by Apache Jenkins Server-2