Build failed in Jenkins: Tika-trunk #972

classic Classic list List threaded Threaded
20 messages Options
Reply | Threaded
Open this post in threaded view
|

Build failed in Jenkins: Tika-trunk #972

Apache Jenkins Server-2
See <https://builds.apache.org/job/Tika-trunk/972/changes>

Changes:

[mattmann] Apply patch from Raimund Merkert and Chris Mattmann for TIKA-1047: Provide a JAX-RS to detect only mediatype.

[mattmann] Apply patch from Raimund Merkert and Chris Mattmann for TIKA-1047: Provide a JAX-RS to detect only mediatype.

[mattmann] Apply patch from Raimund Merkert and Chris Mattmann for TIKA-1047: Provide a JAX-RS to detect only mediatype.

------------------------------------------
[...truncated 1941 lines...]
[INFO]
[INFO] --- maven-install-plugin:2.3.1:install (default-install) @ tika-app ---
[INFO] Installing <https://builds.apache.org/job/Tika-trunk/ws/trunk/tika-app/pom.xml> to /home/jenkins/jenkins-slave/maven-repositories/0/org/apache/tika/tika-app/1.4-SNAPSHOT/tika-app-1.4-SNAPSHOT.pom
mojoSucceeded org.apache.maven.plugins:maven-install-plugin:2.3.1(default-install)
mojoStarted org.apache.maven.plugins:maven-deploy-plugin:2.6(default-deploy)Downloading: https://repository.apache.org/content/repositories/snapshots/org/apache/tika/tika-app/1.4-SNAPSHOT/maven-metadata.xml

[INFO]
[INFO] --- maven-deploy-plugin:2.6:deploy (default-deploy) @ tika-app ---
Downloaded: https://repository.apache.org/content/repositories/snapshots/org/apache/tika/tika-app/1.4-SNAPSHOT/maven-metadata.xml (767 B at 3.1 KB/sec)
Uploading: https://repository.apache.org/content/repositories/snapshots/org/apache/tika/tika-app/1.4-SNAPSHOT/tika-app-1.4-20130127.200907-5.jar
Uploaded: https://repository.apache.org/content/repositories/snapshots/org/apache/tika/tika-app/1.4-SNAPSHOT/tika-app-1.4-20130127.200907-5.jar (27097 KB at 3853.9 KB/sec)
Uploading: https://repository.apache.org/content/repositories/snapshots/org/apache/tika/tika-app/1.4-SNAPSHOT/tika-app-1.4-20130127.200907-5.pom
Uploaded: https://repository.apache.org/content/repositories/snapshots/org/apache/tika/tika-app/1.4-SNAPSHOT/tika-app-1.4-20130127.200907-5.pom (8 KB at 22.3 KB/sec)
Downloading: https://repository.apache.org/content/repositories/snapshots/org/apache/tika/tika-app/maven-metadata.xml
Downloaded: https://repository.apache.org/content/repositories/snapshots/org/apache/tika/tika-app/maven-metadata.xml (339 B at 1.0 KB/sec)
Uploading: https://repository.apache.org/content/repositories/snapshots/org/apache/tika/tika-app/1.4-SNAPSHOT/maven-metadata.xml
Uploaded: https://repository.apache.org/content/repositories/snapshots/org/apache/tika/tika-app/1.4-SNAPSHOT/maven-metadata.xml (767 B at 2.3 KB/sec)
Uploading: https://repository.apache.org/content/repositories/snapshots/org/apache/tika/tika-app/maven-metadata.xml
Uploaded: https://repository.apache.org/content/repositories/snapshots/org/apache/tika/tika-app/maven-metadata.xml (339 B at 0.7 KB/sec)
mojoSucceeded org.apache.maven.plugins:maven-deploy-plugin:2.6(default-deploy)
projectSucceeded org.apache.tika:tika-app:1.4-SNAPSHOT
projectStarted org.apache.tika:tika-bundle:1.4-SNAPSHOT
[INFO]                                                                        
[INFO] ------------------------------------------------------------------------
[INFO] Building Apache Tika OSGi bundle 1.4-SNAPSHOT
[INFO] ------------------------------------------------------------------------
mojoStarted org.apache.maven.plugins:maven-clean-plugin:2.4.1(default-clean)
[INFO]
[INFO] --- maven-clean-plugin:2.4.1:clean (default-clean) @ tika-bundle ---
mojoSucceeded org.apache.maven.plugins:maven-clean-plugin:2.4.1(default-clean)
[TASKS] Scanning folder '<https://builds.apache.org/job/Tika-trunk/ws/trunk/tika-bundle'> for files matching the pattern '**/*.java' - excludes:
[TASKS] Found 1 files to scan for tasks
Found 0 open tasks.
[TASKS] Computing warning deltas based on reference build #971
mojoStarted org.apache.maven.plugins:maven-remote-resources-plugin:1.2.1(default)
[INFO]
[INFO] --- maven-remote-resources-plugin:1.2.1:process (default) @ tika-bundle ---
mojoSucceeded org.apache.maven.plugins:maven-remote-resources-plugin:1.2.1(default)
mojoStarted org.apache.maven.plugins:maven-resources-plugin:2.5(default-resources)[debug] execute contextualize
[INFO] Using 'UTF-8' encoding to copy filtered resources.
[INFO] skip non existing resourceDirectory <https://builds.apache.org/job/Tika-trunk/ws/trunk/tika-bundle/src/main/resources>
[INFO] Copying 3 resources

[INFO]
[INFO] --- maven-resources-plugin:2.5:resources (default-resources) @ tika-bundle ---
mojoSucceeded org.apache.maven.plugins:maven-resources-plugin:2.5(default-resources)
mojoStarted org.apache.maven.plugins:maven-compiler-plugin:2.3.2(default-compile)[INFO] No sources to compile

[INFO]
[INFO] --- maven-compiler-plugin:2.3.2:compile (default-compile) @ tika-bundle ---
mojoSucceeded org.apache.maven.plugins:maven-compiler-plugin:2.3.2(default-compile)
mojoStarted org.apache.maven.plugins:maven-resources-plugin:2.5(default-testResources)[debug] execute contextualize
[INFO] Using 'UTF-8' encoding to copy filtered resources.
[INFO] Copying 1 resource
[INFO] Copying 3 resources

[INFO]
[INFO] --- maven-resources-plugin:2.5:testResources (default-testResources) @ tika-bundle ---
mojoSucceeded org.apache.maven.plugins:maven-resources-plugin:2.5(default-testResources)
mojoStarted org.apache.maven.plugins:maven-compiler-plugin:2.3.2(default-testCompile)[INFO] Compiling 1 source file to <https://builds.apache.org/job/Tika-trunk/ws/trunk/tika-bundle/target/test-classes>

[INFO]
[INFO] --- maven-compiler-plugin:2.3.2:testCompile (default-testCompile) @ tika-bundle ---
mojoSucceeded org.apache.maven.plugins:maven-compiler-plugin:2.3.2(default-testCompile)
mojoStarted org.apache.maven.plugins:maven-surefire-plugin:2.12(default-test)[INFO] Surefire report directory: <https://builds.apache.org/job/Tika-trunk/ws/trunk/tika-bundle/target/surefire-reports>

-------------------------------------------------------
 T E S T S
-------------------------------------------------------

[INFO]
[INFO] --- maven-surefire-plugin:2.12:test (default-test) @ tika-bundle ---

Results :

Tests run: 0, Failures: 0, Errors: 0, Skipped: 0

mojoSucceeded org.apache.maven.plugins:maven-surefire-plugin:2.12(default-test)
[JENKINS] Recording test results
mojoStarted org.apache.maven.plugins:maven-dependency-plugin:2.1(default)
[INFO]
[INFO] --- maven-dependency-plugin:2.1:unpack-dependencies (default) @ tika-bundle ---
[INFO] Unpacking /home/jenkins/jenkins-slave/maven-repositories/0/edu/ucar/netcdf/4.2-min/netcdf-4.2-min.jar to
  <https://builds.apache.org/job/Tika-trunk/ws/trunk/tika-bundle/target/classes>
   with includes null and excludes:ucar/nc2/iosp/fysat/Fysat*.class,
                ucar/nc2/dataset/transform/VOceanSG1*class,
                ucar/unidata/geoloc/vertical/OceanSG*.class,
                META-INF/**,CHANGES,README
mojoSucceeded org.apache.maven.plugins:maven-dependency-plugin:2.1(default)
mojoStarted org.apache.felix:maven-bundle-plugin:2.3.4(default-bundle)
[INFO]
[INFO] --- maven-bundle-plugin:2.3.4:bundle (default-bundle) @ tika-bundle ---
[WARNING] Embed-Dependency: clause "commons-io" did not match any dependencies
mojoSucceeded org.apache.felix:maven-bundle-plugin:2.3.4(default-bundle)
mojoStarted org.apache.maven.plugins:maven-site-plugin:3.0(attach-descriptor)
[INFO]
[INFO] --- maven-site-plugin:3.0:attach-descriptor (attach-descriptor) @ tika-bundle ---
mojoSucceeded org.apache.maven.plugins:maven-site-plugin:3.0(attach-descriptor)
mojoStarted org.apache.rat:apache-rat-plugin:0.7(default)[INFO] No excludes

[INFO]
[INFO] --- apache-rat-plugin:0.7:check (default) @ tika-bundle ---
mojoSucceeded org.apache.rat:apache-rat-plugin:0.7(default)
[PMD] No report found for mojo check
mojoStarted org.apache.maven.plugins:maven-install-plugin:2.3.1(default-install)[INFO] Installing <https://builds.apache.org/job/Tika-trunk/ws/trunk/tika-bundle/target/tika-bundle-1.4-SNAPSHOT.jar> to /home/jenkins/jenkins-slave/maven-repositories/0/org/apache/tika/tika-bundle/1.4-SNAPSHOT/tika-bundle-1.4-SNAPSHOT.jar

[INFO]
[INFO] --- maven-install-plugin:2.3.1:install (default-install) @ tika-bundle ---
[INFO] Installing <https://builds.apache.org/job/Tika-trunk/ws/trunk/tika-bundle/pom.xml> to /home/jenkins/jenkins-slave/maven-repositories/0/org/apache/tika/tika-bundle/1.4-SNAPSHOT/tika-bundle-1.4-SNAPSHOT.pom
mojoSucceeded org.apache.maven.plugins:maven-install-plugin:2.3.1(default-install)
mojoStarted org.apache.felix:maven-bundle-plugin:2.3.4(default-install)[INFO] Local OBR update disabled (enable with -DobrRepository)

[INFO]
[INFO] --- maven-bundle-plugin:2.3.4:install (default-install) @ tika-bundle ---
mojoSucceeded org.apache.felix:maven-bundle-plugin:2.3.4(default-install)
mojoStarted org.apache.maven.plugins:maven-deploy-plugin:2.6(default-deploy)Downloading: https://repository.apache.org/content/repositories/snapshots/org/apache/tika/tika-bundle/1.4-SNAPSHOT/maven-metadata.xml

[INFO]
[INFO] --- maven-deploy-plugin:2.6:deploy (default-deploy) @ tika-bundle ---
Downloaded: https://repository.apache.org/content/repositories/snapshots/org/apache/tika/tika-bundle/1.4-SNAPSHOT/maven-metadata.xml (770 B at 1.6 KB/sec)
Uploading: https://repository.apache.org/content/repositories/snapshots/org/apache/tika/tika-bundle/1.4-SNAPSHOT/tika-bundle-1.4-20130127.200939-5.jar
Uploaded: https://repository.apache.org/content/repositories/snapshots/org/apache/tika/tika-bundle/1.4-SNAPSHOT/tika-bundle-1.4-20130127.200939-5.jar (21965 KB at 5815.4 KB/sec)
Uploading: https://repository.apache.org/content/repositories/snapshots/org/apache/tika/tika-bundle/1.4-SNAPSHOT/tika-bundle-1.4-20130127.200939-5.pom
Uploaded: https://repository.apache.org/content/repositories/snapshots/org/apache/tika/tika-bundle/1.4-SNAPSHOT/tika-bundle-1.4-20130127.200939-5.pom (11 KB at 23.9 KB/sec)
Downloading: https://repository.apache.org/content/repositories/snapshots/org/apache/tika/tika-bundle/maven-metadata.xml
Downloaded: https://repository.apache.org/content/repositories/snapshots/org/apache/tika/tika-bundle/maven-metadata.xml (342 B at 0.2 KB/sec)
Uploading: https://repository.apache.org/content/repositories/snapshots/org/apache/tika/tika-bundle/1.4-SNAPSHOT/maven-metadata.xml
Uploaded: https://repository.apache.org/content/repositories/snapshots/org/apache/tika/tika-bundle/1.4-SNAPSHOT/maven-metadata.xml (770 B at 2.7 KB/sec)
Uploading: https://repository.apache.org/content/repositories/snapshots/org/apache/tika/tika-bundle/maven-metadata.xml
Uploaded: https://repository.apache.org/content/repositories/snapshots/org/apache/tika/tika-bundle/maven-metadata.xml (342 B at 0.7 KB/sec)
mojoSucceeded org.apache.maven.plugins:maven-deploy-plugin:2.6(default-deploy)
mojoStarted org.apache.felix:maven-bundle-plugin:2.3.4(default-deploy)[INFO] Remote OBR update disabled (enable with -DremoteOBR)

[INFO]
[INFO] --- maven-bundle-plugin:2.3.4:deploy (default-deploy) @ tika-bundle ---
mojoSucceeded org.apache.felix:maven-bundle-plugin:2.3.4(default-deploy)
projectSucceeded org.apache.tika:tika-bundle:1.4-SNAPSHOT
projectStarted org.apache.tika:tika-server:1.4-SNAPSHOT
[INFO]                                                                        
[INFO] ------------------------------------------------------------------------
[INFO] Building Apache Tika server 1.4-SNAPSHOT
[INFO] ------------------------------------------------------------------------
mojoStarted org.apache.maven.plugins:maven-clean-plugin:2.4.1(default-clean)
[INFO]
[INFO] --- maven-clean-plugin:2.4.1:clean (default-clean) @ tika-server ---
mojoSucceeded org.apache.maven.plugins:maven-clean-plugin:2.4.1(default-clean)
[TASKS] Scanning folder '<https://builds.apache.org/job/Tika-trunk/ws/trunk/tika-server'> for files matching the pattern '**/*.java' - excludes:
[TASKS] Found 18 files to scan for tasks
Found 0 open tasks.
[TASKS] Computing warning deltas based on reference build #971
mojoStarted org.apache.maven.plugins:maven-remote-resources-plugin:1.2.1(default)
[INFO]
[INFO] --- maven-remote-resources-plugin:1.2.1:process (default) @ tika-server ---
mojoSucceeded org.apache.maven.plugins:maven-remote-resources-plugin:1.2.1(default)
mojoStarted org.apache.maven.plugins:maven-resources-plugin:2.5(default-resources)[debug] execute contextualize
[INFO] Using 'UTF-8' encoding to copy filtered resources.
[INFO] Copying 2 resources
[INFO] Copying 3 resources

[INFO]
[INFO] --- maven-resources-plugin:2.5:resources (default-resources) @ tika-server ---
mojoSucceeded org.apache.maven.plugins:maven-resources-plugin:2.5(default-resources)
mojoStarted org.apache.maven.plugins:maven-compiler-plugin:2.3.2(default-compile)[INFO] Compiling 12 source files to <https://builds.apache.org/job/Tika-trunk/ws/trunk/tika-server/target/classes>

[INFO]
[INFO] --- maven-compiler-plugin:2.3.2:compile (default-compile) @ tika-server ---
[INFO] -------------------------------------------------------------
[ERROR] COMPILATION ERROR :
[INFO] -------------------------------------------------------------
[ERROR] <https://builds.apache.org/job/Tika-trunk/ws/trunk/tika-server/src/main/java/org/apache/tika/server/CSVMessageBodyWriter.java>:[51,3] method does not override a method from its superclass
mojoFailed org.apache.maven.plugins:maven-compiler-plugin:2.3.2(default-compile)[ERROR] <https://builds.apache.org/job/Tika-trunk/ws/trunk/tika-server/src/main/java/org/apache/tika/server/JSONMessageBodyWriter.java>:[51,3] method does not override a method from its superclass
[INFO] 2 errors
[INFO] -------------------------------------------------------------

projectFailed org.apache.tika:tika-server:1.4-SNAPSHOT
sessionEnded
[INFO] ------------------------------------------------------------------------
[INFO] Reactor Summary:
[INFO]
[INFO] Apache Tika parent ................................ SUCCESS [40.618s]
[INFO] Apache Tika core .................................. SUCCESS [43.851s]
[INFO] Apache Tika parsers ............................... SUCCESS [1:13.057s]
[INFO] Apache Tika XMP ................................... SUCCESS [9.806s]
[INFO] Apache Tika application ........................... SUCCESS [31.512s]
[INFO] Apache Tika OSGi bundle ........................... SUCCESS [29.711s]
[INFO] Apache Tika server ................................ FAILURE [5.169s]
[INFO] Apache Tika ....................................... SKIPPED
[INFO] ------------------------------------------------------------------------
[INFO] BUILD FAILURE
[INFO] ------------------------------------------------------------------------
[INFO] Total time: 3:59.204s
[INFO] Finished at: Sun Jan 27 20:09:52 UTC 2013
[INFO] Final Memory: 43M/327M
[INFO] ------------------------------------------------------------------------
Projects to build: [MavenProject: org.apache.tika:tika-parent:1.4-SNAPSHOT @ <https://builds.apache.org/job/Tika-trunk/ws/trunk/tika-parent/pom.xml,> MavenProject: org.apache.tika:tika-core:1.4-SNAPSHOT @ <https://builds.apache.org/job/Tika-trunk/ws/trunk/tika-core/pom.xml,> MavenProject: org.apache.tika:tika-parsers:1.4-SNAPSHOT @ <https://builds.apache.org/job/Tika-trunk/ws/trunk/tika-parsers/pom.xml,> MavenProject: org.apache.tika:tika-xmp:1.4-SNAPSHOT @ <https://builds.apache.org/job/Tika-trunk/ws/trunk/tika-xmp/pom.xml,> MavenProject: org.apache.tika:tika-app:1.4-SNAPSHOT @ <https://builds.apache.org/job/Tika-trunk/ws/trunk/tika-app/pom.xml,> MavenProject: org.apache.tika:tika-bundle:1.4-SNAPSHOT @ <https://builds.apache.org/job/Tika-trunk/ws/trunk/tika-bundle/pom.xml,> MavenProject: org.apache.tika:tika-server:1.4-SNAPSHOT @ <https://builds.apache.org/job/Tika-trunk/ws/trunk/tika-server/pom.xml,> MavenProject: org.apache.tika:tika:1.4-SNAPSHOT @ <https://builds.apache.org/job/Tika-trunk/ws/trunk/pom.xml]>
[JENKINS] Archiving <https://builds.apache.org/job/Tika-trunk/ws/trunk/pom.xml> to /home/hudson/hudson/jobs/Tika-trunk/modules/org.apache.tika$tika/builds/2013-01-27_20-05-29/archive/org.apache.tika/tika/1.4-SNAPSHOT/tika-1.4-SNAPSHOT.pom
[JENKINS] Archiving <https://builds.apache.org/job/Tika-trunk/ws/trunk/tika-parent/pom.xml> to /home/hudson/hudson/jobs/Tika-trunk/modules/org.apache.tika$tika-parent/builds/2013-01-27_20-05-29/archive/org.apache.tika/tika-parent/1.4-SNAPSHOT/tika-parent-1.4-SNAPSHOT.pom
[JENKINS] Archiving <https://builds.apache.org/job/Tika-trunk/ws/trunk/tika-parsers/pom.xml> to /home/hudson/hudson/jobs/Tika-trunk/modules/org.apache.tika$tika-parsers/builds/2013-01-27_20-05-30/archive/org.apache.tika/tika-parsers/1.4-SNAPSHOT/tika-parsers-1.4-SNAPSHOT.pom
[JENKINS] Archiving <https://builds.apache.org/job/Tika-trunk/ws/trunk/tika-parsers/target/tika-parsers-1.4-SNAPSHOT.jar> to /home/hudson/hudson/jobs/Tika-trunk/modules/org.apache.tika$tika-parsers/builds/2013-01-27_20-05-30/archive/org.apache.tika/tika-parsers/1.4-20130127.200831-5/tika-parsers-1.4-20130127.200831-5.jar
[JENKINS] Archiving <https://builds.apache.org/job/Tika-trunk/ws/trunk/tika-xmp/pom.xml> to /home/hudson/hudson/jobs/Tika-trunk/modules/org.apache.tika$tika-xmp/builds/2013-01-27_20-05-30/archive/org.apache.tika/tika-xmp/1.4-SNAPSHOT/tika-xmp-1.4-SNAPSHOT.pom
[JENKINS] Archiving <https://builds.apache.org/job/Tika-trunk/ws/trunk/tika-xmp/target/tika-xmp-1.4-SNAPSHOT.jar> to /home/hudson/hudson/jobs/Tika-trunk/modules/org.apache.tika$tika-xmp/builds/2013-01-27_20-05-30/archive/org.apache.tika/tika-xmp/1.4-20130127.200841-5/tika-xmp-1.4-20130127.200841-5.jar
[JENKINS] Archiving <https://builds.apache.org/job/Tika-trunk/ws/trunk/tika-app/pom.xml> to /home/hudson/hudson/jobs/Tika-trunk/modules/org.apache.tika$tika-app/builds/2013-01-27_20-05-30/archive/org.apache.tika/tika-app/1.4-SNAPSHOT/tika-app-1.4-SNAPSHOT.pom
[JENKINS] Archiving <https://builds.apache.org/job/Tika-trunk/ws/trunk/tika-app/target/tika-app-1.4-SNAPSHOT.jar> to /home/hudson/hudson/jobs/Tika-trunk/modules/org.apache.tika$tika-app/builds/2013-01-27_20-05-30/archive/org.apache.tika/tika-app/1.4-20130127.200907-5/tika-app-1.4-20130127.200907-5.jar
[JENKINS] Archiving <https://builds.apache.org/job/Tika-trunk/ws/trunk/tika-server/pom.xml> to /home/hudson/hudson/jobs/Tika-trunk/modules/org.apache.tika$tika-server/builds/2013-01-27_20-05-30/archive/org.apache.tika/tika-server/1.4-SNAPSHOT/tika-server-1.4-SNAPSHOT.pom
[JENKINS] Archiving <https://builds.apache.org/job/Tika-trunk/ws/trunk/tika-core/pom.xml> to /home/hudson/hudson/jobs/Tika-trunk/modules/org.apache.tika$tika-core/builds/2013-01-27_20-05-30/archive/org.apache.tika/tika-core/1.4-SNAPSHOT/tika-core-1.4-SNAPSHOT.pom
[JENKINS] Archiving <https://builds.apache.org/job/Tika-trunk/ws/trunk/tika-core/target/tika-core-1.4-SNAPSHOT.jar> to /home/hudson/hudson/jobs/Tika-trunk/modules/org.apache.tika$tika-core/builds/2013-01-27_20-05-30/archive/org.apache.tika/tika-core/1.4-20130127.200718-5/tika-core-1.4-20130127.200718-5.jar
[JENKINS] Archiving <https://builds.apache.org/job/Tika-trunk/ws/trunk/tika-bundle/pom.xml> to /home/hudson/hudson/jobs/Tika-trunk/modules/org.apache.tika$tika-bundle/builds/2013-01-27_20-05-30/archive/org.apache.tika/tika-bundle/1.4-SNAPSHOT/tika-bundle-1.4-SNAPSHOT.pom
[JENKINS] Archiving <https://builds.apache.org/job/Tika-trunk/ws/trunk/tika-bundle/target/tika-bundle-1.4-SNAPSHOT.jar> to /home/hudson/hudson/jobs/Tika-trunk/modules/org.apache.tika$tika-bundle/builds/2013-01-27_20-05-30/archive/org.apache.tika/tika-bundle/1.4-20130127.200939-5/tika-bundle-1.4-20130127.200939-5.jar
Waiting for Jenkins to finish collecting data
mavenExecutionResult exceptions not empty
message : Failed to execute goal org.apache.maven.plugins:maven-compiler-plugin:2.3.2:compile (default-compile) on project tika-server: Compilation failure
cause : Compilation failure
Stack trace :
org.apache.maven.lifecycle.LifecycleExecutionException: Failed to execute goal org.apache.maven.plugins:maven-compiler-plugin:2.3.2:compile (default-compile) on project tika-server: Compilation failure
        at org.apache.maven.lifecycle.internal.MojoExecutor.execute(MojoExecutor.java:213)
        at org.apache.maven.lifecycle.internal.MojoExecutor.execute(MojoExecutor.java:153)
        at org.apache.maven.lifecycle.internal.MojoExecutor.execute(MojoExecutor.java:145)
        at org.apache.maven.lifecycle.internal.LifecycleModuleBuilder.buildProject(LifecycleModuleBuilder.java:84)
        at org.apache.maven.lifecycle.internal.LifecycleModuleBuilder.buildProject(LifecycleModuleBuilder.java:59)
        at org.apache.maven.lifecycle.internal.LifecycleStarter.singleThreadedBuild(LifecycleStarter.java:183)
        at org.apache.maven.lifecycle.internal.LifecycleStarter.execute(LifecycleStarter.java:161)
        at org.apache.maven.DefaultMaven.doExecute(DefaultMaven.java:320)
        at org.apache.maven.DefaultMaven.execute(DefaultMaven.java:156)
        at org.jvnet.hudson.maven3.launcher.Maven3Launcher.main(Maven3Launcher.java:79)
        at sun.reflect.NativeMethodAccessorImpl.invoke0(Native Method)
        at sun.reflect.NativeMethodAccessorImpl.invoke(NativeMethodAccessorImpl.java:39)
        at sun.reflect.DelegatingMethodAccessorImpl.invoke(DelegatingMethodAccessorImpl.java:25)
        at java.lang.reflect.Method.invoke(Method.java:592)
        at org.codehaus.plexus.classworlds.launcher.Launcher.launchStandard(Launcher.java:329)
        at org.codehaus.plexus.classworlds.launcher.Launcher.launch(Launcher.java:239)
        at org.jvnet.hudson.maven3.agent.Maven3Main.launch(Maven3Main.java:158)
        at hudson.maven.Maven3Builder.call(Maven3Builder.java:100)
        at hudson.maven.Maven3Builder.call(Maven3Builder.java:66)
        at hudson.remoting.UserRequest.perform(UserRequest.java:118)
        at hudson.remoting.UserRequest.perform(UserRequest.java:48)
        at hudson.remoting.Request$2.run(Request.java:326)
        at hudson.remoting.InterceptingExecutorService$1.call(InterceptingExecutorService.java:72)
        at java.util.concurrent.FutureTask$Sync.innerRun(FutureTask.java:269)
        at java.util.concurrent.FutureTask.run(FutureTask.java:123)
        at java.util.concurrent.ThreadPoolExecutor$Worker.runTask(ThreadPoolExecutor.java:651)
        at java.util.concurrent.ThreadPoolExecutor$Worker.run(ThreadPoolExecutor.java:676)
        at java.lang.Thread.run(Thread.java:595)
Caused by: org.apache.maven.plugin.CompilationFailureException: Compilation failure
        at org.apache.maven.plugin.AbstractCompilerMojo.execute(AbstractCompilerMojo.java:656)
        at org.apache.maven.plugin.CompilerMojo.execute(CompilerMojo.java:128)
        at org.apache.maven.plugin.DefaultBuildPluginManager.executeMojo(DefaultBuildPluginManager.java:101)
        at org.apache.maven.lifecycle.internal.MojoExecutor.execute(MojoExecutor.java:209)
        ... 27 more
channel stopped
Reply | Threaded
Open this post in threaded view
|

Build failed in Jenkins: Tika-trunk #973

Apache Jenkins Server-2
See <https://builds.apache.org/job/Tika-trunk/973/changes>

Changes:

[nick] TIKA-1065 SAS subtype and mime magic

[nick] TIKA-1065 Mimetype entries for SAS file types

------------------------------------------
[...truncated 804 lines...]
[INFO] Installing <https://builds.apache.org/job/Tika-trunk/ws/trunk/tika-app/pom.xml> to /home/jenkins/jenkins-slave/maven-repositories/0/org/apache/tika/tika-app/1.4-SNAPSHOT/tika-app-1.4-SNAPSHOT.pom
mojoSucceeded org.apache.maven.plugins:maven-install-plugin:2.3.1(default-install)
Downloading: https://repository.apache.org/content/repositories/snapshots/org/apache/tika/tika-app/1.4-SNAPSHOT/maven-metadata.xml
mojoStarted org.apache.maven.plugins:maven-deploy-plugin:2.6(default-deploy)
[INFO]
[INFO] --- maven-deploy-plugin:2.6:deploy (default-deploy) @ tika-app ---
Downloaded: https://repository.apache.org/content/repositories/snapshots/org/apache/tika/tika-app/1.4-SNAPSHOT/maven-metadata.xml (767 B at 2.6 KB/sec)
Uploading: https://repository.apache.org/content/repositories/snapshots/org/apache/tika/tika-app/1.4-SNAPSHOT/tika-app-1.4-20130128.181939-6.jar
Uploaded: https://repository.apache.org/content/repositories/snapshots/org/apache/tika/tika-app/1.4-SNAPSHOT/tika-app-1.4-20130128.181939-6.jar (27098 KB at 5382.8 KB/sec)
Uploading: https://repository.apache.org/content/repositories/snapshots/org/apache/tika/tika-app/1.4-SNAPSHOT/tika-app-1.4-20130128.181939-6.pom
Uploaded: https://repository.apache.org/content/repositories/snapshots/org/apache/tika/tika-app/1.4-SNAPSHOT/tika-app-1.4-20130128.181939-6.pom (8 KB at 22.3 KB/sec)
Downloading: https://repository.apache.org/content/repositories/snapshots/org/apache/tika/tika-app/maven-metadata.xml
Downloaded: https://repository.apache.org/content/repositories/snapshots/org/apache/tika/tika-app/maven-metadata.xml (339 B at 1.1 KB/sec)
Uploading: https://repository.apache.org/content/repositories/snapshots/org/apache/tika/tika-app/1.4-SNAPSHOT/maven-metadata.xml
Uploaded: https://repository.apache.org/content/repositories/snapshots/org/apache/tika/tika-app/1.4-SNAPSHOT/maven-metadata.xml (767 B at 2.7 KB/sec)
Uploading: https://repository.apache.org/content/repositories/snapshots/org/apache/tika/tika-app/maven-metadata.xml
Uploaded: https://repository.apache.org/content/repositories/snapshots/org/apache/tika/tika-app/maven-metadata.xml (339 B at 1.0 KB/sec)
mojoSucceeded org.apache.maven.plugins:maven-deploy-plugin:2.6(default-deploy)
projectSucceeded org.apache.tika:tika-app:1.4-SNAPSHOT
projectStarted org.apache.tika:tika-bundle:1.4-SNAPSHOT
[INFO]                                                                        
[INFO] ------------------------------------------------------------------------
[INFO] Building Apache Tika OSGi bundle 1.4-SNAPSHOT
[INFO] ------------------------------------------------------------------------
[INFO] Deleting <https://builds.apache.org/job/Tika-trunk/ws/trunk/tika-bundle/target>
mojoStarted org.apache.maven.plugins:maven-clean-plugin:2.4.1(default-clean)
[INFO]
[INFO] --- maven-clean-plugin:2.4.1:clean (default-clean) @ tika-bundle ---
mojoSucceeded org.apache.maven.plugins:maven-clean-plugin:2.4.1(default-clean)
[TASKS] Scanning folder '<https://builds.apache.org/job/Tika-trunk/ws/trunk/tika-bundle'> for files matching the pattern '**/*.java' - excludes:
[TASKS] Found 1 files to scan for tasks
Found 0 open tasks.
[TASKS] Computing warning deltas based on reference build #972
mojoStarted org.apache.maven.plugins:maven-remote-resources-plugin:1.2.1(default)
[INFO]
[INFO] --- maven-remote-resources-plugin:1.2.1:process (default) @ tika-bundle ---
mojoSucceeded org.apache.maven.plugins:maven-remote-resources-plugin:1.2.1(default)
[debug] execute contextualize
mojoStarted org.apache.maven.plugins:maven-resources-plugin:2.5(default-resources)[INFO] Using 'UTF-8' encoding to copy filtered resources.
[INFO] skip non existing resourceDirectory <https://builds.apache.org/job/Tika-trunk/ws/trunk/tika-bundle/src/main/resources>
[INFO] Copying 3 resources

[INFO]
[INFO] --- maven-resources-plugin:2.5:resources (default-resources) @ tika-bundle ---
mojoSucceeded org.apache.maven.plugins:maven-resources-plugin:2.5(default-resources)
[INFO] No sources to compile
mojoStarted org.apache.maven.plugins:maven-compiler-plugin:2.3.2(default-compile)
[INFO]
[INFO] --- maven-compiler-plugin:2.3.2:compile (default-compile) @ tika-bundle ---
mojoSucceeded org.apache.maven.plugins:maven-compiler-plugin:2.3.2(default-compile)
mojoStarted org.apache.maven.plugins:maven-resources-plugin:2.5(default-testResources)[debug] execute contextualize
[INFO] Using 'UTF-8' encoding to copy filtered resources.

[INFO]
[INFO] --- maven-resources-plugin:2.5:testResources (default-testResources) @ tika-bundle ---
[INFO] Copying 1 resource
[INFO] Copying 3 resources
mojoSucceeded org.apache.maven.plugins:maven-resources-plugin:2.5(default-testResources)
mojoStarted org.apache.maven.plugins:maven-compiler-plugin:2.3.2(default-testCompile)[INFO] Compiling 1 source file to <https://builds.apache.org/job/Tika-trunk/ws/trunk/tika-bundle/target/test-classes>

[INFO]
[INFO] --- maven-compiler-plugin:2.3.2:testCompile (default-testCompile) @ tika-bundle ---
mojoSucceeded org.apache.maven.plugins:maven-compiler-plugin:2.3.2(default-testCompile)
mojoStarted org.apache.maven.plugins:maven-surefire-plugin:2.12(default-test)[INFO] Surefire report directory: <https://builds.apache.org/job/Tika-trunk/ws/trunk/tika-bundle/target/surefire-reports>

-------------------------------------------------------
 T E S T S
-------------------------------------------------------

[INFO]
[INFO] --- maven-surefire-plugin:2.12:test (default-test) @ tika-bundle ---

Results :

Tests run: 0, Failures: 0, Errors: 0, Skipped: 0

mojoSucceeded org.apache.maven.plugins:maven-surefire-plugin:2.12(default-test)
[JENKINS] Recording test results
mojoStarted org.apache.maven.plugins:maven-dependency-plugin:2.1(default)
[INFO]
[INFO] --- maven-dependency-plugin:2.1:unpack-dependencies (default) @ tika-bundle ---
[INFO] Unpacking /home/jenkins/jenkins-slave/maven-repositories/0/edu/ucar/netcdf/4.2-min/netcdf-4.2-min.jar to
  <https://builds.apache.org/job/Tika-trunk/ws/trunk/tika-bundle/target/classes>
   with includes null and excludes:ucar/nc2/iosp/fysat/Fysat*.class,
                ucar/nc2/dataset/transform/VOceanSG1*class,
                ucar/unidata/geoloc/vertical/OceanSG*.class,
                META-INF/**,CHANGES,README
mojoSucceeded org.apache.maven.plugins:maven-dependency-plugin:2.1(default)
mojoStarted org.apache.felix:maven-bundle-plugin:2.3.4(default-bundle)
[INFO]
[INFO] --- maven-bundle-plugin:2.3.4:bundle (default-bundle) @ tika-bundle ---
[WARNING] Embed-Dependency: clause "commons-io" did not match any dependencies
mojoSucceeded org.apache.felix:maven-bundle-plugin:2.3.4(default-bundle)
mojoStarted org.apache.maven.plugins:maven-site-plugin:3.0(attach-descriptor)
[INFO]
[INFO] --- maven-site-plugin:3.0:attach-descriptor (attach-descriptor) @ tika-bundle ---
mojoSucceeded org.apache.maven.plugins:maven-site-plugin:3.0(attach-descriptor)
mojoStarted org.apache.rat:apache-rat-plugin:0.7(default)[INFO] No excludes

[INFO]
[INFO] --- apache-rat-plugin:0.7:check (default) @ tika-bundle ---
mojoSucceeded org.apache.rat:apache-rat-plugin:0.7(default)
[PMD] No report found for mojo check
mojoStarted org.apache.maven.plugins:maven-install-plugin:2.3.1(default-install)[INFO] Installing <https://builds.apache.org/job/Tika-trunk/ws/trunk/tika-bundle/target/tika-bundle-1.4-SNAPSHOT.jar> to /home/jenkins/jenkins-slave/maven-repositories/0/org/apache/tika/tika-bundle/1.4-SNAPSHOT/tika-bundle-1.4-SNAPSHOT.jar

[INFO]
[INFO] --- maven-install-plugin:2.3.1:install (default-install) @ tika-bundle ---
[INFO] Installing <https://builds.apache.org/job/Tika-trunk/ws/trunk/tika-bundle/pom.xml> to /home/jenkins/jenkins-slave/maven-repositories/0/org/apache/tika/tika-bundle/1.4-SNAPSHOT/tika-bundle-1.4-SNAPSHOT.pom
mojoSucceeded org.apache.maven.plugins:maven-install-plugin:2.3.1(default-install)
[INFO] Local OBR update disabled (enable with -DobrRepository)
mojoStarted org.apache.felix:maven-bundle-plugin:2.3.4(default-install)
[INFO]
[INFO] --- maven-bundle-plugin:2.3.4:install (default-install) @ tika-bundle ---
mojoSucceeded org.apache.felix:maven-bundle-plugin:2.3.4(default-install)
mojoStarted org.apache.maven.plugins:maven-deploy-plugin:2.6(default-deploy)Downloading: https://repository.apache.org/content/repositories/snapshots/org/apache/tika/tika-bundle/1.4-SNAPSHOT/maven-metadata.xml

[INFO]
[INFO] --- maven-deploy-plugin:2.6:deploy (default-deploy) @ tika-bundle ---
Downloaded: https://repository.apache.org/content/repositories/snapshots/org/apache/tika/tika-bundle/1.4-SNAPSHOT/maven-metadata.xml (770 B at 1.5 KB/sec)
Uploading: https://repository.apache.org/content/repositories/snapshots/org/apache/tika/tika-bundle/1.4-SNAPSHOT/tika-bundle-1.4-20130128.182013-6.jar
Uploaded: https://repository.apache.org/content/repositories/snapshots/org/apache/tika/tika-bundle/1.4-SNAPSHOT/tika-bundle-1.4-20130128.182013-6.jar (21965 KB at 5893.4 KB/sec)
Uploading: https://repository.apache.org/content/repositories/snapshots/org/apache/tika/tika-bundle/1.4-SNAPSHOT/tika-bundle-1.4-20130128.182013-6.pom
Uploaded: https://repository.apache.org/content/repositories/snapshots/org/apache/tika/tika-bundle/1.4-SNAPSHOT/tika-bundle-1.4-20130128.182013-6.pom (11 KB at 32.1 KB/sec)
Downloading: https://repository.apache.org/content/repositories/snapshots/org/apache/tika/tika-bundle/maven-metadata.xml
Downloaded: https://repository.apache.org/content/repositories/snapshots/org/apache/tika/tika-bundle/maven-metadata.xml (342 B at 0.9 KB/sec)
Uploading: https://repository.apache.org/content/repositories/snapshots/org/apache/tika/tika-bundle/1.4-SNAPSHOT/maven-metadata.xml
Uploaded: https://repository.apache.org/content/repositories/snapshots/org/apache/tika/tika-bundle/1.4-SNAPSHOT/maven-metadata.xml (770 B at 2.8 KB/sec)
Uploading: https://repository.apache.org/content/repositories/snapshots/org/apache/tika/tika-bundle/maven-metadata.xml
Uploaded: https://repository.apache.org/content/repositories/snapshots/org/apache/tika/tika-bundle/maven-metadata.xml (342 B at 1.0 KB/sec)
mojoSucceeded org.apache.maven.plugins:maven-deploy-plugin:2.6(default-deploy)
mojoStarted org.apache.felix:maven-bundle-plugin:2.3.4(default-deploy)[INFO] Remote OBR update disabled (enable with -DremoteOBR)

[INFO]
[INFO] --- maven-bundle-plugin:2.3.4:deploy (default-deploy) @ tika-bundle ---
mojoSucceeded org.apache.felix:maven-bundle-plugin:2.3.4(default-deploy)
projectSucceeded org.apache.tika:tika-bundle:1.4-SNAPSHOT
projectStarted org.apache.tika:tika-server:1.4-SNAPSHOT
[INFO]                                                                        
[INFO] ------------------------------------------------------------------------
[INFO] Building Apache Tika server 1.4-SNAPSHOT
[INFO] ------------------------------------------------------------------------
[INFO] Deleting <https://builds.apache.org/job/Tika-trunk/ws/trunk/tika-server/target>
mojoStarted org.apache.maven.plugins:maven-clean-plugin:2.4.1(default-clean)
[INFO]
[INFO] --- maven-clean-plugin:2.4.1:clean (default-clean) @ tika-server ---
mojoSucceeded org.apache.maven.plugins:maven-clean-plugin:2.4.1(default-clean)
[TASKS] Scanning folder '<https://builds.apache.org/job/Tika-trunk/ws/trunk/tika-server'> for files matching the pattern '**/*.java' - excludes:
[TASKS] Found 18 files to scan for tasks
Found 0 open tasks.
[TASKS] Computing warning deltas based on reference build #971
mojoStarted org.apache.maven.plugins:maven-remote-resources-plugin:1.2.1(default)
[INFO]
[INFO] --- maven-remote-resources-plugin:1.2.1:process (default) @ tika-server ---
mojoSucceeded org.apache.maven.plugins:maven-remote-resources-plugin:1.2.1(default)
mojoStarted org.apache.maven.plugins:maven-resources-plugin:2.5(default-resources)[debug] execute contextualize
[INFO] Using 'UTF-8' encoding to copy filtered resources.
[INFO] Copying 2 resources
[INFO] Copying 3 resources

[INFO]
[INFO] --- maven-resources-plugin:2.5:resources (default-resources) @ tika-server ---
mojoSucceeded org.apache.maven.plugins:maven-resources-plugin:2.5(default-resources)
mojoStarted org.apache.maven.plugins:maven-compiler-plugin:2.3.2(default-compile)
[INFO]
[INFO] --- maven-compiler-plugin:2.3.2:compile (default-compile) @ tika-server ---
[INFO] Compiling 12 source files to <https://builds.apache.org/job/Tika-trunk/ws/trunk/tika-server/target/classes>
[INFO] -------------------------------------------------------------
[ERROR] COMPILATION ERROR :
[INFO] -------------------------------------------------------------
[ERROR] <https://builds.apache.org/job/Tika-trunk/ws/trunk/tika-server/src/main/java/org/apache/tika/server/CSVMessageBodyWriter.java>:[51,3] method does not override a method from its superclass
mojoFailed org.apache.maven.plugins:maven-compiler-plugin:2.3.2(default-compile)[ERROR] <https://builds.apache.org/job/Tika-trunk/ws/trunk/tika-server/src/main/java/org/apache/tika/server/JSONMessageBodyWriter.java>:[51,3] method does not override a method from its superclass
[INFO] 2 errors
[INFO] -------------------------------------------------------------

projectFailed org.apache.tika:tika-server:1.4-SNAPSHOT
sessionEnded
[INFO] ------------------------------------------------------------------------
[INFO] Reactor Summary:
[INFO]
[INFO] Apache Tika parent ................................ SUCCESS [35.790s]
[INFO] Apache Tika core .................................. SUCCESS [39.088s]
[INFO] Apache Tika parsers ............................... SUCCESS [1:18.123s]
[INFO] Apache Tika XMP ................................... SUCCESS [10.853s]
[INFO] Apache Tika application ........................... SUCCESS [30.858s]
[INFO] Apache Tika OSGi bundle ........................... SUCCESS [32.087s]
[INFO] Apache Tika server ................................ FAILURE [8.703s]
[INFO] Apache Tika ....................................... SKIPPED
[INFO] ------------------------------------------------------------------------
[INFO] BUILD FAILURE
[INFO] ------------------------------------------------------------------------
[INFO] Total time: 4:00.308s
[INFO] Finished at: Mon Jan 28 18:20:28 UTC 2013
[INFO] Final Memory: 46M/327M
[INFO] ------------------------------------------------------------------------
Projects to build: [MavenProject: org.apache.tika:tika-parent:1.4-SNAPSHOT @ <https://builds.apache.org/job/Tika-trunk/ws/trunk/tika-parent/pom.xml,> MavenProject: org.apache.tika:tika-core:1.4-SNAPSHOT @ <https://builds.apache.org/job/Tika-trunk/ws/trunk/tika-core/pom.xml,> MavenProject: org.apache.tika:tika-parsers:1.4-SNAPSHOT @ <https://builds.apache.org/job/Tika-trunk/ws/trunk/tika-parsers/pom.xml,> MavenProject: org.apache.tika:tika-xmp:1.4-SNAPSHOT @ <https://builds.apache.org/job/Tika-trunk/ws/trunk/tika-xmp/pom.xml,> MavenProject: org.apache.tika:tika-app:1.4-SNAPSHOT @ <https://builds.apache.org/job/Tika-trunk/ws/trunk/tika-app/pom.xml,> MavenProject: org.apache.tika:tika-bundle:1.4-SNAPSHOT @ <https://builds.apache.org/job/Tika-trunk/ws/trunk/tika-bundle/pom.xml,> MavenProject: org.apache.tika:tika-server:1.4-SNAPSHOT @ <https://builds.apache.org/job/Tika-trunk/ws/trunk/tika-server/pom.xml,> MavenProject: org.apache.tika:tika:1.4-SNAPSHOT @ <https://builds.apache.org/job/Tika-trunk/ws/trunk/pom.xml]>
[JENKINS] Archiving <https://builds.apache.org/job/Tika-trunk/ws/trunk/pom.xml> to /home/hudson/hudson/jobs/Tika-trunk/modules/org.apache.tika$tika/builds/2013-01-28_18-16-05/archive/org.apache.tika/tika/1.4-SNAPSHOT/tika-1.4-SNAPSHOT.pom
[JENKINS] Archiving <https://builds.apache.org/job/Tika-trunk/ws/trunk/tika-parent/pom.xml> to /home/hudson/hudson/jobs/Tika-trunk/modules/org.apache.tika$tika-parent/builds/2013-01-28_18-16-05/archive/org.apache.tika/tika-parent/1.4-SNAPSHOT/tika-parent-1.4-SNAPSHOT.pom
[JENKINS] Archiving <https://builds.apache.org/job/Tika-trunk/ws/trunk/tika-parsers/pom.xml> to /home/hudson/hudson/jobs/Tika-trunk/modules/org.apache.tika$tika-parsers/builds/2013-01-28_18-16-05/archive/org.apache.tika/tika-parsers/1.4-SNAPSHOT/tika-parsers-1.4-SNAPSHOT.pom
[JENKINS] Archiving <https://builds.apache.org/job/Tika-trunk/ws/trunk/tika-parsers/target/tika-parsers-1.4-SNAPSHOT.jar> to /home/hudson/hudson/jobs/Tika-trunk/modules/org.apache.tika$tika-parsers/builds/2013-01-28_18-16-05/archive/org.apache.tika/tika-parsers/1.4-20130128.181901-6/tika-parsers-1.4-20130128.181901-6.jar
[JENKINS] Archiving <https://builds.apache.org/job/Tika-trunk/ws/trunk/tika-xmp/pom.xml> to /home/hudson/hudson/jobs/Tika-trunk/modules/org.apache.tika$tika-xmp/builds/2013-01-28_18-16-05/archive/org.apache.tika/tika-xmp/1.4-SNAPSHOT/tika-xmp-1.4-SNAPSHOT.pom
[JENKINS] Archiving <https://builds.apache.org/job/Tika-trunk/ws/trunk/tika-xmp/target/tika-xmp-1.4-SNAPSHOT.jar> to /home/hudson/hudson/jobs/Tika-trunk/modules/org.apache.tika$tika-xmp/builds/2013-01-28_18-16-05/archive/org.apache.tika/tika-xmp/1.4-20130128.181913-6/tika-xmp-1.4-20130128.181913-6.jar
[JENKINS] Archiving <https://builds.apache.org/job/Tika-trunk/ws/trunk/tika-app/pom.xml> to /home/hudson/hudson/jobs/Tika-trunk/modules/org.apache.tika$tika-app/builds/2013-01-28_18-16-05/archive/org.apache.tika/tika-app/1.4-SNAPSHOT/tika-app-1.4-SNAPSHOT.pom
[JENKINS] Archiving <https://builds.apache.org/job/Tika-trunk/ws/trunk/tika-app/target/tika-app-1.4-SNAPSHOT.jar> to /home/hudson/hudson/jobs/Tika-trunk/modules/org.apache.tika$tika-app/builds/2013-01-28_18-16-05/archive/org.apache.tika/tika-app/1.4-20130128.181939-6/tika-app-1.4-20130128.181939-6.jar
[JENKINS] Archiving <https://builds.apache.org/job/Tika-trunk/ws/trunk/tika-server/pom.xml> to /home/hudson/hudson/jobs/Tika-trunk/modules/org.apache.tika$tika-server/builds/2013-01-28_18-16-05/archive/org.apache.tika/tika-server/1.4-SNAPSHOT/tika-server-1.4-SNAPSHOT.pom
[JENKINS] Archiving <https://builds.apache.org/job/Tika-trunk/ws/trunk/tika-core/pom.xml> to /home/hudson/hudson/jobs/Tika-trunk/modules/org.apache.tika$tika-core/builds/2013-01-28_18-16-05/archive/org.apache.tika/tika-core/1.4-SNAPSHOT/tika-core-1.4-SNAPSHOT.pom
[JENKINS] Archiving <https://builds.apache.org/job/Tika-trunk/ws/trunk/tika-core/target/tika-core-1.4-SNAPSHOT.jar> to /home/hudson/hudson/jobs/Tika-trunk/modules/org.apache.tika$tika-core/builds/2013-01-28_18-16-05/archive/org.apache.tika/tika-core/1.4-20130128.181743-6/tika-core-1.4-20130128.181743-6.jar
[JENKINS] Archiving <https://builds.apache.org/job/Tika-trunk/ws/trunk/tika-bundle/pom.xml> to /home/hudson/hudson/jobs/Tika-trunk/modules/org.apache.tika$tika-bundle/builds/2013-01-28_18-16-05/archive/org.apache.tika/tika-bundle/1.4-SNAPSHOT/tika-bundle-1.4-SNAPSHOT.pom
[JENKINS] Archiving <https://builds.apache.org/job/Tika-trunk/ws/trunk/tika-bundle/target/tika-bundle-1.4-SNAPSHOT.jar> to /home/hudson/hudson/jobs/Tika-trunk/modules/org.apache.tika$tika-bundle/builds/2013-01-28_18-16-05/archive/org.apache.tika/tika-bundle/1.4-20130128.182013-6/tika-bundle-1.4-20130128.182013-6.jar
Waiting for Jenkins to finish collecting data
mavenExecutionResult exceptions not empty
message : Failed to execute goal org.apache.maven.plugins:maven-compiler-plugin:2.3.2:compile (default-compile) on project tika-server: Compilation failure
cause : Compilation failure
Stack trace :
org.apache.maven.lifecycle.LifecycleExecutionException: Failed to execute goal org.apache.maven.plugins:maven-compiler-plugin:2.3.2:compile (default-compile) on project tika-server: Compilation failure
        at org.apache.maven.lifecycle.internal.MojoExecutor.execute(MojoExecutor.java:213)
        at org.apache.maven.lifecycle.internal.MojoExecutor.execute(MojoExecutor.java:153)
        at org.apache.maven.lifecycle.internal.MojoExecutor.execute(MojoExecutor.java:145)
        at org.apache.maven.lifecycle.internal.LifecycleModuleBuilder.buildProject(LifecycleModuleBuilder.java:84)
        at org.apache.maven.lifecycle.internal.LifecycleModuleBuilder.buildProject(LifecycleModuleBuilder.java:59)
        at org.apache.maven.lifecycle.internal.LifecycleStarter.singleThreadedBuild(LifecycleStarter.java:183)
        at org.apache.maven.lifecycle.internal.LifecycleStarter.execute(LifecycleStarter.java:161)
        at org.apache.maven.DefaultMaven.doExecute(DefaultMaven.java:320)
        at org.apache.maven.DefaultMaven.execute(DefaultMaven.java:156)
        at org.jvnet.hudson.maven3.launcher.Maven3Launcher.main(Maven3Launcher.java:79)
        at sun.reflect.NativeMethodAccessorImpl.invoke0(Native Method)
        at sun.reflect.NativeMethodAccessorImpl.invoke(NativeMethodAccessorImpl.java:39)
        at sun.reflect.DelegatingMethodAccessorImpl.invoke(DelegatingMethodAccessorImpl.java:25)
        at java.lang.reflect.Method.invoke(Method.java:592)
        at org.codehaus.plexus.classworlds.launcher.Launcher.launchStandard(Launcher.java:329)
        at org.codehaus.plexus.classworlds.launcher.Launcher.launch(Launcher.java:239)
        at org.jvnet.hudson.maven3.agent.Maven3Main.launch(Maven3Main.java:158)
        at hudson.maven.Maven3Builder.call(Maven3Builder.java:100)
        at hudson.maven.Maven3Builder.call(Maven3Builder.java:66)
        at hudson.remoting.UserRequest.perform(UserRequest.java:118)
        at hudson.remoting.UserRequest.perform(UserRequest.java:48)
        at hudson.remoting.Request$2.run(Request.java:326)
        at hudson.remoting.InterceptingExecutorService$1.call(InterceptingExecutorService.java:72)
        at java.util.concurrent.FutureTask$Sync.innerRun(FutureTask.java:269)
        at java.util.concurrent.FutureTask.run(FutureTask.java:123)
        at java.util.concurrent.ThreadPoolExecutor$Worker.runTask(ThreadPoolExecutor.java:651)
        at java.util.concurrent.ThreadPoolExecutor$Worker.run(ThreadPoolExecutor.java:676)
        at java.lang.Thread.run(Thread.java:595)
Caused by: org.apache.maven.plugin.CompilationFailureException: Compilation failure
        at org.apache.maven.plugin.AbstractCompilerMojo.execute(AbstractCompilerMojo.java:656)
        at org.apache.maven.plugin.CompilerMojo.execute(CompilerMojo.java:128)
        at org.apache.maven.plugin.DefaultBuildPluginManager.executeMojo(DefaultBuildPluginManager.java:101)
        at org.apache.maven.lifecycle.internal.MojoExecutor.execute(MojoExecutor.java:209)
        ... 27 more
channel stopped
Reply | Threaded
Open this post in threaded view
|

Build failed in Jenkins: Tika-trunk #974

Apache Jenkins Server-2
See <https://builds.apache.org/job/Tika-trunk/974/changes>

Changes:

[nick] FileMaker Pro mime entry from Marco Quaranta from TIKA-1061

[nick] Support tika:link and tika:uti mimetype extensions, along with unit tests. Modified version of the patch from TIKA-1012

[nick] TIKA-1076 Upgrade to Apache POI 3.9. Commit disables some HSLF related unit test checks, they need re-enabling along with a fix soon

------------------------------------------
[...truncated 851 lines...]
[INFO] Installing <https://builds.apache.org/job/Tika-trunk/ws/trunk/tika-app/pom.xml> to /home/jenkins/jenkins-slave/maven-repositories/1/org/apache/tika/tika-app/1.4-SNAPSHOT/tika-app-1.4-SNAPSHOT.pom
mojoSucceeded org.apache.maven.plugins:maven-install-plugin:2.3.1(default-install)
mojoStarted org.apache.maven.plugins:maven-deploy-plugin:2.6(default-deploy)
[INFO]
Downloading: https://repository.apache.org/content/repositories/snapshots/org/apache/tika/tika-app/1.4-SNAPSHOT/maven-metadata.xml
[INFO] --- maven-deploy-plugin:2.6:deploy (default-deploy) @ tika-app ---
Downloaded: https://repository.apache.org/content/repositories/snapshots/org/apache/tika/tika-app/1.4-SNAPSHOT/maven-metadata.xml (767 B at 3.2 KB/sec)
Uploading: https://repository.apache.org/content/repositories/snapshots/org/apache/tika/tika-app/1.4-SNAPSHOT/tika-app-1.4-20130204.191027-7.jar
Uploaded: https://repository.apache.org/content/repositories/snapshots/org/apache/tika/tika-app/1.4-SNAPSHOT/tika-app-1.4-20130204.191027-7.jar (27284 KB at 24425.7 KB/sec)
Uploading: https://repository.apache.org/content/repositories/snapshots/org/apache/tika/tika-app/1.4-SNAPSHOT/tika-app-1.4-20130204.191027-7.pom
Uploaded: https://repository.apache.org/content/repositories/snapshots/org/apache/tika/tika-app/1.4-SNAPSHOT/tika-app-1.4-20130204.191027-7.pom (8 KB at 125.1 KB/sec)
Downloading: https://repository.apache.org/content/repositories/snapshots/org/apache/tika/tika-app/maven-metadata.xml
Downloaded: https://repository.apache.org/content/repositories/snapshots/org/apache/tika/tika-app/maven-metadata.xml (339 B at 1.1 KB/sec)
Uploading: https://repository.apache.org/content/repositories/snapshots/org/apache/tika/tika-app/1.4-SNAPSHOT/maven-metadata.xml
Uploaded: https://repository.apache.org/content/repositories/snapshots/org/apache/tika/tika-app/1.4-SNAPSHOT/maven-metadata.xml (767 B at 10.7 KB/sec)
Uploading: https://repository.apache.org/content/repositories/snapshots/org/apache/tika/tika-app/maven-metadata.xml
Uploaded: https://repository.apache.org/content/repositories/snapshots/org/apache/tika/tika-app/maven-metadata.xml (339 B at 0.6 KB/sec)
mojoSucceeded org.apache.maven.plugins:maven-deploy-plugin:2.6(default-deploy)
projectSucceeded org.apache.tika:tika-app:1.4-SNAPSHOT
projectStarted org.apache.tika:tika-bundle:1.4-SNAPSHOT
[INFO]                                                                        
[INFO] ------------------------------------------------------------------------
[INFO] Building Apache Tika OSGi bundle 1.4-SNAPSHOT
[INFO] ------------------------------------------------------------------------
mojoStarted org.apache.maven.plugins:maven-clean-plugin:2.4.1(default-clean)[INFO] Deleting <https://builds.apache.org/job/Tika-trunk/ws/trunk/tika-bundle/target>

[INFO]
[INFO] --- maven-clean-plugin:2.4.1:clean (default-clean) @ tika-bundle ---
mojoSucceeded org.apache.maven.plugins:maven-clean-plugin:2.4.1(default-clean)
[TASKS] Scanning folder '<https://builds.apache.org/job/Tika-trunk/ws/trunk/tika-bundle'> for files matching the pattern '**/*.java' - excludes:
[TASKS] Found 1 files to scan for tasks
Found 0 open tasks.
[TASKS] Computing warning deltas based on reference build #973
mojoStarted org.apache.maven.plugins:maven-remote-resources-plugin:1.2.1(default)
[INFO]
[INFO] --- maven-remote-resources-plugin:1.2.1:process (default) @ tika-bundle ---
mojoSucceeded org.apache.maven.plugins:maven-remote-resources-plugin:1.2.1(default)
[debug] execute contextualize
mojoStarted org.apache.maven.plugins:maven-resources-plugin:2.5(default-resources)[INFO] Using 'UTF-8' encoding to copy filtered resources.
[INFO] skip non existing resourceDirectory <https://builds.apache.org/job/Tika-trunk/ws/trunk/tika-bundle/src/main/resources>
[INFO] Copying 3 resources

[INFO]
[INFO] --- maven-resources-plugin:2.5:resources (default-resources) @ tika-bundle ---
mojoSucceeded org.apache.maven.plugins:maven-resources-plugin:2.5(default-resources)
[INFO] No sources to compile
mojoStarted org.apache.maven.plugins:maven-compiler-plugin:2.3.2(default-compile)
[INFO]
[INFO] --- maven-compiler-plugin:2.3.2:compile (default-compile) @ tika-bundle ---
mojoSucceeded org.apache.maven.plugins:maven-compiler-plugin:2.3.2(default-compile)
[debug] execute contextualize
[INFO] Using 'UTF-8' encoding to copy filtered resources.
mojoStarted org.apache.maven.plugins:maven-resources-plugin:2.5(default-testResources)[INFO] Copying 1 resource
[INFO] Copying 3 resources

[INFO]
[INFO] --- maven-resources-plugin:2.5:testResources (default-testResources) @ tika-bundle ---
mojoSucceeded org.apache.maven.plugins:maven-resources-plugin:2.5(default-testResources)
mojoStarted org.apache.maven.plugins:maven-compiler-plugin:2.3.2(default-testCompile)
[INFO]
[INFO] --- maven-compiler-plugin:2.3.2:testCompile (default-testCompile) @ tika-bundle ---
[INFO] Compiling 1 source file to <https://builds.apache.org/job/Tika-trunk/ws/trunk/tika-bundle/target/test-classes>
mojoSucceeded org.apache.maven.plugins:maven-compiler-plugin:2.3.2(default-testCompile)
mojoStarted org.apache.maven.plugins:maven-surefire-plugin:2.12(default-test)[INFO] Surefire report directory: <https://builds.apache.org/job/Tika-trunk/ws/trunk/tika-bundle/target/surefire-reports>

[INFO]

-------------------------------------------------------
 T E S T S
-------------------------------------------------------
[INFO] --- maven-surefire-plugin:2.12:test (default-test) @ tika-bundle ---

Results :

Tests run: 0, Failures: 0, Errors: 0, Skipped: 0

mojoSucceeded org.apache.maven.plugins:maven-surefire-plugin:2.12(default-test)
[JENKINS] Recording test results
mojoStarted org.apache.maven.plugins:maven-dependency-plugin:2.1(default)
[INFO]
[INFO] --- maven-dependency-plugin:2.1:unpack-dependencies (default) @ tika-bundle ---
[INFO] Unpacking /home/jenkins/jenkins-slave/maven-repositories/1/edu/ucar/netcdf/4.2-min/netcdf-4.2-min.jar to
  <https://builds.apache.org/job/Tika-trunk/ws/trunk/tika-bundle/target/classes>
   with includes null and excludes:ucar/nc2/iosp/fysat/Fysat*.class,
                ucar/nc2/dataset/transform/VOceanSG1*class,
                ucar/unidata/geoloc/vertical/OceanSG*.class,
                META-INF/**,CHANGES,README
mojoSucceeded org.apache.maven.plugins:maven-dependency-plugin:2.1(default)
mojoStarted org.apache.felix:maven-bundle-plugin:2.3.4(default-bundle)
[INFO]
[INFO] --- maven-bundle-plugin:2.3.4:bundle (default-bundle) @ tika-bundle ---
[WARNING] Embed-Dependency: clause "commons-io" did not match any dependencies
mojoSucceeded org.apache.felix:maven-bundle-plugin:2.3.4(default-bundle)
mojoStarted org.apache.maven.plugins:maven-site-plugin:3.0(attach-descriptor)
[INFO]
[INFO] --- maven-site-plugin:3.0:attach-descriptor (attach-descriptor) @ tika-bundle ---
mojoSucceeded org.apache.maven.plugins:maven-site-plugin:3.0(attach-descriptor)
mojoStarted org.apache.rat:apache-rat-plugin:0.7(default)[INFO] No excludes

[INFO]
[INFO] --- apache-rat-plugin:0.7:check (default) @ tika-bundle ---
mojoSucceeded org.apache.rat:apache-rat-plugin:0.7(default)
[PMD] No report found for mojo check
mojoStarted org.apache.maven.plugins:maven-install-plugin:2.3.1(default-install)[INFO] Installing <https://builds.apache.org/job/Tika-trunk/ws/trunk/tika-bundle/target/tika-bundle-1.4-SNAPSHOT.jar> to /home/jenkins/jenkins-slave/maven-repositories/1/org/apache/tika/tika-bundle/1.4-SNAPSHOT/tika-bundle-1.4-SNAPSHOT.jar

[INFO]
[INFO] --- maven-install-plugin:2.3.1:install (default-install) @ tika-bundle ---
[INFO] Installing <https://builds.apache.org/job/Tika-trunk/ws/trunk/tika-bundle/pom.xml> to /home/jenkins/jenkins-slave/maven-repositories/1/org/apache/tika/tika-bundle/1.4-SNAPSHOT/tika-bundle-1.4-SNAPSHOT.pom
mojoSucceeded org.apache.maven.plugins:maven-install-plugin:2.3.1(default-install)
mojoStarted org.apache.felix:maven-bundle-plugin:2.3.4(default-install)[INFO] Local OBR update disabled (enable with -DobrRepository)

[INFO]
[INFO] --- maven-bundle-plugin:2.3.4:install (default-install) @ tika-bundle ---
mojoSucceeded org.apache.felix:maven-bundle-plugin:2.3.4(default-install)
mojoStarted org.apache.maven.plugins:maven-deploy-plugin:2.6(default-deploy)Downloading: https://repository.apache.org/content/repositories/snapshots/org/apache/tika/tika-bundle/1.4-SNAPSHOT/maven-metadata.xml

[INFO]
[INFO] --- maven-deploy-plugin:2.6:deploy (default-deploy) @ tika-bundle ---
Downloaded: https://repository.apache.org/content/repositories/snapshots/org/apache/tika/tika-bundle/1.4-SNAPSHOT/maven-metadata.xml (770 B at 6.5 KB/sec)
Uploading: https://repository.apache.org/content/repositories/snapshots/org/apache/tika/tika-bundle/1.4-SNAPSHOT/tika-bundle-1.4-20130204.191041-7.jar
Uploaded: https://repository.apache.org/content/repositories/snapshots/org/apache/tika/tika-bundle/1.4-SNAPSHOT/tika-bundle-1.4-20130204.191041-7.jar (22129 KB at 27118.7 KB/sec)
Uploading: https://repository.apache.org/content/repositories/snapshots/org/apache/tika/tika-bundle/1.4-SNAPSHOT/tika-bundle-1.4-20130204.191041-7.pom
Uploaded: https://repository.apache.org/content/repositories/snapshots/org/apache/tika/tika-bundle/1.4-SNAPSHOT/tika-bundle-1.4-20130204.191041-7.pom (11 KB at 109.5 KB/sec)
Downloading: https://repository.apache.org/content/repositories/snapshots/org/apache/tika/tika-bundle/maven-metadata.xml
Downloaded: https://repository.apache.org/content/repositories/snapshots/org/apache/tika/tika-bundle/maven-metadata.xml (342 B at 4.2 KB/sec)
Uploading: https://repository.apache.org/content/repositories/snapshots/org/apache/tika/tika-bundle/1.4-SNAPSHOT/maven-metadata.xml
Uploaded: https://repository.apache.org/content/repositories/snapshots/org/apache/tika/tika-bundle/1.4-SNAPSHOT/maven-metadata.xml (770 B at 12.7 KB/sec)
Uploading: https://repository.apache.org/content/repositories/snapshots/org/apache/tika/tika-bundle/maven-metadata.xml
Uploaded: https://repository.apache.org/content/repositories/snapshots/org/apache/tika/tika-bundle/maven-metadata.xml (342 B at 2.8 KB/sec)
mojoSucceeded org.apache.maven.plugins:maven-deploy-plugin:2.6(default-deploy)
mojoStarted org.apache.felix:maven-bundle-plugin:2.3.4(default-deploy)[INFO] Remote OBR update disabled (enable with -DremoteOBR)

[INFO]
[INFO] --- maven-bundle-plugin:2.3.4:deploy (default-deploy) @ tika-bundle ---
mojoSucceeded org.apache.felix:maven-bundle-plugin:2.3.4(default-deploy)
projectSucceeded org.apache.tika:tika-bundle:1.4-SNAPSHOT
projectStarted org.apache.tika:tika-server:1.4-SNAPSHOT
[INFO]                                                                        
[INFO] ------------------------------------------------------------------------
[INFO] Building Apache Tika server 1.4-SNAPSHOT
[INFO] ------------------------------------------------------------------------
mojoStarted org.apache.maven.plugins:maven-clean-plugin:2.4.1(default-clean)[INFO] Deleting <https://builds.apache.org/job/Tika-trunk/ws/trunk/tika-server/target>

[INFO]
[INFO] --- maven-clean-plugin:2.4.1:clean (default-clean) @ tika-server ---
mojoSucceeded org.apache.maven.plugins:maven-clean-plugin:2.4.1(default-clean)
[TASKS] Scanning folder '<https://builds.apache.org/job/Tika-trunk/ws/trunk/tika-server'> for files matching the pattern '**/*.java' - excludes:
[TASKS] Found 18 files to scan for tasks
Found 0 open tasks.
[TASKS] Computing warning deltas based on reference build #971
mojoStarted org.apache.maven.plugins:maven-remote-resources-plugin:1.2.1(default)
[INFO]
[INFO] --- maven-remote-resources-plugin:1.2.1:process (default) @ tika-server ---
mojoSucceeded org.apache.maven.plugins:maven-remote-resources-plugin:1.2.1(default)
[debug] execute contextualize
mojoStarted org.apache.maven.plugins:maven-resources-plugin:2.5(default-resources)[INFO] Using 'UTF-8' encoding to copy filtered resources.

[INFO]
[INFO] --- maven-resources-plugin:2.5:resources (default-resources) @ tika-server ---
[INFO] Copying 2 resources
[INFO] Copying 3 resources
mojoSucceeded org.apache.maven.plugins:maven-resources-plugin:2.5(default-resources)
mojoStarted org.apache.maven.plugins:maven-compiler-plugin:2.3.2(default-compile)
[INFO]
[INFO] --- maven-compiler-plugin:2.3.2:compile (default-compile) @ tika-server ---
[INFO] Compiling 12 source files to <https://builds.apache.org/job/Tika-trunk/ws/trunk/tika-server/target/classes>
[INFO] -------------------------------------------------------------
[ERROR] COMPILATION ERROR :
[INFO] -------------------------------------------------------------
[ERROR] <https://builds.apache.org/job/Tika-trunk/ws/trunk/tika-server/src/main/java/org/apache/tika/server/CSVMessageBodyWriter.java>:[51,3] method does not override a method from its superclass
[ERROR] <https://builds.apache.org/job/Tika-trunk/ws/trunk/tika-server/src/main/java/org/apache/tika/server/JSONMessageBodyWriter.java>:[51,3] method does not override a method from its superclass
[INFO] 2 errors
[INFO] -------------------------------------------------------------
mojoFailed org.apache.maven.plugins:maven-compiler-plugin:2.3.2(default-compile)
projectFailed org.apache.tika:tika-server:1.4-SNAPSHOT
sessionEnded
[INFO] ------------------------------------------------------------------------
[INFO] Reactor Summary:
[INFO]
[INFO] Apache Tika parent ................................ SUCCESS [11.690s]
[INFO] Apache Tika core .................................. SUCCESS [19.501s]
[INFO] Apache Tika parsers ............................... SUCCESS [40.109s]
[INFO] Apache Tika XMP ................................... SUCCESS [3.888s]
[INFO] Apache Tika application ........................... SUCCESS [15.126s]
[INFO] Apache Tika OSGi bundle ........................... SUCCESS [12.586s]
[INFO] Apache Tika server ................................ FAILURE [2.331s]
[INFO] Apache Tika ....................................... SKIPPED
[INFO] ------------------------------------------------------------------------
[INFO] BUILD FAILURE
[INFO] ------------------------------------------------------------------------
[INFO] Total time: 1:47.564s
[INFO] Finished at: Mon Feb 04 19:10:45 GMT 2013
[INFO] Final Memory: 51M/439M
[INFO] ------------------------------------------------------------------------
Projects to build: [MavenProject: org.apache.tika:tika-parent:1.4-SNAPSHOT @ <https://builds.apache.org/job/Tika-trunk/ws/trunk/tika-parent/pom.xml,> MavenProject: org.apache.tika:tika-core:1.4-SNAPSHOT @ <https://builds.apache.org/job/Tika-trunk/ws/trunk/tika-core/pom.xml,> MavenProject: org.apache.tika:tika-parsers:1.4-SNAPSHOT @ <https://builds.apache.org/job/Tika-trunk/ws/trunk/tika-parsers/pom.xml,> MavenProject: org.apache.tika:tika-xmp:1.4-SNAPSHOT @ <https://builds.apache.org/job/Tika-trunk/ws/trunk/tika-xmp/pom.xml,> MavenProject: org.apache.tika:tika-app:1.4-SNAPSHOT @ <https://builds.apache.org/job/Tika-trunk/ws/trunk/tika-app/pom.xml,> MavenProject: org.apache.tika:tika-bundle:1.4-SNAPSHOT @ <https://builds.apache.org/job/Tika-trunk/ws/trunk/tika-bundle/pom.xml,> MavenProject: org.apache.tika:tika-server:1.4-SNAPSHOT @ <https://builds.apache.org/job/Tika-trunk/ws/trunk/tika-server/pom.xml,> MavenProject: org.apache.tika:tika:1.4-SNAPSHOT @ <https://builds.apache.org/job/Tika-trunk/ws/trunk/pom.xml]>
[JENKINS] Archiving <https://builds.apache.org/job/Tika-trunk/ws/trunk/pom.xml> to /home/hudson/hudson/jobs/Tika-trunk/modules/org.apache.tika$tika/builds/2013-02-04_19-08-48/archive/org.apache.tika/tika/1.4-SNAPSHOT/tika-1.4-SNAPSHOT.pom
[JENKINS] Archiving <https://builds.apache.org/job/Tika-trunk/ws/trunk/tika-parent/pom.xml> to /home/hudson/hudson/jobs/Tika-trunk/modules/org.apache.tika$tika-parent/builds/2013-02-04_19-08-48/archive/org.apache.tika/tika-parent/1.4-SNAPSHOT/tika-parent-1.4-SNAPSHOT.pom
[JENKINS] Archiving <https://builds.apache.org/job/Tika-trunk/ws/trunk/tika-parsers/pom.xml> to /home/hudson/hudson/jobs/Tika-trunk/modules/org.apache.tika$tika-parsers/builds/2013-02-04_19-08-48/archive/org.apache.tika/tika-parsers/1.4-SNAPSHOT/tika-parsers-1.4-SNAPSHOT.pom
[JENKINS] Archiving <https://builds.apache.org/job/Tika-trunk/ws/trunk/tika-parsers/target/tika-parsers-1.4-SNAPSHOT.jar> to /home/hudson/hudson/jobs/Tika-trunk/modules/org.apache.tika$tika-parsers/builds/2013-02-04_19-08-48/archive/org.apache.tika/tika-parsers/1.4-20130204.191010-7/tika-parsers-1.4-20130204.191010-7.jar
[JENKINS] Archiving <https://builds.apache.org/job/Tika-trunk/ws/trunk/tika-xmp/pom.xml> to /home/hudson/hudson/jobs/Tika-trunk/modules/org.apache.tika$tika-xmp/builds/2013-02-04_19-08-48/archive/org.apache.tika/tika-xmp/1.4-SNAPSHOT/tika-xmp-1.4-SNAPSHOT.pom
[JENKINS] Archiving <https://builds.apache.org/job/Tika-trunk/ws/trunk/tika-xmp/target/tika-xmp-1.4-SNAPSHOT.jar> to /home/hudson/hudson/jobs/Tika-trunk/modules/org.apache.tika$tika-xmp/builds/2013-02-04_19-08-48/archive/org.apache.tika/tika-xmp/1.4-20130204.191014-7/tika-xmp-1.4-20130204.191014-7.jar
[JENKINS] Archiving <https://builds.apache.org/job/Tika-trunk/ws/trunk/tika-app/pom.xml> to /home/hudson/hudson/jobs/Tika-trunk/modules/org.apache.tika$tika-app/builds/2013-02-04_19-08-48/archive/org.apache.tika/tika-app/1.4-SNAPSHOT/tika-app-1.4-SNAPSHOT.pom
[JENKINS] Archiving <https://builds.apache.org/job/Tika-trunk/ws/trunk/tika-app/target/tika-app-1.4-SNAPSHOT.jar> to /home/hudson/hudson/jobs/Tika-trunk/modules/org.apache.tika$tika-app/builds/2013-02-04_19-08-48/archive/org.apache.tika/tika-app/1.4-20130204.191027-7/tika-app-1.4-20130204.191027-7.jar
[JENKINS] Archiving <https://builds.apache.org/job/Tika-trunk/ws/trunk/tika-server/pom.xml> to /home/hudson/hudson/jobs/Tika-trunk/modules/org.apache.tika$tika-server/builds/2013-02-04_19-08-48/archive/org.apache.tika/tika-server/1.4-SNAPSHOT/tika-server-1.4-SNAPSHOT.pom
[JENKINS] Archiving <https://builds.apache.org/job/Tika-trunk/ws/trunk/tika-core/pom.xml> to /home/hudson/hudson/jobs/Tika-trunk/modules/org.apache.tika$tika-core/builds/2013-02-04_19-08-48/archive/org.apache.tika/tika-core/1.4-SNAPSHOT/tika-core-1.4-SNAPSHOT.pom
[JENKINS] Archiving <https://builds.apache.org/job/Tika-trunk/ws/trunk/tika-core/target/tika-core-1.4-SNAPSHOT.jar> to /home/hudson/hudson/jobs/Tika-trunk/modules/org.apache.tika$tika-core/builds/2013-02-04_19-08-48/archive/org.apache.tika/tika-core/1.4-20130204.190929-7/tika-core-1.4-20130204.190929-7.jar
[JENKINS] Archiving <https://builds.apache.org/job/Tika-trunk/ws/trunk/tika-bundle/pom.xml> to /home/hudson/hudson/jobs/Tika-trunk/modules/org.apache.tika$tika-bundle/builds/2013-02-04_19-08-48/archive/org.apache.tika/tika-bundle/1.4-SNAPSHOT/tika-bundle-1.4-SNAPSHOT.pom
[JENKINS] Archiving <https://builds.apache.org/job/Tika-trunk/ws/trunk/tika-bundle/target/tika-bundle-1.4-SNAPSHOT.jar> to /home/hudson/hudson/jobs/Tika-trunk/modules/org.apache.tika$tika-bundle/builds/2013-02-04_19-08-48/archive/org.apache.tika/tika-bundle/1.4-20130204.191041-7/tika-bundle-1.4-20130204.191041-7.jar
Waiting for Jenkins to finish collecting data
mavenExecutionResult exceptions not empty
message : Failed to execute goal org.apache.maven.plugins:maven-compiler-plugin:2.3.2:compile (default-compile) on project tika-server: Compilation failure
cause : Compilation failure
Stack trace :
org.apache.maven.lifecycle.LifecycleExecutionException: Failed to execute goal org.apache.maven.plugins:maven-compiler-plugin:2.3.2:compile (default-compile) on project tika-server: Compilation failure
        at org.apache.maven.lifecycle.internal.MojoExecutor.execute(MojoExecutor.java:213)
        at org.apache.maven.lifecycle.internal.MojoExecutor.execute(MojoExecutor.java:153)
        at org.apache.maven.lifecycle.internal.MojoExecutor.execute(MojoExecutor.java:145)
        at org.apache.maven.lifecycle.internal.LifecycleModuleBuilder.buildProject(LifecycleModuleBuilder.java:84)
        at org.apache.maven.lifecycle.internal.LifecycleModuleBuilder.buildProject(LifecycleModuleBuilder.java:59)
        at org.apache.maven.lifecycle.internal.LifecycleStarter.singleThreadedBuild(LifecycleStarter.java:183)
        at org.apache.maven.lifecycle.internal.LifecycleStarter.execute(LifecycleStarter.java:161)
        at org.apache.maven.DefaultMaven.doExecute(DefaultMaven.java:320)
        at org.apache.maven.DefaultMaven.execute(DefaultMaven.java:156)
        at org.jvnet.hudson.maven3.launcher.Maven3Launcher.main(Maven3Launcher.java:79)
        at sun.reflect.NativeMethodAccessorImpl.invoke0(Native Method)
        at sun.reflect.NativeMethodAccessorImpl.invoke(NativeMethodAccessorImpl.java:39)
        at sun.reflect.DelegatingMethodAccessorImpl.invoke(DelegatingMethodAccessorImpl.java:25)
        at java.lang.reflect.Method.invoke(Method.java:592)
        at org.codehaus.plexus.classworlds.launcher.Launcher.launchStandard(Launcher.java:329)
        at org.codehaus.plexus.classworlds.launcher.Launcher.launch(Launcher.java:239)
        at org.jvnet.hudson.maven3.agent.Maven3Main.launch(Maven3Main.java:158)
        at hudson.maven.Maven3Builder.call(Maven3Builder.java:100)
        at hudson.maven.Maven3Builder.call(Maven3Builder.java:66)
        at hudson.remoting.UserRequest.perform(UserRequest.java:118)
        at hudson.remoting.UserRequest.perform(UserRequest.java:48)
        at hudson.remoting.Request$2.run(Request.java:326)
        at hudson.remoting.InterceptingExecutorService$1.call(InterceptingExecutorService.java:72)
        at java.util.concurrent.FutureTask$Sync.innerRun(FutureTask.java:269)
        at java.util.concurrent.FutureTask.run(FutureTask.java:123)
        at java.util.concurrent.ThreadPoolExecutor$Worker.runTask(ThreadPoolExecutor.java:651)
        at java.util.concurrent.ThreadPoolExecutor$Worker.run(ThreadPoolExecutor.java:676)
        at java.lang.Thread.run(Thread.java:595)
Caused by: org.apache.maven.plugin.CompilationFailureException: Compilation failure
        at org.apache.maven.plugin.AbstractCompilerMojo.execute(AbstractCompilerMojo.java:656)
        at org.apache.maven.plugin.CompilerMojo.execute(CompilerMojo.java:128)
        at org.apache.maven.plugin.DefaultBuildPluginManager.executeMojo(DefaultBuildPluginManager.java:101)
        at org.apache.maven.lifecycle.internal.MojoExecutor.execute(MojoExecutor.java:209)
        ... 27 more
channel stopped
Reply | Threaded
Open this post in threaded view
|

Build failed in Jenkins: Tika-trunk #975

Apache Jenkins Server-2
See <https://builds.apache.org/job/Tika-trunk/975/changes>

Changes:

[nick] Apply patch from Oliver Heger from TIKA-991 - Re-work MP3 parser to capture audio duration by processing more of the audio frames

[nick] TIKA-991 Enable the DURATION property

------------------------------------------
[...truncated 56 lines...]
[INFO]
[INFO] --- apache-rat-plugin:0.7:check (default) @ tika-parent ---
[INFO] No excludes
mojoSucceeded org.apache.rat:apache-rat-plugin:0.7(default)
[PMD] No report found for mojo check
mojoStarted org.apache.maven.plugins:maven-install-plugin:2.3.1(default-install)
[INFO]
[INFO] --- maven-install-plugin:2.3.1:install (default-install) @ tika-parent ---
[INFO] Installing <https://builds.apache.org/job/Tika-trunk/ws/trunk/tika-parent/pom.xml> to /home/jenkins/jenkins-slave/maven-repositories/0/org/apache/tika/tika-parent/1.4-SNAPSHOT/tika-parent-1.4-SNAPSHOT.pom
mojoSucceeded org.apache.maven.plugins:maven-install-plugin:2.3.1(default-install)
mojoStarted org.apache.maven.plugins:maven-deploy-plugin:2.6(default-deploy)
[INFO]
[INFO] --- maven-deploy-plugin:2.6:deploy (default-deploy) @ tika-parent ---
Downloading: https://repository.apache.org/content/repositories/snapshots/org/apache/tika/tika-parent/1.4-SNAPSHOT/maven-metadata.xml
Downloaded: https://repository.apache.org/content/repositories/snapshots/org/apache/tika/tika-parent/1.4-SNAPSHOT/maven-metadata.xml (599 B at 1.4 KB/sec)
Uploading: https://repository.apache.org/content/repositories/snapshots/org/apache/tika/tika-parent/1.4-SNAPSHOT/tika-parent-1.4-20130205.022930-8.pom
Uploaded: https://repository.apache.org/content/repositories/snapshots/org/apache/tika/tika-parent/1.4-SNAPSHOT/tika-parent-1.4-20130205.022930-8.pom (10 KB at 74.0 KB/sec)
Downloading: https://repository.apache.org/content/repositories/snapshots/org/apache/tika/tika-parent/maven-metadata.xml
Downloaded: https://repository.apache.org/content/repositories/snapshots/org/apache/tika/tika-parent/maven-metadata.xml (342 B at 3.2 KB/sec)
Uploading: https://repository.apache.org/content/repositories/snapshots/org/apache/tika/tika-parent/1.4-SNAPSHOT/maven-metadata.xml
Uploaded: https://repository.apache.org/content/repositories/snapshots/org/apache/tika/tika-parent/1.4-SNAPSHOT/maven-metadata.xml (599 B at 6.8 KB/sec)
Uploading: https://repository.apache.org/content/repositories/snapshots/org/apache/tika/tika-parent/maven-metadata.xml
Uploaded: https://repository.apache.org/content/repositories/snapshots/org/apache/tika/tika-parent/maven-metadata.xml (342 B at 3.2 KB/sec)
mojoSucceeded org.apache.maven.plugins:maven-deploy-plugin:2.6(default-deploy)
projectSucceeded org.apache.tika:tika-parent:1.4-SNAPSHOT
projectStarted org.apache.tika:tika-core:1.4-SNAPSHOT
[INFO]                                                                        
[INFO] ------------------------------------------------------------------------
[INFO] Building Apache Tika core 1.4-SNAPSHOT
[INFO] ------------------------------------------------------------------------
mojoStarted org.apache.maven.plugins:maven-clean-plugin:2.4.1(default-clean)
[INFO]
[INFO] Deleting <https://builds.apache.org/job/Tika-trunk/ws/trunk/tika-core/target>
[INFO] --- maven-clean-plugin:2.4.1:clean (default-clean) @ tika-core ---
mojoSucceeded org.apache.maven.plugins:maven-clean-plugin:2.4.1(default-clean)
[TASKS] Scanning folder '<https://builds.apache.org/job/Tika-trunk/ws/trunk/tika-core'> for files matching the pattern '**/*.java' - excludes:
[TASKS] Found 212 files to scan for tasks
Found 37 open tasks.
[TASKS] Computing warning deltas based on reference build #974
mojoStarted org.apache.maven.plugins:maven-remote-resources-plugin:1.2.1(default)
[INFO]
[INFO] --- maven-remote-resources-plugin:1.2.1:process (default) @ tika-core ---
mojoSucceeded org.apache.maven.plugins:maven-remote-resources-plugin:1.2.1(default)
mojoStarted org.apache.maven.plugins:maven-resources-plugin:2.5(default-resources)
[INFO]
[INFO] --- maven-resources-plugin:2.5:resources (default-resources) @ tika-core ---
[debug] execute contextualize
[INFO] Using 'UTF-8' encoding to copy filtered resources.
[INFO] Copying 29 resources
[INFO] Copying 3 resources
mojoSucceeded org.apache.maven.plugins:maven-resources-plugin:2.5(default-resources)
mojoStarted org.apache.maven.plugins:maven-compiler-plugin:2.3.2(default-compile)
[INFO]
[INFO] --- maven-compiler-plugin:2.3.2:compile (default-compile) @ tika-core ---
[INFO] Compiling 176 source files to <https://builds.apache.org/job/Tika-trunk/ws/trunk/tika-core/target/classes>
mojoSucceeded org.apache.maven.plugins:maven-compiler-plugin:2.3.2(default-compile)
mojoStarted org.apache.maven.plugins:maven-resources-plugin:2.5(default-testResources)[debug] execute contextualize
[INFO] Using 'UTF-8' encoding to copy filtered resources.

[INFO]
[INFO] --- maven-resources-plugin:2.5:testResources (default-testResources) @ tika-core ---
[INFO] Copying 36 resources
[INFO] Copying 3 resources
mojoSucceeded org.apache.maven.plugins:maven-resources-plugin:2.5(default-testResources)
mojoStarted org.apache.maven.plugins:maven-compiler-plugin:2.3.2(default-testCompile)
[INFO]
[INFO] --- maven-compiler-plugin:2.3.2:testCompile (default-testCompile) @ tika-core ---
[INFO] Compiling 36 source files to <https://builds.apache.org/job/Tika-trunk/ws/trunk/tika-core/target/test-classes>
mojoSucceeded org.apache.maven.plugins:maven-compiler-plugin:2.3.2(default-testCompile)
mojoStarted org.apache.maven.plugins:maven-surefire-plugin:2.12(default-test)
[INFO]
[INFO] --- maven-surefire-plugin:2.12:test (default-test) @ tika-core ---
[INFO] Surefire report directory: <https://builds.apache.org/job/Tika-trunk/ws/trunk/tika-core/target/surefire-reports>

-------------------------------------------------------
 T E S T S
-------------------------------------------------------
Running org.apache.tika.config.TikaConfigTest
Tests run: 3, Failures: 0, Errors: 0, Skipped: 0, Time elapsed: 0.2 sec
Running org.apache.tika.parser.CompositeParserTest
Tests run: 3, Failures: 0, Errors: 0, Skipped: 0, Time elapsed: 0.033 sec
Running org.apache.tika.metadata.TestMetadata
Tests run: 12, Failures: 0, Errors: 0, Skipped: 0, Time elapsed: 0.016 sec
Running org.apache.tika.mime.MimeTypesReaderTest
Tests run: 6, Failures: 0, Errors: 0, Skipped: 0, Time elapsed: 0.003 sec
Running org.apache.tika.mime.MimeDetectionTest
Tests run: 6, Failures: 0, Errors: 0, Skipped: 0, Time elapsed: 0.191 sec
Running org.apache.tika.mime.PatternsTest
Tests run: 4, Failures: 0, Errors: 0, Skipped: 0, Time elapsed: 0.001 sec
Running org.apache.tika.mime.MediaTypeTest
Tests run: 9, Failures: 0, Errors: 0, Skipped: 0, Time elapsed: 0.002 sec
Running org.apache.tika.language.ProfilingWriterTest
Tests run: 1, Failures: 0, Errors: 0, Skipped: 0, Time elapsed: 0 sec
Running org.apache.tika.language.LanguageProfileTest
Tests run: 1, Failures: 0, Errors: 0, Skipped: 0, Time elapsed: 0 sec
Running org.apache.tika.language.LanguageIdentifierTest
Tests run: 4, Failures: 0, Errors: 0, Skipped: 0, Time elapsed: 2.321 sec
Running org.apache.tika.language.LanguageProfilerBuilderTest
Tests run: 2, Failures: 0, Errors: 0, Skipped: 0, Time elapsed: 0.185 sec
Running org.apache.tika.TestRereadableInputStream
Tests run: 3, Failures: 0, Errors: 0, Skipped: 0, Time elapsed: 0.002 sec
Running org.apache.tika.TikaDetectionTest
Tests run: 1, Failures: 0, Errors: 0, Skipped: 0, Time elapsed: 0.023 sec
Running org.apache.tika.io.TaggedInputStreamTest
Tests run: 1, Failures: 0, Errors: 0, Skipped: 0, Time elapsed: 0.025 sec
Running org.apache.tika.io.TikaInputStreamTest
Tests run: 3, Failures: 0, Errors: 0, Skipped: 0, Time elapsed: 0.002 sec
Running org.apache.tika.io.TailStreamTest
Tests run: 8, Failures: 0, Errors: 0, Skipped: 0, Time elapsed: 0.002 sec
Running org.apache.tika.io.LookaheadInputStreamTest
Tests run: 6, Failures: 0, Errors: 0, Skipped: 0, Time elapsed: 0.002 sec
Running org.apache.tika.detect.TextDetectorTest
Tests run: 3, Failures: 0, Errors: 0, Skipped: 0, Time elapsed: 0.003 sec
Running org.apache.tika.detect.TypeDetectorTest
Tests run: 1, Failures: 0, Errors: 0, Skipped: 0, Time elapsed: 0.001 sec
Running org.apache.tika.detect.MagicDetectorTest
Tests run: 8, Failures: 0, Errors: 0, Skipped: 0, Time elapsed: 0.028 sec
Running org.apache.tika.detect.NameDetectorTest
Tests run: 1, Failures: 0, Errors: 0, Skipped: 0, Time elapsed: 0 sec
Running org.apache.tika.utils.RegexUtilsTest
Tests run: 3, Failures: 0, Errors: 0, Skipped: 0, Time elapsed: 0.003 sec
Running org.apache.tika.utils.CharsetUtilsTest
Tests run: 4, Failures: 0, Errors: 0, Skipped: 0, Time elapsed: 0.025 sec
Running org.apache.tika.fork.ForkParserTest
Tests run: 4, Failures: 0, Errors: 0, Skipped: 0, Time elapsed: 2.223 sec
Running org.apache.tika.sax.OfflineContentHandlerTest
Tests run: 2, Failures: 0, Errors: 0, Skipped: 0, Time elapsed: 0.001 sec
Running org.apache.tika.sax.xpath.XPathParserTest
Tests run: 7, Failures: 0, Errors: 0, Skipped: 0, Time elapsed: 0.001 sec
Running org.apache.tika.sax.SecureContentHandlerTest
Tests run: 8, Failures: 0, Errors: 0, Skipped: 0, Time elapsed: 0.175 sec
Running org.apache.tika.sax.SerializerTest
Tests run: 3, Failures: 0, Errors: 0, Skipped: 0, Time elapsed: 0.002 sec
Running org.apache.tika.sax.BodyContentHandlerTest
Tests run: 1, Failures: 0, Errors: 0, Skipped: 0, Time elapsed: 0.002 sec
Running org.apache.tika.sax.SafeContentHandlerTest
Tests run: 6, Failures: 0, Errors: 0, Skipped: 0, Time elapsed: 0.001 sec
Running org.apache.tika.sax.XHTMLContentHandlerTest
Tests run: 3, Failures: 0, Errors: 0, Skipped: 0, Time elapsed: 0.001 sec
Running org.apache.tika.sax.LinkContentHandlerTest
Tests run: 2, Failures: 0, Errors: 0, Skipped: 0, Time elapsed: 0.001 sec

Results :

Tests run: 129, Failures: 0, Errors: 0, Skipped: 0

mojoSucceeded org.apache.maven.plugins:maven-surefire-plugin:2.12(default-test)
[JENKINS] Recording test results
mojoStarted org.apache.felix:maven-bundle-plugin:2.3.4(default-bundle)
[INFO]
[INFO] --- maven-bundle-plugin:2.3.4:bundle (default-bundle) @ tika-core ---
mojoSucceeded org.apache.felix:maven-bundle-plugin:2.3.4(default-bundle)
mojoStarted org.apache.maven.plugins:maven-site-plugin:3.0(attach-descriptor)
[INFO]
[INFO] --- maven-site-plugin:3.0:attach-descriptor (attach-descriptor) @ tika-core ---
mojoSucceeded org.apache.maven.plugins:maven-site-plugin:3.0(attach-descriptor)
mojoStarted org.apache.maven.plugins:maven-failsafe-plugin:2.10(default)
[INFO]
[INFO] --- maven-failsafe-plugin:2.10:integration-test (default) @ tika-core ---
[INFO] Failsafe report directory: <https://builds.apache.org/job/Tika-trunk/ws/trunk/tika-core/target/failsafe-reports>

-------------------------------------------------------
 T E S T S
-------------------------------------------------------
Running org.apache.tika.TikaIT
Tests run: 1, Failures: 0, Errors: 0, Skipped: 0, Time elapsed: 0.184 sec

Results :

Tests run: 1, Failures: 0, Errors: 0, Skipped: 0

mojoSucceeded org.apache.maven.plugins:maven-failsafe-plugin:2.10(default)
mojoStarted org.apache.rat:apache-rat-plugin:0.7(default)
[INFO]
[INFO] --- apache-rat-plugin:0.7:check (default) @ tika-core ---
[INFO] Exclude: src/test/resources/org/apache/tika/**
mojoFailed org.apache.rat:apache-rat-plugin:0.7(default)
[PMD] No report found for mojo check
projectFailed org.apache.tika:tika-core:1.4-SNAPSHOT
sessionEnded
[INFO] ------------------------------------------------------------------------
[INFO] Reactor Summary:
[INFO]
[INFO] Apache Tika parent ................................ SUCCESS [7.442s]
[INFO] Apache Tika core .................................. FAILURE [17.362s]
[INFO] Apache Tika parsers ............................... SKIPPED
[INFO] Apache Tika XMP ................................... SKIPPED
[INFO] Apache Tika application ........................... SKIPPED
[INFO] Apache Tika OSGi bundle ........................... SKIPPED
[INFO] Apache Tika server ................................ SKIPPED
[INFO] Apache Tika ....................................... SKIPPED
[INFO] ------------------------------------------------------------------------
[INFO] BUILD FAILURE
[INFO] ------------------------------------------------------------------------
[INFO] Total time: 25.874s
[INFO] Finished at: Tue Feb 05 02:29:48 GMT 2013
[INFO] Final Memory: 21M/401M
[INFO] ------------------------------------------------------------------------
Projects to build: [MavenProject: org.apache.tika:tika-parent:1.4-SNAPSHOT @ <https://builds.apache.org/job/Tika-trunk/ws/trunk/tika-parent/pom.xml,> MavenProject: org.apache.tika:tika-core:1.4-SNAPSHOT @ <https://builds.apache.org/job/Tika-trunk/ws/trunk/tika-core/pom.xml,> MavenProject: org.apache.tika:tika-parsers:1.4-SNAPSHOT @ <https://builds.apache.org/job/Tika-trunk/ws/trunk/tika-parsers/pom.xml,> MavenProject: org.apache.tika:tika-xmp:1.4-SNAPSHOT @ <https://builds.apache.org/job/Tika-trunk/ws/trunk/tika-xmp/pom.xml,> MavenProject: org.apache.tika:tika-app:1.4-SNAPSHOT @ <https://builds.apache.org/job/Tika-trunk/ws/trunk/tika-app/pom.xml,> MavenProject: org.apache.tika:tika-bundle:1.4-SNAPSHOT @ <https://builds.apache.org/job/Tika-trunk/ws/trunk/tika-bundle/pom.xml,> MavenProject: org.apache.tika:tika-server:1.4-SNAPSHOT @ <https://builds.apache.org/job/Tika-trunk/ws/trunk/tika-server/pom.xml,> MavenProject: org.apache.tika:tika:1.4-SNAPSHOT @ <https://builds.apache.org/job/Tika-trunk/ws/trunk/pom.xml]>
[JENKINS] Archiving <https://builds.apache.org/job/Tika-trunk/ws/trunk/pom.xml> to /home/hudson/hudson/jobs/Tika-trunk/modules/org.apache.tika$tika/builds/2013-02-05_02-29-17/archive/org.apache.tika/tika/1.4-SNAPSHOT/tika-1.4-SNAPSHOT.pom
[JENKINS] Archiving <https://builds.apache.org/job/Tika-trunk/ws/trunk/tika-parent/pom.xml> to /home/hudson/hudson/jobs/Tika-trunk/modules/org.apache.tika$tika-parent/builds/2013-02-05_02-29-17/archive/org.apache.tika/tika-parent/1.4-SNAPSHOT/tika-parent-1.4-SNAPSHOT.pom
[JENKINS] Archiving <https://builds.apache.org/job/Tika-trunk/ws/trunk/tika-parsers/pom.xml> to /home/hudson/hudson/jobs/Tika-trunk/modules/org.apache.tika$tika-parsers/builds/2013-02-05_02-29-17/archive/org.apache.tika/tika-parsers/1.4-SNAPSHOT/tika-parsers-1.4-SNAPSHOT.pom
[JENKINS] Archiving <https://builds.apache.org/job/Tika-trunk/ws/trunk/tika-xmp/pom.xml> to /home/hudson/hudson/jobs/Tika-trunk/modules/org.apache.tika$tika-xmp/builds/2013-02-05_02-29-17/archive/org.apache.tika/tika-xmp/1.4-SNAPSHOT/tika-xmp-1.4-SNAPSHOT.pom
[JENKINS] Archiving <https://builds.apache.org/job/Tika-trunk/ws/trunk/tika-app/pom.xml> to /home/hudson/hudson/jobs/Tika-trunk/modules/org.apache.tika$tika-app/builds/2013-02-05_02-29-17/archive/org.apache.tika/tika-app/1.4-SNAPSHOT/tika-app-1.4-SNAPSHOT.pom
[JENKINS] Archiving <https://builds.apache.org/job/Tika-trunk/ws/trunk/tika-server/pom.xml> to /home/hudson/hudson/jobs/Tika-trunk/modules/org.apache.tika$tika-server/builds/2013-02-05_02-29-17/archive/org.apache.tika/tika-server/1.4-SNAPSHOT/tika-server-1.4-SNAPSHOT.pom
[JENKINS] Archiving <https://builds.apache.org/job/Tika-trunk/ws/trunk/tika-core/pom.xml> to /home/hudson/hudson/jobs/Tika-trunk/modules/org.apache.tika$tika-core/builds/2013-02-05_02-29-17/archive/org.apache.tika/tika-core/1.4-SNAPSHOT/tika-core-1.4-SNAPSHOT.pom
[JENKINS] Archiving <https://builds.apache.org/job/Tika-trunk/ws/trunk/tika-core/target/tika-core-1.4-SNAPSHOT.jar> to /home/hudson/hudson/jobs/Tika-trunk/modules/org.apache.tika$tika-core/builds/2013-02-05_02-29-17/archive/org.apache.tika/tika-core/1.4-SNAPSHOT/tika-core-1.4-SNAPSHOT.jar
[JENKINS] Archiving <https://builds.apache.org/job/Tika-trunk/ws/trunk/tika-bundle/pom.xml> to /home/hudson/hudson/jobs/Tika-trunk/modules/org.apache.tika$tika-bundle/builds/2013-02-05_02-29-17/archive/org.apache.tika/tika-bundle/1.4-SNAPSHOT/tika-bundle-1.4-SNAPSHOT.pom
Waiting for Jenkins to finish collecting data
mavenExecutionResult exceptions not empty
message : Failed to execute goal org.apache.rat:apache-rat-plugin:0.7:check (default) on project tika-core: Too many unapproved licenses: 1
cause : Too many unapproved licenses: 1
Stack trace :
org.apache.maven.lifecycle.LifecycleExecutionException: Failed to execute goal org.apache.rat:apache-rat-plugin:0.7:check (default) on project tika-core: Too many unapproved licenses: 1
        at org.apache.maven.lifecycle.internal.MojoExecutor.execute(MojoExecutor.java:213)
        at org.apache.maven.lifecycle.internal.MojoExecutor.execute(MojoExecutor.java:153)
        at org.apache.maven.lifecycle.internal.MojoExecutor.execute(MojoExecutor.java:145)
        at org.apache.maven.lifecycle.internal.LifecycleModuleBuilder.buildProject(LifecycleModuleBuilder.java:84)
        at org.apache.maven.lifecycle.internal.LifecycleModuleBuilder.buildProject(LifecycleModuleBuilder.java:59)
        at org.apache.maven.lifecycle.internal.LifecycleStarter.singleThreadedBuild(LifecycleStarter.java:183)
        at org.apache.maven.lifecycle.internal.LifecycleStarter.execute(LifecycleStarter.java:161)
        at org.apache.maven.DefaultMaven.doExecute(DefaultMaven.java:320)
        at org.apache.maven.DefaultMaven.execute(DefaultMaven.java:156)
        at org.jvnet.hudson.maven3.launcher.Maven3Launcher.main(Maven3Launcher.java:79)
        at sun.reflect.NativeMethodAccessorImpl.invoke0(Native Method)
        at sun.reflect.NativeMethodAccessorImpl.invoke(NativeMethodAccessorImpl.java:39)
        at sun.reflect.DelegatingMethodAccessorImpl.invoke(DelegatingMethodAccessorImpl.java:25)
        at java.lang.reflect.Method.invoke(Method.java:592)
        at org.codehaus.plexus.classworlds.launcher.Launcher.launchStandard(Launcher.java:329)
        at org.codehaus.plexus.classworlds.launcher.Launcher.launch(Launcher.java:239)
        at org.jvnet.hudson.maven3.agent.Maven3Main.launch(Maven3Main.java:158)
        at hudson.maven.Maven3Builder.call(Maven3Builder.java:100)
        at hudson.maven.Maven3Builder.call(Maven3Builder.java:66)
        at hudson.remoting.UserRequest.perform(UserRequest.java:118)
        at hudson.remoting.UserRequest.perform(UserRequest.java:48)
        at hudson.remoting.Request$2.run(Request.java:326)
        at hudson.remoting.InterceptingExecutorService$1.call(InterceptingExecutorService.java:72)
        at java.util.concurrent.FutureTask$Sync.innerRun(FutureTask.java:269)
        at java.util.concurrent.FutureTask.run(FutureTask.java:123)
        at java.util.concurrent.ThreadPoolExecutor$Worker.runTask(ThreadPoolExecutor.java:651)
        at java.util.concurrent.ThreadPoolExecutor$Worker.run(ThreadPoolExecutor.java:676)
        at java.lang.Thread.run(Thread.java:595)
Caused by: org.apache.rat.mp.RatCheckException: Too many unapproved licenses: 1
        at org.apache.rat.mp.RatCheckMojo.check(RatCheckMojo.java:167)
        at org.apache.rat.mp.RatCheckMojo.execute(RatCheckMojo.java:159)
        at org.apache.maven.plugin.DefaultBuildPluginManager.executeMojo(DefaultBuildPluginManager.java:101)
        at org.apache.maven.lifecycle.internal.MojoExecutor.execute(MojoExecutor.java:209)
        ... 27 more
channel stopped
Reply | Threaded
Open this post in threaded view
|

Build failed in Jenkins: Tika-trunk #976

Apache Jenkins Server-2
See <https://builds.apache.org/job/Tika-trunk/976/changes>

Changes:

[nick] Add missing license header

------------------------------------------
[...truncated 834 lines...]
[INFO] Installing <https://builds.apache.org/job/Tika-trunk/ws/trunk/tika-app/pom.xml> to /home/jenkins/jenkins-slave/maven-repositories/1/org/apache/tika/tika-app/1.4-SNAPSHOT/tika-app-1.4-SNAPSHOT.pom
mojoSucceeded org.apache.maven.plugins:maven-install-plugin:2.3.1(default-install)
mojoStarted org.apache.maven.plugins:maven-deploy-plugin:2.6(default-deploy)Downloading: https://repository.apache.org/content/repositories/snapshots/org/apache/tika/tika-app/1.4-SNAPSHOT/maven-metadata.xml

[INFO]
[INFO] --- maven-deploy-plugin:2.6:deploy (default-deploy) @ tika-app ---
Downloaded: https://repository.apache.org/content/repositories/snapshots/org/apache/tika/tika-app/1.4-SNAPSHOT/maven-metadata.xml (767 B at 1.8 KB/sec)
Uploading: https://repository.apache.org/content/repositories/snapshots/org/apache/tika/tika-app/1.4-SNAPSHOT/tika-app-1.4-20130205.112511-8.jar
Uploaded: https://repository.apache.org/content/repositories/snapshots/org/apache/tika/tika-app/1.4-SNAPSHOT/tika-app-1.4-20130205.112511-8.jar (27291 KB at 5268.4 KB/sec)
Uploading: https://repository.apache.org/content/repositories/snapshots/org/apache/tika/tika-app/1.4-SNAPSHOT/tika-app-1.4-20130205.112511-8.pom
Uploaded: https://repository.apache.org/content/repositories/snapshots/org/apache/tika/tika-app/1.4-SNAPSHOT/tika-app-1.4-20130205.112511-8.pom (8 KB at 23.2 KB/sec)
Downloading: https://repository.apache.org/content/repositories/snapshots/org/apache/tika/tika-app/maven-metadata.xml
Downloaded: https://repository.apache.org/content/repositories/snapshots/org/apache/tika/tika-app/maven-metadata.xml (339 B at 1.6 KB/sec)
Uploading: https://repository.apache.org/content/repositories/snapshots/org/apache/tika/tika-app/1.4-SNAPSHOT/maven-metadata.xml
Uploaded: https://repository.apache.org/content/repositories/snapshots/org/apache/tika/tika-app/1.4-SNAPSHOT/maven-metadata.xml (767 B at 2.7 KB/sec)
Uploading: https://repository.apache.org/content/repositories/snapshots/org/apache/tika/tika-app/maven-metadata.xml
Uploaded: https://repository.apache.org/content/repositories/snapshots/org/apache/tika/tika-app/maven-metadata.xml (339 B at 1.0 KB/sec)
mojoSucceeded org.apache.maven.plugins:maven-deploy-plugin:2.6(default-deploy)
projectSucceeded org.apache.tika:tika-app:1.4-SNAPSHOT
projectStarted org.apache.tika:tika-bundle:1.4-SNAPSHOT
[INFO]                                                                        
[INFO] ------------------------------------------------------------------------
[INFO] Building Apache Tika OSGi bundle 1.4-SNAPSHOT
[INFO] ------------------------------------------------------------------------
mojoStarted org.apache.maven.plugins:maven-clean-plugin:2.4.1(default-clean)[INFO] Deleting <https://builds.apache.org/job/Tika-trunk/ws/trunk/tika-bundle/target>

[INFO]
[INFO] --- maven-clean-plugin:2.4.1:clean (default-clean) @ tika-bundle ---
mojoSucceeded org.apache.maven.plugins:maven-clean-plugin:2.4.1(default-clean)
[TASKS] Scanning folder '<https://builds.apache.org/job/Tika-trunk/ws/trunk/tika-bundle'> for files matching the pattern '**/*.java' - excludes:
[TASKS] Found 1 files to scan for tasks
Found 0 open tasks.
[TASKS] Computing warning deltas based on reference build #974
mojoStarted org.apache.maven.plugins:maven-remote-resources-plugin:1.2.1(default)
[INFO]
[INFO] --- maven-remote-resources-plugin:1.2.1:process (default) @ tika-bundle ---
mojoSucceeded org.apache.maven.plugins:maven-remote-resources-plugin:1.2.1(default)
[debug] execute contextualize
[INFO] Using 'UTF-8' encoding to copy filtered resources.
[INFO] skip non existing resourceDirectory <https://builds.apache.org/job/Tika-trunk/ws/trunk/tika-bundle/src/main/resources>
mojoStarted org.apache.maven.plugins:maven-resources-plugin:2.5(default-resources)[INFO] Copying 3 resources

[INFO]
[INFO] --- maven-resources-plugin:2.5:resources (default-resources) @ tika-bundle ---
mojoSucceeded org.apache.maven.plugins:maven-resources-plugin:2.5(default-resources)
mojoStarted org.apache.maven.plugins:maven-compiler-plugin:2.3.2(default-compile)[INFO] No sources to compile

[INFO]
[INFO] --- maven-compiler-plugin:2.3.2:compile (default-compile) @ tika-bundle ---
mojoSucceeded org.apache.maven.plugins:maven-compiler-plugin:2.3.2(default-compile)
mojoStarted org.apache.maven.plugins:maven-resources-plugin:2.5(default-testResources)[debug] execute contextualize
[INFO] Using 'UTF-8' encoding to copy filtered resources.
[INFO] Copying 1 resource

[INFO]
[INFO] --- maven-resources-plugin:2.5:testResources (default-testResources) @ tika-bundle ---
mojoSucceeded org.apache.maven.plugins:maven-resources-plugin:2.5(default-testResources)[INFO] Copying 3 resources

mojoStarted org.apache.maven.plugins:maven-compiler-plugin:2.3.2(default-testCompile)
[INFO]
[INFO] --- maven-compiler-plugin:2.3.2:testCompile (default-testCompile) @ tika-bundle ---
[INFO] Compiling 1 source file to <https://builds.apache.org/job/Tika-trunk/ws/trunk/tika-bundle/target/test-classes>
mojoSucceeded org.apache.maven.plugins:maven-compiler-plugin:2.3.2(default-testCompile)
mojoStarted org.apache.maven.plugins:maven-surefire-plugin:2.12(default-test)[INFO] Surefire report directory: <https://builds.apache.org/job/Tika-trunk/ws/trunk/tika-bundle/target/surefire-reports>

-------------------------------------------------------
 T E S T S
-------------------------------------------------------

[INFO]
[INFO] --- maven-surefire-plugin:2.12:test (default-test) @ tika-bundle ---

Results :

Tests run: 0, Failures: 0, Errors: 0, Skipped: 0

mojoSucceeded org.apache.maven.plugins:maven-surefire-plugin:2.12(default-test)
[JENKINS] Recording test results
mojoStarted org.apache.maven.plugins:maven-dependency-plugin:2.1(default)
[INFO]
[INFO] --- maven-dependency-plugin:2.1:unpack-dependencies (default) @ tika-bundle ---
[INFO] Unpacking /home/jenkins/jenkins-slave/maven-repositories/1/edu/ucar/netcdf/4.2-min/netcdf-4.2-min.jar to
  <https://builds.apache.org/job/Tika-trunk/ws/trunk/tika-bundle/target/classes>
   with includes null and excludes:ucar/nc2/iosp/fysat/Fysat*.class,
                ucar/nc2/dataset/transform/VOceanSG1*class,
                ucar/unidata/geoloc/vertical/OceanSG*.class,
                META-INF/**,CHANGES,README
mojoSucceeded org.apache.maven.plugins:maven-dependency-plugin:2.1(default)
mojoStarted org.apache.felix:maven-bundle-plugin:2.3.4(default-bundle)
[INFO]
[INFO] --- maven-bundle-plugin:2.3.4:bundle (default-bundle) @ tika-bundle ---
[WARNING] Embed-Dependency: clause "commons-io" did not match any dependencies
mojoSucceeded org.apache.felix:maven-bundle-plugin:2.3.4(default-bundle)
mojoStarted org.apache.maven.plugins:maven-site-plugin:3.0(attach-descriptor)
[INFO]
[INFO] --- maven-site-plugin:3.0:attach-descriptor (attach-descriptor) @ tika-bundle ---
mojoSucceeded org.apache.maven.plugins:maven-site-plugin:3.0(attach-descriptor)
mojoStarted org.apache.rat:apache-rat-plugin:0.7(default)[INFO] No excludes

[INFO]
[INFO] --- apache-rat-plugin:0.7:check (default) @ tika-bundle ---
mojoSucceeded org.apache.rat:apache-rat-plugin:0.7(default)
[PMD] No report found for mojo check
mojoStarted org.apache.maven.plugins:maven-install-plugin:2.3.1(default-install)[INFO] Installing <https://builds.apache.org/job/Tika-trunk/ws/trunk/tika-bundle/target/tika-bundle-1.4-SNAPSHOT.jar> to /home/jenkins/jenkins-slave/maven-repositories/1/org/apache/tika/tika-bundle/1.4-SNAPSHOT/tika-bundle-1.4-SNAPSHOT.jar

[INFO]
[INFO] --- maven-install-plugin:2.3.1:install (default-install) @ tika-bundle ---
[INFO] Installing <https://builds.apache.org/job/Tika-trunk/ws/trunk/tika-bundle/pom.xml> to /home/jenkins/jenkins-slave/maven-repositories/1/org/apache/tika/tika-bundle/1.4-SNAPSHOT/tika-bundle-1.4-SNAPSHOT.pom
mojoSucceeded org.apache.maven.plugins:maven-install-plugin:2.3.1(default-install)
mojoStarted org.apache.felix:maven-bundle-plugin:2.3.4(default-install)[INFO] Local OBR update disabled (enable with -DobrRepository)

[INFO]
[INFO] --- maven-bundle-plugin:2.3.4:install (default-install) @ tika-bundle ---
mojoSucceeded org.apache.felix:maven-bundle-plugin:2.3.4(default-install)
mojoStarted org.apache.maven.plugins:maven-deploy-plugin:2.6(default-deploy)Downloading: https://repository.apache.org/content/repositories/snapshots/org/apache/tika/tika-bundle/1.4-SNAPSHOT/maven-metadata.xml

[INFO]
[INFO] --- maven-deploy-plugin:2.6:deploy (default-deploy) @ tika-bundle ---
Downloaded: https://repository.apache.org/content/repositories/snapshots/org/apache/tika/tika-bundle/1.4-SNAPSHOT/maven-metadata.xml (770 B at 2.9 KB/sec)
Uploading: https://repository.apache.org/content/repositories/snapshots/org/apache/tika/tika-bundle/1.4-SNAPSHOT/tika-bundle-1.4-20130205.112548-8.jar
Uploaded: https://repository.apache.org/content/repositories/snapshots/org/apache/tika/tika-bundle/1.4-SNAPSHOT/tika-bundle-1.4-20130205.112548-8.jar (22134 KB at 4679.5 KB/sec)
Uploading: https://repository.apache.org/content/repositories/snapshots/org/apache/tika/tika-bundle/1.4-SNAPSHOT/tika-bundle-1.4-20130205.112548-8.pom
Uploaded: https://repository.apache.org/content/repositories/snapshots/org/apache/tika/tika-bundle/1.4-SNAPSHOT/tika-bundle-1.4-20130205.112548-8.pom (11 KB at 30.4 KB/sec)
Downloading: https://repository.apache.org/content/repositories/snapshots/org/apache/tika/tika-bundle/maven-metadata.xml
Downloaded: https://repository.apache.org/content/repositories/snapshots/org/apache/tika/tika-bundle/maven-metadata.xml (342 B at 1.1 KB/sec)
Uploading: https://repository.apache.org/content/repositories/snapshots/org/apache/tika/tika-bundle/1.4-SNAPSHOT/maven-metadata.xml
Uploaded: https://repository.apache.org/content/repositories/snapshots/org/apache/tika/tika-bundle/1.4-SNAPSHOT/maven-metadata.xml (770 B at 2.1 KB/sec)
Uploading: https://repository.apache.org/content/repositories/snapshots/org/apache/tika/tika-bundle/maven-metadata.xml
Uploaded: https://repository.apache.org/content/repositories/snapshots/org/apache/tika/tika-bundle/maven-metadata.xml (342 B at 0.9 KB/sec)
mojoSucceeded org.apache.maven.plugins:maven-deploy-plugin:2.6(default-deploy)
mojoStarted org.apache.felix:maven-bundle-plugin:2.3.4(default-deploy)[INFO] Remote OBR update disabled (enable with -DremoteOBR)

[INFO]
[INFO] --- maven-bundle-plugin:2.3.4:deploy (default-deploy) @ tika-bundle ---
mojoSucceeded org.apache.felix:maven-bundle-plugin:2.3.4(default-deploy)
projectSucceeded org.apache.tika:tika-bundle:1.4-SNAPSHOT
projectStarted org.apache.tika:tika-server:1.4-SNAPSHOT
[INFO]                                                                        
[INFO] ------------------------------------------------------------------------
[INFO] Building Apache Tika server 1.4-SNAPSHOT
[INFO] ------------------------------------------------------------------------
mojoStarted org.apache.maven.plugins:maven-clean-plugin:2.4.1(default-clean)[INFO] Deleting <https://builds.apache.org/job/Tika-trunk/ws/trunk/tika-server/target>

[INFO]
[INFO] --- maven-clean-plugin:2.4.1:clean (default-clean) @ tika-server ---
mojoSucceeded org.apache.maven.plugins:maven-clean-plugin:2.4.1(default-clean)
[TASKS] Scanning folder '<https://builds.apache.org/job/Tika-trunk/ws/trunk/tika-server'> for files matching the pattern '**/*.java' - excludes:
[TASKS] Found 18 files to scan for tasks
Found 0 open tasks.
[TASKS] Computing warning deltas based on reference build #971
mojoStarted org.apache.maven.plugins:maven-remote-resources-plugin:1.2.1(default)
[INFO]
[INFO] --- maven-remote-resources-plugin:1.2.1:process (default) @ tika-server ---
mojoSucceeded org.apache.maven.plugins:maven-remote-resources-plugin:1.2.1(default)
mojoStarted org.apache.maven.plugins:maven-resources-plugin:2.5(default-resources)[debug] execute contextualize
[INFO] Using 'UTF-8' encoding to copy filtered resources.
[INFO] Copying 2 resources
[INFO] Copying 3 resources

[INFO]
[INFO] --- maven-resources-plugin:2.5:resources (default-resources) @ tika-server ---
mojoSucceeded org.apache.maven.plugins:maven-resources-plugin:2.5(default-resources)
mojoStarted org.apache.maven.plugins:maven-compiler-plugin:2.3.2(default-compile)
[INFO]
[INFO] --- maven-compiler-plugin:2.3.2:compile (default-compile) @ tika-server ---
[INFO] Compiling 12 source files to <https://builds.apache.org/job/Tika-trunk/ws/trunk/tika-server/target/classes>
[INFO] -------------------------------------------------------------
[ERROR] COMPILATION ERROR :
[INFO] -------------------------------------------------------------
[ERROR] <https://builds.apache.org/job/Tika-trunk/ws/trunk/tika-server/src/main/java/org/apache/tika/server/CSVMessageBodyWriter.java>:[51,3] method does not override a method from its superclass
[ERROR] <https://builds.apache.org/job/Tika-trunk/ws/trunk/tika-server/src/main/java/org/apache/tika/server/JSONMessageBodyWriter.java>:[51,3] method does not override a method from its superclass
[INFO] 2 errors
[INFO] -------------------------------------------------------------
mojoFailed org.apache.maven.plugins:maven-compiler-plugin:2.3.2(default-compile)
projectFailed org.apache.tika:tika-server:1.4-SNAPSHOT
sessionEnded
[INFO] ------------------------------------------------------------------------
[INFO] Reactor Summary:
[INFO]
[INFO] Apache Tika parent ................................ SUCCESS [31.475s]
[INFO] Apache Tika core .................................. SUCCESS [46.790s]
[INFO] Apache Tika parsers ............................... SUCCESS [1:46.681s]
[INFO] Apache Tika XMP ................................... SUCCESS [10.437s]
[INFO] Apache Tika application ........................... SUCCESS [32.120s]
[INFO] Apache Tika OSGi bundle ........................... SUCCESS [36.264s]
[INFO] Apache Tika server ................................ FAILURE [4.868s]
[INFO] Apache Tika ....................................... SKIPPED
[INFO] ------------------------------------------------------------------------
[INFO] BUILD FAILURE
[INFO] ------------------------------------------------------------------------
[INFO] Total time: 4:34.760s
[INFO] Finished at: Tue Feb 05 11:26:00 UTC 2013
[INFO] Final Memory: 40M/300M
[INFO] ------------------------------------------------------------------------
Projects to build: [MavenProject: org.apache.tika:tika-parent:1.4-SNAPSHOT @ <https://builds.apache.org/job/Tika-trunk/ws/trunk/tika-parent/pom.xml,> MavenProject: org.apache.tika:tika-core:1.4-SNAPSHOT @ <https://builds.apache.org/job/Tika-trunk/ws/trunk/tika-core/pom.xml,> MavenProject: org.apache.tika:tika-parsers:1.4-SNAPSHOT @ <https://builds.apache.org/job/Tika-trunk/ws/trunk/tika-parsers/pom.xml,> MavenProject: org.apache.tika:tika-xmp:1.4-SNAPSHOT @ <https://builds.apache.org/job/Tika-trunk/ws/trunk/tika-xmp/pom.xml,> MavenProject: org.apache.tika:tika-app:1.4-SNAPSHOT @ <https://builds.apache.org/job/Tika-trunk/ws/trunk/tika-app/pom.xml,> MavenProject: org.apache.tika:tika-bundle:1.4-SNAPSHOT @ <https://builds.apache.org/job/Tika-trunk/ws/trunk/tika-bundle/pom.xml,> MavenProject: org.apache.tika:tika-server:1.4-SNAPSHOT @ <https://builds.apache.org/job/Tika-trunk/ws/trunk/tika-server/pom.xml,> MavenProject: org.apache.tika:tika:1.4-SNAPSHOT @ <https://builds.apache.org/job/Tika-trunk/ws/trunk/pom.xml]>
[JENKINS] Archiving <https://builds.apache.org/job/Tika-trunk/ws/trunk/pom.xml> to /home/hudson/hudson/jobs/Tika-trunk/modules/org.apache.tika$tika/builds/2013-02-05_11-20-58/archive/org.apache.tika/tika/1.4-SNAPSHOT/tika-1.4-SNAPSHOT.pom
[JENKINS] Archiving <https://builds.apache.org/job/Tika-trunk/ws/trunk/tika-parent/pom.xml> to /home/hudson/hudson/jobs/Tika-trunk/modules/org.apache.tika$tika-parent/builds/2013-02-05_11-20-59/archive/org.apache.tika/tika-parent/1.4-SNAPSHOT/tika-parent-1.4-SNAPSHOT.pom
[JENKINS] Archiving <https://builds.apache.org/job/Tika-trunk/ws/trunk/tika-parsers/pom.xml> to /home/hudson/hudson/jobs/Tika-trunk/modules/org.apache.tika$tika-parsers/builds/2013-02-05_11-20-59/archive/org.apache.tika/tika-parsers/1.4-SNAPSHOT/tika-parsers-1.4-SNAPSHOT.pom
[JENKINS] Archiving <https://builds.apache.org/job/Tika-trunk/ws/trunk/tika-parsers/target/tika-parsers-1.4-SNAPSHOT.jar> to /home/hudson/hudson/jobs/Tika-trunk/modules/org.apache.tika$tika-parsers/builds/2013-02-05_11-20-59/archive/org.apache.tika/tika-parsers/1.4-20130205.112433-8/tika-parsers-1.4-20130205.112433-8.jar
[JENKINS] Archiving <https://builds.apache.org/job/Tika-trunk/ws/trunk/tika-xmp/pom.xml> to /home/hudson/hudson/jobs/Tika-trunk/modules/org.apache.tika$tika-xmp/builds/2013-02-05_11-20-59/archive/org.apache.tika/tika-xmp/1.4-SNAPSHOT/tika-xmp-1.4-SNAPSHOT.pom
[JENKINS] Archiving <https://builds.apache.org/job/Tika-trunk/ws/trunk/tika-xmp/target/tika-xmp-1.4-SNAPSHOT.jar> to /home/hudson/hudson/jobs/Tika-trunk/modules/org.apache.tika$tika-xmp/builds/2013-02-05_11-20-59/archive/org.apache.tika/tika-xmp/1.4-20130205.112444-8/tika-xmp-1.4-20130205.112444-8.jar
[JENKINS] Archiving <https://builds.apache.org/job/Tika-trunk/ws/trunk/tika-app/pom.xml> to /home/hudson/hudson/jobs/Tika-trunk/modules/org.apache.tika$tika-app/builds/2013-02-05_11-20-59/archive/org.apache.tika/tika-app/1.4-SNAPSHOT/tika-app-1.4-SNAPSHOT.pom
[JENKINS] Archiving <https://builds.apache.org/job/Tika-trunk/ws/trunk/tika-app/target/tika-app-1.4-SNAPSHOT.jar> to /home/hudson/hudson/jobs/Tika-trunk/modules/org.apache.tika$tika-app/builds/2013-02-05_11-20-59/archive/org.apache.tika/tika-app/1.4-20130205.112511-8/tika-app-1.4-20130205.112511-8.jar
[JENKINS] Archiving <https://builds.apache.org/job/Tika-trunk/ws/trunk/tika-server/pom.xml> to /home/hudson/hudson/jobs/Tika-trunk/modules/org.apache.tika$tika-server/builds/2013-02-05_11-20-59/archive/org.apache.tika/tika-server/1.4-SNAPSHOT/tika-server-1.4-SNAPSHOT.pom
[JENKINS] Archiving <https://builds.apache.org/job/Tika-trunk/ws/trunk/tika-core/pom.xml> to /home/hudson/hudson/jobs/Tika-trunk/modules/org.apache.tika$tika-core/builds/2013-02-05_11-20-59/archive/org.apache.tika/tika-core/1.4-SNAPSHOT/tika-core-1.4-SNAPSHOT.pom
[JENKINS] Archiving <https://builds.apache.org/job/Tika-trunk/ws/trunk/tika-core/target/tika-core-1.4-SNAPSHOT.jar> to /home/hudson/hudson/jobs/Tika-trunk/modules/org.apache.tika$tika-core/builds/2013-02-05_11-20-59/archive/org.apache.tika/tika-core/1.4-20130205.112245-8/tika-core-1.4-20130205.112245-8.jar
[JENKINS] Archiving <https://builds.apache.org/job/Tika-trunk/ws/trunk/tika-bundle/pom.xml> to /home/hudson/hudson/jobs/Tika-trunk/modules/org.apache.tika$tika-bundle/builds/2013-02-05_11-20-59/archive/org.apache.tika/tika-bundle/1.4-SNAPSHOT/tika-bundle-1.4-SNAPSHOT.pom
[JENKINS] Archiving <https://builds.apache.org/job/Tika-trunk/ws/trunk/tika-bundle/target/tika-bundle-1.4-SNAPSHOT.jar> to /home/hudson/hudson/jobs/Tika-trunk/modules/org.apache.tika$tika-bundle/builds/2013-02-05_11-20-59/archive/org.apache.tika/tika-bundle/1.4-20130205.112548-8/tika-bundle-1.4-20130205.112548-8.jar
Waiting for Jenkins to finish collecting data
mavenExecutionResult exceptions not empty
message : Failed to execute goal org.apache.maven.plugins:maven-compiler-plugin:2.3.2:compile (default-compile) on project tika-server: Compilation failure
cause : Compilation failure
Stack trace :
org.apache.maven.lifecycle.LifecycleExecutionException: Failed to execute goal org.apache.maven.plugins:maven-compiler-plugin:2.3.2:compile (default-compile) on project tika-server: Compilation failure
        at org.apache.maven.lifecycle.internal.MojoExecutor.execute(MojoExecutor.java:213)
        at org.apache.maven.lifecycle.internal.MojoExecutor.execute(MojoExecutor.java:153)
        at org.apache.maven.lifecycle.internal.MojoExecutor.execute(MojoExecutor.java:145)
        at org.apache.maven.lifecycle.internal.LifecycleModuleBuilder.buildProject(LifecycleModuleBuilder.java:84)
        at org.apache.maven.lifecycle.internal.LifecycleModuleBuilder.buildProject(LifecycleModuleBuilder.java:59)
        at org.apache.maven.lifecycle.internal.LifecycleStarter.singleThreadedBuild(LifecycleStarter.java:183)
        at org.apache.maven.lifecycle.internal.LifecycleStarter.execute(LifecycleStarter.java:161)
        at org.apache.maven.DefaultMaven.doExecute(DefaultMaven.java:320)
        at org.apache.maven.DefaultMaven.execute(DefaultMaven.java:156)
        at org.jvnet.hudson.maven3.launcher.Maven3Launcher.main(Maven3Launcher.java:79)
        at sun.reflect.NativeMethodAccessorImpl.invoke0(Native Method)
        at sun.reflect.NativeMethodAccessorImpl.invoke(NativeMethodAccessorImpl.java:39)
        at sun.reflect.DelegatingMethodAccessorImpl.invoke(DelegatingMethodAccessorImpl.java:25)
        at java.lang.reflect.Method.invoke(Method.java:592)
        at org.codehaus.plexus.classworlds.launcher.Launcher.launchStandard(Launcher.java:329)
        at org.codehaus.plexus.classworlds.launcher.Launcher.launch(Launcher.java:239)
        at org.jvnet.hudson.maven3.agent.Maven3Main.launch(Maven3Main.java:158)
        at hudson.maven.Maven3Builder.call(Maven3Builder.java:100)
        at hudson.maven.Maven3Builder.call(Maven3Builder.java:66)
        at hudson.remoting.UserRequest.perform(UserRequest.java:118)
        at hudson.remoting.UserRequest.perform(UserRequest.java:48)
        at hudson.remoting.Request$2.run(Request.java:326)
        at hudson.remoting.InterceptingExecutorService$1.call(InterceptingExecutorService.java:72)
        at java.util.concurrent.FutureTask$Sync.innerRun(FutureTask.java:269)
        at java.util.concurrent.FutureTask.run(FutureTask.java:123)
        at java.util.concurrent.ThreadPoolExecutor$Worker.runTask(ThreadPoolExecutor.java:651)
        at java.util.concurrent.ThreadPoolExecutor$Worker.run(ThreadPoolExecutor.java:676)
        at java.lang.Thread.run(Thread.java:595)
Caused by: org.apache.maven.plugin.CompilationFailureException: Compilation failure
        at org.apache.maven.plugin.AbstractCompilerMojo.execute(AbstractCompilerMojo.java:656)
        at org.apache.maven.plugin.CompilerMojo.execute(CompilerMojo.java:128)
        at org.apache.maven.plugin.DefaultBuildPluginManager.executeMojo(DefaultBuildPluginManager.java:101)
        at org.apache.maven.lifecycle.internal.MojoExecutor.execute(MojoExecutor.java:209)
        ... 27 more
channel stopped
Reply | Threaded
Open this post in threaded view
|

Build failed in Jenkins: Tika-trunk #977

Apache Jenkins Server-2
See <https://builds.apache.org/job/Tika-trunk/977/changes>

Changes:

[mikemccand] TIKA-1053: upgrade to ASM 4.1

------------------------------------------
[...truncated 799 lines...]
[INFO] Installing <https://builds.apache.org/job/Tika-trunk/ws/trunk/tika-app/pom.xml> to /home/jenkins/jenkins-slave/maven-repositories/1/org/apache/tika/tika-app/1.4-SNAPSHOT/tika-app-1.4-SNAPSHOT.pom
mojoSucceeded org.apache.maven.plugins:maven-install-plugin:2.3.1(default-install)
mojoStarted org.apache.maven.plugins:maven-deploy-plugin:2.6(default-deploy)Downloading: https://repository.apache.org/content/repositories/snapshots/org/apache/tika/tika-app/1.4-SNAPSHOT/maven-metadata.xml

[INFO]
[INFO] --- maven-deploy-plugin:2.6:deploy (default-deploy) @ tika-app ---
Downloaded: https://repository.apache.org/content/repositories/snapshots/org/apache/tika/tika-app/1.4-SNAPSHOT/maven-metadata.xml (767 B at 1.5 KB/sec)
Uploading: https://repository.apache.org/content/repositories/snapshots/org/apache/tika/tika-app/1.4-SNAPSHOT/tika-app-1.4-20130207.175603-9.jar
Uploaded: https://repository.apache.org/content/repositories/snapshots/org/apache/tika/tika-app/1.4-SNAPSHOT/tika-app-1.4-20130207.175603-9.jar (27582 KB at 3644.5 KB/sec)
Uploading: https://repository.apache.org/content/repositories/snapshots/org/apache/tika/tika-app/1.4-SNAPSHOT/tika-app-1.4-20130207.175603-9.pom
Uploaded: https://repository.apache.org/content/repositories/snapshots/org/apache/tika/tika-app/1.4-SNAPSHOT/tika-app-1.4-20130207.175603-9.pom (8 KB at 21.7 KB/sec)
Downloading: https://repository.apache.org/content/repositories/snapshots/org/apache/tika/tika-app/maven-metadata.xml
Downloaded: https://repository.apache.org/content/repositories/snapshots/org/apache/tika/tika-app/maven-metadata.xml (339 B at 0.8 KB/sec)
Uploading: https://repository.apache.org/content/repositories/snapshots/org/apache/tika/tika-app/1.4-SNAPSHOT/maven-metadata.xml
Uploaded: https://repository.apache.org/content/repositories/snapshots/org/apache/tika/tika-app/1.4-SNAPSHOT/maven-metadata.xml (767 B at 2.5 KB/sec)
Uploading: https://repository.apache.org/content/repositories/snapshots/org/apache/tika/tika-app/maven-metadata.xml
Uploaded: https://repository.apache.org/content/repositories/snapshots/org/apache/tika/tika-app/maven-metadata.xml (339 B at 0.9 KB/sec)
mojoSucceeded org.apache.maven.plugins:maven-deploy-plugin:2.6(default-deploy)
projectSucceeded org.apache.tika:tika-app:1.4-SNAPSHOT
projectStarted org.apache.tika:tika-bundle:1.4-SNAPSHOT
[INFO]                                                                        
[INFO] ------------------------------------------------------------------------
[INFO] Building Apache Tika OSGi bundle 1.4-SNAPSHOT
[INFO] ------------------------------------------------------------------------
mojoStarted org.apache.maven.plugins:maven-clean-plugin:2.4.1(default-clean)[INFO] Deleting <https://builds.apache.org/job/Tika-trunk/ws/trunk/tika-bundle/target>

[INFO]
[INFO] --- maven-clean-plugin:2.4.1:clean (default-clean) @ tika-bundle ---
mojoSucceeded org.apache.maven.plugins:maven-clean-plugin:2.4.1(default-clean)
[TASKS] Scanning folder '<https://builds.apache.org/job/Tika-trunk/ws/trunk/tika-bundle'> for files matching the pattern '**/*.java' - excludes:
[TASKS] Found 1 files to scan for tasks
Found 0 open tasks.
[TASKS] Computing warning deltas based on reference build #976
mojoStarted org.apache.maven.plugins:maven-remote-resources-plugin:1.2.1(default)
[INFO]
[INFO] --- maven-remote-resources-plugin:1.2.1:process (default) @ tika-bundle ---
mojoSucceeded org.apache.maven.plugins:maven-remote-resources-plugin:1.2.1(default)
mojoStarted org.apache.maven.plugins:maven-resources-plugin:2.5(default-resources)[debug] execute contextualize
[INFO] Using 'UTF-8' encoding to copy filtered resources.
[INFO] skip non existing resourceDirectory <https://builds.apache.org/job/Tika-trunk/ws/trunk/tika-bundle/src/main/resources>
[INFO] Copying 3 resources

[INFO]
[INFO] --- maven-resources-plugin:2.5:resources (default-resources) @ tika-bundle ---
mojoSucceeded org.apache.maven.plugins:maven-resources-plugin:2.5(default-resources)
[INFO] No sources to compile
mojoStarted org.apache.maven.plugins:maven-compiler-plugin:2.3.2(default-compile)
[INFO]
[INFO] --- maven-compiler-plugin:2.3.2:compile (default-compile) @ tika-bundle ---
mojoSucceeded org.apache.maven.plugins:maven-compiler-plugin:2.3.2(default-compile)
mojoStarted org.apache.maven.plugins:maven-resources-plugin:2.5(default-testResources)[debug] execute contextualize
[INFO] Using 'UTF-8' encoding to copy filtered resources.
[INFO] Copying 1 resource
[INFO] Copying 3 resources

[INFO]
[INFO] --- maven-resources-plugin:2.5:testResources (default-testResources) @ tika-bundle ---
mojoSucceeded org.apache.maven.plugins:maven-resources-plugin:2.5(default-testResources)
mojoStarted org.apache.maven.plugins:maven-compiler-plugin:2.3.2(default-testCompile)
[INFO]
[INFO] --- maven-compiler-plugin:2.3.2:testCompile (default-testCompile) @ tika-bundle ---
[INFO] Compiling 1 source file to <https://builds.apache.org/job/Tika-trunk/ws/trunk/tika-bundle/target/test-classes>
mojoSucceeded org.apache.maven.plugins:maven-compiler-plugin:2.3.2(default-testCompile)
mojoStarted org.apache.maven.plugins:maven-surefire-plugin:2.12(default-test)[INFO] Surefire report directory: <https://builds.apache.org/job/Tika-trunk/ws/trunk/tika-bundle/target/surefire-reports>

-------------------------------------------------------
 T E S T S
-------------------------------------------------------

[INFO]
[INFO] --- maven-surefire-plugin:2.12:test (default-test) @ tika-bundle ---

Results :

Tests run: 0, Failures: 0, Errors: 0, Skipped: 0

mojoSucceeded org.apache.maven.plugins:maven-surefire-plugin:2.12(default-test)
[JENKINS] Recording test results
mojoStarted org.apache.maven.plugins:maven-dependency-plugin:2.1(default)
[INFO]
[INFO] --- maven-dependency-plugin:2.1:unpack-dependencies (default) @ tika-bundle ---
[INFO] Unpacking /home/jenkins/jenkins-slave/maven-repositories/1/edu/ucar/netcdf/4.2-min/netcdf-4.2-min.jar to
  <https://builds.apache.org/job/Tika-trunk/ws/trunk/tika-bundle/target/classes>
   with includes null and excludes:ucar/nc2/iosp/fysat/Fysat*.class,
                ucar/nc2/dataset/transform/VOceanSG1*class,
                ucar/unidata/geoloc/vertical/OceanSG*.class,
                META-INF/**,CHANGES,README
mojoSucceeded org.apache.maven.plugins:maven-dependency-plugin:2.1(default)
mojoStarted org.apache.felix:maven-bundle-plugin:2.3.4(default-bundle)
[INFO]
[INFO] --- maven-bundle-plugin:2.3.4:bundle (default-bundle) @ tika-bundle ---
[WARNING] Embed-Dependency: clause "commons-io" did not match any dependencies
mojoSucceeded org.apache.felix:maven-bundle-plugin:2.3.4(default-bundle)
mojoStarted org.apache.maven.plugins:maven-site-plugin:3.0(attach-descriptor)
[INFO]
[INFO] --- maven-site-plugin:3.0:attach-descriptor (attach-descriptor) @ tika-bundle ---
mojoSucceeded org.apache.maven.plugins:maven-site-plugin:3.0(attach-descriptor)
[INFO] No excludes
mojoStarted org.apache.rat:apache-rat-plugin:0.7(default)
[INFO]
[INFO] --- apache-rat-plugin:0.7:check (default) @ tika-bundle ---
mojoSucceeded org.apache.rat:apache-rat-plugin:0.7(default)
[PMD] No report found for mojo check
[INFO] Installing <https://builds.apache.org/job/Tika-trunk/ws/trunk/tika-bundle/target/tika-bundle-1.4-SNAPSHOT.jar> to /home/jenkins/jenkins-slave/maven-repositories/1/org/apache/tika/tika-bundle/1.4-SNAPSHOT/tika-bundle-1.4-SNAPSHOT.jar
mojoStarted org.apache.maven.plugins:maven-install-plugin:2.3.1(default-install)
[INFO]
[INFO] --- maven-install-plugin:2.3.1:install (default-install) @ tika-bundle ---
[INFO] Installing <https://builds.apache.org/job/Tika-trunk/ws/trunk/tika-bundle/pom.xml> to /home/jenkins/jenkins-slave/maven-repositories/1/org/apache/tika/tika-bundle/1.4-SNAPSHOT/tika-bundle-1.4-SNAPSHOT.pom
mojoSucceeded org.apache.maven.plugins:maven-install-plugin:2.3.1(default-install)
[INFO] Local OBR update disabled (enable with -DobrRepository)
mojoStarted org.apache.felix:maven-bundle-plugin:2.3.4(default-install)
[INFO]
[INFO] --- maven-bundle-plugin:2.3.4:install (default-install) @ tika-bundle ---
mojoSucceeded org.apache.felix:maven-bundle-plugin:2.3.4(default-install)
mojoStarted org.apache.maven.plugins:maven-deploy-plugin:2.6(default-deploy)Downloading: https://repository.apache.org/content/repositories/snapshots/org/apache/tika/tika-bundle/1.4-SNAPSHOT/maven-metadata.xml

[INFO]
[INFO] --- maven-deploy-plugin:2.6:deploy (default-deploy) @ tika-bundle ---
Downloaded: https://repository.apache.org/content/repositories/snapshots/org/apache/tika/tika-bundle/1.4-SNAPSHOT/maven-metadata.xml (770 B at 2.1 KB/sec)
Uploading: https://repository.apache.org/content/repositories/snapshots/org/apache/tika/tika-bundle/1.4-SNAPSHOT/tika-bundle-1.4-20130207.175707-9.jar
Uploaded: https://repository.apache.org/content/repositories/snapshots/org/apache/tika/tika-bundle/1.4-SNAPSHOT/tika-bundle-1.4-20130207.175707-9.jar (22134 KB at 3715.6 KB/sec)
Uploading: https://repository.apache.org/content/repositories/snapshots/org/apache/tika/tika-bundle/1.4-SNAPSHOT/tika-bundle-1.4-20130207.175707-9.pom
Uploaded: https://repository.apache.org/content/repositories/snapshots/org/apache/tika/tika-bundle/1.4-SNAPSHOT/tika-bundle-1.4-20130207.175707-9.pom (11 KB at 30.2 KB/sec)
Downloading: https://repository.apache.org/content/repositories/snapshots/org/apache/tika/tika-bundle/maven-metadata.xml
Downloaded: https://repository.apache.org/content/repositories/snapshots/org/apache/tika/tika-bundle/maven-metadata.xml (342 B at 1.1 KB/sec)
Uploading: https://repository.apache.org/content/repositories/snapshots/org/apache/tika/tika-bundle/1.4-SNAPSHOT/maven-metadata.xml
Uploaded: https://repository.apache.org/content/repositories/snapshots/org/apache/tika/tika-bundle/1.4-SNAPSHOT/maven-metadata.xml (770 B at 2.6 KB/sec)
Uploading: https://repository.apache.org/content/repositories/snapshots/org/apache/tika/tika-bundle/maven-metadata.xml
Uploaded: https://repository.apache.org/content/repositories/snapshots/org/apache/tika/tika-bundle/maven-metadata.xml (342 B at 0.9 KB/sec)
mojoSucceeded org.apache.maven.plugins:maven-deploy-plugin:2.6(default-deploy)
[INFO] Remote OBR update disabled (enable with -DremoteOBR)
mojoStarted org.apache.felix:maven-bundle-plugin:2.3.4(default-deploy)
[INFO]
[INFO] --- maven-bundle-plugin:2.3.4:deploy (default-deploy) @ tika-bundle ---
mojoSucceeded org.apache.felix:maven-bundle-plugin:2.3.4(default-deploy)
projectSucceeded org.apache.tika:tika-bundle:1.4-SNAPSHOT
projectStarted org.apache.tika:tika-server:1.4-SNAPSHOT
[INFO]                                                                        
[INFO] ------------------------------------------------------------------------
[INFO] Building Apache Tika server 1.4-SNAPSHOT
[INFO] ------------------------------------------------------------------------
[INFO] Deleting <https://builds.apache.org/job/Tika-trunk/ws/trunk/tika-server/target>
mojoStarted org.apache.maven.plugins:maven-clean-plugin:2.4.1(default-clean)
[INFO]
[INFO] --- maven-clean-plugin:2.4.1:clean (default-clean) @ tika-server ---
mojoSucceeded org.apache.maven.plugins:maven-clean-plugin:2.4.1(default-clean)
[TASKS] Scanning folder '<https://builds.apache.org/job/Tika-trunk/ws/trunk/tika-server'> for files matching the pattern '**/*.java' - excludes:
[TASKS] Found 18 files to scan for tasks
Found 0 open tasks.
[TASKS] Computing warning deltas based on reference build #971
mojoStarted org.apache.maven.plugins:maven-remote-resources-plugin:1.2.1(default)
[INFO]
[INFO] --- maven-remote-resources-plugin:1.2.1:process (default) @ tika-server ---
mojoSucceeded org.apache.maven.plugins:maven-remote-resources-plugin:1.2.1(default)
mojoStarted org.apache.maven.plugins:maven-resources-plugin:2.5(default-resources)[debug] execute contextualize
[INFO] Using 'UTF-8' encoding to copy filtered resources.
[INFO] Copying 2 resources
[INFO] Copying 3 resources

[INFO]
[INFO] --- maven-resources-plugin:2.5:resources (default-resources) @ tika-server ---
mojoSucceeded org.apache.maven.plugins:maven-resources-plugin:2.5(default-resources)
mojoStarted org.apache.maven.plugins:maven-compiler-plugin:2.3.2(default-compile)[INFO] Compiling 12 source files to <https://builds.apache.org/job/Tika-trunk/ws/trunk/tika-server/target/classes>

[INFO]
[INFO] --- maven-compiler-plugin:2.3.2:compile (default-compile) @ tika-server ---
[INFO] -------------------------------------------------------------
[ERROR] COMPILATION ERROR :
[INFO] -------------------------------------------------------------
[ERROR] <https://builds.apache.org/job/Tika-trunk/ws/trunk/tika-server/src/main/java/org/apache/tika/server/CSVMessageBodyWriter.java>:[51,3] method does not override a method from its superclass
[ERROR] <https://builds.apache.org/job/Tika-trunk/ws/trunk/tika-server/src/main/java/org/apache/tika/server/JSONMessageBodyWriter.java>:[51,3] method does not override a method from its superclass
[INFO] 2 errors
[INFO] -------------------------------------------------------------
mojoFailed org.apache.maven.plugins:maven-compiler-plugin:2.3.2(default-compile)
projectFailed org.apache.tika:tika-server:1.4-SNAPSHOT
sessionEnded
[INFO] ------------------------------------------------------------------------
[INFO] Reactor Summary:
[INFO]
[INFO] Apache Tika parent ................................ SUCCESS [38.797s]
[INFO] Apache Tika core .................................. SUCCESS [1:25.237s]
[INFO] Apache Tika parsers ............................... SUCCESS [3:13.459s]
[INFO] Apache Tika XMP ................................... SUCCESS [18.483s]
[INFO] Apache Tika application ........................... SUCCESS [1:12.318s]
[INFO] Apache Tika OSGi bundle ........................... SUCCESS [1:02.529s]
[INFO] Apache Tika server ................................ FAILURE [9.538s]
[INFO] Apache Tika ....................................... SKIPPED
[INFO] ------------------------------------------------------------------------
[INFO] BUILD FAILURE
[INFO] ------------------------------------------------------------------------
[INFO] Total time: 8:08.879s
[INFO] Finished at: Thu Feb 07 17:57:26 UTC 2013
[INFO] Final Memory: 41M/305M
[INFO] ------------------------------------------------------------------------
Projects to build: [MavenProject: org.apache.tika:tika-parent:1.4-SNAPSHOT @ <https://builds.apache.org/job/Tika-trunk/ws/trunk/tika-parent/pom.xml,> MavenProject: org.apache.tika:tika-core:1.4-SNAPSHOT @ <https://builds.apache.org/job/Tika-trunk/ws/trunk/tika-core/pom.xml,> MavenProject: org.apache.tika:tika-parsers:1.4-SNAPSHOT @ <https://builds.apache.org/job/Tika-trunk/ws/trunk/tika-parsers/pom.xml,> MavenProject: org.apache.tika:tika-xmp:1.4-SNAPSHOT @ <https://builds.apache.org/job/Tika-trunk/ws/trunk/tika-xmp/pom.xml,> MavenProject: org.apache.tika:tika-app:1.4-SNAPSHOT @ <https://builds.apache.org/job/Tika-trunk/ws/trunk/tika-app/pom.xml,> MavenProject: org.apache.tika:tika-bundle:1.4-SNAPSHOT @ <https://builds.apache.org/job/Tika-trunk/ws/trunk/tika-bundle/pom.xml,> MavenProject: org.apache.tika:tika-server:1.4-SNAPSHOT @ <https://builds.apache.org/job/Tika-trunk/ws/trunk/tika-server/pom.xml,> MavenProject: org.apache.tika:tika:1.4-SNAPSHOT @ <https://builds.apache.org/job/Tika-trunk/ws/trunk/pom.xml]>
[JENKINS] Archiving <https://builds.apache.org/job/Tika-trunk/ws/trunk/pom.xml> to /home/hudson/hudson/jobs/Tika-trunk/modules/org.apache.tika$tika/builds/2013-02-07_17-48-50/archive/org.apache.tika/tika/1.4-SNAPSHOT/tika-1.4-SNAPSHOT.pom
[JENKINS] Archiving <https://builds.apache.org/job/Tika-trunk/ws/trunk/tika-parent/pom.xml> to /home/hudson/hudson/jobs/Tika-trunk/modules/org.apache.tika$tika-parent/builds/2013-02-07_17-48-50/archive/org.apache.tika/tika-parent/1.4-SNAPSHOT/tika-parent-1.4-SNAPSHOT.pom
[JENKINS] Archiving <https://builds.apache.org/job/Tika-trunk/ws/trunk/tika-parsers/pom.xml> to /home/hudson/hudson/jobs/Tika-trunk/modules/org.apache.tika$tika-parsers/builds/2013-02-07_17-48-50/archive/org.apache.tika/tika-parsers/1.4-SNAPSHOT/tika-parsers-1.4-SNAPSHOT.pom
[JENKINS] Archiving <https://builds.apache.org/job/Tika-trunk/ws/trunk/tika-parsers/target/tika-parsers-1.4-SNAPSHOT.jar> to /home/hudson/hudson/jobs/Tika-trunk/modules/org.apache.tika$tika-parsers/builds/2013-02-07_17-48-50/archive/org.apache.tika/tika-parsers/1.4-20130207.175438-9/tika-parsers-1.4-20130207.175438-9.jar
[JENKINS] Archiving <https://builds.apache.org/job/Tika-trunk/ws/trunk/tika-xmp/pom.xml> to /home/hudson/hudson/jobs/Tika-trunk/modules/org.apache.tika$tika-xmp/builds/2013-02-07_17-48-50/archive/org.apache.tika/tika-xmp/1.4-SNAPSHOT/tika-xmp-1.4-SNAPSHOT.pom
[JENKINS] Archiving <https://builds.apache.org/job/Tika-trunk/ws/trunk/tika-xmp/target/tika-xmp-1.4-SNAPSHOT.jar> to /home/hudson/hudson/jobs/Tika-trunk/modules/org.apache.tika$tika-xmp/builds/2013-02-07_17-48-50/archive/org.apache.tika/tika-xmp/1.4-20130207.175457-9/tika-xmp-1.4-20130207.175457-9.jar
[JENKINS] Archiving <https://builds.apache.org/job/Tika-trunk/ws/trunk/tika-app/pom.xml> to /home/hudson/hudson/jobs/Tika-trunk/modules/org.apache.tika$tika-app/builds/2013-02-07_17-48-50/archive/org.apache.tika/tika-app/1.4-SNAPSHOT/tika-app-1.4-SNAPSHOT.pom
[JENKINS] Archiving <https://builds.apache.org/job/Tika-trunk/ws/trunk/tika-app/target/tika-app-1.4-SNAPSHOT.jar> to /home/hudson/hudson/jobs/Tika-trunk/modules/org.apache.tika$tika-app/builds/2013-02-07_17-48-50/archive/org.apache.tika/tika-app/1.4-20130207.175603-9/tika-app-1.4-20130207.175603-9.jar
[JENKINS] Archiving <https://builds.apache.org/job/Tika-trunk/ws/trunk/tika-server/pom.xml> to /home/hudson/hudson/jobs/Tika-trunk/modules/org.apache.tika$tika-server/builds/2013-02-07_17-48-50/archive/org.apache.tika/tika-server/1.4-SNAPSHOT/tika-server-1.4-SNAPSHOT.pom
[JENKINS] Archiving <https://builds.apache.org/job/Tika-trunk/ws/trunk/tika-core/pom.xml> to /home/hudson/hudson/jobs/Tika-trunk/modules/org.apache.tika$tika-core/builds/2013-02-07_17-48-50/archive/org.apache.tika/tika-core/1.4-SNAPSHOT/tika-core-1.4-SNAPSHOT.pom
[JENKINS] Archiving <https://builds.apache.org/job/Tika-trunk/ws/trunk/tika-core/target/tika-core-1.4-SNAPSHOT.jar> to /home/hudson/hudson/jobs/Tika-trunk/modules/org.apache.tika$tika-core/builds/2013-02-07_17-48-50/archive/org.apache.tika/tika-core/1.4-20130207.175124-9/tika-core-1.4-20130207.175124-9.jar
[JENKINS] Archiving <https://builds.apache.org/job/Tika-trunk/ws/trunk/tika-bundle/pom.xml> to /home/hudson/hudson/jobs/Tika-trunk/modules/org.apache.tika$tika-bundle/builds/2013-02-07_17-48-50/archive/org.apache.tika/tika-bundle/1.4-SNAPSHOT/tika-bundle-1.4-SNAPSHOT.pom
[JENKINS] Archiving <https://builds.apache.org/job/Tika-trunk/ws/trunk/tika-bundle/target/tika-bundle-1.4-SNAPSHOT.jar> to /home/hudson/hudson/jobs/Tika-trunk/modules/org.apache.tika$tika-bundle/builds/2013-02-07_17-48-50/archive/org.apache.tika/tika-bundle/1.4-20130207.175707-9/tika-bundle-1.4-20130207.175707-9.jar
Waiting for Jenkins to finish collecting data
mavenExecutionResult exceptions not empty
message : Failed to execute goal org.apache.maven.plugins:maven-compiler-plugin:2.3.2:compile (default-compile) on project tika-server: Compilation failure
cause : Compilation failure
Stack trace :
org.apache.maven.lifecycle.LifecycleExecutionException: Failed to execute goal org.apache.maven.plugins:maven-compiler-plugin:2.3.2:compile (default-compile) on project tika-server: Compilation failure
        at org.apache.maven.lifecycle.internal.MojoExecutor.execute(MojoExecutor.java:213)
        at org.apache.maven.lifecycle.internal.MojoExecutor.execute(MojoExecutor.java:153)
        at org.apache.maven.lifecycle.internal.MojoExecutor.execute(MojoExecutor.java:145)
        at org.apache.maven.lifecycle.internal.LifecycleModuleBuilder.buildProject(LifecycleModuleBuilder.java:84)
        at org.apache.maven.lifecycle.internal.LifecycleModuleBuilder.buildProject(LifecycleModuleBuilder.java:59)
        at org.apache.maven.lifecycle.internal.LifecycleStarter.singleThreadedBuild(LifecycleStarter.java:183)
        at org.apache.maven.lifecycle.internal.LifecycleStarter.execute(LifecycleStarter.java:161)
        at org.apache.maven.DefaultMaven.doExecute(DefaultMaven.java:320)
        at org.apache.maven.DefaultMaven.execute(DefaultMaven.java:156)
        at org.jvnet.hudson.maven3.launcher.Maven3Launcher.main(Maven3Launcher.java:79)
        at sun.reflect.NativeMethodAccessorImpl.invoke0(Native Method)
        at sun.reflect.NativeMethodAccessorImpl.invoke(NativeMethodAccessorImpl.java:39)
        at sun.reflect.DelegatingMethodAccessorImpl.invoke(DelegatingMethodAccessorImpl.java:25)
        at java.lang.reflect.Method.invoke(Method.java:592)
        at org.codehaus.plexus.classworlds.launcher.Launcher.launchStandard(Launcher.java:329)
        at org.codehaus.plexus.classworlds.launcher.Launcher.launch(Launcher.java:239)
        at org.jvnet.hudson.maven3.agent.Maven3Main.launch(Maven3Main.java:158)
        at hudson.maven.Maven3Builder.call(Maven3Builder.java:100)
        at hudson.maven.Maven3Builder.call(Maven3Builder.java:66)
        at hudson.remoting.UserRequest.perform(UserRequest.java:118)
        at hudson.remoting.UserRequest.perform(UserRequest.java:48)
        at hudson.remoting.Request$2.run(Request.java:326)
        at hudson.remoting.InterceptingExecutorService$1.call(InterceptingExecutorService.java:72)
        at java.util.concurrent.FutureTask$Sync.innerRun(FutureTask.java:269)
        at java.util.concurrent.FutureTask.run(FutureTask.java:123)
        at java.util.concurrent.ThreadPoolExecutor$Worker.runTask(ThreadPoolExecutor.java:651)
        at java.util.concurrent.ThreadPoolExecutor$Worker.run(ThreadPoolExecutor.java:676)
        at java.lang.Thread.run(Thread.java:595)
Caused by: org.apache.maven.plugin.CompilationFailureException: Compilation failure
        at org.apache.maven.plugin.AbstractCompilerMojo.execute(AbstractCompilerMojo.java:656)
        at org.apache.maven.plugin.CompilerMojo.execute(CompilerMojo.java:128)
        at org.apache.maven.plugin.DefaultBuildPluginManager.executeMojo(DefaultBuildPluginManager.java:101)
        at org.apache.maven.lifecycle.internal.MojoExecutor.execute(MojoExecutor.java:209)
        ... 27 more
channel stopped
Reply | Threaded
Open this post in threaded view
|

Re: Build failed in Jenkins: Tika-trunk #977

Michael McCandless-2
Hmm it looks like the Tika build is failing on Jenkins due to this:

[ERROR] /home/jenkins/jenkins-slave/workspace/Tika-trunk/trunk/tika-server/src/main/java/org/apache/tika/server/CSVMessageBodyWriter.java:[51,3]
method does not override a method from its superclass
[ERROR] /home/jenkins/jenkins-slave/workspace/Tika-trunk/trunk/tika-server/src/main/java/org/apache/tika/server/JSONMessageBodyWriter.java:[51,3]
method does not override a method from its superclass

I think this is from TIKA-1047?  Anyone know what's up?  "mvn test"
passes for me locally ...

Mike McCandless

http://blog.mikemccandless.com

On Thu, Feb 7, 2013 at 1:03 PM, Apache Jenkins Server
<[hidden email]> wrote:

> See <https://builds.apache.org/job/Tika-trunk/977/changes>
>
> Changes:
>
> [mikemccand] TIKA-1053: upgrade to ASM 4.1
>
> ------------------------------------------
> [...truncated 799 lines...]
> [INFO] Installing <https://builds.apache.org/job/Tika-trunk/ws/trunk/tika-app/pom.xml> to /home/jenkins/jenkins-slave/maven-repositories/1/org/apache/tika/tika-app/1.4-SNAPSHOT/tika-app-1.4-SNAPSHOT.pom
> mojoSucceeded org.apache.maven.plugins:maven-install-plugin:2.3.1(default-install)
> mojoStarted org.apache.maven.plugins:maven-deploy-plugin:2.6(default-deploy)Downloading: https://repository.apache.org/content/repositories/snapshots/org/apache/tika/tika-app/1.4-SNAPSHOT/maven-metadata.xml
>
> [INFO]
> [INFO] --- maven-deploy-plugin:2.6:deploy (default-deploy) @ tika-app ---
> Downloaded: https://repository.apache.org/content/repositories/snapshots/org/apache/tika/tika-app/1.4-SNAPSHOT/maven-metadata.xml (767 B at 1.5 KB/sec)
> Uploading: https://repository.apache.org/content/repositories/snapshots/org/apache/tika/tika-app/1.4-SNAPSHOT/tika-app-1.4-20130207.175603-9.jar
> Uploaded: https://repository.apache.org/content/repositories/snapshots/org/apache/tika/tika-app/1.4-SNAPSHOT/tika-app-1.4-20130207.175603-9.jar (27582 KB at 3644.5 KB/sec)
> Uploading: https://repository.apache.org/content/repositories/snapshots/org/apache/tika/tika-app/1.4-SNAPSHOT/tika-app-1.4-20130207.175603-9.pom
> Uploaded: https://repository.apache.org/content/repositories/snapshots/org/apache/tika/tika-app/1.4-SNAPSHOT/tika-app-1.4-20130207.175603-9.pom (8 KB at 21.7 KB/sec)
> Downloading: https://repository.apache.org/content/repositories/snapshots/org/apache/tika/tika-app/maven-metadata.xml
> Downloaded: https://repository.apache.org/content/repositories/snapshots/org/apache/tika/tika-app/maven-metadata.xml (339 B at 0.8 KB/sec)
> Uploading: https://repository.apache.org/content/repositories/snapshots/org/apache/tika/tika-app/1.4-SNAPSHOT/maven-metadata.xml
> Uploaded: https://repository.apache.org/content/repositories/snapshots/org/apache/tika/tika-app/1.4-SNAPSHOT/maven-metadata.xml (767 B at 2.5 KB/sec)
> Uploading: https://repository.apache.org/content/repositories/snapshots/org/apache/tika/tika-app/maven-metadata.xml
> Uploaded: https://repository.apache.org/content/repositories/snapshots/org/apache/tika/tika-app/maven-metadata.xml (339 B at 0.9 KB/sec)
> mojoSucceeded org.apache.maven.plugins:maven-deploy-plugin:2.6(default-deploy)
> projectSucceeded org.apache.tika:tika-app:1.4-SNAPSHOT
> projectStarted org.apache.tika:tika-bundle:1.4-SNAPSHOT
> [INFO]
> [INFO] ------------------------------------------------------------------------
> [INFO] Building Apache Tika OSGi bundle 1.4-SNAPSHOT
> [INFO] ------------------------------------------------------------------------
> mojoStarted org.apache.maven.plugins:maven-clean-plugin:2.4.1(default-clean)[INFO] Deleting <https://builds.apache.org/job/Tika-trunk/ws/trunk/tika-bundle/target>
>
> [INFO]
> [INFO] --- maven-clean-plugin:2.4.1:clean (default-clean) @ tika-bundle ---
> mojoSucceeded org.apache.maven.plugins:maven-clean-plugin:2.4.1(default-clean)
> [TASKS] Scanning folder '<https://builds.apache.org/job/Tika-trunk/ws/trunk/tika-bundle'> for files matching the pattern '**/*.java' - excludes:
> [TASKS] Found 1 files to scan for tasks
> Found 0 open tasks.
> [TASKS] Computing warning deltas based on reference build #976
> mojoStarted org.apache.maven.plugins:maven-remote-resources-plugin:1.2.1(default)
> [INFO]
> [INFO] --- maven-remote-resources-plugin:1.2.1:process (default) @ tika-bundle ---
> mojoSucceeded org.apache.maven.plugins:maven-remote-resources-plugin:1.2.1(default)
> mojoStarted org.apache.maven.plugins:maven-resources-plugin:2.5(default-resources)[debug] execute contextualize
> [INFO] Using 'UTF-8' encoding to copy filtered resources.
> [INFO] skip non existing resourceDirectory <https://builds.apache.org/job/Tika-trunk/ws/trunk/tika-bundle/src/main/resources>
> [INFO] Copying 3 resources
>
> [INFO]
> [INFO] --- maven-resources-plugin:2.5:resources (default-resources) @ tika-bundle ---
> mojoSucceeded org.apache.maven.plugins:maven-resources-plugin:2.5(default-resources)
> [INFO] No sources to compile
> mojoStarted org.apache.maven.plugins:maven-compiler-plugin:2.3.2(default-compile)
> [INFO]
> [INFO] --- maven-compiler-plugin:2.3.2:compile (default-compile) @ tika-bundle ---
> mojoSucceeded org.apache.maven.plugins:maven-compiler-plugin:2.3.2(default-compile)
> mojoStarted org.apache.maven.plugins:maven-resources-plugin:2.5(default-testResources)[debug] execute contextualize
> [INFO] Using 'UTF-8' encoding to copy filtered resources.
> [INFO] Copying 1 resource
> [INFO] Copying 3 resources
>
> [INFO]
> [INFO] --- maven-resources-plugin:2.5:testResources (default-testResources) @ tika-bundle ---
> mojoSucceeded org.apache.maven.plugins:maven-resources-plugin:2.5(default-testResources)
> mojoStarted org.apache.maven.plugins:maven-compiler-plugin:2.3.2(default-testCompile)
> [INFO]
> [INFO] --- maven-compiler-plugin:2.3.2:testCompile (default-testCompile) @ tika-bundle ---
> [INFO] Compiling 1 source file to <https://builds.apache.org/job/Tika-trunk/ws/trunk/tika-bundle/target/test-classes>
> mojoSucceeded org.apache.maven.plugins:maven-compiler-plugin:2.3.2(default-testCompile)
> mojoStarted org.apache.maven.plugins:maven-surefire-plugin:2.12(default-test)[INFO] Surefire report directory: <https://builds.apache.org/job/Tika-trunk/ws/trunk/tika-bundle/target/surefire-reports>
>
> -------------------------------------------------------
>  T E S T S
> -------------------------------------------------------
>
> [INFO]
> [INFO] --- maven-surefire-plugin:2.12:test (default-test) @ tika-bundle ---
>
> Results :
>
> Tests run: 0, Failures: 0, Errors: 0, Skipped: 0
>
> mojoSucceeded org.apache.maven.plugins:maven-surefire-plugin:2.12(default-test)
> [JENKINS] Recording test results
> mojoStarted org.apache.maven.plugins:maven-dependency-plugin:2.1(default)
> [INFO]
> [INFO] --- maven-dependency-plugin:2.1:unpack-dependencies (default) @ tika-bundle ---
> [INFO] Unpacking /home/jenkins/jenkins-slave/maven-repositories/1/edu/ucar/netcdf/4.2-min/netcdf-4.2-min.jar to
>   <https://builds.apache.org/job/Tika-trunk/ws/trunk/tika-bundle/target/classes>
>    with includes null and excludes:ucar/nc2/iosp/fysat/Fysat*.class,
>                 ucar/nc2/dataset/transform/VOceanSG1*class,
>                 ucar/unidata/geoloc/vertical/OceanSG*.class,
>                 META-INF/**,CHANGES,README
> mojoSucceeded org.apache.maven.plugins:maven-dependency-plugin:2.1(default)
> mojoStarted org.apache.felix:maven-bundle-plugin:2.3.4(default-bundle)
> [INFO]
> [INFO] --- maven-bundle-plugin:2.3.4:bundle (default-bundle) @ tika-bundle ---
> [WARNING] Embed-Dependency: clause "commons-io" did not match any dependencies
> mojoSucceeded org.apache.felix:maven-bundle-plugin:2.3.4(default-bundle)
> mojoStarted org.apache.maven.plugins:maven-site-plugin:3.0(attach-descriptor)
> [INFO]
> [INFO] --- maven-site-plugin:3.0:attach-descriptor (attach-descriptor) @ tika-bundle ---
> mojoSucceeded org.apache.maven.plugins:maven-site-plugin:3.0(attach-descriptor)
> [INFO] No excludes
> mojoStarted org.apache.rat:apache-rat-plugin:0.7(default)
> [INFO]
> [INFO] --- apache-rat-plugin:0.7:check (default) @ tika-bundle ---
> mojoSucceeded org.apache.rat:apache-rat-plugin:0.7(default)
> [PMD] No report found for mojo check
> [INFO] Installing <https://builds.apache.org/job/Tika-trunk/ws/trunk/tika-bundle/target/tika-bundle-1.4-SNAPSHOT.jar> to /home/jenkins/jenkins-slave/maven-repositories/1/org/apache/tika/tika-bundle/1.4-SNAPSHOT/tika-bundle-1.4-SNAPSHOT.jar
> mojoStarted org.apache.maven.plugins:maven-install-plugin:2.3.1(default-install)
> [INFO]
> [INFO] --- maven-install-plugin:2.3.1:install (default-install) @ tika-bundle ---
> [INFO] Installing <https://builds.apache.org/job/Tika-trunk/ws/trunk/tika-bundle/pom.xml> to /home/jenkins/jenkins-slave/maven-repositories/1/org/apache/tika/tika-bundle/1.4-SNAPSHOT/tika-bundle-1.4-SNAPSHOT.pom
> mojoSucceeded org.apache.maven.plugins:maven-install-plugin:2.3.1(default-install)
> [INFO] Local OBR update disabled (enable with -DobrRepository)
> mojoStarted org.apache.felix:maven-bundle-plugin:2.3.4(default-install)
> [INFO]
> [INFO] --- maven-bundle-plugin:2.3.4:install (default-install) @ tika-bundle ---
> mojoSucceeded org.apache.felix:maven-bundle-plugin:2.3.4(default-install)
> mojoStarted org.apache.maven.plugins:maven-deploy-plugin:2.6(default-deploy)Downloading: https://repository.apache.org/content/repositories/snapshots/org/apache/tika/tika-bundle/1.4-SNAPSHOT/maven-metadata.xml
>
> [INFO]
> [INFO] --- maven-deploy-plugin:2.6:deploy (default-deploy) @ tika-bundle ---
> Downloaded: https://repository.apache.org/content/repositories/snapshots/org/apache/tika/tika-bundle/1.4-SNAPSHOT/maven-metadata.xml (770 B at 2.1 KB/sec)
> Uploading: https://repository.apache.org/content/repositories/snapshots/org/apache/tika/tika-bundle/1.4-SNAPSHOT/tika-bundle-1.4-20130207.175707-9.jar
> Uploaded: https://repository.apache.org/content/repositories/snapshots/org/apache/tika/tika-bundle/1.4-SNAPSHOT/tika-bundle-1.4-20130207.175707-9.jar (22134 KB at 3715.6 KB/sec)
> Uploading: https://repository.apache.org/content/repositories/snapshots/org/apache/tika/tika-bundle/1.4-SNAPSHOT/tika-bundle-1.4-20130207.175707-9.pom
> Uploaded: https://repository.apache.org/content/repositories/snapshots/org/apache/tika/tika-bundle/1.4-SNAPSHOT/tika-bundle-1.4-20130207.175707-9.pom (11 KB at 30.2 KB/sec)
> Downloading: https://repository.apache.org/content/repositories/snapshots/org/apache/tika/tika-bundle/maven-metadata.xml
> Downloaded: https://repository.apache.org/content/repositories/snapshots/org/apache/tika/tika-bundle/maven-metadata.xml (342 B at 1.1 KB/sec)
> Uploading: https://repository.apache.org/content/repositories/snapshots/org/apache/tika/tika-bundle/1.4-SNAPSHOT/maven-metadata.xml
> Uploaded: https://repository.apache.org/content/repositories/snapshots/org/apache/tika/tika-bundle/1.4-SNAPSHOT/maven-metadata.xml (770 B at 2.6 KB/sec)
> Uploading: https://repository.apache.org/content/repositories/snapshots/org/apache/tika/tika-bundle/maven-metadata.xml
> Uploaded: https://repository.apache.org/content/repositories/snapshots/org/apache/tika/tika-bundle/maven-metadata.xml (342 B at 0.9 KB/sec)
> mojoSucceeded org.apache.maven.plugins:maven-deploy-plugin:2.6(default-deploy)
> [INFO] Remote OBR update disabled (enable with -DremoteOBR)
> mojoStarted org.apache.felix:maven-bundle-plugin:2.3.4(default-deploy)
> [INFO]
> [INFO] --- maven-bundle-plugin:2.3.4:deploy (default-deploy) @ tika-bundle ---
> mojoSucceeded org.apache.felix:maven-bundle-plugin:2.3.4(default-deploy)
> projectSucceeded org.apache.tika:tika-bundle:1.4-SNAPSHOT
> projectStarted org.apache.tika:tika-server:1.4-SNAPSHOT
> [INFO]
> [INFO] ------------------------------------------------------------------------
> [INFO] Building Apache Tika server 1.4-SNAPSHOT
> [INFO] ------------------------------------------------------------------------
> [INFO] Deleting <https://builds.apache.org/job/Tika-trunk/ws/trunk/tika-server/target>
> mojoStarted org.apache.maven.plugins:maven-clean-plugin:2.4.1(default-clean)
> [INFO]
> [INFO] --- maven-clean-plugin:2.4.1:clean (default-clean) @ tika-server ---
> mojoSucceeded org.apache.maven.plugins:maven-clean-plugin:2.4.1(default-clean)
> [TASKS] Scanning folder '<https://builds.apache.org/job/Tika-trunk/ws/trunk/tika-server'> for files matching the pattern '**/*.java' - excludes:
> [TASKS] Found 18 files to scan for tasks
> Found 0 open tasks.
> [TASKS] Computing warning deltas based on reference build #971
> mojoStarted org.apache.maven.plugins:maven-remote-resources-plugin:1.2.1(default)
> [INFO]
> [INFO] --- maven-remote-resources-plugin:1.2.1:process (default) @ tika-server ---
> mojoSucceeded org.apache.maven.plugins:maven-remote-resources-plugin:1.2.1(default)
> mojoStarted org.apache.maven.plugins:maven-resources-plugin:2.5(default-resources)[debug] execute contextualize
> [INFO] Using 'UTF-8' encoding to copy filtered resources.
> [INFO] Copying 2 resources
> [INFO] Copying 3 resources
>
> [INFO]
> [INFO] --- maven-resources-plugin:2.5:resources (default-resources) @ tika-server ---
> mojoSucceeded org.apache.maven.plugins:maven-resources-plugin:2.5(default-resources)
> mojoStarted org.apache.maven.plugins:maven-compiler-plugin:2.3.2(default-compile)[INFO] Compiling 12 source files to <https://builds.apache.org/job/Tika-trunk/ws/trunk/tika-server/target/classes>
>
> [INFO]
> [INFO] --- maven-compiler-plugin:2.3.2:compile (default-compile) @ tika-server ---
> [INFO] -------------------------------------------------------------
> [ERROR] COMPILATION ERROR :
> [INFO] -------------------------------------------------------------
> [ERROR] <https://builds.apache.org/job/Tika-trunk/ws/trunk/tika-server/src/main/java/org/apache/tika/server/CSVMessageBodyWriter.java>:[51,3] method does not override a method from its superclass
> [ERROR] <https://builds.apache.org/job/Tika-trunk/ws/trunk/tika-server/src/main/java/org/apache/tika/server/JSONMessageBodyWriter.java>:[51,3] method does not override a method from its superclass
> [INFO] 2 errors
> [INFO] -------------------------------------------------------------
> mojoFailed org.apache.maven.plugins:maven-compiler-plugin:2.3.2(default-compile)
> projectFailed org.apache.tika:tika-server:1.4-SNAPSHOT
> sessionEnded
> [INFO] ------------------------------------------------------------------------
> [INFO] Reactor Summary:
> [INFO]
> [INFO] Apache Tika parent ................................ SUCCESS [38.797s]
> [INFO] Apache Tika core .................................. SUCCESS [1:25.237s]
> [INFO] Apache Tika parsers ............................... SUCCESS [3:13.459s]
> [INFO] Apache Tika XMP ................................... SUCCESS [18.483s]
> [INFO] Apache Tika application ........................... SUCCESS [1:12.318s]
> [INFO] Apache Tika OSGi bundle ........................... SUCCESS [1:02.529s]
> [INFO] Apache Tika server ................................ FAILURE [9.538s]
> [INFO] Apache Tika ....................................... SKIPPED
> [INFO] ------------------------------------------------------------------------
> [INFO] BUILD FAILURE
> [INFO] ------------------------------------------------------------------------
> [INFO] Total time: 8:08.879s
> [INFO] Finished at: Thu Feb 07 17:57:26 UTC 2013
> [INFO] Final Memory: 41M/305M
> [INFO] ------------------------------------------------------------------------
> Projects to build: [MavenProject: org.apache.tika:tika-parent:1.4-SNAPSHOT @ <https://builds.apache.org/job/Tika-trunk/ws/trunk/tika-parent/pom.xml,> MavenProject: org.apache.tika:tika-core:1.4-SNAPSHOT @ <https://builds.apache.org/job/Tika-trunk/ws/trunk/tika-core/pom.xml,> MavenProject: org.apache.tika:tika-parsers:1.4-SNAPSHOT @ <https://builds.apache.org/job/Tika-trunk/ws/trunk/tika-parsers/pom.xml,> MavenProject: org.apache.tika:tika-xmp:1.4-SNAPSHOT @ <https://builds.apache.org/job/Tika-trunk/ws/trunk/tika-xmp/pom.xml,> MavenProject: org.apache.tika:tika-app:1.4-SNAPSHOT @ <https://builds.apache.org/job/Tika-trunk/ws/trunk/tika-app/pom.xml,> MavenProject: org.apache.tika:tika-bundle:1.4-SNAPSHOT @ <https://builds.apache.org/job/Tika-trunk/ws/trunk/tika-bundle/pom.xml,> MavenProject: org.apache.tika:tika-server:1.4-SNAPSHOT @ <https://builds.apache.org/job/Tika-trunk/ws/trunk/tika-server/pom.xml,> MavenProject: org.apache.tika:tika:1.4-SNAPSHOT @ <https://builds.apache.org/job/Tika-trunk/ws/trunk/pom.xml]>
> [JENKINS] Archiving <https://builds.apache.org/job/Tika-trunk/ws/trunk/pom.xml> to /home/hudson/hudson/jobs/Tika-trunk/modules/org.apache.tika$tika/builds/2013-02-07_17-48-50/archive/org.apache.tika/tika/1.4-SNAPSHOT/tika-1.4-SNAPSHOT.pom
> [JENKINS] Archiving <https://builds.apache.org/job/Tika-trunk/ws/trunk/tika-parent/pom.xml> to /home/hudson/hudson/jobs/Tika-trunk/modules/org.apache.tika$tika-parent/builds/2013-02-07_17-48-50/archive/org.apache.tika/tika-parent/1.4-SNAPSHOT/tika-parent-1.4-SNAPSHOT.pom
> [JENKINS] Archiving <https://builds.apache.org/job/Tika-trunk/ws/trunk/tika-parsers/pom.xml> to /home/hudson/hudson/jobs/Tika-trunk/modules/org.apache.tika$tika-parsers/builds/2013-02-07_17-48-50/archive/org.apache.tika/tika-parsers/1.4-SNAPSHOT/tika-parsers-1.4-SNAPSHOT.pom
> [JENKINS] Archiving <https://builds.apache.org/job/Tika-trunk/ws/trunk/tika-parsers/target/tika-parsers-1.4-SNAPSHOT.jar> to /home/hudson/hudson/jobs/Tika-trunk/modules/org.apache.tika$tika-parsers/builds/2013-02-07_17-48-50/archive/org.apache.tika/tika-parsers/1.4-20130207.175438-9/tika-parsers-1.4-20130207.175438-9.jar
> [JENKINS] Archiving <https://builds.apache.org/job/Tika-trunk/ws/trunk/tika-xmp/pom.xml> to /home/hudson/hudson/jobs/Tika-trunk/modules/org.apache.tika$tika-xmp/builds/2013-02-07_17-48-50/archive/org.apache.tika/tika-xmp/1.4-SNAPSHOT/tika-xmp-1.4-SNAPSHOT.pom
> [JENKINS] Archiving <https://builds.apache.org/job/Tika-trunk/ws/trunk/tika-xmp/target/tika-xmp-1.4-SNAPSHOT.jar> to /home/hudson/hudson/jobs/Tika-trunk/modules/org.apache.tika$tika-xmp/builds/2013-02-07_17-48-50/archive/org.apache.tika/tika-xmp/1.4-20130207.175457-9/tika-xmp-1.4-20130207.175457-9.jar
> [JENKINS] Archiving <https://builds.apache.org/job/Tika-trunk/ws/trunk/tika-app/pom.xml> to /home/hudson/hudson/jobs/Tika-trunk/modules/org.apache.tika$tika-app/builds/2013-02-07_17-48-50/archive/org.apache.tika/tika-app/1.4-SNAPSHOT/tika-app-1.4-SNAPSHOT.pom
> [JENKINS] Archiving <https://builds.apache.org/job/Tika-trunk/ws/trunk/tika-app/target/tika-app-1.4-SNAPSHOT.jar> to /home/hudson/hudson/jobs/Tika-trunk/modules/org.apache.tika$tika-app/builds/2013-02-07_17-48-50/archive/org.apache.tika/tika-app/1.4-20130207.175603-9/tika-app-1.4-20130207.175603-9.jar
> [JENKINS] Archiving <https://builds.apache.org/job/Tika-trunk/ws/trunk/tika-server/pom.xml> to /home/hudson/hudson/jobs/Tika-trunk/modules/org.apache.tika$tika-server/builds/2013-02-07_17-48-50/archive/org.apache.tika/tika-server/1.4-SNAPSHOT/tika-server-1.4-SNAPSHOT.pom
> [JENKINS] Archiving <https://builds.apache.org/job/Tika-trunk/ws/trunk/tika-core/pom.xml> to /home/hudson/hudson/jobs/Tika-trunk/modules/org.apache.tika$tika-core/builds/2013-02-07_17-48-50/archive/org.apache.tika/tika-core/1.4-SNAPSHOT/tika-core-1.4-SNAPSHOT.pom
> [JENKINS] Archiving <https://builds.apache.org/job/Tika-trunk/ws/trunk/tika-core/target/tika-core-1.4-SNAPSHOT.jar> to /home/hudson/hudson/jobs/Tika-trunk/modules/org.apache.tika$tika-core/builds/2013-02-07_17-48-50/archive/org.apache.tika/tika-core/1.4-20130207.175124-9/tika-core-1.4-20130207.175124-9.jar
> [JENKINS] Archiving <https://builds.apache.org/job/Tika-trunk/ws/trunk/tika-bundle/pom.xml> to /home/hudson/hudson/jobs/Tika-trunk/modules/org.apache.tika$tika-bundle/builds/2013-02-07_17-48-50/archive/org.apache.tika/tika-bundle/1.4-SNAPSHOT/tika-bundle-1.4-SNAPSHOT.pom
> [JENKINS] Archiving <https://builds.apache.org/job/Tika-trunk/ws/trunk/tika-bundle/target/tika-bundle-1.4-SNAPSHOT.jar> to /home/hudson/hudson/jobs/Tika-trunk/modules/org.apache.tika$tika-bundle/builds/2013-02-07_17-48-50/archive/org.apache.tika/tika-bundle/1.4-20130207.175707-9/tika-bundle-1.4-20130207.175707-9.jar
> Waiting for Jenkins to finish collecting data
> mavenExecutionResult exceptions not empty
> message : Failed to execute goal org.apache.maven.plugins:maven-compiler-plugin:2.3.2:compile (default-compile) on project tika-server: Compilation failure
> cause : Compilation failure
> Stack trace :
> org.apache.maven.lifecycle.LifecycleExecutionException: Failed to execute goal org.apache.maven.plugins:maven-compiler-plugin:2.3.2:compile (default-compile) on project tika-server: Compilation failure
>         at org.apache.maven.lifecycle.internal.MojoExecutor.execute(MojoExecutor.java:213)
>         at org.apache.maven.lifecycle.internal.MojoExecutor.execute(MojoExecutor.java:153)
>         at org.apache.maven.lifecycle.internal.MojoExecutor.execute(MojoExecutor.java:145)
>         at org.apache.maven.lifecycle.internal.LifecycleModuleBuilder.buildProject(LifecycleModuleBuilder.java:84)
>         at org.apache.maven.lifecycle.internal.LifecycleModuleBuilder.buildProject(LifecycleModuleBuilder.java:59)
>         at org.apache.maven.lifecycle.internal.LifecycleStarter.singleThreadedBuild(LifecycleStarter.java:183)
>         at org.apache.maven.lifecycle.internal.LifecycleStarter.execute(LifecycleStarter.java:161)
>         at org.apache.maven.DefaultMaven.doExecute(DefaultMaven.java:320)
>         at org.apache.maven.DefaultMaven.execute(DefaultMaven.java:156)
>         at org.jvnet.hudson.maven3.launcher.Maven3Launcher.main(Maven3Launcher.java:79)
>         at sun.reflect.NativeMethodAccessorImpl.invoke0(Native Method)
>         at sun.reflect.NativeMethodAccessorImpl.invoke(NativeMethodAccessorImpl.java:39)
>         at sun.reflect.DelegatingMethodAccessorImpl.invoke(DelegatingMethodAccessorImpl.java:25)
>         at java.lang.reflect.Method.invoke(Method.java:592)
>         at org.codehaus.plexus.classworlds.launcher.Launcher.launchStandard(Launcher.java:329)
>         at org.codehaus.plexus.classworlds.launcher.Launcher.launch(Launcher.java:239)
>         at org.jvnet.hudson.maven3.agent.Maven3Main.launch(Maven3Main.java:158)
>         at hudson.maven.Maven3Builder.call(Maven3Builder.java:100)
>         at hudson.maven.Maven3Builder.call(Maven3Builder.java:66)
>         at hudson.remoting.UserRequest.perform(UserRequest.java:118)
>         at hudson.remoting.UserRequest.perform(UserRequest.java:48)
>         at hudson.remoting.Request$2.run(Request.java:326)
>         at hudson.remoting.InterceptingExecutorService$1.call(InterceptingExecutorService.java:72)
>         at java.util.concurrent.FutureTask$Sync.innerRun(FutureTask.java:269)
>         at java.util.concurrent.FutureTask.run(FutureTask.java:123)
>         at java.util.concurrent.ThreadPoolExecutor$Worker.runTask(ThreadPoolExecutor.java:651)
>         at java.util.concurrent.ThreadPoolExecutor$Worker.run(ThreadPoolExecutor.java:676)
>         at java.lang.Thread.run(Thread.java:595)
> Caused by: org.apache.maven.plugin.CompilationFailureException: Compilation failure
>         at org.apache.maven.plugin.AbstractCompilerMojo.execute(AbstractCompilerMojo.java:656)
>         at org.apache.maven.plugin.CompilerMojo.execute(CompilerMojo.java:128)
>         at org.apache.maven.plugin.DefaultBuildPluginManager.executeMojo(DefaultBuildPluginManager.java:101)
>         at org.apache.maven.lifecycle.internal.MojoExecutor.execute(MojoExecutor.java:209)
>         ... 27 more
> channel stopped
Reply | Threaded
Open this post in threaded view
|

Re: Build failed in Jenkins: Tika-trunk #977

Mattmann, Chris A (3010)
Hey Mike,

Weird. I did notice in the patch for:

https://issues.apache.org/jira/browse/TIKA-1047


That there were some JDK7 stuff -- I went ahead and fixed it to be JDK6
compat and updated the patch and committed that version as I noted in the
issue comments. I wonder if there was something I missed? I'm running JDK6
on my Mac OS X 10.6.8 and all tests are passing locally for me too.

Thoughts?

Cheers,
Chris

On 2/7/13 10:55 AM, "Michael McCandless" <[hidden email]> wrote:

>Hmm it looks like the Tika build is failing on Jenkins due to this:
>
>[ERROR]
>/home/jenkins/jenkins-slave/workspace/Tika-trunk/trunk/tika-server/src/mai
>n/java/org/apache/tika/server/CSVMessageBodyWriter.java:[51,3]
>method does not override a method from its superclass
>[ERROR]
>/home/jenkins/jenkins-slave/workspace/Tika-trunk/trunk/tika-server/src/mai
>n/java/org/apache/tika/server/JSONMessageBodyWriter.java:[51,3]
>method does not override a method from its superclass
>
>I think this is from TIKA-1047?  Anyone know what's up?  "mvn test"
>passes for me locally ...
>
>Mike McCandless
>
>http://blog.mikemccandless.com
>
>On Thu, Feb 7, 2013 at 1:03 PM, Apache Jenkins Server
><[hidden email]> wrote:
>> See <https://builds.apache.org/job/Tika-trunk/977/changes>
>>
>> Changes:
>>
>> [mikemccand] TIKA-1053: upgrade to ASM 4.1
>>
>> ------------------------------------------
>> [...truncated 799 lines...]
>> [INFO] Installing
>><https://builds.apache.org/job/Tika-trunk/ws/trunk/tika-app/pom.xml> to
>>/home/jenkins/jenkins-slave/maven-repositories/1/org/apache/tika/tika-app
>>/1.4-SNAPSHOT/tika-app-1.4-SNAPSHOT.pom
>> mojoSucceeded
>>org.apache.maven.plugins:maven-install-plugin:2.3.1(default-install)
>> mojoStarted
>>org.apache.maven.plugins:maven-deploy-plugin:2.6(default-deploy)Downloadi
>>ng:
>>https://repository.apache.org/content/repositories/snapshots/org/apache/t
>>ika/tika-app/1.4-SNAPSHOT/maven-metadata.xml
>>
>> [INFO]
>> [INFO] --- maven-deploy-plugin:2.6:deploy (default-deploy) @ tika-app
>>---
>> Downloaded:
>>https://repository.apache.org/content/repositories/snapshots/org/apache/t
>>ika/tika-app/1.4-SNAPSHOT/maven-metadata.xml (767 B at 1.5 KB/sec)
>> Uploading:
>>https://repository.apache.org/content/repositories/snapshots/org/apache/t
>>ika/tika-app/1.4-SNAPSHOT/tika-app-1.4-20130207.175603-9.jar
>> Uploaded:
>>https://repository.apache.org/content/repositories/snapshots/org/apache/t
>>ika/tika-app/1.4-SNAPSHOT/tika-app-1.4-20130207.175603-9.jar (27582 KB
>>at 3644.5 KB/sec)
>> Uploading:
>>https://repository.apache.org/content/repositories/snapshots/org/apache/t
>>ika/tika-app/1.4-SNAPSHOT/tika-app-1.4-20130207.175603-9.pom
>> Uploaded:
>>https://repository.apache.org/content/repositories/snapshots/org/apache/t
>>ika/tika-app/1.4-SNAPSHOT/tika-app-1.4-20130207.175603-9.pom (8 KB at
>>21.7 KB/sec)
>> Downloading:
>>https://repository.apache.org/content/repositories/snapshots/org/apache/t
>>ika/tika-app/maven-metadata.xml
>> Downloaded:
>>https://repository.apache.org/content/repositories/snapshots/org/apache/t
>>ika/tika-app/maven-metadata.xml (339 B at 0.8 KB/sec)
>> Uploading:
>>https://repository.apache.org/content/repositories/snapshots/org/apache/t
>>ika/tika-app/1.4-SNAPSHOT/maven-metadata.xml
>> Uploaded:
>>https://repository.apache.org/content/repositories/snapshots/org/apache/t
>>ika/tika-app/1.4-SNAPSHOT/maven-metadata.xml (767 B at 2.5 KB/sec)
>> Uploading:
>>https://repository.apache.org/content/repositories/snapshots/org/apache/t
>>ika/tika-app/maven-metadata.xml
>> Uploaded:
>>https://repository.apache.org/content/repositories/snapshots/org/apache/t
>>ika/tika-app/maven-metadata.xml (339 B at 0.9 KB/sec)
>> mojoSucceeded
>>org.apache.maven.plugins:maven-deploy-plugin:2.6(default-deploy)
>> projectSucceeded org.apache.tika:tika-app:1.4-SNAPSHOT
>> projectStarted org.apache.tika:tika-bundle:1.4-SNAPSHOT
>> [INFO]
>> [INFO]
>>------------------------------------------------------------------------
>> [INFO] Building Apache Tika OSGi bundle 1.4-SNAPSHOT
>> [INFO]
>>------------------------------------------------------------------------
>> mojoStarted
>>org.apache.maven.plugins:maven-clean-plugin:2.4.1(default-clean)[INFO]
>>Deleting
>><https://builds.apache.org/job/Tika-trunk/ws/trunk/tika-bundle/target>
>>
>> [INFO]
>> [INFO] --- maven-clean-plugin:2.4.1:clean (default-clean) @ tika-bundle
>>---
>> mojoSucceeded
>>org.apache.maven.plugins:maven-clean-plugin:2.4.1(default-clean)
>> [TASKS] Scanning folder
>>'<https://builds.apache.org/job/Tika-trunk/ws/trunk/tika-bundle'> for
>>files matching the pattern '**/*.java' - excludes:
>> [TASKS] Found 1 files to scan for tasks
>> Found 0 open tasks.
>> [TASKS] Computing warning deltas based on reference build #976
>> mojoStarted
>>org.apache.maven.plugins:maven-remote-resources-plugin:1.2.1(default)
>> [INFO]
>> [INFO] --- maven-remote-resources-plugin:1.2.1:process (default) @
>>tika-bundle ---
>> mojoSucceeded
>>org.apache.maven.plugins:maven-remote-resources-plugin:1.2.1(default)
>> mojoStarted
>>org.apache.maven.plugins:maven-resources-plugin:2.5(default-resources)[de
>>bug] execute contextualize
>> [INFO] Using 'UTF-8' encoding to copy filtered resources.
>> [INFO] skip non existing resourceDirectory
>><https://builds.apache.org/job/Tika-trunk/ws/trunk/tika-bundle/src/main/r
>>esources>
>> [INFO] Copying 3 resources
>>
>> [INFO]
>> [INFO] --- maven-resources-plugin:2.5:resources (default-resources) @
>>tika-bundle ---
>> mojoSucceeded
>>org.apache.maven.plugins:maven-resources-plugin:2.5(default-resources)
>> [INFO] No sources to compile
>> mojoStarted
>>org.apache.maven.plugins:maven-compiler-plugin:2.3.2(default-compile)
>> [INFO]
>> [INFO] --- maven-compiler-plugin:2.3.2:compile (default-compile) @
>>tika-bundle ---
>> mojoSucceeded
>>org.apache.maven.plugins:maven-compiler-plugin:2.3.2(default-compile)
>> mojoStarted
>>org.apache.maven.plugins:maven-resources-plugin:2.5(default-testResources
>>)[debug] execute contextualize
>> [INFO] Using 'UTF-8' encoding to copy filtered resources.
>> [INFO] Copying 1 resource
>> [INFO] Copying 3 resources
>>
>> [INFO]
>> [INFO] --- maven-resources-plugin:2.5:testResources
>>(default-testResources) @ tika-bundle ---
>> mojoSucceeded
>>org.apache.maven.plugins:maven-resources-plugin:2.5(default-testResources
>>)
>> mojoStarted
>>org.apache.maven.plugins:maven-compiler-plugin:2.3.2(default-testCompile)
>> [INFO]
>> [INFO] --- maven-compiler-plugin:2.3.2:testCompile
>>(default-testCompile) @ tika-bundle ---
>> [INFO] Compiling 1 source file to
>><https://builds.apache.org/job/Tika-trunk/ws/trunk/tika-bundle/target/tes
>>t-classes>
>> mojoSucceeded
>>org.apache.maven.plugins:maven-compiler-plugin:2.3.2(default-testCompile)
>> mojoStarted
>>org.apache.maven.plugins:maven-surefire-plugin:2.12(default-test)[INFO]
>>Surefire report directory:
>><https://builds.apache.org/job/Tika-trunk/ws/trunk/tika-bundle/target/sur
>>efire-reports>
>>
>> -------------------------------------------------------
>>  T E S T S
>> -------------------------------------------------------
>>
>> [INFO]
>> [INFO] --- maven-surefire-plugin:2.12:test (default-test) @ tika-bundle
>>---
>>
>> Results :
>>
>> Tests run: 0, Failures: 0, Errors: 0, Skipped: 0
>>
>> mojoSucceeded
>>org.apache.maven.plugins:maven-surefire-plugin:2.12(default-test)
>> [JENKINS] Recording test results
>> mojoStarted
>>org.apache.maven.plugins:maven-dependency-plugin:2.1(default)
>> [INFO]
>> [INFO] --- maven-dependency-plugin:2.1:unpack-dependencies (default) @
>>tika-bundle ---
>> [INFO] Unpacking
>>/home/jenkins/jenkins-slave/maven-repositories/1/edu/ucar/netcdf/4.2-min/
>>netcdf-4.2-min.jar to
>>  
>><https://builds.apache.org/job/Tika-trunk/ws/trunk/tika-bundle/target/cla
>>sses>
>>    with includes null and excludes:ucar/nc2/iosp/fysat/Fysat*.class,
>>                 ucar/nc2/dataset/transform/VOceanSG1*class,
>>                 ucar/unidata/geoloc/vertical/OceanSG*.class,
>>                 META-INF/**,CHANGES,README
>> mojoSucceeded
>>org.apache.maven.plugins:maven-dependency-plugin:2.1(default)
>> mojoStarted org.apache.felix:maven-bundle-plugin:2.3.4(default-bundle)
>> [INFO]
>> [INFO] --- maven-bundle-plugin:2.3.4:bundle (default-bundle) @
>>tika-bundle ---
>> [WARNING] Embed-Dependency: clause "commons-io" did not match any
>>dependencies
>> mojoSucceeded org.apache.felix:maven-bundle-plugin:2.3.4(default-bundle)
>> mojoStarted
>>org.apache.maven.plugins:maven-site-plugin:3.0(attach-descriptor)
>> [INFO]
>> [INFO] --- maven-site-plugin:3.0:attach-descriptor (attach-descriptor)
>>@ tika-bundle ---
>> mojoSucceeded
>>org.apache.maven.plugins:maven-site-plugin:3.0(attach-descriptor)
>> [INFO] No excludes
>> mojoStarted org.apache.rat:apache-rat-plugin:0.7(default)
>> [INFO]
>> [INFO] --- apache-rat-plugin:0.7:check (default) @ tika-bundle ---
>> mojoSucceeded org.apache.rat:apache-rat-plugin:0.7(default)
>> [PMD] No report found for mojo check
>> [INFO] Installing
>><https://builds.apache.org/job/Tika-trunk/ws/trunk/tika-bundle/target/tik
>>a-bundle-1.4-SNAPSHOT.jar> to
>>/home/jenkins/jenkins-slave/maven-repositories/1/org/apache/tika/tika-bun
>>dle/1.4-SNAPSHOT/tika-bundle-1.4-SNAPSHOT.jar
>> mojoStarted
>>org.apache.maven.plugins:maven-install-plugin:2.3.1(default-install)
>> [INFO]
>> [INFO] --- maven-install-plugin:2.3.1:install (default-install) @
>>tika-bundle ---
>> [INFO] Installing
>><https://builds.apache.org/job/Tika-trunk/ws/trunk/tika-bundle/pom.xml>
>>to
>>/home/jenkins/jenkins-slave/maven-repositories/1/org/apache/tika/tika-bun
>>dle/1.4-SNAPSHOT/tika-bundle-1.4-SNAPSHOT.pom
>> mojoSucceeded
>>org.apache.maven.plugins:maven-install-plugin:2.3.1(default-install)
>> [INFO] Local OBR update disabled (enable with -DobrRepository)
>> mojoStarted org.apache.felix:maven-bundle-plugin:2.3.4(default-install)
>> [INFO]
>> [INFO] --- maven-bundle-plugin:2.3.4:install (default-install) @
>>tika-bundle ---
>> mojoSucceeded
>>org.apache.felix:maven-bundle-plugin:2.3.4(default-install)
>> mojoStarted
>>org.apache.maven.plugins:maven-deploy-plugin:2.6(default-deploy)Downloadi
>>ng:
>>https://repository.apache.org/content/repositories/snapshots/org/apache/t
>>ika/tika-bundle/1.4-SNAPSHOT/maven-metadata.xml
>>
>> [INFO]
>> [INFO] --- maven-deploy-plugin:2.6:deploy (default-deploy) @
>>tika-bundle ---
>> Downloaded:
>>https://repository.apache.org/content/repositories/snapshots/org/apache/t
>>ika/tika-bundle/1.4-SNAPSHOT/maven-metadata.xml (770 B at 2.1 KB/sec)
>> Uploading:
>>https://repository.apache.org/content/repositories/snapshots/org/apache/t
>>ika/tika-bundle/1.4-SNAPSHOT/tika-bundle-1.4-20130207.175707-9.jar
>> Uploaded:
>>https://repository.apache.org/content/repositories/snapshots/org/apache/t
>>ika/tika-bundle/1.4-SNAPSHOT/tika-bundle-1.4-20130207.175707-9.jar
>>(22134 KB at 3715.6 KB/sec)
>> Uploading:
>>https://repository.apache.org/content/repositories/snapshots/org/apache/t
>>ika/tika-bundle/1.4-SNAPSHOT/tika-bundle-1.4-20130207.175707-9.pom
>> Uploaded:
>>https://repository.apache.org/content/repositories/snapshots/org/apache/t
>>ika/tika-bundle/1.4-SNAPSHOT/tika-bundle-1.4-20130207.175707-9.pom (11
>>KB at 30.2 KB/sec)
>> Downloading:
>>https://repository.apache.org/content/repositories/snapshots/org/apache/t
>>ika/tika-bundle/maven-metadata.xml
>> Downloaded:
>>https://repository.apache.org/content/repositories/snapshots/org/apache/t
>>ika/tika-bundle/maven-metadata.xml (342 B at 1.1 KB/sec)
>> Uploading:
>>https://repository.apache.org/content/repositories/snapshots/org/apache/t
>>ika/tika-bundle/1.4-SNAPSHOT/maven-metadata.xml
>> Uploaded:
>>https://repository.apache.org/content/repositories/snapshots/org/apache/t
>>ika/tika-bundle/1.4-SNAPSHOT/maven-metadata.xml (770 B at 2.6 KB/sec)
>> Uploading:
>>https://repository.apache.org/content/repositories/snapshots/org/apache/t
>>ika/tika-bundle/maven-metadata.xml
>> Uploaded:
>>https://repository.apache.org/content/repositories/snapshots/org/apache/t
>>ika/tika-bundle/maven-metadata.xml (342 B at 0.9 KB/sec)
>> mojoSucceeded
>>org.apache.maven.plugins:maven-deploy-plugin:2.6(default-deploy)
>> [INFO] Remote OBR update disabled (enable with -DremoteOBR)
>> mojoStarted org.apache.felix:maven-bundle-plugin:2.3.4(default-deploy)
>> [INFO]
>> [INFO] --- maven-bundle-plugin:2.3.4:deploy (default-deploy) @
>>tika-bundle ---
>> mojoSucceeded org.apache.felix:maven-bundle-plugin:2.3.4(default-deploy)
>> projectSucceeded org.apache.tika:tika-bundle:1.4-SNAPSHOT
>> projectStarted org.apache.tika:tika-server:1.4-SNAPSHOT
>> [INFO]
>> [INFO]
>>------------------------------------------------------------------------
>> [INFO] Building Apache Tika server 1.4-SNAPSHOT
>> [INFO]
>>------------------------------------------------------------------------
>> [INFO] Deleting
>><https://builds.apache.org/job/Tika-trunk/ws/trunk/tika-server/target>
>> mojoStarted
>>org.apache.maven.plugins:maven-clean-plugin:2.4.1(default-clean)
>> [INFO]
>> [INFO] --- maven-clean-plugin:2.4.1:clean (default-clean) @ tika-server
>>---
>> mojoSucceeded
>>org.apache.maven.plugins:maven-clean-plugin:2.4.1(default-clean)
>> [TASKS] Scanning folder
>>'<https://builds.apache.org/job/Tika-trunk/ws/trunk/tika-server'> for
>>files matching the pattern '**/*.java' - excludes:
>> [TASKS] Found 18 files to scan for tasks
>> Found 0 open tasks.
>> [TASKS] Computing warning deltas based on reference build #971
>> mojoStarted
>>org.apache.maven.plugins:maven-remote-resources-plugin:1.2.1(default)
>> [INFO]
>> [INFO] --- maven-remote-resources-plugin:1.2.1:process (default) @
>>tika-server ---
>> mojoSucceeded
>>org.apache.maven.plugins:maven-remote-resources-plugin:1.2.1(default)
>> mojoStarted
>>org.apache.maven.plugins:maven-resources-plugin:2.5(default-resources)[de
>>bug] execute contextualize
>> [INFO] Using 'UTF-8' encoding to copy filtered resources.
>> [INFO] Copying 2 resources
>> [INFO] Copying 3 resources
>>
>> [INFO]
>> [INFO] --- maven-resources-plugin:2.5:resources (default-resources) @
>>tika-server ---
>> mojoSucceeded
>>org.apache.maven.plugins:maven-resources-plugin:2.5(default-resources)
>> mojoStarted
>>org.apache.maven.plugins:maven-compiler-plugin:2.3.2(default-compile)[INF
>>O] Compiling 12 source files to
>><https://builds.apache.org/job/Tika-trunk/ws/trunk/tika-server/target/cla
>>sses>
>>
>> [INFO]
>> [INFO] --- maven-compiler-plugin:2.3.2:compile (default-compile) @
>>tika-server ---
>> [INFO] -------------------------------------------------------------
>> [ERROR] COMPILATION ERROR :
>> [INFO] -------------------------------------------------------------
>> [ERROR]
>><https://builds.apache.org/job/Tika-trunk/ws/trunk/tika-server/src/main/j
>>ava/org/apache/tika/server/CSVMessageBodyWriter.java>:[51,3] method does
>>not override a method from its superclass
>> [ERROR]
>><https://builds.apache.org/job/Tika-trunk/ws/trunk/tika-server/src/main/j
>>ava/org/apache/tika/server/JSONMessageBodyWriter.java>:[51,3] method
>>does not override a method from its superclass
>> [INFO] 2 errors
>> [INFO] -------------------------------------------------------------
>> mojoFailed
>>org.apache.maven.plugins:maven-compiler-plugin:2.3.2(default-compile)
>> projectFailed org.apache.tika:tika-server:1.4-SNAPSHOT
>> sessionEnded
>> [INFO]
>>------------------------------------------------------------------------
>> [INFO] Reactor Summary:
>> [INFO]
>> [INFO] Apache Tika parent ................................ SUCCESS
>>[38.797s]
>> [INFO] Apache Tika core .................................. SUCCESS
>>[1:25.237s]
>> [INFO] Apache Tika parsers ............................... SUCCESS
>>[3:13.459s]
>> [INFO] Apache Tika XMP ................................... SUCCESS
>>[18.483s]
>> [INFO] Apache Tika application ........................... SUCCESS
>>[1:12.318s]
>> [INFO] Apache Tika OSGi bundle ........................... SUCCESS
>>[1:02.529s]
>> [INFO] Apache Tika server ................................ FAILURE
>>[9.538s]
>> [INFO] Apache Tika ....................................... SKIPPED
>> [INFO]
>>------------------------------------------------------------------------
>> [INFO] BUILD FAILURE
>> [INFO]
>>------------------------------------------------------------------------
>> [INFO] Total time: 8:08.879s
>> [INFO] Finished at: Thu Feb 07 17:57:26 UTC 2013
>> [INFO] Final Memory: 41M/305M
>> [INFO]
>>------------------------------------------------------------------------
>> Projects to build: [MavenProject:
>>org.apache.tika:tika-parent:1.4-SNAPSHOT @
>><https://builds.apache.org/job/Tika-trunk/ws/trunk/tika-parent/pom.xml,>
>>MavenProject: org.apache.tika:tika-core:1.4-SNAPSHOT @
>><https://builds.apache.org/job/Tika-trunk/ws/trunk/tika-core/pom.xml,>
>>MavenProject: org.apache.tika:tika-parsers:1.4-SNAPSHOT @
>><https://builds.apache.org/job/Tika-trunk/ws/trunk/tika-parsers/pom.xml,>
>> MavenProject: org.apache.tika:tika-xmp:1.4-SNAPSHOT @
>><https://builds.apache.org/job/Tika-trunk/ws/trunk/tika-xmp/pom.xml,>
>>MavenProject: org.apache.tika:tika-app:1.4-SNAPSHOT @
>><https://builds.apache.org/job/Tika-trunk/ws/trunk/tika-app/pom.xml,>
>>MavenProject: org.apache.tika:tika-bundle:1.4-SNAPSHOT @
>><https://builds.apache.org/job/Tika-trunk/ws/trunk/tika-bundle/pom.xml,>
>>MavenProject: org.apache.tika:tika-server:1.4-SNAPSHOT @
>><https://builds.apache.org/job/Tika-trunk/ws/trunk/tika-server/pom.xml,>
>>MavenProject: org.apache.tika:tika:1.4-SNAPSHOT @
>><https://builds.apache.org/job/Tika-trunk/ws/trunk/pom.xml]>
>> [JENKINS] Archiving
>><https://builds.apache.org/job/Tika-trunk/ws/trunk/pom.xml> to
>>/home/hudson/hudson/jobs/Tika-trunk/modules/org.apache.tika$tika/builds/2
>>013-02-07_17-48-50/archive/org.apache.tika/tika/1.4-SNAPSHOT/tika-1.4-SNA
>>PSHOT.pom
>> [JENKINS] Archiving
>><https://builds.apache.org/job/Tika-trunk/ws/trunk/tika-parent/pom.xml>
>>to
>>/home/hudson/hudson/jobs/Tika-trunk/modules/org.apache.tika$tika-parent/b
>>uilds/2013-02-07_17-48-50/archive/org.apache.tika/tika-parent/1.4-SNAPSHO
>>T/tika-parent-1.4-SNAPSHOT.pom
>> [JENKINS] Archiving
>><https://builds.apache.org/job/Tika-trunk/ws/trunk/tika-parsers/pom.xml>
>>to
>>/home/hudson/hudson/jobs/Tika-trunk/modules/org.apache.tika$tika-parsers/
>>builds/2013-02-07_17-48-50/archive/org.apache.tika/tika-parsers/1.4-SNAPS
>>HOT/tika-parsers-1.4-SNAPSHOT.pom
>> [JENKINS] Archiving
>><https://builds.apache.org/job/Tika-trunk/ws/trunk/tika-parsers/target/ti
>>ka-parsers-1.4-SNAPSHOT.jar> to
>>/home/hudson/hudson/jobs/Tika-trunk/modules/org.apache.tika$tika-parsers/
>>builds/2013-02-07_17-48-50/archive/org.apache.tika/tika-parsers/1.4-20130
>>207.175438-9/tika-parsers-1.4-20130207.175438-9.jar
>> [JENKINS] Archiving
>><https://builds.apache.org/job/Tika-trunk/ws/trunk/tika-xmp/pom.xml> to
>>/home/hudson/hudson/jobs/Tika-trunk/modules/org.apache.tika$tika-xmp/buil
>>ds/2013-02-07_17-48-50/archive/org.apache.tika/tika-xmp/1.4-SNAPSHOT/tika
>>-xmp-1.4-SNAPSHOT.pom
>> [JENKINS] Archiving
>><https://builds.apache.org/job/Tika-trunk/ws/trunk/tika-xmp/target/tika-x
>>mp-1.4-SNAPSHOT.jar> to
>>/home/hudson/hudson/jobs/Tika-trunk/modules/org.apache.tika$tika-xmp/buil
>>ds/2013-02-07_17-48-50/archive/org.apache.tika/tika-xmp/1.4-20130207.1754
>>57-9/tika-xmp-1.4-20130207.175457-9.jar
>> [JENKINS] Archiving
>><https://builds.apache.org/job/Tika-trunk/ws/trunk/tika-app/pom.xml> to
>>/home/hudson/hudson/jobs/Tika-trunk/modules/org.apache.tika$tika-app/buil
>>ds/2013-02-07_17-48-50/archive/org.apache.tika/tika-app/1.4-SNAPSHOT/tika
>>-app-1.4-SNAPSHOT.pom
>> [JENKINS] Archiving
>><https://builds.apache.org/job/Tika-trunk/ws/trunk/tika-app/target/tika-a
>>pp-1.4-SNAPSHOT.jar> to
>>/home/hudson/hudson/jobs/Tika-trunk/modules/org.apache.tika$tika-app/buil
>>ds/2013-02-07_17-48-50/archive/org.apache.tika/tika-app/1.4-20130207.1756
>>03-9/tika-app-1.4-20130207.175603-9.jar
>> [JENKINS] Archiving
>><https://builds.apache.org/job/Tika-trunk/ws/trunk/tika-server/pom.xml>
>>to
>>/home/hudson/hudson/jobs/Tika-trunk/modules/org.apache.tika$tika-server/b
>>uilds/2013-02-07_17-48-50/archive/org.apache.tika/tika-server/1.4-SNAPSHO
>>T/tika-server-1.4-SNAPSHOT.pom
>> [JENKINS] Archiving
>><https://builds.apache.org/job/Tika-trunk/ws/trunk/tika-core/pom.xml> to
>>/home/hudson/hudson/jobs/Tika-trunk/modules/org.apache.tika$tika-core/bui
>>lds/2013-02-07_17-48-50/archive/org.apache.tika/tika-core/1.4-SNAPSHOT/ti
>>ka-core-1.4-SNAPSHOT.pom
>> [JENKINS] Archiving
>><https://builds.apache.org/job/Tika-trunk/ws/trunk/tika-core/target/tika-
>>core-1.4-SNAPSHOT.jar> to
>>/home/hudson/hudson/jobs/Tika-trunk/modules/org.apache.tika$tika-core/bui
>>lds/2013-02-07_17-48-50/archive/org.apache.tika/tika-core/1.4-20130207.17
>>5124-9/tika-core-1.4-20130207.175124-9.jar
>> [JENKINS] Archiving
>><https://builds.apache.org/job/Tika-trunk/ws/trunk/tika-bundle/pom.xml>
>>to
>>/home/hudson/hudson/jobs/Tika-trunk/modules/org.apache.tika$tika-bundle/b
>>uilds/2013-02-07_17-48-50/archive/org.apache.tika/tika-bundle/1.4-SNAPSHO
>>T/tika-bundle-1.4-SNAPSHOT.pom
>> [JENKINS] Archiving
>><https://builds.apache.org/job/Tika-trunk/ws/trunk/tika-bundle/target/tik
>>a-bundle-1.4-SNAPSHOT.jar> to
>>/home/hudson/hudson/jobs/Tika-trunk/modules/org.apache.tika$tika-bundle/b
>>uilds/2013-02-07_17-48-50/archive/org.apache.tika/tika-bundle/1.4-2013020
>>7.175707-9/tika-bundle-1.4-20130207.175707-9.jar
>> Waiting for Jenkins to finish collecting data
>> mavenExecutionResult exceptions not empty
>> message : Failed to execute goal
>>org.apache.maven.plugins:maven-compiler-plugin:2.3.2:compile
>>(default-compile) on project tika-server: Compilation failure
>> cause : Compilation failure
>> Stack trace :
>> org.apache.maven.lifecycle.LifecycleExecutionException: Failed to
>>execute goal
>>org.apache.maven.plugins:maven-compiler-plugin:2.3.2:compile
>>(default-compile) on project tika-server: Compilation failure
>>         at
>>org.apache.maven.lifecycle.internal.MojoExecutor.execute(MojoExecutor.jav
>>a:213)
>>         at
>>org.apache.maven.lifecycle.internal.MojoExecutor.execute(MojoExecutor.jav
>>a:153)
>>         at
>>org.apache.maven.lifecycle.internal.MojoExecutor.execute(MojoExecutor.jav
>>a:145)
>>         at
>>org.apache.maven.lifecycle.internal.LifecycleModuleBuilder.buildProject(L
>>ifecycleModuleBuilder.java:84)
>>         at
>>org.apache.maven.lifecycle.internal.LifecycleModuleBuilder.buildProject(L
>>ifecycleModuleBuilder.java:59)
>>         at
>>org.apache.maven.lifecycle.internal.LifecycleStarter.singleThreadedBuild(
>>LifecycleStarter.java:183)
>>         at
>>org.apache.maven.lifecycle.internal.LifecycleStarter.execute(LifecycleSta
>>rter.java:161)
>>         at
>>org.apache.maven.DefaultMaven.doExecute(DefaultMaven.java:320)
>>         at org.apache.maven.DefaultMaven.execute(DefaultMaven.java:156)
>>         at
>>org.jvnet.hudson.maven3.launcher.Maven3Launcher.main(Maven3Launcher.java:
>>79)
>>         at sun.reflect.NativeMethodAccessorImpl.invoke0(Native Method)
>>         at
>>sun.reflect.NativeMethodAccessorImpl.invoke(NativeMethodAccessorImpl.java
>>:39)
>>         at
>>sun.reflect.DelegatingMethodAccessorImpl.invoke(DelegatingMethodAccessorI
>>mpl.java:25)
>>         at java.lang.reflect.Method.invoke(Method.java:592)
>>         at
>>org.codehaus.plexus.classworlds.launcher.Launcher.launchStandard(Launcher
>>.java:329)
>>         at
>>org.codehaus.plexus.classworlds.launcher.Launcher.launch(Launcher.java:23
>>9)
>>         at
>>org.jvnet.hudson.maven3.agent.Maven3Main.launch(Maven3Main.java:158)
>>         at hudson.maven.Maven3Builder.call(Maven3Builder.java:100)
>>         at hudson.maven.Maven3Builder.call(Maven3Builder.java:66)
>>         at hudson.remoting.UserRequest.perform(UserRequest.java:118)
>>         at hudson.remoting.UserRequest.perform(UserRequest.java:48)
>>         at hudson.remoting.Request$2.run(Request.java:326)
>>         at
>>hudson.remoting.InterceptingExecutorService$1.call(InterceptingExecutorSe
>>rvice.java:72)
>>         at
>>java.util.concurrent.FutureTask$Sync.innerRun(FutureTask.java:269)
>>         at java.util.concurrent.FutureTask.run(FutureTask.java:123)
>>         at
>>java.util.concurrent.ThreadPoolExecutor$Worker.runTask(ThreadPoolExecutor
>>.java:651)
>>         at
>>java.util.concurrent.ThreadPoolExecutor$Worker.run(ThreadPoolExecutor.jav
>>a:676)
>>         at java.lang.Thread.run(Thread.java:595)
>> Caused by: org.apache.maven.plugin.CompilationFailureException:
>>Compilation failure
>>         at
>>org.apache.maven.plugin.AbstractCompilerMojo.execute(AbstractCompilerMojo
>>.java:656)
>>         at
>>org.apache.maven.plugin.CompilerMojo.execute(CompilerMojo.java:128)
>>         at
>>org.apache.maven.plugin.DefaultBuildPluginManager.executeMojo(DefaultBuil
>>dPluginManager.java:101)
>>         at
>>org.apache.maven.lifecycle.internal.MojoExecutor.execute(MojoExecutor.jav
>>a:209)
>>         ... 27 more
>> channel stopped

Reply | Threaded
Open this post in threaded view
|

Re: Build failed in Jenkins: Tika-trunk #977

Nick Burch-2
In reply to this post by Michael McCandless-2
On Thu, 7 Feb 2013, Michael McCandless wrote:
> Hmm it looks like the Tika build is failing on Jenkins due to this:
>
> [ERROR] /home/jenkins/jenkins-slave/workspace/Tika-trunk/trunk/tika-server/src/main/java/org/apache/tika/server/CSVMessageBodyWriter.java:[51,3]
> method does not override a method from its superclass
> [ERROR] /home/jenkins/jenkins-slave/workspace/Tika-trunk/trunk/tika-server/src/main/java/org/apache/tika/server/JSONMessageBodyWriter.java:[51,3]
> method does not override a method from its superclass

Is that an @Override of a method from an Interface? That works on JDK
1.6+, but isn't valid on JDK 1.5. Just remove the @Override from the
interface implementing methods and you should be fine

Nick
Reply | Threaded
Open this post in threaded view
|

Re: Build failed in Jenkins: Tika-trunk #977

Michael McCandless-2
On Thu, Feb 7, 2013 at 3:51 PM, Nick Burch <[hidden email]> wrote:

> On Thu, 7 Feb 2013, Michael McCandless wrote:
>>
>> Hmm it looks like the Tika build is failing on Jenkins due to this:
>>
>> [ERROR]
>> /home/jenkins/jenkins-slave/workspace/Tika-trunk/trunk/tika-server/src/main/java/org/apache/tika/server/CSVMessageBodyWriter.java:[51,3]
>> method does not override a method from its superclass
>> [ERROR]
>> /home/jenkins/jenkins-slave/workspace/Tika-trunk/trunk/tika-server/src/main/java/org/apache/tika/server/JSONMessageBodyWriter.java:[51,3]
>> method does not override a method from its superclass
>
>
> Is that an @Override of a method from an Interface? That works on JDK 1.6+,
> but isn't valid on JDK 1.5. Just remove the @Override from the interface
> implementing methods and you should be fine

Ahh.... that's right.  I had forgotten about this.  I commented out
those two @Overrides ...

Maybe ... it's time for Tika to require Java 1.6?  Java 1.6 is end of
life next month after all ...

Mike McCandless

http://blog.mikemccandless.com
Reply | Threaded
Open this post in threaded view
|

Jenkins build is back to normal : Tika-trunk #978

Apache Jenkins Server-2
In reply to this post by Apache Jenkins Server-2
Reply | Threaded
Open this post in threaded view
|

Re: Build failed in Jenkins: Tika-trunk #977

kkrugler
In reply to this post by Michael McCandless-2

On Feb 8, 2013, at 3:54am, Michael McCandless wrote:

> On Thu, Feb 7, 2013 at 3:51 PM, Nick Burch <[hidden email]> wrote:
>> On Thu, 7 Feb 2013, Michael McCandless wrote:
>>>
>>> Hmm it looks like the Tika build is failing on Jenkins due to this:
>>>
>>> [ERROR]
>>> /home/jenkins/jenkins-slave/workspace/Tika-trunk/trunk/tika-server/src/main/java/org/apache/tika/server/CSVMessageBodyWriter.java:[51,3]
>>> method does not override a method from its superclass
>>> [ERROR]
>>> /home/jenkins/jenkins-slave/workspace/Tika-trunk/trunk/tika-server/src/main/java/org/apache/tika/server/JSONMessageBodyWriter.java:[51,3]
>>> method does not override a method from its superclass
>>
>>
>> Is that an @Override of a method from an Interface? That works on JDK 1.6+,
>> but isn't valid on JDK 1.5. Just remove the @Override from the interface
>> implementing methods and you should be fine
>
> Ahh.... that's right.  I had forgotten about this.  I commented out
> those two @Overrides ...
>
> Maybe ... it's time for Tika to require Java 1.6?  Java 1.6 is end of
> life next month after all …

+1

Seems like being one generation behind is OK, but not two :)

-- Ken

--------------------------
Ken Krugler
+1 530-210-6378
http://www.scaleunlimited.com
custom big data solutions & training
Hadoop, Cascading, Cassandra & Solr





Reply | Threaded
Open this post in threaded view
|

[DISCUSS] Should Tika require Java6? (was Re: Build failed in Jenkins: Tika-trunk #977)

Mattmann, Chris A (3010)
Hey Guys,

Just to summarize, the question on the table is whether or not Tika should
require Java6. We had some discussions on this previously (if I get time,
will dig up the threads -- ok found time ;) ):

https://issues.apache.org/jira/browse/TIKA-888

http://mail-archives.apache.org/mod_mbox/tika-dev/201011.mbox/%3CC8F38B50.2
3828%[hidden email]%3E


I'm +1 for it. Seems like so is Mike, and also Ken K. Any objections from
others to require Java6?

Cheers,
Chris


On 2/8/13 6:32 AM, "Ken Krugler" <[hidden email]> wrote:

>
>On Feb 8, 2013, at 3:54am, Michael McCandless wrote:
>
>> On Thu, Feb 7, 2013 at 3:51 PM, Nick Burch <[hidden email]> wrote:
>>> On Thu, 7 Feb 2013, Michael McCandless wrote:
>>>>
>>>> Hmm it looks like the Tika build is failing on Jenkins due to this:
>>>>
>>>> [ERROR]
>>>>
>>>>/home/jenkins/jenkins-slave/workspace/Tika-trunk/trunk/tika-server/src/
>>>>main/java/org/apache/tika/server/CSVMessageBodyWriter.java:[51,3]
>>>> method does not override a method from its superclass
>>>> [ERROR]
>>>>
>>>>/home/jenkins/jenkins-slave/workspace/Tika-trunk/trunk/tika-server/src/
>>>>main/java/org/apache/tika/server/JSONMessageBodyWriter.java:[51,3]
>>>> method does not override a method from its superclass
>>>
>>>
>>> Is that an @Override of a method from an Interface? That works on JDK
>>>1.6+,
>>> but isn't valid on JDK 1.5. Just remove the @Override from the
>>>interface
>>> implementing methods and you should be fine
>>
>> Ahh.... that's right.  I had forgotten about this.  I commented out
>> those two @Overrides ...
>>
>> Maybe ... it's time for Tika to require Java 1.6?  Java 1.6 is end of
>> life next month after all Š
>
>+1
>
>Seems like being one generation behind is OK, but not two :)
>
>-- Ken
>
>--------------------------
>Ken Krugler
>+1 530-210-6378
>http://www.scaleunlimited.com
>custom big data solutions & training
>Hadoop, Cascading, Cassandra & Solr
>
>
>
>
>

Reply | Threaded
Open this post in threaded view
|

Re: [DISCUSS] Should Tika require Java6? (was Re: Build failed in Jenkins: Tika-trunk #977)

Jukka Zitting
Hi,

On Fri, Feb 8, 2013 at 6:54 PM, Mattmann, Chris A (388J)
<[hidden email]> wrote:
> I'm +1 for it. Seems like so is Mike, and also Ken K. Any objections from
> others to require Java6?

+1 to drop Java 5. If anyone is still in production with Java 5, it's
high time to start planning for the upgrade.

BR,

Jukka Zitting
Reply | Threaded
Open this post in threaded view
|

Re: [DISCUSS] Should Tika require Java6? (was Re: Build failed in Jenkins: Tika-trunk #977)

Oleg Tikhonov-2
In reply to this post by Mattmann, Chris A (3010)
Back to the "future". Aha moment !!!
Here is mine +1.

According to Oracle "In February 2011 Oracle announced the End of Public
Updates for their Java SE 6 products for July 2012. In February 2012 Oracle
extended the End of Public Updates for 4 months, to November 2012. ".

Oleg



On Fri, Feb 8, 2013 at 6:54 PM, Mattmann, Chris A (388J) <
[hidden email]> wrote:

> Hey Guys,
>
> Just to summarize, the question on the table is whether or not Tika should
> require Java6. We had some discussions on this previously (if I get time,
> will dig up the threads -- ok found time ;) ):
>
> https://issues.apache.org/jira/browse/TIKA-888
>
> http://mail-archives.apache.org/mod_mbox/tika-dev/201011.mbox/%3CC8F38B50.2
> 3828%[hidden email]%3E
>
>
> I'm +1 for it. Seems like so is Mike, and also Ken K. Any objections from
> others to require Java6?
>
> Cheers,
> Chris
>
>
> On 2/8/13 6:32 AM, "Ken Krugler" <[hidden email]> wrote:
>
> >
> >On Feb 8, 2013, at 3:54am, Michael McCandless wrote:
> >
> >> On Thu, Feb 7, 2013 at 3:51 PM, Nick Burch <[hidden email]>
> wrote:
> >>> On Thu, 7 Feb 2013, Michael McCandless wrote:
> >>>>
> >>>> Hmm it looks like the Tika build is failing on Jenkins due to this:
> >>>>
> >>>> [ERROR]
> >>>>
> >>>>/home/jenkins/jenkins-slave/workspace/Tika-trunk/trunk/tika-server/src/
> >>>>main/java/org/apache/tika/server/CSVMessageBodyWriter.java:[51,3]
> >>>> method does not override a method from its superclass
> >>>> [ERROR]
> >>>>
> >>>>/home/jenkins/jenkins-slave/workspace/Tika-trunk/trunk/tika-server/src/
> >>>>main/java/org/apache/tika/server/JSONMessageBodyWriter.java:[51,3]
> >>>> method does not override a method from its superclass
> >>>
> >>>
> >>> Is that an @Override of a method from an Interface? That works on JDK
> >>>1.6+,
> >>> but isn't valid on JDK 1.5. Just remove the @Override from the
> >>>interface
> >>> implementing methods and you should be fine
> >>
> >> Ahh.... that's right.  I had forgotten about this.  I commented out
> >> those two @Overrides ...
> >>
> >> Maybe ... it's time for Tika to require Java 1.6?  Java 1.6 is end of
> >> life next month after all Š
> >
> >+1
> >
> >Seems like being one generation behind is OK, but not two :)
> >
> >-- Ken
> >
> >--------------------------
> >Ken Krugler
> >+1 530-210-6378
> >http://www.scaleunlimited.com
> >custom big data solutions & training
> >Hadoop, Cascading, Cassandra & Solr
> >
> >
> >
> >
> >
>
>
Reply | Threaded
Open this post in threaded view
|

Re: [DISCUSS] Should Tika require Java6? (was Re: Build failed in Jenkins: Tika-trunk #977)

Michael McCandless-2
+1

Mike McCandless

http://blog.mikemccandless.com



On Fri, Feb 8, 2013 at 12:33 PM, Oleg Tikhonov <[hidden email]> wrote:

> Back to the "future". Aha moment !!!
> Here is mine +1.
>
> According to Oracle "In February 2011 Oracle announced the End of Public
> Updates for their Java SE 6 products for July 2012. In February 2012 Oracle
> extended the End of Public Updates for 4 months, to November 2012. ".
>
> Oleg
>
>
>
> On Fri, Feb 8, 2013 at 6:54 PM, Mattmann, Chris A (388J) <
> [hidden email]> wrote:
>
>> Hey Guys,
>>
>> Just to summarize, the question on the table is whether or not Tika should
>> require Java6. We had some discussions on this previously (if I get time,
>> will dig up the threads -- ok found time ;) ):
>>
>> https://issues.apache.org/jira/browse/TIKA-888
>>
>> http://mail-archives.apache.org/mod_mbox/tika-dev/201011.mbox/%3CC8F38B50.2
>> 3828%[hidden email]%3E
>>
>>
>> I'm +1 for it. Seems like so is Mike, and also Ken K. Any objections from
>> others to require Java6?
>>
>> Cheers,
>> Chris
>>
>>
>> On 2/8/13 6:32 AM, "Ken Krugler" <[hidden email]> wrote:
>>
>> >
>> >On Feb 8, 2013, at 3:54am, Michael McCandless wrote:
>> >
>> >> On Thu, Feb 7, 2013 at 3:51 PM, Nick Burch <[hidden email]>
>> wrote:
>> >>> On Thu, 7 Feb 2013, Michael McCandless wrote:
>> >>>>
>> >>>> Hmm it looks like the Tika build is failing on Jenkins due to this:
>> >>>>
>> >>>> [ERROR]
>> >>>>
>> >>>>/home/jenkins/jenkins-slave/workspace/Tika-trunk/trunk/tika-server/src/
>> >>>>main/java/org/apache/tika/server/CSVMessageBodyWriter.java:[51,3]
>> >>>> method does not override a method from its superclass
>> >>>> [ERROR]
>> >>>>
>> >>>>/home/jenkins/jenkins-slave/workspace/Tika-trunk/trunk/tika-server/src/
>> >>>>main/java/org/apache/tika/server/JSONMessageBodyWriter.java:[51,3]
>> >>>> method does not override a method from its superclass
>> >>>
>> >>>
>> >>> Is that an @Override of a method from an Interface? That works on JDK
>> >>>1.6+,
>> >>> but isn't valid on JDK 1.5. Just remove the @Override from the
>> >>>interface
>> >>> implementing methods and you should be fine
>> >>
>> >> Ahh.... that's right.  I had forgotten about this.  I commented out
>> >> those two @Overrides ...
>> >>
>> >> Maybe ... it's time for Tika to require Java 1.6?  Java 1.6 is end of
>> >> life next month after all Š
>> >
>> >+1
>> >
>> >Seems like being one generation behind is OK, but not two :)
>> >
>> >-- Ken
>> >
>> >--------------------------
>> >Ken Krugler
>> >+1 530-210-6378
>> >http://www.scaleunlimited.com
>> >custom big data solutions & training
>> >Hadoop, Cascading, Cassandra & Solr
>> >
>> >
>> >
>> >
>> >
>>
>>
Reply | Threaded
Open this post in threaded view
|

Re: [DISCUSS] Should Tika require Java6? (was Re: Build failed in Jenkins: Tika-trunk #977)

David Meikle
+1 from me.

Cheers,
Dave

On 8 Feb 2013, at 17:49, Michael McCandless <[hidden email]> wrote:

> +1
>
> Mike McCandless
>
> http://blog.mikemccandless.com
>
>
>
> On Fri, Feb 8, 2013 at 12:33 PM, Oleg Tikhonov <[hidden email]> wrote:
>> Back to the "future". Aha moment !!!
>> Here is mine +1.
>>
>> According to Oracle "In February 2011 Oracle announced the End of Public
>> Updates for their Java SE 6 products for July 2012. In February 2012 Oracle
>> extended the End of Public Updates for 4 months, to November 2012. ".
>>
>> Oleg
>>
>>
>>
>> On Fri, Feb 8, 2013 at 6:54 PM, Mattmann, Chris A (388J) <
>> [hidden email]> wrote:
>>
>>> Hey Guys,
>>>
>>> Just to summarize, the question on the table is whether or not Tika should
>>> require Java6. We had some discussions on this previously (if I get time,
>>> will dig up the threads -- ok found time ;) ):
>>>
>>> https://issues.apache.org/jira/browse/TIKA-888
>>>
>>> http://mail-archives.apache.org/mod_mbox/tika-dev/201011.mbox/%3CC8F38B50.2
>>> 3828%[hidden email]%3E
>>>
>>>
>>> I'm +1 for it. Seems like so is Mike, and also Ken K. Any objections from
>>> others to require Java6?
>>>
>>> Cheers,
>>> Chris
>>>
>>>
>>> On 2/8/13 6:32 AM, "Ken Krugler" <[hidden email]> wrote:
>>>
>>>>
>>>> On Feb 8, 2013, at 3:54am, Michael McCandless wrote:
>>>>
>>>>> On Thu, Feb 7, 2013 at 3:51 PM, Nick Burch <[hidden email]>
>>> wrote:
>>>>>> On Thu, 7 Feb 2013, Michael McCandless wrote:
>>>>>>>
>>>>>>> Hmm it looks like the Tika build is failing on Jenkins due to this:
>>>>>>>
>>>>>>> [ERROR]
>>>>>>>
>>>>>>> /home/jenkins/jenkins-slave/workspace/Tika-trunk/trunk/tika-server/src/
>>>>>>> main/java/org/apache/tika/server/CSVMessageBodyWriter.java:[51,3]
>>>>>>> method does not override a method from its superclass
>>>>>>> [ERROR]
>>>>>>>
>>>>>>> /home/jenkins/jenkins-slave/workspace/Tika-trunk/trunk/tika-server/src/
>>>>>>> main/java/org/apache/tika/server/JSONMessageBodyWriter.java:[51,3]
>>>>>>> method does not override a method from its superclass
>>>>>>
>>>>>>
>>>>>> Is that an @Override of a method from an Interface? That works on JDK
>>>>>> 1.6+,
>>>>>> but isn't valid on JDK 1.5. Just remove the @Override from the
>>>>>> interface
>>>>>> implementing methods and you should be fine
>>>>>
>>>>> Ahh.... that's right.  I had forgotten about this.  I commented out
>>>>> those two @Overrides ...
>>>>>
>>>>> Maybe ... it's time for Tika to require Java 1.6?  Java 1.6 is end of
>>>>> life next month after all Š
>>>>
>>>> +1
>>>>
>>>> Seems like being one generation behind is OK, but not two :)
>>>>
>>>> -- Ken
>>>>
>>>> --------------------------
>>>> Ken Krugler
>>>> +1 530-210-6378
>>>> http://www.scaleunlimited.com
>>>> custom big data solutions & training
>>>> Hadoop, Cascading, Cassandra & Solr
>>>>
>>>>
>>>>
>>>>
>>>>
>>>
>>>

Reply | Threaded
Open this post in threaded view
|

Re: [DISCUSS] Should Tika require Java6? (was Re: Build failed in Jenkins: Tika-trunk #977)

Michael McCandless-2
Seems like this passes?

Is this just a matter of changing tika-parent/pom.xml from:

  <properties>
    <maven.compile.source>1.5</maven.compile.source>
    <maven.compile.target>1.5</maven.compile.target>
    <project.reporting.outputEncoding>${project.build.sourceEncoding}</project.reporting.outputEncoding>
  </properties>

to:

  <properties>
    <maven.compile.source>1.6</maven.compile.source>
    <maven.compile.target>1.6</maven.compile.target>
    <project.reporting.outputEncoding>${project.build.sourceEncoding}</project.reporting.outputEncoding>
  </properties>

?

I have precious little Maven experience...

Mike McCandless

http://blog.mikemccandless.com

On Sat, Feb 9, 2013 at 9:52 AM, Dave Meikle <[hidden email]> wrote:

> +1 from me.
>
> Cheers,
> Dave
>
> On 8 Feb 2013, at 17:49, Michael McCandless <[hidden email]> wrote:
>
>> +1
>>
>> Mike McCandless
>>
>> http://blog.mikemccandless.com
>>
>>
>>
>> On Fri, Feb 8, 2013 at 12:33 PM, Oleg Tikhonov <[hidden email]> wrote:
>>> Back to the "future". Aha moment !!!
>>> Here is mine +1.
>>>
>>> According to Oracle "In February 2011 Oracle announced the End of Public
>>> Updates for their Java SE 6 products for July 2012. In February 2012 Oracle
>>> extended the End of Public Updates for 4 months, to November 2012. ".
>>>
>>> Oleg
>>>
>>>
>>>
>>> On Fri, Feb 8, 2013 at 6:54 PM, Mattmann, Chris A (388J) <
>>> [hidden email]> wrote:
>>>
>>>> Hey Guys,
>>>>
>>>> Just to summarize, the question on the table is whether or not Tika should
>>>> require Java6. We had some discussions on this previously (if I get time,
>>>> will dig up the threads -- ok found time ;) ):
>>>>
>>>> https://issues.apache.org/jira/browse/TIKA-888
>>>>
>>>> http://mail-archives.apache.org/mod_mbox/tika-dev/201011.mbox/%3CC8F38B50.2
>>>> 3828%[hidden email]%3E
>>>>
>>>>
>>>> I'm +1 for it. Seems like so is Mike, and also Ken K. Any objections from
>>>> others to require Java6?
>>>>
>>>> Cheers,
>>>> Chris
>>>>
>>>>
>>>> On 2/8/13 6:32 AM, "Ken Krugler" <[hidden email]> wrote:
>>>>
>>>>>
>>>>> On Feb 8, 2013, at 3:54am, Michael McCandless wrote:
>>>>>
>>>>>> On Thu, Feb 7, 2013 at 3:51 PM, Nick Burch <[hidden email]>
>>>> wrote:
>>>>>>> On Thu, 7 Feb 2013, Michael McCandless wrote:
>>>>>>>>
>>>>>>>> Hmm it looks like the Tika build is failing on Jenkins due to this:
>>>>>>>>
>>>>>>>> [ERROR]
>>>>>>>>
>>>>>>>> /home/jenkins/jenkins-slave/workspace/Tika-trunk/trunk/tika-server/src/
>>>>>>>> main/java/org/apache/tika/server/CSVMessageBodyWriter.java:[51,3]
>>>>>>>> method does not override a method from its superclass
>>>>>>>> [ERROR]
>>>>>>>>
>>>>>>>> /home/jenkins/jenkins-slave/workspace/Tika-trunk/trunk/tika-server/src/
>>>>>>>> main/java/org/apache/tika/server/JSONMessageBodyWriter.java:[51,3]
>>>>>>>> method does not override a method from its superclass
>>>>>>>
>>>>>>>
>>>>>>> Is that an @Override of a method from an Interface? That works on JDK
>>>>>>> 1.6+,
>>>>>>> but isn't valid on JDK 1.5. Just remove the @Override from the
>>>>>>> interface
>>>>>>> implementing methods and you should be fine
>>>>>>
>>>>>> Ahh.... that's right.  I had forgotten about this.  I commented out
>>>>>> those two @Overrides ...
>>>>>>
>>>>>> Maybe ... it's time for Tika to require Java 1.6?  Java 1.6 is end of
>>>>>> life next month after all Š
>>>>>
>>>>> +1
>>>>>
>>>>> Seems like being one generation behind is OK, but not two :)
>>>>>
>>>>> -- Ken
>>>>>
>>>>> --------------------------
>>>>> Ken Krugler
>>>>> +1 530-210-6378
>>>>> http://www.scaleunlimited.com
>>>>> custom big data solutions & training
>>>>> Hadoop, Cascading, Cassandra & Solr
>>>>>
>>>>>
>>>>>
>>>>>
>>>>>
>>>>
>>>>
>
Reply | Threaded
Open this post in threaded view
|

Re: [DISCUSS] Should Tika require Java6? (was Re: Build failed in Jenkins: Tika-trunk #977)

Mattmann, Chris A (3010)
Mike, you could have fooled me!

+1 to commit it, we're good. I think there haven't been any objections and
the discussion has sort of died down.

Let's commit it!

Cheers,
Chris


On 2/12/13 3:15 AM, "Michael McCandless" <[hidden email]> wrote:

>Seems like this passes?
>
>Is this just a matter of changing tika-parent/pom.xml from:
>
>  <properties>
>    <maven.compile.source>1.5</maven.compile.source>
>    <maven.compile.target>1.5</maven.compile.target>
>    
><project.reporting.outputEncoding>${project.build.sourceEncoding}</project
>.reporting.outputEncoding>
>  </properties>
>
>to:
>
>  <properties>
>    <maven.compile.source>1.6</maven.compile.source>
>    <maven.compile.target>1.6</maven.compile.target>
>    
><project.reporting.outputEncoding>${project.build.sourceEncoding}</project
>.reporting.outputEncoding>
>  </properties>
>
>?
>
>I have precious little Maven experience...
>
>Mike McCandless
>
>http://blog.mikemccandless.com
>
>On Sat, Feb 9, 2013 at 9:52 AM, Dave Meikle <[hidden email]> wrote:
>> +1 from me.
>>
>> Cheers,
>> Dave
>>
>> On 8 Feb 2013, at 17:49, Michael McCandless <[hidden email]>
>>wrote:
>>
>>> +1
>>>
>>> Mike McCandless
>>>
>>> http://blog.mikemccandless.com
>>>
>>>
>>>
>>> On Fri, Feb 8, 2013 at 12:33 PM, Oleg Tikhonov <[hidden email]> wrote:
>>>> Back to the "future". Aha moment !!!
>>>> Here is mine +1.
>>>>
>>>> According to Oracle "In February 2011 Oracle announced the End of
>>>>Public
>>>> Updates for their Java SE 6 products for July 2012. In February 2012
>>>>Oracle
>>>> extended the End of Public Updates for 4 months, to November 2012. ".
>>>>
>>>> Oleg
>>>>
>>>>
>>>>
>>>> On Fri, Feb 8, 2013 at 6:54 PM, Mattmann, Chris A (388J) <
>>>> [hidden email]> wrote:
>>>>
>>>>> Hey Guys,
>>>>>
>>>>> Just to summarize, the question on the table is whether or not Tika
>>>>>should
>>>>> require Java6. We had some discussions on this previously (if I get
>>>>>time,
>>>>> will dig up the threads -- ok found time ;) ):
>>>>>
>>>>> https://issues.apache.org/jira/browse/TIKA-888
>>>>>
>>>>>
>>>>>http://mail-archives.apache.org/mod_mbox/tika-dev/201011.mbox/%3CC8F38
>>>>>B50.2
>>>>> 3828%[hidden email]%3E
>>>>>
>>>>>
>>>>> I'm +1 for it. Seems like so is Mike, and also Ken K. Any objections
>>>>>from
>>>>> others to require Java6?
>>>>>
>>>>> Cheers,
>>>>> Chris
>>>>>
>>>>>
>>>>> On 2/8/13 6:32 AM, "Ken Krugler" <[hidden email]> wrote:
>>>>>
>>>>>>
>>>>>> On Feb 8, 2013, at 3:54am, Michael McCandless wrote:
>>>>>>
>>>>>>> On Thu, Feb 7, 2013 at 3:51 PM, Nick Burch <[hidden email]>
>>>>> wrote:
>>>>>>>> On Thu, 7 Feb 2013, Michael McCandless wrote:
>>>>>>>>>
>>>>>>>>> Hmm it looks like the Tika build is failing on Jenkins due to
>>>>>>>>>this:
>>>>>>>>>
>>>>>>>>> [ERROR]
>>>>>>>>>
>>>>>>>>>
>>>>>>>>>/home/jenkins/jenkins-slave/workspace/Tika-trunk/trunk/tika-server
>>>>>>>>>/src/
>>>>>>>>> main/java/org/apache/tika/server/CSVMessageBodyWriter.java:[51,3]
>>>>>>>>> method does not override a method from its superclass
>>>>>>>>> [ERROR]
>>>>>>>>>
>>>>>>>>>
>>>>>>>>>/home/jenkins/jenkins-slave/workspace/Tika-trunk/trunk/tika-server
>>>>>>>>>/src/
>>>>>>>>>
>>>>>>>>>main/java/org/apache/tika/server/JSONMessageBodyWriter.java:[51,3]
>>>>>>>>> method does not override a method from its superclass
>>>>>>>>
>>>>>>>>
>>>>>>>> Is that an @Override of a method from an Interface? That works on
>>>>>>>>JDK
>>>>>>>> 1.6+,
>>>>>>>> but isn't valid on JDK 1.5. Just remove the @Override from the
>>>>>>>> interface
>>>>>>>> implementing methods and you should be fine
>>>>>>>
>>>>>>> Ahh.... that's right.  I had forgotten about this.  I commented out
>>>>>>> those two @Overrides ...
>>>>>>>
>>>>>>> Maybe ... it's time for Tika to require Java 1.6?  Java 1.6 is end
>>>>>>>of
>>>>>>> life next month after all Š
>>>>>>
>>>>>> +1
>>>>>>
>>>>>> Seems like being one generation behind is OK, but not two :)
>>>>>>
>>>>>> -- Ken
>>>>>>
>>>>>> --------------------------
>>>>>> Ken Krugler
>>>>>> +1 530-210-6378
>>>>>> http://www.scaleunlimited.com
>>>>>> custom big data solutions & training
>>>>>> Hadoop, Cascading, Cassandra & Solr
>>>>>>
>>>>>>
>>>>>>
>>>>>>
>>>>>>
>>>>>
>>>>>
>>

Reply | Threaded
Open this post in threaded view
|

Re: [DISCUSS] Should Tika require Java6? (was Re: Build failed in Jenkins: Tika-trunk #977)

Michael McCandless-2
OK, Thanks Chris.

I committed, and also re-enabled those two @Overrides to make sure it
"really" worked :)

Mike McCandless

http://blog.mikemccandless.com

On Tue, Feb 12, 2013 at 11:30 AM, Mattmann, Chris A (388J)
<[hidden email]> wrote:

> Mike, you could have fooled me!
>
> +1 to commit it, we're good. I think there haven't been any objections and
> the discussion has sort of died down.
>
> Let's commit it!
>
> Cheers,
> Chris
>
>
> On 2/12/13 3:15 AM, "Michael McCandless" <[hidden email]> wrote:
>
>>Seems like this passes?
>>
>>Is this just a matter of changing tika-parent/pom.xml from:
>>
>>  <properties>
>>    <maven.compile.source>1.5</maven.compile.source>
>>    <maven.compile.target>1.5</maven.compile.target>
>>
>><project.reporting.outputEncoding>${project.build.sourceEncoding}</project
>>.reporting.outputEncoding>
>>  </properties>
>>
>>to:
>>
>>  <properties>
>>    <maven.compile.source>1.6</maven.compile.source>
>>    <maven.compile.target>1.6</maven.compile.target>
>>
>><project.reporting.outputEncoding>${project.build.sourceEncoding}</project
>>.reporting.outputEncoding>
>>  </properties>
>>
>>?
>>
>>I have precious little Maven experience...
>>
>>Mike McCandless
>>
>>http://blog.mikemccandless.com
>>
>>On Sat, Feb 9, 2013 at 9:52 AM, Dave Meikle <[hidden email]> wrote:
>>> +1 from me.
>>>
>>> Cheers,
>>> Dave
>>>
>>> On 8 Feb 2013, at 17:49, Michael McCandless <[hidden email]>
>>>wrote:
>>>
>>>> +1
>>>>
>>>> Mike McCandless
>>>>
>>>> http://blog.mikemccandless.com
>>>>
>>>>
>>>>
>>>> On Fri, Feb 8, 2013 at 12:33 PM, Oleg Tikhonov <[hidden email]> wrote:
>>>>> Back to the "future". Aha moment !!!
>>>>> Here is mine +1.
>>>>>
>>>>> According to Oracle "In February 2011 Oracle announced the End of
>>>>>Public
>>>>> Updates for their Java SE 6 products for July 2012. In February 2012
>>>>>Oracle
>>>>> extended the End of Public Updates for 4 months, to November 2012. ".
>>>>>
>>>>> Oleg
>>>>>
>>>>>
>>>>>
>>>>> On Fri, Feb 8, 2013 at 6:54 PM, Mattmann, Chris A (388J) <
>>>>> [hidden email]> wrote:
>>>>>
>>>>>> Hey Guys,
>>>>>>
>>>>>> Just to summarize, the question on the table is whether or not Tika
>>>>>>should
>>>>>> require Java6. We had some discussions on this previously (if I get
>>>>>>time,
>>>>>> will dig up the threads -- ok found time ;) ):
>>>>>>
>>>>>> https://issues.apache.org/jira/browse/TIKA-888
>>>>>>
>>>>>>
>>>>>>http://mail-archives.apache.org/mod_mbox/tika-dev/201011.mbox/%3CC8F38
>>>>>>B50.2
>>>>>> 3828%[hidden email]%3E
>>>>>>
>>>>>>
>>>>>> I'm +1 for it. Seems like so is Mike, and also Ken K. Any objections
>>>>>>from
>>>>>> others to require Java6?
>>>>>>
>>>>>> Cheers,
>>>>>> Chris
>>>>>>
>>>>>>
>>>>>> On 2/8/13 6:32 AM, "Ken Krugler" <[hidden email]> wrote:
>>>>>>
>>>>>>>
>>>>>>> On Feb 8, 2013, at 3:54am, Michael McCandless wrote:
>>>>>>>
>>>>>>>> On Thu, Feb 7, 2013 at 3:51 PM, Nick Burch <[hidden email]>
>>>>>> wrote:
>>>>>>>>> On Thu, 7 Feb 2013, Michael McCandless wrote:
>>>>>>>>>>
>>>>>>>>>> Hmm it looks like the Tika build is failing on Jenkins due to
>>>>>>>>>>this:
>>>>>>>>>>
>>>>>>>>>> [ERROR]
>>>>>>>>>>
>>>>>>>>>>
>>>>>>>>>>/home/jenkins/jenkins-slave/workspace/Tika-trunk/trunk/tika-server
>>>>>>>>>>/src/
>>>>>>>>>> main/java/org/apache/tika/server/CSVMessageBodyWriter.java:[51,3]
>>>>>>>>>> method does not override a method from its superclass
>>>>>>>>>> [ERROR]
>>>>>>>>>>
>>>>>>>>>>
>>>>>>>>>>/home/jenkins/jenkins-slave/workspace/Tika-trunk/trunk/tika-server
>>>>>>>>>>/src/
>>>>>>>>>>
>>>>>>>>>>main/java/org/apache/tika/server/JSONMessageBodyWriter.java:[51,3]
>>>>>>>>>> method does not override a method from its superclass
>>>>>>>>>
>>>>>>>>>
>>>>>>>>> Is that an @Override of a method from an Interface? That works on
>>>>>>>>>JDK
>>>>>>>>> 1.6+,
>>>>>>>>> but isn't valid on JDK 1.5. Just remove the @Override from the
>>>>>>>>> interface
>>>>>>>>> implementing methods and you should be fine
>>>>>>>>
>>>>>>>> Ahh.... that's right.  I had forgotten about this.  I commented out
>>>>>>>> those two @Overrides ...
>>>>>>>>
>>>>>>>> Maybe ... it's time for Tika to require Java 1.6?  Java 1.6 is end
>>>>>>>>of
>>>>>>>> life next month after all Š
>>>>>>>
>>>>>>> +1
>>>>>>>
>>>>>>> Seems like being one generation behind is OK, but not two :)
>>>>>>>
>>>>>>> -- Ken
>>>>>>>
>>>>>>> --------------------------
>>>>>>> Ken Krugler
>>>>>>> +1 530-210-6378
>>>>>>> http://www.scaleunlimited.com
>>>>>>> custom big data solutions & training
>>>>>>> Hadoop, Cascading, Cassandra & Solr
>>>>>>>
>>>>>>>
>>>>>>>
>>>>>>>
>>>>>>>
>>>>>>
>>>>>>
>>>
>