Hudson build is unstable: Mahout-Quality #142

classic Classic list List threaded Threaded
27 messages Options
12
Reply | Threaded
Open this post in threaded view
|

Hudson build is unstable: Mahout-Quality #142

Apache Hudson Server
Reply | Threaded
Open this post in threaded view
|

Hudson build is still unstable: Mahout-Quality #143

Apache Hudson Server
Reply | Threaded
Open this post in threaded view
|

Hudson build is still unstable: Mahout-Quality #144

Apache Hudson Server
Reply | Threaded
Open this post in threaded view
|

Hudson build is still unstable: Mahout-Quality #145

Apache Hudson Server
Reply | Threaded
Open this post in threaded view
|

Hudson build is still unstable: Mahout-Quality #146

Apache Hudson Server
Reply | Threaded
Open this post in threaded view
|

Hudson build is still unstable: Mahout-Quality #147

Apache Hudson Server
Reply | Threaded
Open this post in threaded view
|

Hudson build is still unstable: Mahout-Quality #148

Apache Hudson Server
Reply | Threaded
Open this post in threaded view
|

Build failed in Hudson: Mahout-Quality #149

Apache Hudson Server
See <http://hudson.zones.apache.org/hudson/job/Mahout-Quality/149/changes>

Changes:

[tdunning] MAHOUT-444 - on-line estimator widget with tests that demonstrate accuracy.

------------------------------------------
[...truncated 1556 lines...]
[INFO] Copying 3 resources
[INFO] [compiler:compile {execution: default-compile}]
[INFO] No sources to compile
[INFO] [findbugs:findbugs {execution: default-cli}]
[INFO] Preparing clover2:instrument
[INFO] [clover2:instrumentInternal {execution: default-instrumentInternal}]
[INFO] No 'maven.clover.licenseLocation' configured. Using default evaluation license.
[INFO] No Clover instrumentation done on source files in: [<http://hudson.zones.apache.org/hudson/job/Mahout-Quality/ws/trunk/buildtools/src/main/java]> as no matching sources files found
[INFO] No Clover instrumentation done on source files in: [<http://hudson.zones.apache.org/hudson/job/Mahout-Quality/ws/trunk/buildtools/src/test/java]> as no matching sources files found
[INFO] [remote-resources:process {execution: default}]
[INFO] inceptionYear not specified, defaulting to 2010
[INFO] [resources:resources {execution: default-resources}]
[INFO] Using 'UTF-8' encoding to copy filtered resources.
[INFO] Copying 3 resources
[INFO] Copying 0 resource
[INFO] Copying 3 resources
[INFO] [compiler:compile {execution: default-compile}]
[INFO] No sources to compile
[INFO] [resources:testResources {execution: default-testResources}]
[INFO] Using 'UTF-8' encoding to copy filtered resources.
[INFO] skip non existing resourceDirectory <http://hudson.zones.apache.org/hudson/job/Mahout-Quality/ws/trunk/buildtools/src/test/resources>
[INFO] Copying 3 resources
[INFO] Copying 3 resources
[INFO] [compiler:testCompile {execution: default-testCompile}]
[INFO] No sources to compile
[INFO] [surefire:test {execution: default-test}]
[INFO] Surefire report directory: <http://hudson.zones.apache.org/hudson/job/Mahout-Quality/ws/trunk/buildtools/target/clover/surefire-reports>

-------------------------------------------------------
 T E S T S
-------------------------------------------------------
There are no tests to run.

Results :

Tests run: 0, Failures: 0, Errors: 0, Skipped: 0

[INFO] [jar:jar {execution: default-jar}]
[INFO] Building jar: <http://hudson.zones.apache.org/hudson/job/Mahout-Quality/ws/trunk/buildtools/target/clover/mahout-buildtools-0.4-SNAPSHOT-clover.jar>
[INFO] [install:install {execution: default-install}]
[INFO] Installing <http://hudson.zones.apache.org/hudson/job/Mahout-Quality/ws/trunk/buildtools/target/clover/mahout-buildtools-0.4-SNAPSHOT-clover.jar> to /home/hudson/.m2/repository/org/apache/mahout/mahout-buildtools/0.4-SNAPSHOT/mahout-buildtools-0.4-SNAPSHOT-clover.jar
[INFO] [clover2:instrument {execution: default-cli}]
[INFO] ------------------------------------------------------------------------
[INFO] Building Package up files needed by Eclipse
[INFO]    task-segment: [clean, install, javadoc:javadoc, checkstyle:checkstyle, findbugs:findbugs, clover2:instrument]
[INFO] ------------------------------------------------------------------------
[INFO] [clean:clean {execution: default-clean}]
[INFO] [remote-resources:process {execution: default}]
[INFO] inceptionYear not specified, defaulting to 2010
[INFO] [resources:resources {execution: default-resources}]
[INFO] Using 'UTF-8' encoding to copy filtered resources.
[INFO] Copying 3 resources
[INFO] Copying 3 resources
[INFO] [compiler:compile {execution: default-compile}]
[INFO] No sources to compile
[INFO] [resources:testResources {execution: default-testResources}]
[INFO] Using 'UTF-8' encoding to copy filtered resources.
[INFO] skip non existing resourceDirectory <http://hudson.zones.apache.org/hudson/job/Mahout-Quality/ws/trunk/eclipse/src/test/resources>
[INFO] Copying 3 resources
[INFO] [compiler:testCompile {execution: default-testCompile}]
[INFO] No sources to compile
[INFO] [surefire:test {execution: default-test}]
[INFO] Surefire report directory: <http://hudson.zones.apache.org/hudson/job/Mahout-Quality/149/artifact/trunk/eclipse/target/surefire-reports>

-------------------------------------------------------
 T E S T S
-------------------------------------------------------
There are no tests to run.

Results :

Tests run: 0, Failures: 0, Errors: 0, Skipped: 0

[INFO] [jar:jar {execution: default-jar}]
[INFO] Building jar: <http://hudson.zones.apache.org/hudson/job/Mahout-Quality/149/artifact/trunk/eclipse/target/mahout-eclipse-support-0.4-SNAPSHOT.jar>
[INFO] [install:install {execution: default-install}]
[INFO] Installing <http://hudson.zones.apache.org/hudson/job/Mahout-Quality/149/artifact/trunk/eclipse/target/mahout-eclipse-support-0.4-SNAPSHOT.jar> to /home/hudson/.m2/repository/org/apache/mahout/mahout-eclipse-support/0.4-SNAPSHOT/mahout-eclipse-support-0.4-SNAPSHOT.jar
[INFO] Preparing javadoc:javadoc
[INFO] No goals needed for project - skipping
[INFO] [javadoc:javadoc {execution: default-cli}]
[INFO] [checkstyle:checkstyle {execution: default-cli}]
[INFO] Source directory does not exist - skipping report.
[INFO] Preparing findbugs:findbugs
[INFO] [remote-resources:process {execution: default}]
[INFO] inceptionYear not specified, defaulting to 2010
[INFO] [resources:resources {execution: default-resources}]
[INFO] Using 'UTF-8' encoding to copy filtered resources.
[INFO] Copying 3 resources
[INFO] Copying 3 resources
[INFO] Copying 3 resources
[INFO] [compiler:compile {execution: default-compile}]
[INFO] No sources to compile
[INFO] [findbugs:findbugs {execution: default-cli}]
[INFO] Preparing clover2:instrument
[INFO] [clover2:instrumentInternal {execution: default-instrumentInternal}]
[INFO] No 'maven.clover.licenseLocation' configured. Using default evaluation license.
[INFO] No Clover instrumentation done on source files in: [<http://hudson.zones.apache.org/hudson/job/Mahout-Quality/ws/trunk/eclipse/src/main/java]> as no matching sources files found
[INFO] No Clover instrumentation done on source files in: [<http://hudson.zones.apache.org/hudson/job/Mahout-Quality/ws/trunk/eclipse/src/test/java]> as no matching sources files found
[INFO] [remote-resources:process {execution: default}]
[INFO] inceptionYear not specified, defaulting to 2010
[INFO] [resources:resources {execution: default-resources}]
[INFO] Using 'UTF-8' encoding to copy filtered resources.
[INFO] Copying 3 resources
[INFO] Copying 0 resource
[INFO] Copying 3 resources
[INFO] [compiler:compile {execution: default-compile}]
[INFO] No sources to compile
[INFO] [resources:testResources {execution: default-testResources}]
[INFO] Using 'UTF-8' encoding to copy filtered resources.
[INFO] skip non existing resourceDirectory <http://hudson.zones.apache.org/hudson/job/Mahout-Quality/ws/trunk/eclipse/src/test/resources>
[INFO] Copying 3 resources
[INFO] Copying 3 resources
[INFO] [compiler:testCompile {execution: default-testCompile}]
[INFO] No sources to compile
[INFO] [surefire:test {execution: default-test}]
[INFO] Surefire report directory: <http://hudson.zones.apache.org/hudson/job/Mahout-Quality/ws/trunk/eclipse/target/clover/surefire-reports>

-------------------------------------------------------
 T E S T S
-------------------------------------------------------
There are no tests to run.

Results :

Tests run: 0, Failures: 0, Errors: 0, Skipped: 0

[INFO] [jar:jar {execution: default-jar}]
[INFO] Building jar: <http://hudson.zones.apache.org/hudson/job/Mahout-Quality/ws/trunk/eclipse/target/clover/mahout-eclipse-support-0.4-SNAPSHOT-clover.jar>
[INFO] [install:install {execution: default-install}]
[INFO] Installing <http://hudson.zones.apache.org/hudson/job/Mahout-Quality/ws/trunk/eclipse/target/clover/mahout-eclipse-support-0.4-SNAPSHOT-clover.jar> to /home/hudson/.m2/repository/org/apache/mahout/mahout-eclipse-support/0.4-SNAPSHOT/mahout-eclipse-support-0.4-SNAPSHOT-clover.jar
[INFO] [clover2:instrument {execution: default-cli}]
[INFO] ------------------------------------------------------------------------
[INFO] Building Apache Mahout
[INFO]    task-segment: [clean, install, javadoc:javadoc, checkstyle:checkstyle, findbugs:findbugs, clover2:instrument]
[INFO] ------------------------------------------------------------------------
[INFO] [clean:clean {execution: default-clean}]
[INFO] [remote-resources:process {execution: default}]
[INFO] [site:attach-descriptor {execution: default-attach-descriptor}]
[INFO] Unable to load parent project from a relative path: Could not find the model file '<http://hudson.zones.apache.org/hudson/job/Mahout-Quality/ws/pom.xml'.> for project unknown
[INFO] Parent project loaded from repository.
[INFO] [install:install {execution: default-install}]
[INFO] Installing <http://hudson.zones.apache.org/hudson/job/Mahout-Quality/ws/trunk/pom.xml> to /home/hudson/.m2/repository/org/apache/mahout/mahout/0.4-SNAPSHOT/mahout-0.4-SNAPSHOT.pom
[INFO] Preparing javadoc:javadoc
[INFO] No goals needed for project - skipping
[INFO] [javadoc:javadoc {execution: default-cli}]
[INFO] [checkstyle:checkstyle {execution: default-cli}]
[INFO] Source directory does not exist - skipping report.
[INFO] Preparing findbugs:findbugs
[INFO] [remote-resources:process {execution: default}]
[INFO] [findbugs:findbugs {execution: default-cli}]
[INFO] Preparing clover2:instrument
[INFO] [clover2:instrumentInternal {execution: default-instrumentInternal}]
[WARNING] The reported language of this project is none, attempting to instrument sources anyway.
[INFO] No Clover instrumentation done on source files in: [<http://hudson.zones.apache.org/hudson/job/Mahout-Quality/ws/trunk/src/main/java]> as no matching sources files found
[INFO] No Clover instrumentation done on source files in: [<http://hudson.zones.apache.org/hudson/job/Mahout-Quality/ws/trunk/src/test/java]> as no matching sources files found
[INFO] [remote-resources:process {execution: default}]
[INFO] [site:attach-descriptor {execution: default-attach-descriptor}]
[INFO] [install:install {execution: default-install}]
[INFO] Installing <http://hudson.zones.apache.org/hudson/job/Mahout-Quality/ws/trunk/pom.xml> to /home/hudson/.m2/repository/org/apache/mahout/mahout/0.4-SNAPSHOT/mahout-0.4-SNAPSHOT.pom
[INFO] [clover2:instrument {execution: default-cli}]
[INFO] ------------------------------------------------------------------------
[INFO] Building Mahout Math
[INFO]    task-segment: [clean, install, javadoc:javadoc, checkstyle:checkstyle, findbugs:findbugs, clover2:instrument]
[INFO] ------------------------------------------------------------------------
[INFO] [clean:clean {execution: default-clean}]
[INFO] [resources:resources {execution: default-resources}]
[INFO] Using 'UTF-8' encoding to copy filtered resources.
[INFO] skip non existing resourceDirectory <http://hudson.zones.apache.org/hudson/job/Mahout-Quality/ws/trunk/math/src/main/resources>
[INFO] [compiler:compile {execution: default-compile}]
[INFO] Compiling 166 source files to <http://hudson.zones.apache.org/hudson/job/Mahout-Quality/149/artifact/trunk/math/target/classes>
[INFO] [resources:testResources {execution: default-testResources}]
[INFO] Using 'UTF-8' encoding to copy filtered resources.
[INFO] skip non existing resourceDirectory <http://hudson.zones.apache.org/hudson/job/Mahout-Quality/ws/trunk/math/src/test/resources>
[INFO] [compiler:testCompile {execution: default-testCompile}]
[INFO] Compiling 23 source files to <http://hudson.zones.apache.org/hudson/job/Mahout-Quality/149/artifact/trunk/math/target/test-classes>
[INFO] [surefire:test {execution: default-test}]
[INFO] Surefire report directory: <http://hudson.zones.apache.org/hudson/job/Mahout-Quality/149/artifact/trunk/math/target/surefire-reports>

-------------------------------------------------------
 T E S T S
-------------------------------------------------------
Running org.apache.mahout.math.TestMatrixView
Tests run: 49, Failures: 0, Errors: 0, Skipped: 0, Time elapsed: 0.183 sec
Running org.apache.mahout.math.TestDenseVector
Tests run: 41, Failures: 0, Errors: 0, Skipped: 0, Time elapsed: 0.049 sec
Running org.apache.mahout.math.TestSparseMatrix
Tests run: 53, Failures: 0, Errors: 0, Skipped: 0, Time elapsed: 0.183 sec
Running org.apache.mahout.math.jet.stat.ProbabilityTest
Tests run: 3, Failures: 0, Errors: 0, Skipped: 0, Time elapsed: 0.098 sec
Running org.apache.mahout.math.TestSparseRowMatrix
Tests run: 53, Failures: 0, Errors: 0, Skipped: 0, Time elapsed: 0.079 sec
Running org.apache.mahout.math.stats.LogLikelihoodTest
Tests run: 4, Failures: 0, Errors: 0, Skipped: 0, Time elapsed: 0.005 sec
Running org.apache.mahout.math.TestRandomAccessSparseVector
Tests run: 41, Failures: 0, Errors: 0, Skipped: 0, Time elapsed: 0.028 sec
Running org.apache.mahout.math.TestOrderedIntDoubleMapping
Tests run: 2, Failures: 0, Errors: 0, Skipped: 0, Time elapsed: 0.004 sec
Running org.apache.mahout.math.jet.random.engine.MersenneTwisterTest
Tests run: 4, Failures: 0, Errors: 0, Skipped: 0, Time elapsed: 0.043 sec
Running org.apache.mahout.math.decomposer.hebbian.TestHebbianSolver
Tests run: 1, Failures: 0, Errors: 0, Skipped: 0, Time elapsed: 2.41 sec
Running org.apache.mahout.math.TestDenseMatrix
Tests run: 53, Failures: 0, Errors: 0, Skipped: 0, Time elapsed: 0.03 sec
Running org.apache.mahout.math.stats.OnlineSummarizerTest
Tests run: 2, Failures: 2, Errors: 0, Skipped: 0, Time elapsed: 0.046 sec <<< FAILURE!
Running org.apache.mahout.math.TestVectorView
Tests run: 36, Failures: 0, Errors: 0, Skipped: 0, Time elapsed: 0.018 sec
Running org.apache.mahout.math.VectorTest
Tests run: 15, Failures: 0, Errors: 0, Skipped: 0, Time elapsed: 0.026 sec
Running org.apache.mahout.math.jet.random.GammaTest
Tests run: 3, Failures: 0, Errors: 0, Skipped: 0, Time elapsed: 0.636 sec
Running org.apache.mahout.math.TestSparseColumnMatrix
Tests run: 53, Failures: 0, Errors: 0, Skipped: 0, Time elapsed: 0.052 sec
Running org.apache.mahout.math.decomposer.lanczos.TestLanczosSolver
Tests run: 2, Failures: 0, Errors: 0, Skipped: 0, Time elapsed: 5.871 sec
Running org.apache.mahout.math.TestSequentialAccessSparseVector
Tests run: 41, Failures: 0, Errors: 0, Skipped: 0, Time elapsed: 0.015 sec
Running org.apache.mahout.math.AIOOBInSortingTest
Tests run: 1, Failures: 0, Errors: 0, Skipped: 0, Time elapsed: 0.015 sec

Results :

Failed tests:
  testCount(org.apache.mahout.math.stats.OnlineSummarizerTest)
  testStats(org.apache.mahout.math.stats.OnlineSummarizerTest)

Tests run: 457, Failures: 2, Errors: 0, Skipped: 0

[INFO] ------------------------------------------------------------------------
[ERROR] BUILD FAILURE
[INFO] ------------------------------------------------------------------------
[INFO] There are test failures.

Please refer to <http://hudson.zones.apache.org/hudson/job/Mahout-Quality/149/artifact/trunk/math/target/surefire-reports> for the individual test results.
[INFO] ------------------------------------------------------------------------
[INFO] For more information, run Maven with the -e switch
[INFO] ------------------------------------------------------------------------
[INFO] Total time: 27 seconds
[INFO] Finished at: Thu Jul 22 01:03:05 UTC 2010
[INFO] Final Memory: 58M/394M
[INFO] ------------------------------------------------------------------------
[PMD] Skipping publisher since build result is FAILURE
[TASKS] Skipping publisher since build result is FAILURE
[FINDBUGS] Skipping publisher since build result is FAILURE
Publishing Javadoc
Archiving artifacts
Recording test results
Publishing Clover coverage report...
No Clover report will be published due to a Build Failure

Reply | Threaded
Open this post in threaded view
|

Build failed in Hudson: Mahout-Quality #150

Apache Hudson Server
See <http://hudson.zones.apache.org/hudson/job/Mahout-Quality/150/changes>

Changes:

[jeastman] MAHOUT-294:
- made clustering driver intermediate job steps public where feasible
- added method=sequential|mapreduce argument to Canopy and Dirichlet to allow reference implementations to
    be exercised from the command line
- more clustering drivers will follow
- added/updated unit tests to verify sequential implementations from command line
- all tests run

------------------------------------------
[...truncated 1556 lines...]
[INFO] Copying 3 resources
[INFO] [compiler:compile {execution: default-compile}]
[INFO] No sources to compile
[INFO] [findbugs:findbugs {execution: default-cli}]
[INFO] Preparing clover2:instrument
[INFO] [clover2:instrumentInternal {execution: default-instrumentInternal}]
[INFO] No 'maven.clover.licenseLocation' configured. Using default evaluation license.
[INFO] No Clover instrumentation done on source files in: [<http://hudson.zones.apache.org/hudson/job/Mahout-Quality/ws/trunk/buildtools/src/main/java]> as no matching sources files found
[INFO] No Clover instrumentation done on source files in: [<http://hudson.zones.apache.org/hudson/job/Mahout-Quality/ws/trunk/buildtools/src/test/java]> as no matching sources files found
[INFO] [remote-resources:process {execution: default}]
[INFO] inceptionYear not specified, defaulting to 2010
[INFO] [resources:resources {execution: default-resources}]
[INFO] Using 'UTF-8' encoding to copy filtered resources.
[INFO] Copying 3 resources
[INFO] Copying 0 resource
[INFO] Copying 3 resources
[INFO] [compiler:compile {execution: default-compile}]
[INFO] No sources to compile
[INFO] [resources:testResources {execution: default-testResources}]
[INFO] Using 'UTF-8' encoding to copy filtered resources.
[INFO] skip non existing resourceDirectory <http://hudson.zones.apache.org/hudson/job/Mahout-Quality/ws/trunk/buildtools/src/test/resources>
[INFO] Copying 3 resources
[INFO] Copying 3 resources
[INFO] [compiler:testCompile {execution: default-testCompile}]
[INFO] No sources to compile
[INFO] [surefire:test {execution: default-test}]
[INFO] Surefire report directory: <http://hudson.zones.apache.org/hudson/job/Mahout-Quality/ws/trunk/buildtools/target/clover/surefire-reports>

-------------------------------------------------------
 T E S T S
-------------------------------------------------------
There are no tests to run.

Results :

Tests run: 0, Failures: 0, Errors: 0, Skipped: 0

[INFO] [jar:jar {execution: default-jar}]
[INFO] Building jar: <http://hudson.zones.apache.org/hudson/job/Mahout-Quality/ws/trunk/buildtools/target/clover/mahout-buildtools-0.4-SNAPSHOT-clover.jar>
[INFO] [install:install {execution: default-install}]
[INFO] Installing <http://hudson.zones.apache.org/hudson/job/Mahout-Quality/ws/trunk/buildtools/target/clover/mahout-buildtools-0.4-SNAPSHOT-clover.jar> to /home/hudson/.m2/repository/org/apache/mahout/mahout-buildtools/0.4-SNAPSHOT/mahout-buildtools-0.4-SNAPSHOT-clover.jar
[INFO] [clover2:instrument {execution: default-cli}]
[INFO] ------------------------------------------------------------------------
[INFO] Building Package up files needed by Eclipse
[INFO]    task-segment: [clean, install, javadoc:javadoc, checkstyle:checkstyle, findbugs:findbugs, clover2:instrument]
[INFO] ------------------------------------------------------------------------
[INFO] [clean:clean {execution: default-clean}]
[INFO] [remote-resources:process {execution: default}]
[INFO] inceptionYear not specified, defaulting to 2010
[INFO] [resources:resources {execution: default-resources}]
[INFO] Using 'UTF-8' encoding to copy filtered resources.
[INFO] Copying 3 resources
[INFO] Copying 3 resources
[INFO] [compiler:compile {execution: default-compile}]
[INFO] No sources to compile
[INFO] [resources:testResources {execution: default-testResources}]
[INFO] Using 'UTF-8' encoding to copy filtered resources.
[INFO] skip non existing resourceDirectory <http://hudson.zones.apache.org/hudson/job/Mahout-Quality/ws/trunk/eclipse/src/test/resources>
[INFO] Copying 3 resources
[INFO] [compiler:testCompile {execution: default-testCompile}]
[INFO] No sources to compile
[INFO] [surefire:test {execution: default-test}]
[INFO] Surefire report directory: <http://hudson.zones.apache.org/hudson/job/Mahout-Quality/150/artifact/trunk/eclipse/target/surefire-reports>

-------------------------------------------------------
 T E S T S
-------------------------------------------------------
There are no tests to run.

Results :

Tests run: 0, Failures: 0, Errors: 0, Skipped: 0

[INFO] [jar:jar {execution: default-jar}]
[INFO] Building jar: <http://hudson.zones.apache.org/hudson/job/Mahout-Quality/150/artifact/trunk/eclipse/target/mahout-eclipse-support-0.4-SNAPSHOT.jar>
[INFO] [install:install {execution: default-install}]
[INFO] Installing <http://hudson.zones.apache.org/hudson/job/Mahout-Quality/150/artifact/trunk/eclipse/target/mahout-eclipse-support-0.4-SNAPSHOT.jar> to /home/hudson/.m2/repository/org/apache/mahout/mahout-eclipse-support/0.4-SNAPSHOT/mahout-eclipse-support-0.4-SNAPSHOT.jar
[INFO] Preparing javadoc:javadoc
[INFO] No goals needed for project - skipping
[INFO] [javadoc:javadoc {execution: default-cli}]
[INFO] [checkstyle:checkstyle {execution: default-cli}]
[INFO] Source directory does not exist - skipping report.
[INFO] Preparing findbugs:findbugs
[INFO] [remote-resources:process {execution: default}]
[INFO] inceptionYear not specified, defaulting to 2010
[INFO] [resources:resources {execution: default-resources}]
[INFO] Using 'UTF-8' encoding to copy filtered resources.
[INFO] Copying 3 resources
[INFO] Copying 3 resources
[INFO] Copying 3 resources
[INFO] [compiler:compile {execution: default-compile}]
[INFO] No sources to compile
[INFO] [findbugs:findbugs {execution: default-cli}]
[INFO] Preparing clover2:instrument
[INFO] [clover2:instrumentInternal {execution: default-instrumentInternal}]
[INFO] No 'maven.clover.licenseLocation' configured. Using default evaluation license.
[INFO] No Clover instrumentation done on source files in: [<http://hudson.zones.apache.org/hudson/job/Mahout-Quality/ws/trunk/eclipse/src/main/java]> as no matching sources files found
[INFO] No Clover instrumentation done on source files in: [<http://hudson.zones.apache.org/hudson/job/Mahout-Quality/ws/trunk/eclipse/src/test/java]> as no matching sources files found
[INFO] [remote-resources:process {execution: default}]
[INFO] inceptionYear not specified, defaulting to 2010
[INFO] [resources:resources {execution: default-resources}]
[INFO] Using 'UTF-8' encoding to copy filtered resources.
[INFO] Copying 3 resources
[INFO] Copying 0 resource
[INFO] Copying 3 resources
[INFO] [compiler:compile {execution: default-compile}]
[INFO] No sources to compile
[INFO] [resources:testResources {execution: default-testResources}]
[INFO] Using 'UTF-8' encoding to copy filtered resources.
[INFO] skip non existing resourceDirectory <http://hudson.zones.apache.org/hudson/job/Mahout-Quality/ws/trunk/eclipse/src/test/resources>
[INFO] Copying 3 resources
[INFO] Copying 3 resources
[INFO] [compiler:testCompile {execution: default-testCompile}]
[INFO] No sources to compile
[INFO] [surefire:test {execution: default-test}]
[INFO] Surefire report directory: <http://hudson.zones.apache.org/hudson/job/Mahout-Quality/ws/trunk/eclipse/target/clover/surefire-reports>

-------------------------------------------------------
 T E S T S
-------------------------------------------------------
There are no tests to run.

Results :

Tests run: 0, Failures: 0, Errors: 0, Skipped: 0

[INFO] [jar:jar {execution: default-jar}]
[INFO] Building jar: <http://hudson.zones.apache.org/hudson/job/Mahout-Quality/ws/trunk/eclipse/target/clover/mahout-eclipse-support-0.4-SNAPSHOT-clover.jar>
[INFO] [install:install {execution: default-install}]
[INFO] Installing <http://hudson.zones.apache.org/hudson/job/Mahout-Quality/ws/trunk/eclipse/target/clover/mahout-eclipse-support-0.4-SNAPSHOT-clover.jar> to /home/hudson/.m2/repository/org/apache/mahout/mahout-eclipse-support/0.4-SNAPSHOT/mahout-eclipse-support-0.4-SNAPSHOT-clover.jar
[INFO] [clover2:instrument {execution: default-cli}]
[INFO] ------------------------------------------------------------------------
[INFO] Building Apache Mahout
[INFO]    task-segment: [clean, install, javadoc:javadoc, checkstyle:checkstyle, findbugs:findbugs, clover2:instrument]
[INFO] ------------------------------------------------------------------------
[INFO] [clean:clean {execution: default-clean}]
[INFO] [remote-resources:process {execution: default}]
[INFO] [site:attach-descriptor {execution: default-attach-descriptor}]
[INFO] Unable to load parent project from a relative path: Could not find the model file '<http://hudson.zones.apache.org/hudson/job/Mahout-Quality/ws/pom.xml'.> for project unknown
[INFO] Parent project loaded from repository.
[INFO] [install:install {execution: default-install}]
[INFO] Installing <http://hudson.zones.apache.org/hudson/job/Mahout-Quality/ws/trunk/pom.xml> to /home/hudson/.m2/repository/org/apache/mahout/mahout/0.4-SNAPSHOT/mahout-0.4-SNAPSHOT.pom
[INFO] Preparing javadoc:javadoc
[INFO] No goals needed for project - skipping
[INFO] [javadoc:javadoc {execution: default-cli}]
[INFO] [checkstyle:checkstyle {execution: default-cli}]
[INFO] Source directory does not exist - skipping report.
[INFO] Preparing findbugs:findbugs
[INFO] [remote-resources:process {execution: default}]
[INFO] [findbugs:findbugs {execution: default-cli}]
[INFO] Preparing clover2:instrument
[INFO] [clover2:instrumentInternal {execution: default-instrumentInternal}]
[WARNING] The reported language of this project is none, attempting to instrument sources anyway.
[INFO] No Clover instrumentation done on source files in: [<http://hudson.zones.apache.org/hudson/job/Mahout-Quality/ws/trunk/src/main/java]> as no matching sources files found
[INFO] No Clover instrumentation done on source files in: [<http://hudson.zones.apache.org/hudson/job/Mahout-Quality/ws/trunk/src/test/java]> as no matching sources files found
[INFO] [remote-resources:process {execution: default}]
[INFO] [site:attach-descriptor {execution: default-attach-descriptor}]
[INFO] [install:install {execution: default-install}]
[INFO] Installing <http://hudson.zones.apache.org/hudson/job/Mahout-Quality/ws/trunk/pom.xml> to /home/hudson/.m2/repository/org/apache/mahout/mahout/0.4-SNAPSHOT/mahout-0.4-SNAPSHOT.pom
[INFO] [clover2:instrument {execution: default-cli}]
[INFO] ------------------------------------------------------------------------
[INFO] Building Mahout Math
[INFO]    task-segment: [clean, install, javadoc:javadoc, checkstyle:checkstyle, findbugs:findbugs, clover2:instrument]
[INFO] ------------------------------------------------------------------------
[INFO] [clean:clean {execution: default-clean}]
[INFO] [resources:resources {execution: default-resources}]
[INFO] Using 'UTF-8' encoding to copy filtered resources.
[INFO] skip non existing resourceDirectory <http://hudson.zones.apache.org/hudson/job/Mahout-Quality/ws/trunk/math/src/main/resources>
[INFO] [compiler:compile {execution: default-compile}]
[INFO] Compiling 166 source files to <http://hudson.zones.apache.org/hudson/job/Mahout-Quality/150/artifact/trunk/math/target/classes>
[INFO] [resources:testResources {execution: default-testResources}]
[INFO] Using 'UTF-8' encoding to copy filtered resources.
[INFO] skip non existing resourceDirectory <http://hudson.zones.apache.org/hudson/job/Mahout-Quality/ws/trunk/math/src/test/resources>
[INFO] [compiler:testCompile {execution: default-testCompile}]
[INFO] Compiling 23 source files to <http://hudson.zones.apache.org/hudson/job/Mahout-Quality/150/artifact/trunk/math/target/test-classes>
[INFO] [surefire:test {execution: default-test}]
[INFO] Surefire report directory: <http://hudson.zones.apache.org/hudson/job/Mahout-Quality/150/artifact/trunk/math/target/surefire-reports>

-------------------------------------------------------
 T E S T S
-------------------------------------------------------
Running org.apache.mahout.math.TestMatrixView
Tests run: 49, Failures: 0, Errors: 0, Skipped: 0, Time elapsed: 0.251 sec
Running org.apache.mahout.math.TestDenseVector
Tests run: 41, Failures: 0, Errors: 0, Skipped: 0, Time elapsed: 0.056 sec
Running org.apache.mahout.math.TestSparseMatrix
Tests run: 53, Failures: 0, Errors: 0, Skipped: 0, Time elapsed: 0.186 sec
Running org.apache.mahout.math.TestSparseRowMatrix
Tests run: 53, Failures: 0, Errors: 0, Skipped: 0, Time elapsed: 0.083 sec
Running org.apache.mahout.math.jet.stat.ProbabilityTest
Tests run: 3, Failures: 0, Errors: 0, Skipped: 0, Time elapsed: 0.1 sec
Running org.apache.mahout.math.stats.LogLikelihoodTest
Tests run: 4, Failures: 0, Errors: 0, Skipped: 0, Time elapsed: 0.004 sec
Running org.apache.mahout.math.TestRandomAccessSparseVector
Tests run: 41, Failures: 0, Errors: 0, Skipped: 0, Time elapsed: 0.028 sec
Running org.apache.mahout.math.TestOrderedIntDoubleMapping
Tests run: 2, Failures: 0, Errors: 0, Skipped: 0, Time elapsed: 0.004 sec
Running org.apache.mahout.math.jet.random.engine.MersenneTwisterTest
Tests run: 4, Failures: 0, Errors: 0, Skipped: 0, Time elapsed: 0.043 sec
Running org.apache.mahout.math.decomposer.hebbian.TestHebbianSolver
Tests run: 1, Failures: 0, Errors: 0, Skipped: 0, Time elapsed: 2.597 sec
Running org.apache.mahout.math.TestDenseMatrix
Tests run: 53, Failures: 0, Errors: 0, Skipped: 0, Time elapsed: 0.029 sec
Running org.apache.mahout.math.stats.OnlineSummarizerTest
Tests run: 2, Failures: 2, Errors: 0, Skipped: 0, Time elapsed: 0.047 sec <<< FAILURE!
Running org.apache.mahout.math.TestVectorView
Tests run: 36, Failures: 0, Errors: 0, Skipped: 0, Time elapsed: 0.017 sec
Running org.apache.mahout.math.VectorTest
Tests run: 15, Failures: 0, Errors: 0, Skipped: 0, Time elapsed: 0.026 sec
Running org.apache.mahout.math.jet.random.GammaTest
Tests run: 3, Failures: 0, Errors: 0, Skipped: 0, Time elapsed: 0.655 sec
Running org.apache.mahout.math.TestSparseColumnMatrix
Tests run: 53, Failures: 0, Errors: 0, Skipped: 0, Time elapsed: 0.052 sec
Running org.apache.mahout.math.decomposer.lanczos.TestLanczosSolver
Tests run: 2, Failures: 0, Errors: 0, Skipped: 0, Time elapsed: 5.845 sec
Running org.apache.mahout.math.TestSequentialAccessSparseVector
Tests run: 41, Failures: 0, Errors: 0, Skipped: 0, Time elapsed: 0.015 sec
Running org.apache.mahout.math.AIOOBInSortingTest
Tests run: 1, Failures: 0, Errors: 0, Skipped: 0, Time elapsed: 0.015 sec

Results :

Failed tests:
  testCount(org.apache.mahout.math.stats.OnlineSummarizerTest)
  testStats(org.apache.mahout.math.stats.OnlineSummarizerTest)

Tests run: 457, Failures: 2, Errors: 0, Skipped: 0

[INFO] ------------------------------------------------------------------------
[ERROR] BUILD FAILURE
[INFO] ------------------------------------------------------------------------
[INFO] There are test failures.

Please refer to <http://hudson.zones.apache.org/hudson/job/Mahout-Quality/150/artifact/trunk/math/target/surefire-reports> for the individual test results.
[INFO] ------------------------------------------------------------------------
[INFO] For more information, run Maven with the -e switch
[INFO] ------------------------------------------------------------------------
[INFO] Total time: 29 seconds
[INFO] Finished at: Thu Jul 22 02:02:29 UTC 2010
[INFO] Final Memory: 58M/396M
[INFO] ------------------------------------------------------------------------
[PMD] Skipping publisher since build result is FAILURE
[TASKS] Skipping publisher since build result is FAILURE
[FINDBUGS] Skipping publisher since build result is FAILURE
Publishing Javadoc
Archiving artifacts
Recording test results
Publishing Clover coverage report...
No Clover report will be published due to a Build Failure

Reply | Threaded
Open this post in threaded view
|

Hudson build is unstable: Mahout-Quality #151

Apache Hudson Server
Reply | Threaded
Open this post in threaded view
|

Hudson build is still unstable: Mahout-Quality #152

Apache Hudson Server
Reply | Threaded
Open this post in threaded view
|

Hudson build is still unstable: Mahout-Quality #153

Apache Hudson Server
Reply | Threaded
Open this post in threaded view
|

Hudson build is still unstable: Mahout-Quality #154

Apache Hudson Server
Reply | Threaded
Open this post in threaded view
|

Hudson build is still unstable: Mahout-Quality #155

Apache Hudson Server
Reply | Threaded
Open this post in threaded view
|

Hudson build is still unstable: Mahout-Quality #156

Apache Hudson Server
Reply | Threaded
Open this post in threaded view
|

Hudson build is still unstable: Mahout-Quality #157

Apache Hudson Server
Reply | Threaded
Open this post in threaded view
|

Hudson build is still unstable: Mahout-Quality #158

Apache Hudson Server
Reply | Threaded
Open this post in threaded view
|

Hudson build is still unstable: Mahout-Quality #159

Apache Hudson Server
Reply | Threaded
Open this post in threaded view
|

Hudson build is still unstable: Mahout-Quality #160

Apache Hudson Server
Reply | Threaded
Open this post in threaded view
|

Hudson build is still unstable: Mahout-Quality #161

Apache Hudson Server
12