Hudson build is unstable: Mahout-Quality #142

classic Classic list List threaded Threaded
27 messages Options
12
Reply | Threaded
Open this post in threaded view
|

Hudson build is still unstable: Mahout-Quality #162

Apache Hudson Server
Reply | Threaded
Open this post in threaded view
|

Hudson build is still unstable: Mahout-Quality #163

Apache Hudson Server
Reply | Threaded
Open this post in threaded view
|

Hudson build is still unstable: Mahout-Quality #164

Apache Hudson Server
Reply | Threaded
Open this post in threaded view
|

Hudson build is still unstable: Mahout-Quality #165

Apache Hudson Server
Reply | Threaded
Open this post in threaded view
|

Hudson build is still unstable: Mahout-Quality #166

Apache Hudson Server
Reply | Threaded
Open this post in threaded view
|

Hudson build is still unstable: Mahout-Quality #167

Apache Hudson Server
Reply | Threaded
Open this post in threaded view
|

Build failed in Hudson: Mahout-Quality #168

Apache Hudson Server
See <http://hudson.zones.apache.org/hudson/job/Mahout-Quality/168/changes>

Changes:

[tdunning] MAHOUT-452 - more aggregates, row and column views

------------------------------------------
[...truncated 1547 lines...]
 T E S T S
-------------------------------------------------------
There are no tests to run.

Results :

Tests run: 0, Failures: 0, Errors: 0, Skipped: 0

[INFO] [jar:jar {execution: default-jar}]
[INFO] Building jar: <http://hudson.zones.apache.org/hudson/job/Mahout-Quality/168/artifact/trunk/buildtools/target/mahout-buildtools-0.4-SNAPSHOT.jar>
[INFO] [install:install {execution: default-install}]
[INFO] Installing <http://hudson.zones.apache.org/hudson/job/Mahout-Quality/168/artifact/trunk/buildtools/target/mahout-buildtools-0.4-SNAPSHOT.jar> to /home/hudson/.m2/repository/org/apache/mahout/mahout-buildtools/0.4-SNAPSHOT/mahout-buildtools-0.4-SNAPSHOT.jar
[INFO] Preparing javadoc:javadoc
[INFO] No goals needed for project - skipping
[INFO] [javadoc:javadoc {execution: default-cli}]
[INFO] snapshot org.apache.mahout:mahout-buildtools:0.4-SNAPSHOT: checking for updates from apache.snapshots
[INFO] snapshot org.apache.mahout:mahout-buildtools:0.4-SNAPSHOT: checking for updates from apache.snapshots
[INFO] [checkstyle:checkstyle {execution: default-cli}]
[INFO] Source directory does not exist - skipping report.
[INFO] Preparing findbugs:findbugs
[INFO] [remote-resources:process {execution: default}]
[INFO] inceptionYear not specified, defaulting to 2010
[INFO] [resources:resources {execution: default-resources}]
[INFO] Using 'UTF-8' encoding to copy filtered resources.
[INFO] Copying 3 resources
[INFO] Copying 3 resources
[INFO] Copying 3 resources
[INFO] [compiler:compile {execution: default-compile}]
[INFO] No sources to compile
[INFO] [findbugs:findbugs {execution: default-cli}]
[INFO] Preparing clover2:instrument
[INFO] [clover2:instrumentInternal {execution: default-instrumentInternal}]
[INFO] No 'maven.clover.licenseLocation' configured. Using default evaluation license.
[INFO] No Clover instrumentation done on source files in: [<http://hudson.zones.apache.org/hudson/job/Mahout-Quality/ws/trunk/buildtools/src/main/java]> as no matching sources files found
[INFO] No Clover instrumentation done on source files in: [<http://hudson.zones.apache.org/hudson/job/Mahout-Quality/ws/trunk/buildtools/src/test/java]> as no matching sources files found
[INFO] [remote-resources:process {execution: default}]
[INFO] inceptionYear not specified, defaulting to 2010
[INFO] [resources:resources {execution: default-resources}]
[INFO] Using 'UTF-8' encoding to copy filtered resources.
[INFO] Copying 3 resources
[INFO] Copying 0 resource
[INFO] Copying 3 resources
[INFO] [compiler:compile {execution: default-compile}]
[INFO] No sources to compile
[INFO] [resources:testResources {execution: default-testResources}]
[INFO] Using 'UTF-8' encoding to copy filtered resources.
[INFO] skip non existing resourceDirectory <http://hudson.zones.apache.org/hudson/job/Mahout-Quality/ws/trunk/buildtools/src/test/resources>
[INFO] Copying 3 resources
[INFO] Copying 3 resources
[INFO] [compiler:testCompile {execution: default-testCompile}]
[INFO] No sources to compile
[INFO] [surefire:test {execution: default-test}]
[INFO] Surefire report directory: <http://hudson.zones.apache.org/hudson/job/Mahout-Quality/ws/trunk/buildtools/target/clover/surefire-reports>

-------------------------------------------------------
 T E S T S
-------------------------------------------------------
There are no tests to run.

Results :

Tests run: 0, Failures: 0, Errors: 0, Skipped: 0

[INFO] [jar:jar {execution: default-jar}]
[INFO] Building jar: <http://hudson.zones.apache.org/hudson/job/Mahout-Quality/ws/trunk/buildtools/target/clover/mahout-buildtools-0.4-SNAPSHOT-clover.jar>
[INFO] [install:install {execution: default-install}]
[INFO] Installing <http://hudson.zones.apache.org/hudson/job/Mahout-Quality/ws/trunk/buildtools/target/clover/mahout-buildtools-0.4-SNAPSHOT-clover.jar> to /home/hudson/.m2/repository/org/apache/mahout/mahout-buildtools/0.4-SNAPSHOT/mahout-buildtools-0.4-SNAPSHOT-clover.jar
[INFO] [clover2:instrument {execution: default-cli}]
[INFO] ------------------------------------------------------------------------
[INFO] Building Package up files needed by Eclipse
[INFO]    task-segment: [clean, install, javadoc:javadoc, checkstyle:checkstyle, findbugs:findbugs, clover2:instrument]
[INFO] ------------------------------------------------------------------------
[INFO] [clean:clean {execution: default-clean}]
[INFO] [remote-resources:process {execution: default}]
[INFO] inceptionYear not specified, defaulting to 2010
[INFO] [resources:resources {execution: default-resources}]
[INFO] Using 'UTF-8' encoding to copy filtered resources.
[INFO] Copying 3 resources
[INFO] Copying 3 resources
[INFO] [compiler:compile {execution: default-compile}]
[INFO] No sources to compile
[INFO] [resources:testResources {execution: default-testResources}]
[INFO] Using 'UTF-8' encoding to copy filtered resources.
[INFO] skip non existing resourceDirectory <http://hudson.zones.apache.org/hudson/job/Mahout-Quality/ws/trunk/eclipse/src/test/resources>
[INFO] Copying 3 resources
[INFO] [compiler:testCompile {execution: default-testCompile}]
[INFO] No sources to compile
[INFO] [surefire:test {execution: default-test}]
[INFO] Surefire report directory: <http://hudson.zones.apache.org/hudson/job/Mahout-Quality/168/artifact/trunk/eclipse/target/surefire-reports>

-------------------------------------------------------
 T E S T S
-------------------------------------------------------
There are no tests to run.

Results :

Tests run: 0, Failures: 0, Errors: 0, Skipped: 0

[INFO] [jar:jar {execution: default-jar}]
[INFO] Building jar: <http://hudson.zones.apache.org/hudson/job/Mahout-Quality/168/artifact/trunk/eclipse/target/mahout-eclipse-support-0.4-SNAPSHOT.jar>
[INFO] [install:install {execution: default-install}]
[INFO] Installing <http://hudson.zones.apache.org/hudson/job/Mahout-Quality/168/artifact/trunk/eclipse/target/mahout-eclipse-support-0.4-SNAPSHOT.jar> to /home/hudson/.m2/repository/org/apache/mahout/mahout-eclipse-support/0.4-SNAPSHOT/mahout-eclipse-support-0.4-SNAPSHOT.jar
[INFO] Preparing javadoc:javadoc
[INFO] No goals needed for project - skipping
[INFO] [javadoc:javadoc {execution: default-cli}]
[INFO] [checkstyle:checkstyle {execution: default-cli}]
[INFO] Source directory does not exist - skipping report.
[INFO] Preparing findbugs:findbugs
[INFO] [remote-resources:process {execution: default}]
[INFO] inceptionYear not specified, defaulting to 2010
[INFO] [resources:resources {execution: default-resources}]
[INFO] Using 'UTF-8' encoding to copy filtered resources.
[INFO] Copying 3 resources
[INFO] Copying 3 resources
[INFO] Copying 3 resources
[INFO] [compiler:compile {execution: default-compile}]
[INFO] No sources to compile
[INFO] [findbugs:findbugs {execution: default-cli}]
[INFO] Preparing clover2:instrument
[INFO] [clover2:instrumentInternal {execution: default-instrumentInternal}]
[INFO] No 'maven.clover.licenseLocation' configured. Using default evaluation license.
[INFO] No Clover instrumentation done on source files in: [<http://hudson.zones.apache.org/hudson/job/Mahout-Quality/ws/trunk/eclipse/src/main/java]> as no matching sources files found
[INFO] No Clover instrumentation done on source files in: [<http://hudson.zones.apache.org/hudson/job/Mahout-Quality/ws/trunk/eclipse/src/test/java]> as no matching sources files found
[INFO] [remote-resources:process {execution: default}]
[INFO] inceptionYear not specified, defaulting to 2010
[INFO] [resources:resources {execution: default-resources}]
[INFO] Using 'UTF-8' encoding to copy filtered resources.
[INFO] Copying 3 resources
[INFO] Copying 0 resource
[INFO] Copying 3 resources
[INFO] [compiler:compile {execution: default-compile}]
[INFO] No sources to compile
[INFO] [resources:testResources {execution: default-testResources}]
[INFO] Using 'UTF-8' encoding to copy filtered resources.
[INFO] skip non existing resourceDirectory <http://hudson.zones.apache.org/hudson/job/Mahout-Quality/ws/trunk/eclipse/src/test/resources>
[INFO] Copying 3 resources
[INFO] Copying 3 resources
[INFO] [compiler:testCompile {execution: default-testCompile}]
[INFO] No sources to compile
[INFO] [surefire:test {execution: default-test}]
[INFO] Surefire report directory: <http://hudson.zones.apache.org/hudson/job/Mahout-Quality/ws/trunk/eclipse/target/clover/surefire-reports>

-------------------------------------------------------
 T E S T S
-------------------------------------------------------
There are no tests to run.

Results :

Tests run: 0, Failures: 0, Errors: 0, Skipped: 0

[INFO] [jar:jar {execution: default-jar}]
[INFO] Building jar: <http://hudson.zones.apache.org/hudson/job/Mahout-Quality/ws/trunk/eclipse/target/clover/mahout-eclipse-support-0.4-SNAPSHOT-clover.jar>
[INFO] [install:install {execution: default-install}]
[INFO] Installing <http://hudson.zones.apache.org/hudson/job/Mahout-Quality/ws/trunk/eclipse/target/clover/mahout-eclipse-support-0.4-SNAPSHOT-clover.jar> to /home/hudson/.m2/repository/org/apache/mahout/mahout-eclipse-support/0.4-SNAPSHOT/mahout-eclipse-support-0.4-SNAPSHOT-clover.jar
[INFO] [clover2:instrument {execution: default-cli}]
[INFO] ------------------------------------------------------------------------
[INFO] Building Apache Mahout
[INFO]    task-segment: [clean, install, javadoc:javadoc, checkstyle:checkstyle, findbugs:findbugs, clover2:instrument]
[INFO] ------------------------------------------------------------------------
[INFO] [clean:clean {execution: default-clean}]
[INFO] [remote-resources:process {execution: default}]
[INFO] [site:attach-descriptor {execution: default-attach-descriptor}]
[INFO] Unable to load parent project from a relative path: Could not find the model file '<http://hudson.zones.apache.org/hudson/job/Mahout-Quality/ws/pom.xml'.> for project unknown
[INFO] Parent project loaded from repository.
[INFO] [install:install {execution: default-install}]
[INFO] Installing <http://hudson.zones.apache.org/hudson/job/Mahout-Quality/ws/trunk/pom.xml> to /home/hudson/.m2/repository/org/apache/mahout/mahout/0.4-SNAPSHOT/mahout-0.4-SNAPSHOT.pom
[INFO] Preparing javadoc:javadoc
[INFO] No goals needed for project - skipping
[INFO] [javadoc:javadoc {execution: default-cli}]
[INFO] [checkstyle:checkstyle {execution: default-cli}]
[INFO] Source directory does not exist - skipping report.
[INFO] Preparing findbugs:findbugs
[INFO] [remote-resources:process {execution: default}]
[INFO] [findbugs:findbugs {execution: default-cli}]
[INFO] Preparing clover2:instrument
[INFO] [clover2:instrumentInternal {execution: default-instrumentInternal}]
[WARNING] The reported language of this project is none, attempting to instrument sources anyway.
[INFO] No Clover instrumentation done on source files in: [<http://hudson.zones.apache.org/hudson/job/Mahout-Quality/ws/trunk/src/main/java]> as no matching sources files found
[INFO] No Clover instrumentation done on source files in: [<http://hudson.zones.apache.org/hudson/job/Mahout-Quality/ws/trunk/src/test/java]> as no matching sources files found
[INFO] [remote-resources:process {execution: default}]
[INFO] [site:attach-descriptor {execution: default-attach-descriptor}]
[INFO] [install:install {execution: default-install}]
[INFO] Installing <http://hudson.zones.apache.org/hudson/job/Mahout-Quality/ws/trunk/pom.xml> to /home/hudson/.m2/repository/org/apache/mahout/mahout/0.4-SNAPSHOT/mahout-0.4-SNAPSHOT.pom
[INFO] [clover2:instrument {execution: default-cli}]
[INFO] ------------------------------------------------------------------------
[INFO] Building Mahout Math
[INFO]    task-segment: [clean, install, javadoc:javadoc, checkstyle:checkstyle, findbugs:findbugs, clover2:instrument]
[INFO] ------------------------------------------------------------------------
[INFO] [clean:clean {execution: default-clean}]
[INFO] [resources:resources {execution: default-resources}]
[INFO] Using 'UTF-8' encoding to copy filtered resources.
[INFO] skip non existing resourceDirectory <http://hudson.zones.apache.org/hudson/job/Mahout-Quality/ws/trunk/math/src/main/resources>
[INFO] [compiler:compile {execution: default-compile}]
[INFO] Compiling 168 source files to <http://hudson.zones.apache.org/hudson/job/Mahout-Quality/168/artifact/trunk/math/target/classes>
[INFO] ------------------------------------------------------------------------
[ERROR] BUILD FAILURE
[INFO] ------------------------------------------------------------------------
[INFO] Compilation failure

<http://hudson.zones.apache.org/hudson/job/Mahout-Quality/ws/trunk/math/src/main/java/org/apache/mahout/math/Matrix.java>:[22,38] cannot find symbol
symbol  : class VectorFunction
location: package org.apache.mahout.math.function

<http://hudson.zones.apache.org/hudson/job/Mahout-Quality/ws/trunk/math/src/main/java/org/apache/mahout/math/Matrix.java>:[101,23] cannot find symbol
symbol  : class VectorFunction
location: interface org.apache.mahout.math.Matrix

<http://hudson.zones.apache.org/hudson/job/Mahout-Quality/ws/trunk/math/src/main/java/org/apache/mahout/math/Matrix.java>:[108,26] cannot find symbol
symbol  : class VectorFunction
location: interface org.apache.mahout.math.Matrix

<http://hudson.zones.apache.org/hudson/job/Mahout-Quality/ws/trunk/math/src/main/java/org/apache/mahout/math/AbstractMatrix.java>:[260,30] cannot find symbol
symbol  : class VectorFunction
location: class org.apache.mahout.math.AbstractMatrix

<http://hudson.zones.apache.org/hudson/job/Mahout-Quality/ws/trunk/math/src/main/java/org/apache/mahout/math/AbstractMatrix.java>:[294,33] cannot find symbol
symbol  : class VectorFunction
location: class org.apache.mahout.math.AbstractMatrix

<http://hudson.zones.apache.org/hudson/job/Mahout-Quality/ws/trunk/math/src/main/java/org/apache/mahout/math/AbstractMatrix.java>:[275,15] cannot find symbol
symbol  : class MatrixVectorView
location: class org.apache.mahout.math.AbstractMatrix

<http://hudson.zones.apache.org/hudson/job/Mahout-Quality/ws/trunk/math/src/main/java/org/apache/mahout/math/AbstractMatrix.java>:[285,15] cannot find symbol
symbol  : class MatrixVectorView
location: class org.apache.mahout.math.AbstractMatrix

<http://hudson.zones.apache.org/hudson/job/Mahout-Quality/ws/trunk/math/src/main/java/org/apache/mahout/math/AbstractMatrix.java>:[310,29] cannot find symbol
symbol  : class VectorFunction
location: class org.apache.mahout.math.AbstractMatrix


[INFO] ------------------------------------------------------------------------
[INFO] For more information, run Maven with the -e switch
[INFO] ------------------------------------------------------------------------
[INFO] Total time: 15 seconds
[INFO] Finished at: Tue Aug 03 01:04:31 UTC 2010
[INFO] Final Memory: 55M/393M
[INFO] ------------------------------------------------------------------------
[PMD] Skipping publisher since build result is FAILURE
[TASKS] Skipping publisher since build result is FAILURE
[FINDBUGS] Skipping publisher since build result is FAILURE
Publishing Javadoc
Archiving artifacts
Recording test results
Publishing Clover coverage report...
No Clover report will be published due to a Build Failure

12