[JENKINS-EA] Lucene-Solr-8.x-Linux (64bit/jdk-13-ea+18) - Build # 672 - Unstable!

classic Classic list List threaded Threaded
1 message Options
Reply | Threaded
Open this post in threaded view
|

[JENKINS-EA] Lucene-Solr-8.x-Linux (64bit/jdk-13-ea+18) - Build # 672 - Unstable!

Policeman Jenkins Server-2
Build: https://jenkins.thetaphi.de/job/Lucene-Solr-8.x-Linux/672/
Java: 64bit/jdk-13-ea+18 -XX:+UseCompressedOops -XX:+UseParallelGC

10 tests failed.
FAILED:  org.apache.lucene.search.TestFieldCacheRewriteMethod.testRegexps

Error Message:
Hit 2 docnumbers don't match Hits length1=25 length2=25 hit=0: doc24=1.0,  doc24=1.0 hit=1: doc38=1.0,  doc38=1.0 hit=2: doc119=1.0,  doc183=1.0 hit=3: doc146=1.0,  doc188=1.0 hit=4: doc152=1.0,  doc193=1.0 hit=5: doc159=1.0,  doc228=1.0 hit=6: doc163=1.0,  doc244=1.0 hit=7: doc169=1.0,  doc291=1.0 hit=8: doc173=1.0,  doc300=1.0 hit=9: doc183=1.0,  doc347=1.0 hit=10: doc188=1.0,  doc349=1.0 hit=11: doc193=1.0,  doc405=1.0 hit=12: doc228=1.0,  doc418=1.0 hit=13: doc244=1.0,  doc431=1.0 hit=14: doc291=1.0,  doc443=1.0 hit=15: doc300=1.0,  doc490=1.0 hit=16: doc347=1.0,  doc555=1.0 hit=17: doc349=1.0,  doc563=1.0 hit=18: doc405=1.0,  doc566=1.0 hit=19: doc418=1.0,  doc571=1.0 hit=20: doc431=1.0,  doc633=1.0 hit=21: doc443=1.0,  doc636=1.0 hit=22: doc490=1.0,  doc649=1.0 hit=23: doc555=1.0,  doc679=1.0 hit=24: doc563=1.0,  doc692=1.0 for query://

Stack Trace:
junit.framework.AssertionFailedError: Hit 2 docnumbers don't match
Hits length1=25 length2=25
hit=0: doc24=1.0, doc24=1.0
hit=1: doc38=1.0, doc38=1.0
hit=2: doc119=1.0, doc183=1.0
hit=3: doc146=1.0, doc188=1.0
hit=4: doc152=1.0, doc193=1.0
hit=5: doc159=1.0, doc228=1.0
hit=6: doc163=1.0, doc244=1.0
hit=7: doc169=1.0, doc291=1.0
hit=8: doc173=1.0, doc300=1.0
hit=9: doc183=1.0, doc347=1.0
hit=10: doc188=1.0, doc349=1.0
hit=11: doc193=1.0, doc405=1.0
hit=12: doc228=1.0, doc418=1.0
hit=13: doc244=1.0, doc431=1.0
hit=14: doc291=1.0, doc443=1.0
hit=15: doc300=1.0, doc490=1.0
hit=16: doc347=1.0, doc555=1.0
hit=17: doc349=1.0, doc563=1.0
hit=18: doc405=1.0, doc566=1.0
hit=19: doc418=1.0, doc571=1.0
hit=20: doc431=1.0, doc633=1.0
hit=21: doc443=1.0, doc636=1.0
hit=22: doc490=1.0, doc649=1.0
hit=23: doc555=1.0, doc679=1.0
hit=24: doc563=1.0, doc692=1.0
for query://
        at __randomizedtesting.SeedInfo.seed([E712F4979E38CFD8:64EB58640929850]:0)
        at junit.framework.Assert.fail(Assert.java:57)
        at org.apache.lucene.search.CheckHits.checkEqual(CheckHits.java:205)
        at org.apache.lucene.search.TestFieldCacheRewriteMethod.assertSame(TestFieldCacheRewriteMethod.java:42)
        at org.apache.lucene.search.TestRegexpRandom2.testRegexps(TestRegexpRandom2.java:164)
        at java.base/jdk.internal.reflect.NativeMethodAccessorImpl.invoke0(Native Method)
        at java.base/jdk.internal.reflect.NativeMethodAccessorImpl.invoke(NativeMethodAccessorImpl.java:62)
        at java.base/jdk.internal.reflect.DelegatingMethodAccessorImpl.invoke(DelegatingMethodAccessorImpl.java:43)
        at java.base/java.lang.reflect.Method.invoke(Method.java:567)
        at com.carrotsearch.randomizedtesting.RandomizedRunner.invoke(RandomizedRunner.java:1750)
        at com.carrotsearch.randomizedtesting.RandomizedRunner$8.evaluate(RandomizedRunner.java:938)
        at com.carrotsearch.randomizedtesting.RandomizedRunner$9.evaluate(RandomizedRunner.java:974)
        at com.carrotsearch.randomizedtesting.RandomizedRunner$10.evaluate(RandomizedRunner.java:988)
        at org.apache.lucene.util.TestRuleSetupTeardownChained$1.evaluate(TestRuleSetupTeardownChained.java:49)
        at org.apache.lucene.util.AbstractBeforeAfterRule$1.evaluate(AbstractBeforeAfterRule.java:45)
        at org.apache.lucene.util.TestRuleThreadAndTestName$1.evaluate(TestRuleThreadAndTestName.java:48)
        at org.apache.lucene.util.TestRuleIgnoreAfterMaxFailures$1.evaluate(TestRuleIgnoreAfterMaxFailures.java:64)
        at org.apache.lucene.util.TestRuleMarkFailure$1.evaluate(TestRuleMarkFailure.java:47)
        at com.carrotsearch.randomizedtesting.rules.StatementAdapter.evaluate(StatementAdapter.java:36)
        at com.carrotsearch.randomizedtesting.ThreadLeakControl$StatementRunner.run(ThreadLeakControl.java:368)
        at com.carrotsearch.randomizedtesting.ThreadLeakControl.forkTimeoutingTask(ThreadLeakControl.java:817)
        at com.carrotsearch.randomizedtesting.ThreadLeakControl$3.evaluate(ThreadLeakControl.java:468)
        at com.carrotsearch.randomizedtesting.RandomizedRunner.runSingleTest(RandomizedRunner.java:947)
        at com.carrotsearch.randomizedtesting.RandomizedRunner$5.evaluate(RandomizedRunner.java:832)
        at com.carrotsearch.randomizedtesting.RandomizedRunner$6.evaluate(RandomizedRunner.java:883)
        at com.carrotsearch.randomizedtesting.RandomizedRunner$7.evaluate(RandomizedRunner.java:894)
        at org.apache.lucene.util.AbstractBeforeAfterRule$1.evaluate(AbstractBeforeAfterRule.java:45)
        at com.carrotsearch.randomizedtesting.rules.StatementAdapter.evaluate(StatementAdapter.java:36)
        at org.apache.lucene.util.TestRuleStoreClassName$1.evaluate(TestRuleStoreClassName.java:41)
        at com.carrotsearch.randomizedtesting.rules.NoShadowingOrOverridesOnMethodsRule$1.evaluate(NoShadowingOrOverridesOnMethodsRule.java:40)
        at com.carrotsearch.randomizedtesting.rules.NoShadowingOrOverridesOnMethodsRule$1.evaluate(NoShadowingOrOverridesOnMethodsRule.java:40)
        at com.carrotsearch.randomizedtesting.rules.StatementAdapter.evaluate(StatementAdapter.java:36)
        at com.carrotsearch.randomizedtesting.rules.StatementAdapter.evaluate(StatementAdapter.java:36)
        at org.apache.lucene.util.TestRuleAssertionsRequired$1.evaluate(TestRuleAssertionsRequired.java:53)
        at org.apache.lucene.util.TestRuleMarkFailure$1.evaluate(TestRuleMarkFailure.java:47)
        at org.apache.lucene.util.TestRuleIgnoreAfterMaxFailures$1.evaluate(TestRuleIgnoreAfterMaxFailures.java:64)
        at org.apache.lucene.util.TestRuleIgnoreTestSuites$1.evaluate(TestRuleIgnoreTestSuites.java:54)
        at com.carrotsearch.randomizedtesting.rules.StatementAdapter.evaluate(StatementAdapter.java:36)
        at com.carrotsearch.randomizedtesting.ThreadLeakControl$StatementRunner.run(ThreadLeakControl.java:368)
        at java.base/java.lang.Thread.run(Thread.java:835)


FAILED:  org.apache.lucene.search.TestFieldCacheRewriteMethod.testRegexps

Error Message:
Hit 2 docnumbers don't match Hits length1=25 length2=25 hit=0: doc24=1.0,  doc24=1.0 hit=1: doc38=1.0,  doc38=1.0 hit=2: doc119=1.0,  doc183=1.0 hit=3: doc146=1.0,  doc188=1.0 hit=4: doc152=1.0,  doc193=1.0 hit=5: doc159=1.0,  doc228=1.0 hit=6: doc163=1.0,  doc244=1.0 hit=7: doc169=1.0,  doc291=1.0 hit=8: doc173=1.0,  doc300=1.0 hit=9: doc183=1.0,  doc347=1.0 hit=10: doc188=1.0,  doc349=1.0 hit=11: doc193=1.0,  doc405=1.0 hit=12: doc228=1.0,  doc418=1.0 hit=13: doc244=1.0,  doc431=1.0 hit=14: doc291=1.0,  doc443=1.0 hit=15: doc300=1.0,  doc490=1.0 hit=16: doc347=1.0,  doc555=1.0 hit=17: doc349=1.0,  doc563=1.0 hit=18: doc405=1.0,  doc566=1.0 hit=19: doc418=1.0,  doc571=1.0 hit=20: doc431=1.0,  doc633=1.0 hit=21: doc443=1.0,  doc636=1.0 hit=22: doc490=1.0,  doc649=1.0 hit=23: doc555=1.0,  doc679=1.0 hit=24: doc563=1.0,  doc692=1.0 for query://

Stack Trace:
junit.framework.AssertionFailedError: Hit 2 docnumbers don't match
Hits length1=25 length2=25
hit=0: doc24=1.0, doc24=1.0
hit=1: doc38=1.0, doc38=1.0
hit=2: doc119=1.0, doc183=1.0
hit=3: doc146=1.0, doc188=1.0
hit=4: doc152=1.0, doc193=1.0
hit=5: doc159=1.0, doc228=1.0
hit=6: doc163=1.0, doc244=1.0
hit=7: doc169=1.0, doc291=1.0
hit=8: doc173=1.0, doc300=1.0
hit=9: doc183=1.0, doc347=1.0
hit=10: doc188=1.0, doc349=1.0
hit=11: doc193=1.0, doc405=1.0
hit=12: doc228=1.0, doc418=1.0
hit=13: doc244=1.0, doc431=1.0
hit=14: doc291=1.0, doc443=1.0
hit=15: doc300=1.0, doc490=1.0
hit=16: doc347=1.0, doc555=1.0
hit=17: doc349=1.0, doc563=1.0
hit=18: doc405=1.0, doc566=1.0
hit=19: doc418=1.0, doc571=1.0
hit=20: doc431=1.0, doc633=1.0
hit=21: doc443=1.0, doc636=1.0
hit=22: doc490=1.0, doc649=1.0
hit=23: doc555=1.0, doc679=1.0
hit=24: doc563=1.0, doc692=1.0
for query://
        at __randomizedtesting.SeedInfo.seed([E712F4979E38CFD8:64EB58640929850]:0)
        at junit.framework.Assert.fail(Assert.java:57)
        at org.apache.lucene.search.CheckHits.checkEqual(CheckHits.java:205)
        at org.apache.lucene.search.TestFieldCacheRewriteMethod.assertSame(TestFieldCacheRewriteMethod.java:42)
        at org.apache.lucene.search.TestRegexpRandom2.testRegexps(TestRegexpRandom2.java:164)
        at java.base/jdk.internal.reflect.NativeMethodAccessorImpl.invoke0(Native Method)
        at java.base/jdk.internal.reflect.NativeMethodAccessorImpl.invoke(NativeMethodAccessorImpl.java:62)
        at java.base/jdk.internal.reflect.DelegatingMethodAccessorImpl.invoke(DelegatingMethodAccessorImpl.java:43)
        at java.base/java.lang.reflect.Method.invoke(Method.java:567)
        at com.carrotsearch.randomizedtesting.RandomizedRunner.invoke(RandomizedRunner.java:1750)
        at com.carrotsearch.randomizedtesting.RandomizedRunner$8.evaluate(RandomizedRunner.java:938)
        at com.carrotsearch.randomizedtesting.RandomizedRunner$9.evaluate(RandomizedRunner.java:974)
        at com.carrotsearch.randomizedtesting.RandomizedRunner$10.evaluate(RandomizedRunner.java:988)
        at org.apache.lucene.util.TestRuleSetupTeardownChained$1.evaluate(TestRuleSetupTeardownChained.java:49)
        at org.apache.lucene.util.AbstractBeforeAfterRule$1.evaluate(AbstractBeforeAfterRule.java:45)
        at org.apache.lucene.util.TestRuleThreadAndTestName$1.evaluate(TestRuleThreadAndTestName.java:48)
        at org.apache.lucene.util.TestRuleIgnoreAfterMaxFailures$1.evaluate(TestRuleIgnoreAfterMaxFailures.java:64)
        at org.apache.lucene.util.TestRuleMarkFailure$1.evaluate(TestRuleMarkFailure.java:47)
        at com.carrotsearch.randomizedtesting.rules.StatementAdapter.evaluate(StatementAdapter.java:36)
        at com.carrotsearch.randomizedtesting.ThreadLeakControl$StatementRunner.run(ThreadLeakControl.java:368)
        at com.carrotsearch.randomizedtesting.ThreadLeakControl.forkTimeoutingTask(ThreadLeakControl.java:817)
        at com.carrotsearch.randomizedtesting.ThreadLeakControl$3.evaluate(ThreadLeakControl.java:468)
        at com.carrotsearch.randomizedtesting.RandomizedRunner.runSingleTest(RandomizedRunner.java:947)
        at com.carrotsearch.randomizedtesting.RandomizedRunner$5.evaluate(RandomizedRunner.java:832)
        at com.carrotsearch.randomizedtesting.RandomizedRunner$6.evaluate(RandomizedRunner.java:883)
        at com.carrotsearch.randomizedtesting.RandomizedRunner$7.evaluate(RandomizedRunner.java:894)
        at org.apache.lucene.util.AbstractBeforeAfterRule$1.evaluate(AbstractBeforeAfterRule.java:45)
        at com.carrotsearch.randomizedtesting.rules.StatementAdapter.evaluate(StatementAdapter.java:36)
        at org.apache.lucene.util.TestRuleStoreClassName$1.evaluate(TestRuleStoreClassName.java:41)
        at com.carrotsearch.randomizedtesting.rules.NoShadowingOrOverridesOnMethodsRule$1.evaluate(NoShadowingOrOverridesOnMethodsRule.java:40)
        at com.carrotsearch.randomizedtesting.rules.NoShadowingOrOverridesOnMethodsRule$1.evaluate(NoShadowingOrOverridesOnMethodsRule.java:40)
        at com.carrotsearch.randomizedtesting.rules.StatementAdapter.evaluate(StatementAdapter.java:36)
        at com.carrotsearch.randomizedtesting.rules.StatementAdapter.evaluate(StatementAdapter.java:36)
        at org.apache.lucene.util.TestRuleAssertionsRequired$1.evaluate(TestRuleAssertionsRequired.java:53)
        at org.apache.lucene.util.TestRuleMarkFailure$1.evaluate(TestRuleMarkFailure.java:47)
        at org.apache.lucene.util.TestRuleIgnoreAfterMaxFailures$1.evaluate(TestRuleIgnoreAfterMaxFailures.java:64)
        at org.apache.lucene.util.TestRuleIgnoreTestSuites$1.evaluate(TestRuleIgnoreTestSuites.java:54)
        at com.carrotsearch.randomizedtesting.rules.StatementAdapter.evaluate(StatementAdapter.java:36)
        at com.carrotsearch.randomizedtesting.ThreadLeakControl$StatementRunner.run(ThreadLeakControl.java:368)
        at java.base/java.lang.Thread.run(Thread.java:835)


FAILED:  org.apache.lucene.search.TestFieldCacheRewriteMethod.testRegexps

Error Message:
Hit 2 docnumbers don't match Hits length1=25 length2=25 hit=0: doc24=1.0,  doc24=1.0 hit=1: doc38=1.0,  doc38=1.0 hit=2: doc119=1.0,  doc183=1.0 hit=3: doc146=1.0,  doc188=1.0 hit=4: doc152=1.0,  doc193=1.0 hit=5: doc159=1.0,  doc228=1.0 hit=6: doc163=1.0,  doc244=1.0 hit=7: doc169=1.0,  doc291=1.0 hit=8: doc173=1.0,  doc300=1.0 hit=9: doc183=1.0,  doc347=1.0 hit=10: doc188=1.0,  doc349=1.0 hit=11: doc193=1.0,  doc405=1.0 hit=12: doc228=1.0,  doc418=1.0 hit=13: doc244=1.0,  doc431=1.0 hit=14: doc291=1.0,  doc443=1.0 hit=15: doc300=1.0,  doc490=1.0 hit=16: doc347=1.0,  doc555=1.0 hit=17: doc349=1.0,  doc563=1.0 hit=18: doc405=1.0,  doc566=1.0 hit=19: doc418=1.0,  doc571=1.0 hit=20: doc431=1.0,  doc633=1.0 hit=21: doc443=1.0,  doc636=1.0 hit=22: doc490=1.0,  doc649=1.0 hit=23: doc555=1.0,  doc679=1.0 hit=24: doc563=1.0,  doc692=1.0 for query://

Stack Trace:
junit.framework.AssertionFailedError: Hit 2 docnumbers don't match
Hits length1=25 length2=25
hit=0: doc24=1.0, doc24=1.0
hit=1: doc38=1.0, doc38=1.0
hit=2: doc119=1.0, doc183=1.0
hit=3: doc146=1.0, doc188=1.0
hit=4: doc152=1.0, doc193=1.0
hit=5: doc159=1.0, doc228=1.0
hit=6: doc163=1.0, doc244=1.0
hit=7: doc169=1.0, doc291=1.0
hit=8: doc173=1.0, doc300=1.0
hit=9: doc183=1.0, doc347=1.0
hit=10: doc188=1.0, doc349=1.0
hit=11: doc193=1.0, doc405=1.0
hit=12: doc228=1.0, doc418=1.0
hit=13: doc244=1.0, doc431=1.0
hit=14: doc291=1.0, doc443=1.0
hit=15: doc300=1.0, doc490=1.0
hit=16: doc347=1.0, doc555=1.0
hit=17: doc349=1.0, doc563=1.0
hit=18: doc405=1.0, doc566=1.0
hit=19: doc418=1.0, doc571=1.0
hit=20: doc431=1.0, doc633=1.0
hit=21: doc443=1.0, doc636=1.0
hit=22: doc490=1.0, doc649=1.0
hit=23: doc555=1.0, doc679=1.0
hit=24: doc563=1.0, doc692=1.0
for query://
        at __randomizedtesting.SeedInfo.seed([E712F4979E38CFD8:64EB58640929850]:0)
        at junit.framework.Assert.fail(Assert.java:57)
        at org.apache.lucene.search.CheckHits.checkEqual(CheckHits.java:205)
        at org.apache.lucene.search.TestFieldCacheRewriteMethod.assertSame(TestFieldCacheRewriteMethod.java:42)
        at org.apache.lucene.search.TestRegexpRandom2.testRegexps(TestRegexpRandom2.java:164)
        at java.base/jdk.internal.reflect.NativeMethodAccessorImpl.invoke0(Native Method)
        at java.base/jdk.internal.reflect.NativeMethodAccessorImpl.invoke(NativeMethodAccessorImpl.java:62)
        at java.base/jdk.internal.reflect.DelegatingMethodAccessorImpl.invoke(DelegatingMethodAccessorImpl.java:43)
        at java.base/java.lang.reflect.Method.invoke(Method.java:567)
        at com.carrotsearch.randomizedtesting.RandomizedRunner.invoke(RandomizedRunner.java:1750)
        at com.carrotsearch.randomizedtesting.RandomizedRunner$8.evaluate(RandomizedRunner.java:938)
        at com.carrotsearch.randomizedtesting.RandomizedRunner$9.evaluate(RandomizedRunner.java:974)
        at com.carrotsearch.randomizedtesting.RandomizedRunner$10.evaluate(RandomizedRunner.java:988)
        at org.apache.lucene.util.TestRuleSetupTeardownChained$1.evaluate(TestRuleSetupTeardownChained.java:49)
        at org.apache.lucene.util.AbstractBeforeAfterRule$1.evaluate(AbstractBeforeAfterRule.java:45)
        at org.apache.lucene.util.TestRuleThreadAndTestName$1.evaluate(TestRuleThreadAndTestName.java:48)
        at org.apache.lucene.util.TestRuleIgnoreAfterMaxFailures$1.evaluate(TestRuleIgnoreAfterMaxFailures.java:64)
        at org.apache.lucene.util.TestRuleMarkFailure$1.evaluate(TestRuleMarkFailure.java:47)
        at com.carrotsearch.randomizedtesting.rules.StatementAdapter.evaluate(StatementAdapter.java:36)
        at com.carrotsearch.randomizedtesting.ThreadLeakControl$StatementRunner.run(ThreadLeakControl.java:368)
        at com.carrotsearch.randomizedtesting.ThreadLeakControl.forkTimeoutingTask(ThreadLeakControl.java:817)
        at com.carrotsearch.randomizedtesting.ThreadLeakControl$3.evaluate(ThreadLeakControl.java:468)
        at com.carrotsearch.randomizedtesting.RandomizedRunner.runSingleTest(RandomizedRunner.java:947)
        at com.carrotsearch.randomizedtesting.RandomizedRunner$5.evaluate(RandomizedRunner.java:832)
        at com.carrotsearch.randomizedtesting.RandomizedRunner$6.evaluate(RandomizedRunner.java:883)
        at com.carrotsearch.randomizedtesting.RandomizedRunner$7.evaluate(RandomizedRunner.java:894)
        at org.apache.lucene.util.AbstractBeforeAfterRule$1.evaluate(AbstractBeforeAfterRule.java:45)
        at com.carrotsearch.randomizedtesting.rules.StatementAdapter.evaluate(StatementAdapter.java:36)
        at org.apache.lucene.util.TestRuleStoreClassName$1.evaluate(TestRuleStoreClassName.java:41)
        at com.carrotsearch.randomizedtesting.rules.NoShadowingOrOverridesOnMethodsRule$1.evaluate(NoShadowingOrOverridesOnMethodsRule.java:40)
        at com.carrotsearch.randomizedtesting.rules.NoShadowingOrOverridesOnMethodsRule$1.evaluate(NoShadowingOrOverridesOnMethodsRule.java:40)
        at com.carrotsearch.randomizedtesting.rules.StatementAdapter.evaluate(StatementAdapter.java:36)
        at com.carrotsearch.randomizedtesting.rules.StatementAdapter.evaluate(StatementAdapter.java:36)
        at org.apache.lucene.util.TestRuleAssertionsRequired$1.evaluate(TestRuleAssertionsRequired.java:53)
        at org.apache.lucene.util.TestRuleMarkFailure$1.evaluate(TestRuleMarkFailure.java:47)
        at org.apache.lucene.util.TestRuleIgnoreAfterMaxFailures$1.evaluate(TestRuleIgnoreAfterMaxFailures.java:64)
        at org.apache.lucene.util.TestRuleIgnoreTestSuites$1.evaluate(TestRuleIgnoreTestSuites.java:54)
        at com.carrotsearch.randomizedtesting.rules.StatementAdapter.evaluate(StatementAdapter.java:36)
        at com.carrotsearch.randomizedtesting.ThreadLeakControl$StatementRunner.run(ThreadLeakControl.java:368)
        at java.base/java.lang.Thread.run(Thread.java:835)


FAILED:  org.apache.lucene.search.TestFieldCacheRewriteMethod.testRegexps

Error Message:
Hit 2 docnumbers don't match Hits length1=25 length2=25 hit=0: doc24=1.0,  doc24=1.0 hit=1: doc38=1.0,  doc38=1.0 hit=2: doc119=1.0,  doc183=1.0 hit=3: doc146=1.0,  doc188=1.0 hit=4: doc152=1.0,  doc193=1.0 hit=5: doc159=1.0,  doc228=1.0 hit=6: doc163=1.0,  doc244=1.0 hit=7: doc169=1.0,  doc291=1.0 hit=8: doc173=1.0,  doc300=1.0 hit=9: doc183=1.0,  doc347=1.0 hit=10: doc188=1.0,  doc349=1.0 hit=11: doc193=1.0,  doc405=1.0 hit=12: doc228=1.0,  doc418=1.0 hit=13: doc244=1.0,  doc431=1.0 hit=14: doc291=1.0,  doc443=1.0 hit=15: doc300=1.0,  doc490=1.0 hit=16: doc347=1.0,  doc555=1.0 hit=17: doc349=1.0,  doc563=1.0 hit=18: doc405=1.0,  doc566=1.0 hit=19: doc418=1.0,  doc571=1.0 hit=20: doc431=1.0,  doc633=1.0 hit=21: doc443=1.0,  doc636=1.0 hit=22: doc490=1.0,  doc649=1.0 hit=23: doc555=1.0,  doc679=1.0 hit=24: doc563=1.0,  doc692=1.0 for query://

Stack Trace:
junit.framework.AssertionFailedError: Hit 2 docnumbers don't match
Hits length1=25 length2=25
hit=0: doc24=1.0, doc24=1.0
hit=1: doc38=1.0, doc38=1.0
hit=2: doc119=1.0, doc183=1.0
hit=3: doc146=1.0, doc188=1.0
hit=4: doc152=1.0, doc193=1.0
hit=5: doc159=1.0, doc228=1.0
hit=6: doc163=1.0, doc244=1.0
hit=7: doc169=1.0, doc291=1.0
hit=8: doc173=1.0, doc300=1.0
hit=9: doc183=1.0, doc347=1.0
hit=10: doc188=1.0, doc349=1.0
hit=11: doc193=1.0, doc405=1.0
hit=12: doc228=1.0, doc418=1.0
hit=13: doc244=1.0, doc431=1.0
hit=14: doc291=1.0, doc443=1.0
hit=15: doc300=1.0, doc490=1.0
hit=16: doc347=1.0, doc555=1.0
hit=17: doc349=1.0, doc563=1.0
hit=18: doc405=1.0, doc566=1.0
hit=19: doc418=1.0, doc571=1.0
hit=20: doc431=1.0, doc633=1.0
hit=21: doc443=1.0, doc636=1.0
hit=22: doc490=1.0, doc649=1.0
hit=23: doc555=1.0, doc679=1.0
hit=24: doc563=1.0, doc692=1.0
for query://
        at __randomizedtesting.SeedInfo.seed([E712F4979E38CFD8:64EB58640929850]:0)
        at junit.framework.Assert.fail(Assert.java:57)
        at org.apache.lucene.search.CheckHits.checkEqual(CheckHits.java:205)
        at org.apache.lucene.search.TestFieldCacheRewriteMethod.assertSame(TestFieldCacheRewriteMethod.java:42)
        at org.apache.lucene.search.TestRegexpRandom2.testRegexps(TestRegexpRandom2.java:164)
        at java.base/jdk.internal.reflect.NativeMethodAccessorImpl.invoke0(Native Method)
        at java.base/jdk.internal.reflect.NativeMethodAccessorImpl.invoke(NativeMethodAccessorImpl.java:62)
        at java.base/jdk.internal.reflect.DelegatingMethodAccessorImpl.invoke(DelegatingMethodAccessorImpl.java:43)
        at java.base/java.lang.reflect.Method.invoke(Method.java:567)
        at com.carrotsearch.randomizedtesting.RandomizedRunner.invoke(RandomizedRunner.java:1750)
        at com.carrotsearch.randomizedtesting.RandomizedRunner$8.evaluate(RandomizedRunner.java:938)
        at com.carrotsearch.randomizedtesting.RandomizedRunner$9.evaluate(RandomizedRunner.java:974)
        at com.carrotsearch.randomizedtesting.RandomizedRunner$10.evaluate(RandomizedRunner.java:988)
        at org.apache.lucene.util.TestRuleSetupTeardownChained$1.evaluate(TestRuleSetupTeardownChained.java:49)
        at org.apache.lucene.util.AbstractBeforeAfterRule$1.evaluate(AbstractBeforeAfterRule.java:45)
        at org.apache.lucene.util.TestRuleThreadAndTestName$1.evaluate(TestRuleThreadAndTestName.java:48)
        at org.apache.lucene.util.TestRuleIgnoreAfterMaxFailures$1.evaluate(TestRuleIgnoreAfterMaxFailures.java:64)
        at org.apache.lucene.util.TestRuleMarkFailure$1.evaluate(TestRuleMarkFailure.java:47)
        at com.carrotsearch.randomizedtesting.rules.StatementAdapter.evaluate(StatementAdapter.java:36)
        at com.carrotsearch.randomizedtesting.ThreadLeakControl$StatementRunner.run(ThreadLeakControl.java:368)
        at com.carrotsearch.randomizedtesting.ThreadLeakControl.forkTimeoutingTask(ThreadLeakControl.java:817)
        at com.carrotsearch.randomizedtesting.ThreadLeakControl$3.evaluate(ThreadLeakControl.java:468)
        at com.carrotsearch.randomizedtesting.RandomizedRunner.runSingleTest(RandomizedRunner.java:947)
        at com.carrotsearch.randomizedtesting.RandomizedRunner$5.evaluate(RandomizedRunner.java:832)
        at com.carrotsearch.randomizedtesting.RandomizedRunner$6.evaluate(RandomizedRunner.java:883)
        at com.carrotsearch.randomizedtesting.RandomizedRunner$7.evaluate(RandomizedRunner.java:894)
        at org.apache.lucene.util.AbstractBeforeAfterRule$1.evaluate(AbstractBeforeAfterRule.java:45)
        at com.carrotsearch.randomizedtesting.rules.StatementAdapter.evaluate(StatementAdapter.java:36)
        at org.apache.lucene.util.TestRuleStoreClassName$1.evaluate(TestRuleStoreClassName.java:41)
        at com.carrotsearch.randomizedtesting.rules.NoShadowingOrOverridesOnMethodsRule$1.evaluate(NoShadowingOrOverridesOnMethodsRule.java:40)
        at com.carrotsearch.randomizedtesting.rules.NoShadowingOrOverridesOnMethodsRule$1.evaluate(NoShadowingOrOverridesOnMethodsRule.java:40)
        at com.carrotsearch.randomizedtesting.rules.StatementAdapter.evaluate(StatementAdapter.java:36)
        at com.carrotsearch.randomizedtesting.rules.StatementAdapter.evaluate(StatementAdapter.java:36)
        at org.apache.lucene.util.TestRuleAssertionsRequired$1.evaluate(TestRuleAssertionsRequired.java:53)
        at org.apache.lucene.util.TestRuleMarkFailure$1.evaluate(TestRuleMarkFailure.java:47)
        at org.apache.lucene.util.TestRuleIgnoreAfterMaxFailures$1.evaluate(TestRuleIgnoreAfterMaxFailures.java:64)
        at org.apache.lucene.util.TestRuleIgnoreTestSuites$1.evaluate(TestRuleIgnoreTestSuites.java:54)
        at com.carrotsearch.randomizedtesting.rules.StatementAdapter.evaluate(StatementAdapter.java:36)
        at com.carrotsearch.randomizedtesting.ThreadLeakControl$StatementRunner.run(ThreadLeakControl.java:368)
        at java.base/java.lang.Thread.run(Thread.java:835)


FAILED:  org.apache.lucene.search.TestFieldCacheRewriteMethod.testRegexps

Error Message:
Hit 2 docnumbers don't match Hits length1=25 length2=25 hit=0: doc24=1.0,  doc24=1.0 hit=1: doc38=1.0,  doc38=1.0 hit=2: doc119=1.0,  doc183=1.0 hit=3: doc146=1.0,  doc188=1.0 hit=4: doc152=1.0,  doc193=1.0 hit=5: doc159=1.0,  doc228=1.0 hit=6: doc163=1.0,  doc244=1.0 hit=7: doc169=1.0,  doc291=1.0 hit=8: doc173=1.0,  doc300=1.0 hit=9: doc183=1.0,  doc347=1.0 hit=10: doc188=1.0,  doc349=1.0 hit=11: doc193=1.0,  doc405=1.0 hit=12: doc228=1.0,  doc418=1.0 hit=13: doc244=1.0,  doc431=1.0 hit=14: doc291=1.0,  doc443=1.0 hit=15: doc300=1.0,  doc490=1.0 hit=16: doc347=1.0,  doc555=1.0 hit=17: doc349=1.0,  doc563=1.0 hit=18: doc405=1.0,  doc566=1.0 hit=19: doc418=1.0,  doc571=1.0 hit=20: doc431=1.0,  doc633=1.0 hit=21: doc443=1.0,  doc636=1.0 hit=22: doc490=1.0,  doc649=1.0 hit=23: doc555=1.0,  doc679=1.0 hit=24: doc563=1.0,  doc692=1.0 for query://

Stack Trace:
junit.framework.AssertionFailedError: Hit 2 docnumbers don't match
Hits length1=25 length2=25
hit=0: doc24=1.0, doc24=1.0
hit=1: doc38=1.0, doc38=1.0
hit=2: doc119=1.0, doc183=1.0
hit=3: doc146=1.0, doc188=1.0
hit=4: doc152=1.0, doc193=1.0
hit=5: doc159=1.0, doc228=1.0
hit=6: doc163=1.0, doc244=1.0
hit=7: doc169=1.0, doc291=1.0
hit=8: doc173=1.0, doc300=1.0
hit=9: doc183=1.0, doc347=1.0
hit=10: doc188=1.0, doc349=1.0
hit=11: doc193=1.0, doc405=1.0
hit=12: doc228=1.0, doc418=1.0
hit=13: doc244=1.0, doc431=1.0
hit=14: doc291=1.0, doc443=1.0
hit=15: doc300=1.0, doc490=1.0
hit=16: doc347=1.0, doc555=1.0
hit=17: doc349=1.0, doc563=1.0
hit=18: doc405=1.0, doc566=1.0
hit=19: doc418=1.0, doc571=1.0
hit=20: doc431=1.0, doc633=1.0
hit=21: doc443=1.0, doc636=1.0
hit=22: doc490=1.0, doc649=1.0
hit=23: doc555=1.0, doc679=1.0
hit=24: doc563=1.0, doc692=1.0
for query://
        at __randomizedtesting.SeedInfo.seed([E712F4979E38CFD8:64EB58640929850]:0)
        at junit.framework.Assert.fail(Assert.java:57)
        at org.apache.lucene.search.CheckHits.checkEqual(CheckHits.java:205)
        at org.apache.lucene.search.TestFieldCacheRewriteMethod.assertSame(TestFieldCacheRewriteMethod.java:42)
        at org.apache.lucene.search.TestRegexpRandom2.testRegexps(TestRegexpRandom2.java:164)
        at java.base/jdk.internal.reflect.NativeMethodAccessorImpl.invoke0(Native Method)
        at java.base/jdk.internal.reflect.NativeMethodAccessorImpl.invoke(NativeMethodAccessorImpl.java:62)
        at java.base/jdk.internal.reflect.DelegatingMethodAccessorImpl.invoke(DelegatingMethodAccessorImpl.java:43)
        at java.base/java.lang.reflect.Method.invoke(Method.java:567)
        at com.carrotsearch.randomizedtesting.RandomizedRunner.invoke(RandomizedRunner.java:1750)
        at com.carrotsearch.randomizedtesting.RandomizedRunner$8.evaluate(RandomizedRunner.java:938)
        at com.carrotsearch.randomizedtesting.RandomizedRunner$9.evaluate(RandomizedRunner.java:974)
        at com.carrotsearch.randomizedtesting.RandomizedRunner$10.evaluate(RandomizedRunner.java:988)
        at org.apache.lucene.util.TestRuleSetupTeardownChained$1.evaluate(TestRuleSetupTeardownChained.java:49)
        at org.apache.lucene.util.AbstractBeforeAfterRule$1.evaluate(AbstractBeforeAfterRule.java:45)
        at org.apache.lucene.util.TestRuleThreadAndTestName$1.evaluate(TestRuleThreadAndTestName.java:48)
        at org.apache.lucene.util.TestRuleIgnoreAfterMaxFailures$1.evaluate(TestRuleIgnoreAfterMaxFailures.java:64)
        at org.apache.lucene.util.TestRuleMarkFailure$1.evaluate(TestRuleMarkFailure.java:47)
        at com.carrotsearch.randomizedtesting.rules.StatementAdapter.evaluate(StatementAdapter.java:36)
        at com.carrotsearch.randomizedtesting.ThreadLeakControl$StatementRunner.run(ThreadLeakControl.java:368)
        at com.carrotsearch.randomizedtesting.ThreadLeakControl.forkTimeoutingTask(ThreadLeakControl.java:817)
        at com.carrotsearch.randomizedtesting.ThreadLeakControl$3.evaluate(ThreadLeakControl.java:468)
        at com.carrotsearch.randomizedtesting.RandomizedRunner.runSingleTest(RandomizedRunner.java:947)
        at com.carrotsearch.randomizedtesting.RandomizedRunner$5.evaluate(RandomizedRunner.java:832)
        at com.carrotsearch.randomizedtesting.RandomizedRunner$6.evaluate(RandomizedRunner.java:883)
        at com.carrotsearch.randomizedtesting.RandomizedRunner$7.evaluate(RandomizedRunner.java:894)
        at org.apache.lucene.util.AbstractBeforeAfterRule$1.evaluate(AbstractBeforeAfterRule.java:45)
        at com.carrotsearch.randomizedtesting.rules.StatementAdapter.evaluate(StatementAdapter.java:36)
        at org.apache.lucene.util.TestRuleStoreClassName$1.evaluate(TestRuleStoreClassName.java:41)
        at com.carrotsearch.randomizedtesting.rules.NoShadowingOrOverridesOnMethodsRule$1.evaluate(NoShadowingOrOverridesOnMethodsRule.java:40)
        at com.carrotsearch.randomizedtesting.rules.NoShadowingOrOverridesOnMethodsRule$1.evaluate(NoShadowingOrOverridesOnMethodsRule.java:40)
        at com.carrotsearch.randomizedtesting.rules.StatementAdapter.evaluate(StatementAdapter.java:36)
        at com.carrotsearch.randomizedtesting.rules.StatementAdapter.evaluate(StatementAdapter.java:36)
        at org.apache.lucene.util.TestRuleAssertionsRequired$1.evaluate(TestRuleAssertionsRequired.java:53)
        at org.apache.lucene.util.TestRuleMarkFailure$1.evaluate(TestRuleMarkFailure.java:47)
        at org.apache.lucene.util.TestRuleIgnoreAfterMaxFailures$1.evaluate(TestRuleIgnoreAfterMaxFailures.java:64)
        at org.apache.lucene.util.TestRuleIgnoreTestSuites$1.evaluate(TestRuleIgnoreTestSuites.java:54)
        at com.carrotsearch.randomizedtesting.rules.StatementAdapter.evaluate(StatementAdapter.java:36)
        at com.carrotsearch.randomizedtesting.ThreadLeakControl$StatementRunner.run(ThreadLeakControl.java:368)
        at java.base/java.lang.Thread.run(Thread.java:835)


FAILED:  org.apache.lucene.search.TestRegexpRandom2.testRegexps

Error Message:
Hit 5 docnumbers don't match Hits length1=25 length2=25 hit=0: doc24=1.0,  doc24=1.0 hit=1: doc33=1.0,  doc33=1.0 hit=2: doc34=1.0,  doc34=1.0 hit=3: doc38=1.0,  doc38=1.0 hit=4: doc43=1.0,  doc43=1.0 hit=5: doc119=1.0,  doc183=1.0 hit=6: doc142=1.0,  doc188=1.0 hit=7: doc146=1.0,  doc193=1.0 hit=8: doc152=1.0,  doc228=1.0 hit=9: doc159=1.0,  doc244=1.0 hit=10: doc163=1.0,  doc250=1.0 hit=11: doc169=1.0,  doc282=1.0 hit=12: doc173=1.0,  doc284=1.0 hit=13: doc183=1.0,  doc291=1.0 hit=14: doc188=1.0,  doc300=1.0 hit=15: doc193=1.0,  doc320=1.0 hit=16: doc228=1.0,  doc347=1.0 hit=17: doc244=1.0,  doc349=1.0 hit=18: doc250=1.0,  doc405=1.0 hit=19: doc282=1.0,  doc418=1.0 hit=20: doc284=1.0,  doc431=1.0 hit=21: doc291=1.0,  doc443=1.0 hit=22: doc300=1.0,  doc490=1.0 hit=23: doc320=1.0,  doc513=1.0 hit=24: doc347=1.0,  doc555=1.0 for query:/[)*-|핯Ѿ]*+/

Stack Trace:
junit.framework.AssertionFailedError: Hit 5 docnumbers don't match
Hits length1=25 length2=25
hit=0: doc24=1.0, doc24=1.0
hit=1: doc33=1.0, doc33=1.0
hit=2: doc34=1.0, doc34=1.0
hit=3: doc38=1.0, doc38=1.0
hit=4: doc43=1.0, doc43=1.0
hit=5: doc119=1.0, doc183=1.0
hit=6: doc142=1.0, doc188=1.0
hit=7: doc146=1.0, doc193=1.0
hit=8: doc152=1.0, doc228=1.0
hit=9: doc159=1.0, doc244=1.0
hit=10: doc163=1.0, doc250=1.0
hit=11: doc169=1.0, doc282=1.0
hit=12: doc173=1.0, doc284=1.0
hit=13: doc183=1.0, doc291=1.0
hit=14: doc188=1.0, doc300=1.0
hit=15: doc193=1.0, doc320=1.0
hit=16: doc228=1.0, doc347=1.0
hit=17: doc244=1.0, doc349=1.0
hit=18: doc250=1.0, doc405=1.0
hit=19: doc282=1.0, doc418=1.0
hit=20: doc284=1.0, doc431=1.0
hit=21: doc291=1.0, doc443=1.0
hit=22: doc300=1.0, doc490=1.0
hit=23: doc320=1.0, doc513=1.0
hit=24: doc347=1.0, doc555=1.0
for query:/[)*-|핯Ѿ]*+/
        at __randomizedtesting.SeedInfo.seed([E712F4979E38CFD8:64EB58640929850]:0)
        at junit.framework.Assert.fail(Assert.java:57)
        at org.apache.lucene.search.CheckHits.checkEqual(CheckHits.java:205)
        at org.apache.lucene.search.TestRegexpRandom2.assertSame(TestRegexpRandom2.java:178)
        at org.apache.lucene.search.TestRegexpRandom2.testRegexps(TestRegexpRandom2.java:164)
        at java.base/jdk.internal.reflect.NativeMethodAccessorImpl.invoke0(Native Method)
        at java.base/jdk.internal.reflect.NativeMethodAccessorImpl.invoke(NativeMethodAccessorImpl.java:62)
        at java.base/jdk.internal.reflect.DelegatingMethodAccessorImpl.invoke(DelegatingMethodAccessorImpl.java:43)
        at java.base/java.lang.reflect.Method.invoke(Method.java:567)
        at com.carrotsearch.randomizedtesting.RandomizedRunner.invoke(RandomizedRunner.java:1750)
        at com.carrotsearch.randomizedtesting.RandomizedRunner$8.evaluate(RandomizedRunner.java:938)
        at com.carrotsearch.randomizedtesting.RandomizedRunner$9.evaluate(RandomizedRunner.java:974)
        at com.carrotsearch.randomizedtesting.RandomizedRunner$10.evaluate(RandomizedRunner.java:988)
        at org.apache.lucene.util.TestRuleSetupTeardownChained$1.evaluate(TestRuleSetupTeardownChained.java:49)
        at org.apache.lucene.util.AbstractBeforeAfterRule$1.evaluate(AbstractBeforeAfterRule.java:45)
        at org.apache.lucene.util.TestRuleThreadAndTestName$1.evaluate(TestRuleThreadAndTestName.java:48)
        at org.apache.lucene.util.TestRuleIgnoreAfterMaxFailures$1.evaluate(TestRuleIgnoreAfterMaxFailures.java:64)
        at org.apache.lucene.util.TestRuleMarkFailure$1.evaluate(TestRuleMarkFailure.java:47)
        at com.carrotsearch.randomizedtesting.rules.StatementAdapter.evaluate(StatementAdapter.java:36)
        at com.carrotsearch.randomizedtesting.ThreadLeakControl$StatementRunner.run(ThreadLeakControl.java:368)
        at com.carrotsearch.randomizedtesting.ThreadLeakControl.forkTimeoutingTask(ThreadLeakControl.java:817)
        at com.carrotsearch.randomizedtesting.ThreadLeakControl$3.evaluate(ThreadLeakControl.java:468)
        at com.carrotsearch.randomizedtesting.RandomizedRunner.runSingleTest(RandomizedRunner.java:947)
        at com.carrotsearch.randomizedtesting.RandomizedRunner$5.evaluate(RandomizedRunner.java:832)
        at com.carrotsearch.randomizedtesting.RandomizedRunner$6.evaluate(RandomizedRunner.java:883)
        at com.carrotsearch.randomizedtesting.RandomizedRunner$7.evaluate(RandomizedRunner.java:894)
        at org.apache.lucene.util.AbstractBeforeAfterRule$1.evaluate(AbstractBeforeAfterRule.java:45)
        at com.carrotsearch.randomizedtesting.rules.StatementAdapter.evaluate(StatementAdapter.java:36)
        at org.apache.lucene.util.TestRuleStoreClassName$1.evaluate(TestRuleStoreClassName.java:41)
        at com.carrotsearch.randomizedtesting.rules.NoShadowingOrOverridesOnMethodsRule$1.evaluate(NoShadowingOrOverridesOnMethodsRule.java:40)
        at com.carrotsearch.randomizedtesting.rules.NoShadowingOrOverridesOnMethodsRule$1.evaluate(NoShadowingOrOverridesOnMethodsRule.java:40)
        at com.carrotsearch.randomizedtesting.rules.StatementAdapter.evaluate(StatementAdapter.java:36)
        at com.carrotsearch.randomizedtesting.rules.StatementAdapter.evaluate(StatementAdapter.java:36)
        at org.apache.lucene.util.TestRuleAssertionsRequired$1.evaluate(TestRuleAssertionsRequired.java:53)
        at org.apache.lucene.util.TestRuleMarkFailure$1.evaluate(TestRuleMarkFailure.java:47)
        at org.apache.lucene.util.TestRuleIgnoreAfterMaxFailures$1.evaluate(TestRuleIgnoreAfterMaxFailures.java:64)
        at org.apache.lucene.util.TestRuleIgnoreTestSuites$1.evaluate(TestRuleIgnoreTestSuites.java:54)
        at com.carrotsearch.randomizedtesting.rules.StatementAdapter.evaluate(StatementAdapter.java:36)
        at com.carrotsearch.randomizedtesting.ThreadLeakControl$StatementRunner.run(ThreadLeakControl.java:368)
        at java.base/java.lang.Thread.run(Thread.java:835)


FAILED:  org.apache.lucene.search.TestRegexpRandom2.testRegexps

Error Message:
Hit 5 docnumbers don't match Hits length1=25 length2=25 hit=0: doc24=1.0,  doc24=1.0 hit=1: doc33=1.0,  doc33=1.0 hit=2: doc34=1.0,  doc34=1.0 hit=3: doc38=1.0,  doc38=1.0 hit=4: doc43=1.0,  doc43=1.0 hit=5: doc119=1.0,  doc183=1.0 hit=6: doc142=1.0,  doc188=1.0 hit=7: doc146=1.0,  doc193=1.0 hit=8: doc152=1.0,  doc228=1.0 hit=9: doc159=1.0,  doc244=1.0 hit=10: doc163=1.0,  doc250=1.0 hit=11: doc169=1.0,  doc282=1.0 hit=12: doc173=1.0,  doc284=1.0 hit=13: doc183=1.0,  doc291=1.0 hit=14: doc188=1.0,  doc300=1.0 hit=15: doc193=1.0,  doc320=1.0 hit=16: doc228=1.0,  doc347=1.0 hit=17: doc244=1.0,  doc349=1.0 hit=18: doc250=1.0,  doc405=1.0 hit=19: doc282=1.0,  doc418=1.0 hit=20: doc284=1.0,  doc431=1.0 hit=21: doc291=1.0,  doc443=1.0 hit=22: doc300=1.0,  doc490=1.0 hit=23: doc320=1.0,  doc513=1.0 hit=24: doc347=1.0,  doc555=1.0 for query:/[)*-|핯Ѿ]*+/

Stack Trace:
junit.framework.AssertionFailedError: Hit 5 docnumbers don't match
Hits length1=25 length2=25
hit=0: doc24=1.0, doc24=1.0
hit=1: doc33=1.0, doc33=1.0
hit=2: doc34=1.0, doc34=1.0
hit=3: doc38=1.0, doc38=1.0
hit=4: doc43=1.0, doc43=1.0
hit=5: doc119=1.0, doc183=1.0
hit=6: doc142=1.0, doc188=1.0
hit=7: doc146=1.0, doc193=1.0
hit=8: doc152=1.0, doc228=1.0
hit=9: doc159=1.0, doc244=1.0
hit=10: doc163=1.0, doc250=1.0
hit=11: doc169=1.0, doc282=1.0
hit=12: doc173=1.0, doc284=1.0
hit=13: doc183=1.0, doc291=1.0
hit=14: doc188=1.0, doc300=1.0
hit=15: doc193=1.0, doc320=1.0
hit=16: doc228=1.0, doc347=1.0
hit=17: doc244=1.0, doc349=1.0
hit=18: doc250=1.0, doc405=1.0
hit=19: doc282=1.0, doc418=1.0
hit=20: doc284=1.0, doc431=1.0
hit=21: doc291=1.0, doc443=1.0
hit=22: doc300=1.0, doc490=1.0
hit=23: doc320=1.0, doc513=1.0
hit=24: doc347=1.0, doc555=1.0
for query:/[)*-|핯Ѿ]*+/
        at __randomizedtesting.SeedInfo.seed([E712F4979E38CFD8:64EB58640929850]:0)
        at junit.framework.Assert.fail(Assert.java:57)
        at org.apache.lucene.search.CheckHits.checkEqual(CheckHits.java:205)
        at org.apache.lucene.search.TestRegexpRandom2.assertSame(TestRegexpRandom2.java:178)
        at org.apache.lucene.search.TestRegexpRandom2.testRegexps(TestRegexpRandom2.java:164)
        at java.base/jdk.internal.reflect.NativeMethodAccessorImpl.invoke0(Native Method)
        at java.base/jdk.internal.reflect.NativeMethodAccessorImpl.invoke(NativeMethodAccessorImpl.java:62)
        at java.base/jdk.internal.reflect.DelegatingMethodAccessorImpl.invoke(DelegatingMethodAccessorImpl.java:43)
        at java.base/java.lang.reflect.Method.invoke(Method.java:567)
        at com.carrotsearch.randomizedtesting.RandomizedRunner.invoke(RandomizedRunner.java:1750)
        at com.carrotsearch.randomizedtesting.RandomizedRunner$8.evaluate(RandomizedRunner.java:938)
        at com.carrotsearch.randomizedtesting.RandomizedRunner$9.evaluate(RandomizedRunner.java:974)
        at com.carrotsearch.randomizedtesting.RandomizedRunner$10.evaluate(RandomizedRunner.java:988)
        at org.apache.lucene.util.TestRuleSetupTeardownChained$1.evaluate(TestRuleSetupTeardownChained.java:49)
        at org.apache.lucene.util.AbstractBeforeAfterRule$1.evaluate(AbstractBeforeAfterRule.java:45)
        at org.apache.lucene.util.TestRuleThreadAndTestName$1.evaluate(TestRuleThreadAndTestName.java:48)
        at org.apache.lucene.util.TestRuleIgnoreAfterMaxFailures$1.evaluate(TestRuleIgnoreAfterMaxFailures.java:64)
        at org.apache.lucene.util.TestRuleMarkFailure$1.evaluate(TestRuleMarkFailure.java:47)
        at com.carrotsearch.randomizedtesting.rules.StatementAdapter.evaluate(StatementAdapter.java:36)
        at com.carrotsearch.randomizedtesting.ThreadLeakControl$StatementRunner.run(ThreadLeakControl.java:368)
        at com.carrotsearch.randomizedtesting.ThreadLeakControl.forkTimeoutingTask(ThreadLeakControl.java:817)
        at com.carrotsearch.randomizedtesting.ThreadLeakControl$3.evaluate(ThreadLeakControl.java:468)
        at com.carrotsearch.randomizedtesting.RandomizedRunner.runSingleTest(RandomizedRunner.java:947)
        at com.carrotsearch.randomizedtesting.RandomizedRunner$5.evaluate(RandomizedRunner.java:832)
        at com.carrotsearch.randomizedtesting.RandomizedRunner$6.evaluate(RandomizedRunner.java:883)
        at com.carrotsearch.randomizedtesting.RandomizedRunner$7.evaluate(RandomizedRunner.java:894)
        at org.apache.lucene.util.AbstractBeforeAfterRule$1.evaluate(AbstractBeforeAfterRule.java:45)
        at com.carrotsearch.randomizedtesting.rules.StatementAdapter.evaluate(StatementAdapter.java:36)
        at org.apache.lucene.util.TestRuleStoreClassName$1.evaluate(TestRuleStoreClassName.java:41)
        at com.carrotsearch.randomizedtesting.rules.NoShadowingOrOverridesOnMethodsRule$1.evaluate(NoShadowingOrOverridesOnMethodsRule.java:40)
        at com.carrotsearch.randomizedtesting.rules.NoShadowingOrOverridesOnMethodsRule$1.evaluate(NoShadowingOrOverridesOnMethodsRule.java:40)
        at com.carrotsearch.randomizedtesting.rules.StatementAdapter.evaluate(StatementAdapter.java:36)
        at com.carrotsearch.randomizedtesting.rules.StatementAdapter.evaluate(StatementAdapter.java:36)
        at org.apache.lucene.util.TestRuleAssertionsRequired$1.evaluate(TestRuleAssertionsRequired.java:53)
        at org.apache.lucene.util.TestRuleMarkFailure$1.evaluate(TestRuleMarkFailure.java:47)
        at org.apache.lucene.util.TestRuleIgnoreAfterMaxFailures$1.evaluate(TestRuleIgnoreAfterMaxFailures.java:64)
        at org.apache.lucene.util.TestRuleIgnoreTestSuites$1.evaluate(TestRuleIgnoreTestSuites.java:54)
        at com.carrotsearch.randomizedtesting.rules.StatementAdapter.evaluate(StatementAdapter.java:36)
        at com.carrotsearch.randomizedtesting.ThreadLeakControl$StatementRunner.run(ThreadLeakControl.java:368)
        at java.base/java.lang.Thread.run(Thread.java:835)


FAILED:  org.apache.lucene.search.TestRegexpRandom2.testRegexps

Error Message:
Hit 5 docnumbers don't match Hits length1=25 length2=25 hit=0: doc24=1.0,  doc24=1.0 hit=1: doc33=1.0,  doc33=1.0 hit=2: doc34=1.0,  doc34=1.0 hit=3: doc38=1.0,  doc38=1.0 hit=4: doc43=1.0,  doc43=1.0 hit=5: doc119=1.0,  doc183=1.0 hit=6: doc142=1.0,  doc188=1.0 hit=7: doc146=1.0,  doc193=1.0 hit=8: doc152=1.0,  doc228=1.0 hit=9: doc159=1.0,  doc244=1.0 hit=10: doc163=1.0,  doc250=1.0 hit=11: doc169=1.0,  doc282=1.0 hit=12: doc173=1.0,  doc284=1.0 hit=13: doc183=1.0,  doc291=1.0 hit=14: doc188=1.0,  doc300=1.0 hit=15: doc193=1.0,  doc320=1.0 hit=16: doc228=1.0,  doc347=1.0 hit=17: doc244=1.0,  doc349=1.0 hit=18: doc250=1.0,  doc405=1.0 hit=19: doc282=1.0,  doc418=1.0 hit=20: doc284=1.0,  doc431=1.0 hit=21: doc291=1.0,  doc443=1.0 hit=22: doc300=1.0,  doc490=1.0 hit=23: doc320=1.0,  doc513=1.0 hit=24: doc347=1.0,  doc555=1.0 for query:/[)*-|핯Ѿ]*+/

Stack Trace:
junit.framework.AssertionFailedError: Hit 5 docnumbers don't match
Hits length1=25 length2=25
hit=0: doc24=1.0, doc24=1.0
hit=1: doc33=1.0, doc33=1.0
hit=2: doc34=1.0, doc34=1.0
hit=3: doc38=1.0, doc38=1.0
hit=4: doc43=1.0, doc43=1.0
hit=5: doc119=1.0, doc183=1.0
hit=6: doc142=1.0, doc188=1.0
hit=7: doc146=1.0, doc193=1.0
hit=8: doc152=1.0, doc228=1.0
hit=9: doc159=1.0, doc244=1.0
hit=10: doc163=1.0, doc250=1.0
hit=11: doc169=1.0, doc282=1.0
hit=12: doc173=1.0, doc284=1.0
hit=13: doc183=1.0, doc291=1.0
hit=14: doc188=1.0, doc300=1.0
hit=15: doc193=1.0, doc320=1.0
hit=16: doc228=1.0, doc347=1.0
hit=17: doc244=1.0, doc349=1.0
hit=18: doc250=1.0, doc405=1.0
hit=19: doc282=1.0, doc418=1.0
hit=20: doc284=1.0, doc431=1.0
hit=21: doc291=1.0, doc443=1.0
hit=22: doc300=1.0, doc490=1.0
hit=23: doc320=1.0, doc513=1.0
hit=24: doc347=1.0, doc555=1.0
for query:/[)*-|핯Ѿ]*+/
        at __randomizedtesting.SeedInfo.seed([E712F4979E38CFD8:64EB58640929850]:0)
        at junit.framework.Assert.fail(Assert.java:57)
        at org.apache.lucene.search.CheckHits.checkEqual(CheckHits.java:205)
        at org.apache.lucene.search.TestRegexpRandom2.assertSame(TestRegexpRandom2.java:178)
        at org.apache.lucene.search.TestRegexpRandom2.testRegexps(TestRegexpRandom2.java:164)
        at java.base/jdk.internal.reflect.NativeMethodAccessorImpl.invoke0(Native Method)
        at java.base/jdk.internal.reflect.NativeMethodAccessorImpl.invoke(NativeMethodAccessorImpl.java:62)
        at java.base/jdk.internal.reflect.DelegatingMethodAccessorImpl.invoke(DelegatingMethodAccessorImpl.java:43)
        at java.base/java.lang.reflect.Method.invoke(Method.java:567)
        at com.carrotsearch.randomizedtesting.RandomizedRunner.invoke(RandomizedRunner.java:1750)
        at com.carrotsearch.randomizedtesting.RandomizedRunner$8.evaluate(RandomizedRunner.java:938)
        at com.carrotsearch.randomizedtesting.RandomizedRunner$9.evaluate(RandomizedRunner.java:974)
        at com.carrotsearch.randomizedtesting.RandomizedRunner$10.evaluate(RandomizedRunner.java:988)
        at org.apache.lucene.util.TestRuleSetupTeardownChained$1.evaluate(TestRuleSetupTeardownChained.java:49)
        at org.apache.lucene.util.AbstractBeforeAfterRule$1.evaluate(AbstractBeforeAfterRule.java:45)
        at org.apache.lucene.util.TestRuleThreadAndTestName$1.evaluate(TestRuleThreadAndTestName.java:48)
        at org.apache.lucene.util.TestRuleIgnoreAfterMaxFailures$1.evaluate(TestRuleIgnoreAfterMaxFailures.java:64)
        at org.apache.lucene.util.TestRuleMarkFailure$1.evaluate(TestRuleMarkFailure.java:47)
        at com.carrotsearch.randomizedtesting.rules.StatementAdapter.evaluate(StatementAdapter.java:36)
        at com.carrotsearch.randomizedtesting.ThreadLeakControl$StatementRunner.run(ThreadLeakControl.java:368)
        at com.carrotsearch.randomizedtesting.ThreadLeakControl.forkTimeoutingTask(ThreadLeakControl.java:817)
        at com.carrotsearch.randomizedtesting.ThreadLeakControl$3.evaluate(ThreadLeakControl.java:468)
        at com.carrotsearch.randomizedtesting.RandomizedRunner.runSingleTest(RandomizedRunner.java:947)
        at com.carrotsearch.randomizedtesting.RandomizedRunner$5.evaluate(RandomizedRunner.java:832)
        at com.carrotsearch.randomizedtesting.RandomizedRunner$6.evaluate(RandomizedRunner.java:883)
        at com.carrotsearch.randomizedtesting.RandomizedRunner$7.evaluate(RandomizedRunner.java:894)
        at org.apache.lucene.util.AbstractBeforeAfterRule$1.evaluate(AbstractBeforeAfterRule.java:45)
        at com.carrotsearch.randomizedtesting.rules.StatementAdapter.evaluate(StatementAdapter.java:36)
        at org.apache.lucene.util.TestRuleStoreClassName$1.evaluate(TestRuleStoreClassName.java:41)
        at com.carrotsearch.randomizedtesting.rules.NoShadowingOrOverridesOnMethodsRule$1.evaluate(NoShadowingOrOverridesOnMethodsRule.java:40)
        at com.carrotsearch.randomizedtesting.rules.NoShadowingOrOverridesOnMethodsRule$1.evaluate(NoShadowingOrOverridesOnMethodsRule.java:40)
        at com.carrotsearch.randomizedtesting.rules.StatementAdapter.evaluate(StatementAdapter.java:36)
        at com.carrotsearch.randomizedtesting.rules.StatementAdapter.evaluate(StatementAdapter.java:36)
        at org.apache.lucene.util.TestRuleAssertionsRequired$1.evaluate(TestRuleAssertionsRequired.java:53)
        at org.apache.lucene.util.TestRuleMarkFailure$1.evaluate(TestRuleMarkFailure.java:47)
        at org.apache.lucene.util.TestRuleIgnoreAfterMaxFailures$1.evaluate(TestRuleIgnoreAfterMaxFailures.java:64)
        at org.apache.lucene.util.TestRuleIgnoreTestSuites$1.evaluate(TestRuleIgnoreTestSuites.java:54)
        at com.carrotsearch.randomizedtesting.rules.StatementAdapter.evaluate(StatementAdapter.java:36)
        at com.carrotsearch.randomizedtesting.ThreadLeakControl$StatementRunner.run(ThreadLeakControl.java:368)
        at java.base/java.lang.Thread.run(Thread.java:835)


FAILED:  org.apache.lucene.search.TestRegexpRandom2.testRegexps

Error Message:
Hit 5 docnumbers don't match Hits length1=25 length2=25 hit=0: doc24=1.0,  doc24=1.0 hit=1: doc33=1.0,  doc33=1.0 hit=2: doc34=1.0,  doc34=1.0 hit=3: doc38=1.0,  doc38=1.0 hit=4: doc43=1.0,  doc43=1.0 hit=5: doc119=1.0,  doc183=1.0 hit=6: doc142=1.0,  doc188=1.0 hit=7: doc146=1.0,  doc193=1.0 hit=8: doc152=1.0,  doc228=1.0 hit=9: doc159=1.0,  doc244=1.0 hit=10: doc163=1.0,  doc250=1.0 hit=11: doc169=1.0,  doc282=1.0 hit=12: doc173=1.0,  doc284=1.0 hit=13: doc183=1.0,  doc291=1.0 hit=14: doc188=1.0,  doc300=1.0 hit=15: doc193=1.0,  doc320=1.0 hit=16: doc228=1.0,  doc347=1.0 hit=17: doc244=1.0,  doc349=1.0 hit=18: doc250=1.0,  doc405=1.0 hit=19: doc282=1.0,  doc418=1.0 hit=20: doc284=1.0,  doc431=1.0 hit=21: doc291=1.0,  doc443=1.0 hit=22: doc300=1.0,  doc490=1.0 hit=23: doc320=1.0,  doc513=1.0 hit=24: doc347=1.0,  doc555=1.0 for query:/[)*-|핯Ѿ]*+/

Stack Trace:
junit.framework.AssertionFailedError: Hit 5 docnumbers don't match
Hits length1=25 length2=25
hit=0: doc24=1.0, doc24=1.0
hit=1: doc33=1.0, doc33=1.0
hit=2: doc34=1.0, doc34=1.0
hit=3: doc38=1.0, doc38=1.0
hit=4: doc43=1.0, doc43=1.0
hit=5: doc119=1.0, doc183=1.0
hit=6: doc142=1.0, doc188=1.0
hit=7: doc146=1.0, doc193=1.0
hit=8: doc152=1.0, doc228=1.0
hit=9: doc159=1.0, doc244=1.0
hit=10: doc163=1.0, doc250=1.0
hit=11: doc169=1.0, doc282=1.0
hit=12: doc173=1.0, doc284=1.0
hit=13: doc183=1.0, doc291=1.0
hit=14: doc188=1.0, doc300=1.0
hit=15: doc193=1.0, doc320=1.0
hit=16: doc228=1.0, doc347=1.0
hit=17: doc244=1.0, doc349=1.0
hit=18: doc250=1.0, doc405=1.0
hit=19: doc282=1.0, doc418=1.0
hit=20: doc284=1.0, doc431=1.0
hit=21: doc291=1.0, doc443=1.0
hit=22: doc300=1.0, doc490=1.0
hit=23: doc320=1.0, doc513=1.0
hit=24: doc347=1.0, doc555=1.0
for query:/[)*-|핯Ѿ]*+/
        at __randomizedtesting.SeedInfo.seed([E712F4979E38CFD8:64EB58640929850]:0)
        at junit.framework.Assert.fail(Assert.java:57)
        at org.apache.lucene.search.CheckHits.checkEqual(CheckHits.java:205)
        at org.apache.lucene.search.TestRegexpRandom2.assertSame(TestRegexpRandom2.java:178)
        at org.apache.lucene.search.TestRegexpRandom2.testRegexps(TestRegexpRandom2.java:164)
        at java.base/jdk.internal.reflect.NativeMethodAccessorImpl.invoke0(Native Method)
        at java.base/jdk.internal.reflect.NativeMethodAccessorImpl.invoke(NativeMethodAccessorImpl.java:62)
        at java.base/jdk.internal.reflect.DelegatingMethodAccessorImpl.invoke(DelegatingMethodAccessorImpl.java:43)
        at java.base/java.lang.reflect.Method.invoke(Method.java:567)
        at com.carrotsearch.randomizedtesting.RandomizedRunner.invoke(RandomizedRunner.java:1750)
        at com.carrotsearch.randomizedtesting.RandomizedRunner$8.evaluate(RandomizedRunner.java:938)
        at com.carrotsearch.randomizedtesting.RandomizedRunner$9.evaluate(RandomizedRunner.java:974)
        at com.carrotsearch.randomizedtesting.RandomizedRunner$10.evaluate(RandomizedRunner.java:988)
        at org.apache.lucene.util.TestRuleSetupTeardownChained$1.evaluate(TestRuleSetupTeardownChained.java:49)
        at org.apache.lucene.util.AbstractBeforeAfterRule$1.evaluate(AbstractBeforeAfterRule.java:45)
        at org.apache.lucene.util.TestRuleThreadAndTestName$1.evaluate(TestRuleThreadAndTestName.java:48)
        at org.apache.lucene.util.TestRuleIgnoreAfterMaxFailures$1.evaluate(TestRuleIgnoreAfterMaxFailures.java:64)
        at org.apache.lucene.util.TestRuleMarkFailure$1.evaluate(TestRuleMarkFailure.java:47)
        at com.carrotsearch.randomizedtesting.rules.StatementAdapter.evaluate(StatementAdapter.java:36)
        at com.carrotsearch.randomizedtesting.ThreadLeakControl$StatementRunner.run(ThreadLeakControl.java:368)
        at com.carrotsearch.randomizedtesting.ThreadLeakControl.forkTimeoutingTask(ThreadLeakControl.java:817)
        at com.carrotsearch.randomizedtesting.ThreadLeakControl$3.evaluate(ThreadLeakControl.java:468)
        at com.carrotsearch.randomizedtesting.RandomizedRunner.runSingleTest(RandomizedRunner.java:947)
        at com.carrotsearch.randomizedtesting.RandomizedRunner$5.evaluate(RandomizedRunner.java:832)
        at com.carrotsearch.randomizedtesting.RandomizedRunner$6.evaluate(RandomizedRunner.java:883)
        at com.carrotsearch.randomizedtesting.RandomizedRunner$7.evaluate(RandomizedRunner.java:894)
        at org.apache.lucene.util.AbstractBeforeAfterRule$1.evaluate(AbstractBeforeAfterRule.java:45)
        at com.carrotsearch.randomizedtesting.rules.StatementAdapter.evaluate(StatementAdapter.java:36)
        at org.apache.lucene.util.TestRuleStoreClassName$1.evaluate(TestRuleStoreClassName.java:41)
        at com.carrotsearch.randomizedtesting.rules.NoShadowingOrOverridesOnMethodsRule$1.evaluate(NoShadowingOrOverridesOnMethodsRule.java:40)
        at com.carrotsearch.randomizedtesting.rules.NoShadowingOrOverridesOnMethodsRule$1.evaluate(NoShadowingOrOverridesOnMethodsRule.java:40)
        at com.carrotsearch.randomizedtesting.rules.StatementAdapter.evaluate(StatementAdapter.java:36)
        at com.carrotsearch.randomizedtesting.rules.StatementAdapter.evaluate(StatementAdapter.java:36)
        at org.apache.lucene.util.TestRuleAssertionsRequired$1.evaluate(TestRuleAssertionsRequired.java:53)
        at org.apache.lucene.util.TestRuleMarkFailure$1.evaluate(TestRuleMarkFailure.java:47)
        at org.apache.lucene.util.TestRuleIgnoreAfterMaxFailures$1.evaluate(TestRuleIgnoreAfterMaxFailures.java:64)
        at org.apache.lucene.util.TestRuleIgnoreTestSuites$1.evaluate(TestRuleIgnoreTestSuites.java:54)
        at com.carrotsearch.randomizedtesting.rules.StatementAdapter.evaluate(StatementAdapter.java:36)
        at com.carrotsearch.randomizedtesting.ThreadLeakControl$StatementRunner.run(ThreadLeakControl.java:368)
        at java.base/java.lang.Thread.run(Thread.java:835)


FAILED:  org.apache.lucene.search.TestRegexpRandom2.testRegexps

Error Message:
Hit 5 docnumbers don't match Hits length1=25 length2=25 hit=0: doc24=1.0,  doc24=1.0 hit=1: doc33=1.0,  doc33=1.0 hit=2: doc34=1.0,  doc34=1.0 hit=3: doc38=1.0,  doc38=1.0 hit=4: doc43=1.0,  doc43=1.0 hit=5: doc119=1.0,  doc183=1.0 hit=6: doc142=1.0,  doc188=1.0 hit=7: doc146=1.0,  doc193=1.0 hit=8: doc152=1.0,  doc228=1.0 hit=9: doc159=1.0,  doc244=1.0 hit=10: doc163=1.0,  doc250=1.0 hit=11: doc169=1.0,  doc282=1.0 hit=12: doc173=1.0,  doc284=1.0 hit=13: doc183=1.0,  doc291=1.0 hit=14: doc188=1.0,  doc300=1.0 hit=15: doc193=1.0,  doc320=1.0 hit=16: doc228=1.0,  doc347=1.0 hit=17: doc244=1.0,  doc349=1.0 hit=18: doc250=1.0,  doc405=1.0 hit=19: doc282=1.0,  doc418=1.0 hit=20: doc284=1.0,  doc431=1.0 hit=21: doc291=1.0,  doc443=1.0 hit=22: doc300=1.0,  doc490=1.0 hit=23: doc320=1.0,  doc513=1.0 hit=24: doc347=1.0,  doc555=1.0 for query:/[)*-|핯Ѿ]*+/

Stack Trace:
junit.framework.AssertionFailedError: Hit 5 docnumbers don't match
Hits length1=25 length2=25
hit=0: doc24=1.0, doc24=1.0
hit=1: doc33=1.0, doc33=1.0
hit=2: doc34=1.0, doc34=1.0
hit=3: doc38=1.0, doc38=1.0
hit=4: doc43=1.0, doc43=1.0
hit=5: doc119=1.0, doc183=1.0
hit=6: doc142=1.0, doc188=1.0
hit=7: doc146=1.0, doc193=1.0
hit=8: doc152=1.0, doc228=1.0
hit=9: doc159=1.0, doc244=1.0
hit=10: doc163=1.0, doc250=1.0
hit=11: doc169=1.0, doc282=1.0
hit=12: doc173=1.0, doc284=1.0
hit=13: doc183=1.0, doc291=1.0
hit=14: doc188=1.0, doc300=1.0
hit=15: doc193=1.0, doc320=1.0
hit=16: doc228=1.0, doc347=1.0
hit=17: doc244=1.0, doc349=1.0
hit=18: doc250=1.0, doc405=1.0
hit=19: doc282=1.0, doc418=1.0
hit=20: doc284=1.0, doc431=1.0
hit=21: doc291=1.0, doc443=1.0
hit=22: doc300=1.0, doc490=1.0
hit=23: doc320=1.0, doc513=1.0
hit=24: doc347=1.0, doc555=1.0
for query:/[)*-|핯Ѿ]*+/
        at __randomizedtesting.SeedInfo.seed([E712F4979E38CFD8:64EB58640929850]:0)
        at junit.framework.Assert.fail(Assert.java:57)
        at org.apache.lucene.search.CheckHits.checkEqual(CheckHits.java:205)
        at org.apache.lucene.search.TestRegexpRandom2.assertSame(TestRegexpRandom2.java:178)
        at org.apache.lucene.search.TestRegexpRandom2.testRegexps(TestRegexpRandom2.java:164)
        at java.base/jdk.internal.reflect.NativeMethodAccessorImpl.invoke0(Native Method)
        at java.base/jdk.internal.reflect.NativeMethodAccessorImpl.invoke(NativeMethodAccessorImpl.java:62)
        at java.base/jdk.internal.reflect.DelegatingMethodAccessorImpl.invoke(DelegatingMethodAccessorImpl.java:43)
        at java.base/java.lang.reflect.Method.invoke(Method.java:567)
        at com.carrotsearch.randomizedtesting.RandomizedRunner.invoke(RandomizedRunner.java:1750)
        at com.carrotsearch.randomizedtesting.RandomizedRunner$8.evaluate(RandomizedRunner.java:938)
        at com.carrotsearch.randomizedtesting.RandomizedRunner$9.evaluate(RandomizedRunner.java:974)
        at com.carrotsearch.randomizedtesting.RandomizedRunner$10.evaluate(RandomizedRunner.java:988)
        at org.apache.lucene.util.TestRuleSetupTeardownChained$1.evaluate(TestRuleSetupTeardownChained.java:49)
        at org.apache.lucene.util.AbstractBeforeAfterRule$1.evaluate(AbstractBeforeAfterRule.java:45)
        at org.apache.lucene.util.TestRuleThreadAndTestName$1.evaluate(TestRuleThreadAndTestName.java:48)
        at org.apache.lucene.util.TestRuleIgnoreAfterMaxFailures$1.evaluate(TestRuleIgnoreAfterMaxFailures.java:64)
        at org.apache.lucene.util.TestRuleMarkFailure$1.evaluate(TestRuleMarkFailure.java:47)
        at com.carrotsearch.randomizedtesting.rules.StatementAdapter.evaluate(StatementAdapter.java:36)
        at com.carrotsearch.randomizedtesting.ThreadLeakControl$StatementRunner.run(ThreadLeakControl.java:368)
        at com.carrotsearch.randomizedtesting.ThreadLeakControl.forkTimeoutingTask(ThreadLeakControl.java:817)
        at com.carrotsearch.randomizedtesting.ThreadLeakControl$3.evaluate(ThreadLeakControl.java:468)
        at com.carrotsearch.randomizedtesting.RandomizedRunner.runSingleTest(RandomizedRunner.java:947)
        at com.carrotsearch.randomizedtesting.RandomizedRunner$5.evaluate(RandomizedRunner.java:832)
        at com.carrotsearch.randomizedtesting.RandomizedRunner$6.evaluate(RandomizedRunner.java:883)
        at com.carrotsearch.randomizedtesting.RandomizedRunner$7.evaluate(RandomizedRunner.java:894)
        at org.apache.lucene.util.AbstractBeforeAfterRule$1.evaluate(AbstractBeforeAfterRule.java:45)
        at com.carrotsearch.randomizedtesting.rules.StatementAdapter.evaluate(StatementAdapter.java:36)
        at org.apache.lucene.util.TestRuleStoreClassName$1.evaluate(TestRuleStoreClassName.java:41)
        at com.carrotsearch.randomizedtesting.rules.NoShadowingOrOverridesOnMethodsRule$1.evaluate(NoShadowingOrOverridesOnMethodsRule.java:40)
        at com.carrotsearch.randomizedtesting.rules.NoShadowingOrOverridesOnMethodsRule$1.evaluate(NoShadowingOrOverridesOnMethodsRule.java:40)
        at com.carrotsearch.randomizedtesting.rules.StatementAdapter.evaluate(StatementAdapter.java:36)
        at com.carrotsearch.randomizedtesting.rules.StatementAdapter.evaluate(StatementAdapter.java:36)
        at org.apache.lucene.util.TestRuleAssertionsRequired$1.evaluate(TestRuleAssertionsRequired.java:53)
        at org.apache.lucene.util.TestRuleMarkFailure$1.evaluate(TestRuleMarkFailure.java:47)
        at org.apache.lucene.util.TestRuleIgnoreAfterMaxFailures$1.evaluate(TestRuleIgnoreAfterMaxFailures.java:64)
        at org.apache.lucene.util.TestRuleIgnoreTestSuites$1.evaluate(TestRuleIgnoreTestSuites.java:54)
        at com.carrotsearch.randomizedtesting.rules.StatementAdapter.evaluate(StatementAdapter.java:36)
        at com.carrotsearch.randomizedtesting.ThreadLeakControl$StatementRunner.run(ThreadLeakControl.java:368)
        at java.base/java.lang.Thread.run(Thread.java:835)




Build Log:
[...truncated 729 lines...]
   [junit4] Suite: org.apache.lucene.search.TestFieldCacheRewriteMethod
   [junit4]   2> NOTE: reproduce with: ant test  -Dtestcase=TestFieldCacheRewriteMethod -Dtests.method=testRegexps -Dtests.seed=E712F4979E38CFD8 -Dtests.multiplier=3 -Dtests.slow=true -Dtests.locale=am-ET -Dtests.timezone=America/New_York -Dtests.asserts=true -Dtests.file.encoding=US-ASCII
   [junit4] FAILURE 0.05s J1 | TestFieldCacheRewriteMethod.testRegexps <<<
   [junit4]    > Throwable #1: junit.framework.AssertionFailedError: Hit 2 docnumbers don't match
   [junit4]    > Hits length1=25 length2=25
   [junit4]    > hit=0: doc24=1.0, doc24=1.0
   [junit4]    > hit=1: doc38=1.0, doc38=1.0
   [junit4]    > hit=2: doc119=1.0, doc183=1.0
   [junit4]    > hit=3: doc146=1.0, doc188=1.0
   [junit4]    > hit=4: doc152=1.0, doc193=1.0
   [junit4]    > hit=5: doc159=1.0, doc228=1.0
   [junit4]    > hit=6: doc163=1.0, doc244=1.0
   [junit4]    > hit=7: doc169=1.0, doc291=1.0
   [junit4]    > hit=8: doc173=1.0, doc300=1.0
   [junit4]    > hit=9: doc183=1.0, doc347=1.0
   [junit4]    > hit=10: doc188=1.0, doc349=1.0
   [junit4]    > hit=11: doc193=1.0, doc405=1.0
   [junit4]    > hit=12: doc228=1.0, doc418=1.0
   [junit4]    > hit=13: doc244=1.0, doc431=1.0
   [junit4]    > hit=14: doc291=1.0, doc443=1.0
   [junit4]    > hit=15: doc300=1.0, doc490=1.0
   [junit4]    > hit=16: doc347=1.0, doc555=1.0
   [junit4]    > hit=17: doc349=1.0, doc563=1.0
   [junit4]    > hit=18: doc405=1.0, doc566=1.0
   [junit4]    > hit=19: doc418=1.0, doc571=1.0
   [junit4]    > hit=20: doc431=1.0, doc633=1.0
   [junit4]    > hit=21: doc443=1.0, doc636=1.0
   [junit4]    > hit=22: doc490=1.0, doc649=1.0
   [junit4]    > hit=23: doc555=1.0, doc679=1.0
   [junit4]    > hit=24: doc563=1.0, doc692=1.0
   [junit4]    > for query://
   [junit4]    > at __randomizedtesting.SeedInfo.seed([E712F4979E38CFD8:64EB58640929850]:0)
   [junit4]    > at junit.framework.Assert.fail(Assert.java:57)
   [junit4]    > at org.apache.lucene.search.CheckHits.checkEqual(CheckHits.java:205)
   [junit4]    > at org.apache.lucene.search.TestFieldCacheRewriteMethod.assertSame(TestFieldCacheRewriteMethod.java:42)
   [junit4]    > at org.apache.lucene.search.TestRegexpRandom2.testRegexps(TestRegexpRandom2.java:164)
   [junit4]    > at java.base/jdk.internal.reflect.NativeMethodAccessorImpl.invoke0(Native Method)
   [junit4]    > at java.base/jdk.internal.reflect.NativeMethodAccessorImpl.invoke(NativeMethodAccessorImpl.java:62)
   [junit4]    > at java.base/jdk.internal.reflect.DelegatingMethodAccessorImpl.invoke(DelegatingMethodAccessorImpl.java:43)
   [junit4]    > at java.base/java.lang.reflect.Method.invoke(Method.java:567)
   [junit4]    > at java.base/java.lang.Thread.run(Thread.java:835)
   [junit4]   2> NOTE: test params are: codec=Asserting(Lucene80): {=PostingsFormat(name=LuceneFixedGap), field=PostingsFormat(name=Direct)}, docValues:{=DocValuesFormat(name=Lucene80), field=DocValuesFormat(name=Direct)}, maxPointsInLeafNode=730, maxMBSortInHeap=7.733851075164457, sim=Asserting(org.apache.lucene.search.similarities.AssertingSimilarity@34b0567), locale=am-ET, timezone=America/New_York
   [junit4]   2> NOTE: Linux 4.18.0-17-generic amd64/Oracle Corporation 13-ea (64-bit)/cpus=8,threads=1,free=160989816,total=242221056
   [junit4]   2> NOTE: All tests run in this JVM: [TestSpansEnum, TestConstantScoreScorer, TestOperations, TestBytesRefArray, TestIndexWriterExceptions, TestTotalHits, TestSPIClassIterator, TestLucene80NormsFormatMergeInstance, TestTopFieldCollector, TestNewestSegment, TestLongBitSet, TestPackedTokenAttributeImpl, TestRAMDirectory, TestMultiLevelSkipList, TestConjunctionDISI, TestTermVectors, TestRadixSelector, TestDirectPacked, TestSpanExplanationsOfNonMatches, TestPagedBytes, FiniteStringsIteratorTest, TestTermsEnum2, TestLongDistanceFeatureQuery, TestCachingCollector, TestMatchNoDocsQuery, TestDocumentsWriterDeleteQueue, TestReadOnlyIndex, TestNotDocIdSet, TestDocsAndPositions, TestLatLonPoint, TestDuelingCodecsAtNight, TestIsCurrent, Test2BBKDPoints, TestMultiPhraseQuery, TestDeterminizeLexicon, TestTermQuery, TestLongPostings, TestSimpleFSLockFactory, TestStressIndexing2, TestSameTokenSamePosition, TestFeatureSort, TestByteArrayDataInput, TestQueryVisitor, TestBoolean2, TestSortRescorer, TestIndexWriterConfig, TestSwappedIndexFiles, TestMultiThreadTermVectors, TestFixedBitSet, TestSimpleExplanationsWithFillerDocs, TestSegmentReader, TestCodecs, TestFieldUpdatesBuffer, TestSloppyMath, TestIndexWriterOnDiskFull, TestCharsRefBuilder, TestLucene50StoredFieldsFormatHighCompression, TestGraphTokenStreamFiniteStrings, TestCachingTokenFilter, TestOneMergeWrappingMergePolicy, TestIndexSearcher, TestIndexWriterFromReader, TestTryDelete, TestDateSort, TestClassicSimilarity, TestVersion, TestFieldCacheRewriteMethod]
   [junit4] Completed [113/522 (1!)] on J1 in 0.25s, 2 tests, 1 failure <<< FAILURES!

[...truncated 60 lines...]
   [junit4] Suite: org.apache.lucene.search.TestRegexpRandom2
   [junit4]   2> NOTE: reproduce with: ant test  -Dtestcase=TestRegexpRandom2 -Dtests.method=testRegexps -Dtests.seed=E712F4979E38CFD8 -Dtests.multiplier=3 -Dtests.slow=true -Dtests.locale=fr-HT -Dtests.timezone=America/New_York -Dtests.asserts=true -Dtests.file.encoding=US-ASCII
   [junit4] FAILURE 0.07s J1 | TestRegexpRandom2.testRegexps <<<
   [junit4]    > Throwable #1: junit.framework.AssertionFailedError: Hit 5 docnumbers don't match
   [junit4]    > Hits length1=25 length2=25
   [junit4]    > hit=0: doc24=1.0, doc24=1.0
   [junit4]    > hit=1: doc33=1.0, doc33=1.0
   [junit4]    > hit=2: doc34=1.0, doc34=1.0
   [junit4]    > hit=3: doc38=1.0, doc38=1.0
   [junit4]    > hit=4: doc43=1.0, doc43=1.0
   [junit4]    > hit=5: doc119=1.0, doc183=1.0
   [junit4]    > hit=6: doc142=1.0, doc188=1.0
   [junit4]    > hit=7: doc146=1.0, doc193=1.0
   [junit4]    > hit=8: doc152=1.0, doc228=1.0
   [junit4]    > hit=9: doc159=1.0, doc244=1.0
   [junit4]    > hit=10: doc163=1.0, doc250=1.0
   [junit4]    > hit=11: doc169=1.0, doc282=1.0
   [junit4]    > hit=12: doc173=1.0, doc284=1.0
   [junit4]    > hit=13: doc183=1.0, doc291=1.0
   [junit4]    > hit=14: doc188=1.0, doc300=1.0
   [junit4]    > hit=15: doc193=1.0, doc320=1.0
   [junit4]    > hit=16: doc228=1.0, doc347=1.0
   [junit4]    > hit=17: doc244=1.0, doc349=1.0
   [junit4]    > hit=18: doc250=1.0, doc405=1.0
   [junit4]    > hit=19: doc282=1.0, doc418=1.0
   [junit4]    > hit=20: doc284=1.0, doc431=1.0
   [junit4]    > hit=21: doc291=1.0, doc443=1.0
   [junit4]    > hit=22: doc300=1.0, doc490=1.0
   [junit4]    > hit=23: doc320=1.0, doc513=1.0
   [junit4]    > hit=24: doc347=1.0, doc555=1.0
   [junit4]    > for query:/[)*-|핯Ѿ]*+/
   [junit4]    > at __randomizedtesting.SeedInfo.seed([E712F4979E38CFD8:64EB58640929850]:0)
   [junit4]    > at junit.framework.Assert.fail(Assert.java:57)
   [junit4]    > at org.apache.lucene.search.CheckHits.checkEqual(CheckHits.java:205)
   [junit4]    > at org.apache.lucene.search.TestRegexpRandom2.assertSame(TestRegexpRandom2.java:178)
   [junit4]    > at org.apache.lucene.search.TestRegexpRandom2.testRegexps(TestRegexpRandom2.java:164)
   [junit4]    > at java.base/jdk.internal.reflect.NativeMethodAccessorImpl.invoke0(Native Method)
   [junit4]    > at java.base/jdk.internal.reflect.NativeMethodAccessorImpl.invoke(NativeMethodAccessorImpl.java:62)
   [junit4]    > at java.base/jdk.internal.reflect.DelegatingMethodAccessorImpl.invoke(DelegatingMethodAccessorImpl.java:43)
   [junit4]    > at java.base/java.lang.reflect.Method.invoke(Method.java:567)
   [junit4]    > at java.base/java.lang.Thread.run(Thread.java:835)
   [junit4]   2> NOTE: test params are: codec=Asserting(Lucene80): {=PostingsFormat(name=Asserting)}, docValues:{=DocValuesFormat(name=Lucene80)}, maxPointsInLeafNode=99, maxMBSortInHeap=6.5001116595178905, sim=Asserting(org.apache.lucene.search.similarities.AssertingSimilarity@2a0a8380), locale=fr-HT, timezone=America/New_York
   [junit4]   2> NOTE: Linux 4.18.0-17-generic amd64/Oracle Corporation 13-ea (64-bit)/cpus=8,threads=1,free=138177544,total=291504128
   [junit4]   2> NOTE: All tests run in this JVM: [TestSpansEnum, TestConstantScoreScorer, TestOperations, TestBytesRefArray, TestIndexWriterExceptions, TestTotalHits, TestSPIClassIterator, TestLucene80NormsFormatMergeInstance, TestTopFieldCollector, TestNewestSegment, TestLongBitSet, TestPackedTokenAttributeImpl, TestRAMDirectory, TestMultiLevelSkipList, TestConjunctionDISI, TestTermVectors, TestRadixSelector, TestDirectPacked, TestSpanExplanationsOfNonMatches, TestPagedBytes, FiniteStringsIteratorTest, TestTermsEnum2, TestLongDistanceFeatureQuery, TestCachingCollector, TestMatchNoDocsQuery, TestDocumentsWriterDeleteQueue, TestReadOnlyIndex, TestNotDocIdSet, TestDocsAndPositions, TestLatLonPoint, TestDuelingCodecsAtNight, TestIsCurrent, Test2BBKDPoints, TestMultiPhraseQuery, TestDeterminizeLexicon, TestTermQuery, TestLongPostings, TestSimpleFSLockFactory, TestStressIndexing2, TestSameTokenSamePosition, TestFeatureSort, TestByteArrayDataInput, TestQueryVisitor, TestBoolean2, TestSortRescorer, TestIndexWriterConfig, TestSwappedIndexFiles, TestMultiThreadTermVectors, TestFixedBitSet, TestSimpleExplanationsWithFillerDocs, TestSegmentReader, TestCodecs, TestFieldUpdatesBuffer, TestSloppyMath, TestIndexWriterOnDiskFull, TestCharsRefBuilder, TestLucene50StoredFieldsFormatHighCompression, TestGraphTokenStreamFiniteStrings, TestCachingTokenFilter, TestOneMergeWrappingMergePolicy, TestIndexSearcher, TestIndexWriterFromReader, TestTryDelete, TestDateSort, TestClassicSimilarity, TestVersion, TestFieldCacheRewriteMethod, TestDoubleValuesSource, TestIndexTooManyDocs, TestUpgradeIndexMergePolicy, TestFilterSpans, TestReaderWrapperDVTypeCheck, TermInSetQueryTest, TestBytesStore, TestFloatRangeFieldQueries, TestIndependenceChiSquared, TestSameScoresWithThreads, TestTragicIndexWriterDeadlock, TestCustomTermFreq, Test2BTerms, TestLucene60FieldInfoFormat, TestStopFilter, TestNRTReaderWithThreads, TestPerFieldPostingsFormat2, TestNeedsScores, TestRegexpRandom2]
   [junit4] Completed [132/522 (2!)] on J1 in 0.25s, 1 test, 1 failure <<< FAILURES!

[...truncated 59785 lines...]
[repro] Jenkins log URL: https://jenkins.thetaphi.de/job/Lucene-Solr-8.x-Linux/672/consoleText

[repro] Revision: b92ae784c7f0aa0208c7463a44a77622d719122e

[repro] Ant options: "-Dargs=-XX:+UseCompressedOops -XX:+UseParallelGC"
[repro] Repro line:  ant test  -Dtestcase=TestFieldCacheRewriteMethod -Dtests.method=testRegexps -Dtests.seed=E712F4979E38CFD8 -Dtests.multiplier=3 -Dtests.slow=true -Dtests.locale=am-ET -Dtests.timezone=America/New_York -Dtests.asserts=true -Dtests.file.encoding=US-ASCII

[repro] Repro line:  ant test  -Dtestcase=TestRegexpRandom2 -Dtests.method=testRegexps -Dtests.seed=E712F4979E38CFD8 -Dtests.multiplier=3 -Dtests.slow=true -Dtests.locale=fr-HT -Dtests.timezone=America/New_York -Dtests.asserts=true -Dtests.file.encoding=US-ASCII

[repro] ant clean

[...truncated 6 lines...]
[repro] Test suites by module:
[repro]    lucene/core
[repro]       TestRegexpRandom2
[repro]       TestFieldCacheRewriteMethod
[repro] ant compile-test

[...truncated 210 lines...]
[repro] ant test-nocompile -Dtests.dups=5 -Dtests.maxfailures=10 -Dtests.class="*.TestRegexpRandom2|*.TestFieldCacheRewriteMethod" -Dtests.showOutput=onerror "-Dargs=-XX:+UseCompressedOops -XX:+UseParallelGC" -Dtests.seed=E712F4979E38CFD8 -Dtests.multiplier=3 -Dtests.slow=true -Dtests.locale=fr-HT -Dtests.timezone=America/New_York -Dtests.asserts=true -Dtests.file.encoding=US-ASCII

[...truncated 32 lines...]
   [junit4] Suite: org.apache.lucene.search.TestRegexpRandom2
   [junit4]   2> NOTE: reproduce with: ant test  -Dtestcase=TestRegexpRandom2 -Dtests.method=testRegexps -Dtests.seed=E712F4979E38CFD8 -Dtests.multiplier=3 -Dtests.slow=true -Dtests.badapples=true -Dtests.locale=fr-HT -Dtests.timezone=America/New_York -Dtests.asserts=true -Dtests.file.encoding=US-ASCII
   [junit4] FAILURE 1.49s J0 | TestRegexpRandom2.testRegexps <<<
   [junit4]    > Throwable #1: junit.framework.AssertionFailedError: Hit 5 docnumbers don't match
   [junit4]    > Hits length1=25 length2=25
   [junit4]    > hit=0: doc24=1.0, doc24=1.0
   [junit4]    > hit=1: doc33=1.0, doc33=1.0
   [junit4]    > hit=2: doc34=1.0, doc34=1.0
   [junit4]    > hit=3: doc38=1.0, doc38=1.0
   [junit4]    > hit=4: doc43=1.0, doc43=1.0
   [junit4]    > hit=5: doc119=1.0, doc183=1.0
   [junit4]    > hit=6: doc142=1.0, doc188=1.0
   [junit4]    > hit=7: doc146=1.0, doc193=1.0
   [junit4]    > hit=8: doc152=1.0, doc228=1.0
   [junit4]    > hit=9: doc159=1.0, doc244=1.0
   [junit4]    > hit=10: doc163=1.0, doc250=1.0
   [junit4]    > hit=11: doc169=1.0, doc282=1.0
   [junit4]    > hit=12: doc173=1.0, doc284=1.0
   [junit4]    > hit=13: doc183=1.0, doc291=1.0
   [junit4]    > hit=14: doc188=1.0, doc300=1.0
   [junit4]    > hit=15: doc193=1.0, doc320=1.0
   [junit4]    > hit=16: doc228=1.0, doc347=1.0
   [junit4]    > hit=17: doc244=1.0, doc349=1.0
   [junit4]    > hit=18: doc250=1.0, doc405=1.0
   [junit4]    > hit=19: doc282=1.0, doc418=1.0
   [junit4]    > hit=20: doc284=1.0, doc431=1.0
   [junit4]    > hit=21: doc291=1.0, doc443=1.0
   [junit4]    > hit=22: doc300=1.0, doc490=1.0
   [junit4]    > hit=23: doc320=1.0, doc513=1.0
   [junit4]    > hit=24: doc347=1.0, doc555=1.0
   [junit4]    > for query:/[)*-|핯Ѿ]*+/
   [junit4]    > at __randomizedtesting.SeedInfo.seed([E712F4979E38CFD8:64EB58640929850]:0)
   [junit4]    > at junit.framework.Assert.fail(Assert.java:57)
   [junit4]    > at org.apache.lucene.search.CheckHits.checkEqual(CheckHits.java:205)
   [junit4]    > at org.apache.lucene.search.TestRegexpRandom2.assertSame(TestRegexpRandom2.java:178)
   [junit4]    > at org.apache.lucene.search.TestRegexpRandom2.testRegexps(TestRegexpRandom2.java:164)
   [junit4]    > at java.base/jdk.internal.reflect.NativeMethodAccessorImpl.invoke0(Native Method)
   [junit4]    > at java.base/jdk.internal.reflect.NativeMethodAccessorImpl.invoke(NativeMethodAccessorImpl.java:62)
   [junit4]    > at java.base/jdk.internal.reflect.DelegatingMethodAccessorImpl.invoke(DelegatingMethodAccessorImpl.java:43)
   [junit4]    > at java.base/java.lang.reflect.Method.invoke(Method.java:567)
   [junit4]    > at java.base/java.lang.Thread.run(Thread.java:835)
   [junit4]   2> NOTE: test params are: codec=Asserting(Lucene80): {=PostingsFormat(name=Asserting)}, docValues:{=DocValuesFormat(name=Lucene80)}, maxPointsInLeafNode=99, maxMBSortInHeap=6.5001116595178905, sim=Asserting(org.apache.lucene.search.similarities.AssertingSimilarity@3bb990ee), locale=fr-HT, timezone=America/New_York
   [junit4]   2> NOTE: Linux 4.18.0-17-generic amd64/Oracle Corporation 13-ea (64-bit)/cpus=8,threads=1,free=387882056,total=514850816
   [junit4]   2> NOTE: All tests run in this JVM: [TestRegexpRandom2]
   [junit4] Completed [1/10 (1!)] on J0 in 2.34s, 1 test, 1 failure <<< FAILURES!

[...truncated 1 lines...]
   [junit4] Suite: org.apache.lucene.search.TestFieldCacheRewriteMethod
   [junit4]   2> NOTE: reproduce with: ant test  -Dtestcase=TestFieldCacheRewriteMethod -Dtests.method=testRegexps -Dtests.seed=E712F4979E38CFD8 -Dtests.multiplier=3 -Dtests.slow=true -Dtests.badapples=true -Dtests.locale=fr-HT -Dtests.timezone=America/New_York -Dtests.asserts=true -Dtests.file.encoding=US-ASCII
   [junit4] FAILURE 1.29s J2 | TestFieldCacheRewriteMethod.testRegexps <<<
   [junit4]    > Throwable #1: junit.framework.AssertionFailedError: Hit 2 docnumbers don't match
   [junit4]    > Hits length1=25 length2=25
   [junit4]    > hit=0: doc24=1.0, doc24=1.0
   [junit4]    > hit=1: doc38=1.0, doc38=1.0
   [junit4]    > hit=2: doc119=1.0, doc183=1.0
   [junit4]    > hit=3: doc146=1.0, doc188=1.0
   [junit4]    > hit=4: doc152=1.0, doc193=1.0
   [junit4]    > hit=5: doc159=1.0, doc228=1.0
   [junit4]    > hit=6: doc163=1.0, doc244=1.0
   [junit4]    > hit=7: doc169=1.0, doc291=1.0
   [junit4]    > hit=8: doc173=1.0, doc300=1.0
   [junit4]    > hit=9: doc183=1.0, doc347=1.0
   [junit4]    > hit=10: doc188=1.0, doc349=1.0
   [junit4]    > hit=11: doc193=1.0, doc405=1.0
   [junit4]    > hit=12: doc228=1.0, doc418=1.0
   [junit4]    > hit=13: doc244=1.0, doc431=1.0
   [junit4]    > hit=14: doc291=1.0, doc443=1.0
   [junit4]    > hit=15: doc300=1.0, doc490=1.0
   [junit4]    > hit=16: doc347=1.0, doc555=1.0
   [junit4]    > hit=17: doc349=1.0, doc563=1.0
   [junit4]    > hit=18: doc405=1.0, doc566=1.0
   [junit4]    > hit=19: doc418=1.0, doc571=1.0
   [junit4]    > hit=20: doc431=1.0, doc633=1.0
   [junit4]    > hit=21: doc443=1.0, doc636=1.0
   [junit4]    > hit=22: doc490=1.0, doc649=1.0
   [junit4]    > hit=23: doc555=1.0, doc679=1.0
   [junit4]    > hit=24: doc563=1.0, doc692=1.0
   [junit4]    > for query://
   [junit4]    > at __randomizedtesting.SeedInfo.seed([E712F4979E38CFD8:64EB58640929850]:0)
   [junit4]    > at junit.framework.Assert.fail(Assert.java:57)
   [junit4]    > at org.apache.lucene.search.CheckHits.checkEqual(CheckHits.java:205)
   [junit4]    > at org.apache.lucene.search.TestFieldCacheRewriteMethod.assertSame(TestFieldCacheRewriteMethod.java:42)
   [junit4]    > at org.apache.lucene.search.TestRegexpRandom2.testRegexps(TestRegexpRandom2.java:164)
   [junit4]    > at java.base/jdk.internal.reflect.NativeMethodAccessorImpl.invoke0(Native Method)
   [junit4]    > at java.base/jdk.internal.reflect.NativeMethodAccessorImpl.invoke(NativeMethodAccessorImpl.java:62)
   [junit4]    > at java.base/jdk.internal.reflect.DelegatingMethodAccessorImpl.invoke(DelegatingMethodAccessorImpl.java:43)
   [junit4]    > at java.base/java.lang.reflect.Method.invoke(Method.java:567)
   [junit4]    > at java.base/java.lang.Thread.run(Thread.java:835)
   [junit4] OK      0.43s J2 | TestFieldCacheRewriteMethod.testEquals
   [junit4]   2> NOTE: test params are: codec=Asserting(Lucene80): {=PostingsFormat(name=LuceneFixedGap), field=PostingsFormat(name=Direct)}, docValues:{=DocValuesFormat(name=Lucene80), field=DocValuesFormat(name=Direct)}, maxPointsInLeafNode=730, maxMBSortInHeap=7.733851075164457, sim=Asserting(org.apache.lucene.search.similarities.AssertingSimilarity@4c9fd0cc), locale=fr-HT, timezone=America/New_York
   [junit4]   2> NOTE: Linux 4.18.0-17-generic amd64/Oracle Corporation 13-ea (64-bit)/cpus=8,threads=1,free=481101896,total=514850816
   [junit4]   2> NOTE: All tests run in this JVM: [TestFieldCacheRewriteMethod]
   [junit4] Completed [2/10 (2!)] on J2 in 2.74s, 2 tests, 1 failure <<< FAILURES!

[...truncated 1 lines...]
   [junit4] Suite: org.apache.lucene.search.TestFieldCacheRewriteMethod
   [junit4]   2> NOTE: reproduce with: ant test  -Dtestcase=TestFieldCacheRewriteMethod -Dtests.method=testRegexps -Dtests.seed=E712F4979E38CFD8 -Dtests.multiplier=3 -Dtests.slow=true -Dtests.badapples=true -Dtests.locale=fr-HT -Dtests.timezone=America/New_York -Dtests.asserts=true -Dtests.file.encoding=US-ASCII
   [junit4] FAILURE 1.40s J1 | TestFieldCacheRewriteMethod.testRegexps <<<
   [junit4]    > Throwable #1: junit.framework.AssertionFailedError: Hit 2 docnumbers don't match
   [junit4]    > Hits length1=25 length2=25
   [junit4]    > hit=0: doc24=1.0, doc24=1.0
   [junit4]    > hit=1: doc38=1.0, doc38=1.0
   [junit4]    > hit=2: doc119=1.0, doc183=1.0
   [junit4]    > hit=3: doc146=1.0, doc188=1.0
   [junit4]    > hit=4: doc152=1.0, doc193=1.0
   [junit4]    > hit=5: doc159=1.0, doc228=1.0
   [junit4]    > hit=6: doc163=1.0, doc244=1.0
   [junit4]    > hit=7: doc169=1.0, doc291=1.0
   [junit4]    > hit=8: doc173=1.0, doc300=1.0
   [junit4]    > hit=9: doc183=1.0, doc347=1.0
   [junit4]    > hit=10: doc188=1.0, doc349=1.0
   [junit4]    > hit=11: doc193=1.0, doc405=1.0
   [junit4]    > hit=12: doc228=1.0, doc418=1.0
   [junit4]    > hit=13: doc244=1.0, doc431=1.0
   [junit4]    > hit=14: doc291=1.0, doc443=1.0
   [junit4]    > hit=15: doc300=1.0, doc490=1.0
   [junit4]    > hit=16: doc347=1.0, doc555=1.0
   [junit4]    > hit=17: doc349=1.0, doc563=1.0
   [junit4]    > hit=18: doc405=1.0, doc566=1.0
   [junit4]    > hit=19: doc418=1.0, doc571=1.0
   [junit4]    > hit=20: doc431=1.0, doc633=1.0
   [junit4]    > hit=21: doc443=1.0, doc636=1.0
   [junit4]    > hit=22: doc490=1.0, doc649=1.0
   [junit4]    > hit=23: doc555=1.0, doc679=1.0
   [junit4]    > hit=24: doc563=1.0, doc692=1.0
   [junit4]    > for query://
   [junit4]    > at __randomizedtesting.SeedInfo.seed([E712F4979E38CFD8:64EB58640929850]:0)
   [junit4]    > at junit.framework.Assert.fail(Assert.java:57)
   [junit4]    > at org.apache.lucene.search.CheckHits.checkEqual(CheckHits.java:205)
   [junit4]    > at org.apache.lucene.search.TestFieldCacheRewriteMethod.assertSame(TestFieldCacheRewriteMethod.java:42)
   [junit4]    > at org.apache.lucene.search.TestRegexpRandom2.testRegexps(TestRegexpRandom2.java:164)
   [junit4]    > at java.base/jdk.internal.reflect.NativeMethodAccessorImpl.invoke0(Native Method)
   [junit4]    > at java.base/jdk.internal.reflect.NativeMethodAccessorImpl.invoke(NativeMethodAccessorImpl.java:62)
   [junit4]    > at java.base/jdk.internal.reflect.DelegatingMethodAccessorImpl.invoke(DelegatingMethodAccessorImpl.java:43)
   [junit4]    > at java.base/java.lang.reflect.Method.invoke(Method.java:567)
   [junit4]    > at java.base/java.lang.Thread.run(Thread.java:835)
   [junit4] OK      0.50s J1 | TestFieldCacheRewriteMethod.testEquals
   [junit4]   2> NOTE: test params are: codec=Asserting(Lucene80): {=PostingsFormat(name=LuceneFixedGap), field=PostingsFormat(name=Direct)}, docValues:{=DocValuesFormat(name=Lucene80), field=DocValuesFormat(name=Direct)}, maxPointsInLeafNode=730, maxMBSortInHeap=7.733851075164457, sim=Asserting(org.apache.lucene.search.similarities.AssertingSimilarity@43a678f3), locale=fr-HT, timezone=America/New_York
   [junit4]   2> NOTE: Linux 4.18.0-17-generic amd64/Oracle Corporation 13-ea (64-bit)/cpus=8,threads=1,free=481099992,total=514850816
   [junit4]   2> NOTE: All tests run in this JVM: [TestFieldCacheRewriteMethod]
   [junit4] Completed [3/10 (3!)] on J1 in 2.85s, 2 tests, 1 failure <<< FAILURES!

[...truncated 1 lines...]
   [junit4] Suite: org.apache.lucene.search.TestRegexpRandom2
   [junit4]   2> NOTE: reproduce with: ant test  -Dtestcase=TestRegexpRandom2 -Dtests.method=testRegexps -Dtests.seed=E712F4979E38CFD8 -Dtests.multiplier=3 -Dtests.slow=true -Dtests.badapples=true -Dtests.locale=fr-HT -Dtests.timezone=America/New_York -Dtests.asserts=true -Dtests.file.encoding=US-ASCII
   [junit4] FAILURE 0.63s J2 | TestRegexpRandom2.testRegexps <<<
   [junit4]    > Throwable #1: junit.framework.AssertionFailedError: Hit 5 docnumbers don't match
   [junit4]    > Hits length1=25 length2=25
   [junit4]    > hit=0: doc24=1.0, doc24=1.0
   [junit4]    > hit=1: doc33=1.0, doc33=1.0
   [junit4]    > hit=2: doc34=1.0, doc34=1.0
   [junit4]    > hit=3: doc38=1.0, doc38=1.0
   [junit4]    > hit=4: doc43=1.0, doc43=1.0
   [junit4]    > hit=5: doc119=1.0, doc183=1.0
   [junit4]    > hit=6: doc142=1.0, doc188=1.0
   [junit4]    > hit=7: doc146=1.0, doc193=1.0
   [junit4]    > hit=8: doc152=1.0, doc228=1.0
   [junit4]    > hit=9: doc159=1.0, doc244=1.0
   [junit4]    > hit=10: doc163=1.0, doc250=1.0
   [junit4]    > hit=11: doc169=1.0, doc282=1.0
   [junit4]    > hit=12: doc173=1.0, doc284=1.0
   [junit4]    > hit=13: doc183=1.0, doc291=1.0
   [junit4]    > hit=14: doc188=1.0, doc300=1.0
   [junit4]    > hit=15: doc193=1.0, doc320=1.0
   [junit4]    > hit=16: doc228=1.0, doc347=1.0
   [junit4]    > hit=17: doc244=1.0, doc349=1.0
   [junit4]    > hit=18: doc250=1.0, doc405=1.0
   [junit4]    > hit=19: doc282=1.0, doc418=1.0
   [junit4]    > hit=20: doc284=1.0, doc431=1.0
   [junit4]    > hit=21: doc291=1.0, doc443=1.0
   [junit4]    > hit=22: doc300=1.0, doc490=1.0
   [junit4]    > hit=23: doc320=1.0, doc513=1.0
   [junit4]    > hit=24: doc347=1.0, doc555=1.0
   [junit4]    > for query:/[)*-|핯Ѿ]*+/
   [junit4]    > at __randomizedtesting.SeedInfo.seed([E712F4979E38CFD8:64EB58640929850]:0)
   [junit4]    > at junit.framework.Assert.fail(Assert.java:57)
   [junit4]    > at org.apache.lucene.search.CheckHits.checkEqual(CheckHits.java:205)
   [junit4]    > at org.apache.lucene.search.TestRegexpRandom2.assertSame(TestRegexpRandom2.java:178)
   [junit4]    > at org.apache.lucene.search.TestRegexpRandom2.testRegexps(TestRegexpRandom2.java:164)
   [junit4]    > at java.base/jdk.internal.reflect.NativeMethodAccessorImpl.invoke0(Native Method)
   [junit4]    > at java.base/jdk.internal.reflect.NativeMethodAccessorImpl.invoke(NativeMethodAccessorImpl.java:62)
   [junit4]    > at java.base/jdk.internal.reflect.DelegatingMethodAccessorImpl.invoke(DelegatingMethodAccessorImpl.java:43)
   [junit4]    > at java.base/java.lang.reflect.Method.invoke(Method.java:567)
   [junit4]    > at java.base/java.lang.Thread.run(Thread.java:835)
   [junit4]   2> NOTE: test params are: codec=Asserting(Lucene80): {=PostingsFormat(name=Asserting)}, docValues:{=DocValuesFormat(name=Lucene80)}, maxPointsInLeafNode=99, maxMBSortInHeap=6.5001116595178905, sim=Asserting(org.apache.lucene.search.similarities.AssertingSimilarity@1dbd822b), locale=fr-HT, timezone=America/New_York
   [junit4]   2> NOTE: Linux 4.18.0-17-generic amd64/Oracle Corporation 13-ea (64-bit)/cpus=8,threads=1,free=413468032,total=514850816
   [junit4]   2> NOTE: All tests run in this JVM: [TestFieldCacheRewriteMethod, TestRegexpRandom2]
   [junit4] Completed [4/10 (4!)] on J2 in 0.77s, 1 test, 1 failure <<< FAILURES!

[...truncated 1 lines...]
   [junit4] Suite: org.apache.lucene.search.TestRegexpRandom2
   [junit4]   2> NOTE: reproduce with: ant test  -Dtestcase=TestRegexpRandom2 -Dtests.method=testRegexps -Dtests.seed=E712F4979E38CFD8 -Dtests.multiplier=3 -Dtests.slow=true -Dtests.badapples=true -Dtests.locale=fr-HT -Dtests.timezone=America/New_York -Dtests.asserts=true -Dtests.file.encoding=US-ASCII
   [junit4] FAILURE 0.66s J1 | TestRegexpRandom2.testRegexps <<<
   [junit4]    > Throwable #1: junit.framework.AssertionFailedError: Hit 5 docnumbers don't match
   [junit4]    > Hits length1=25 length2=25
   [junit4]    > hit=0: doc24=1.0, doc24=1.0
   [junit4]    > hit=1: doc33=1.0, doc33=1.0
   [junit4]    > hit=2: doc34=1.0, doc34=1.0
   [junit4]    > hit=3: doc38=1.0, doc38=1.0
   [junit4]    > hit=4: doc43=1.0, doc43=1.0
   [junit4]    > hit=5: doc119=1.0, doc183=1.0
   [junit4]    > hit=6: doc142=1.0, doc188=1.0
   [junit4]    > hit=7: doc146=1.0, doc193=1.0
   [junit4]    > hit=8: doc152=1.0, doc228=1.0
   [junit4]    > hit=9: doc159=1.0, doc244=1.0
   [junit4]    > hit=10: doc163=1.0, doc250=1.0
   [junit4]    > hit=11: doc169=1.0, doc282=1.0
   [junit4]    > hit=12: doc173=1.0, doc284=1.0
   [junit4]    > hit=13: doc183=1.0, doc291=1.0
   [junit4]    > hit=14: doc188=1.0, doc300=1.0
   [junit4]    > hit=15: doc193=1.0, doc320=1.0
   [junit4]    > hit=16: doc228=1.0, doc347=1.0
   [junit4]    > hit=17: doc244=1.0, doc349=1.0
   [junit4]    > hit=18: doc250=1.0, doc405=1.0
   [junit4]    > hit=19: doc282=1.0, doc418=1.0
   [junit4]    > hit=20: doc284=1.0, doc431=1.0
   [junit4]    > hit=21: doc291=1.0, doc443=1.0
   [junit4]    > hit=22: doc300=1.0, doc490=1.0
   [junit4]    > hit=23: doc320=1.0, doc513=1.0
   [junit4]    > hit=24: doc347=1.0, doc555=1.0
   [junit4]    > for query:/[)*-|핯Ѿ]*+/
   [junit4]    > at __randomizedtesting.SeedInfo.seed([E712F4979E38CFD8:64EB58640929850]:0)
   [junit4]    > at junit.framework.Assert.fail(Assert.java:57)
   [junit4]    > at org.apache.lucene.search.CheckHits.checkEqual(CheckHits.java:205)
   [junit4]    > at org.apache.lucene.search.TestRegexpRandom2.assertSame(TestRegexpRandom2.java:178)
   [junit4]    > at org.apache.lucene.search.TestRegexpRandom2.testRegexps(TestRegexpRandom2.java:164)
   [junit4]    > at java.base/jdk.internal.reflect.NativeMethodAccessorImpl.invoke0(Native Method)
   [junit4]    > at java.base/jdk.internal.reflect.NativeMethodAccessorImpl.invoke(NativeMethodAccessorImpl.java:62)
   [junit4]    > at java.base/jdk.internal.reflect.DelegatingMethodAccessorImpl.invoke(DelegatingMethodAccessorImpl.java:43)
   [junit4]    > at java.base/java.lang.reflect.Method.invoke(Method.java:567)
   [junit4]    > at java.base/java.lang.Thread.run(Thread.java:835)
   [junit4]   2> NOTE: test params are: codec=Asserting(Lucene80): {=PostingsFormat(name=Asserting)}, docValues:{=DocValuesFormat(name=Lucene80)}, maxPointsInLeafNode=99, maxMBSortInHeap=6.5001116595178905, sim=Asserting(org.apache.lucene.search.similarities.AssertingSimilarity@32e40baa), locale=fr-HT, timezone=America/New_York
   [junit4]   2> NOTE: Linux 4.18.0-17-generic amd64/Oracle Corporation 13-ea (64-bit)/cpus=8,threads=1,free=413198304,total=514850816
   [junit4]   2> NOTE: All tests run in this JVM: [TestFieldCacheRewriteMethod, TestRegexpRandom2]
   [junit4] Completed [5/10 (5!)] on J1 in 0.80s, 1 test, 1 failure <<< FAILURES!

[...truncated 1 lines...]
   [junit4] Suite: org.apache.lucene.search.TestFieldCacheRewriteMethod
   [junit4]   2> NOTE: reproduce with: ant test  -Dtestcase=TestFieldCacheRewriteMethod -Dtests.method=testRegexps -Dtests.seed=E712F4979E38CFD8 -Dtests.multiplier=3 -Dtests.slow=true -Dtests.badapples=true -Dtests.locale=fr-HT -Dtests.timezone=America/New_York -Dtests.asserts=true -Dtests.file.encoding=US-ASCII
   [junit4] FAILURE 0.63s J0 | TestFieldCacheRewriteMethod.testRegexps <<<
   [junit4]    > Throwable #1: junit.framework.AssertionFailedError: Hit 2 docnumbers don't match
   [junit4]    > Hits length1=25 length2=25
   [junit4]    > hit=0: doc24=1.0, doc24=1.0
   [junit4]    > hit=1: doc38=1.0, doc38=1.0
   [junit4]    > hit=2: doc119=1.0, doc183=1.0
   [junit4]    > hit=3: doc146=1.0, doc188=1.0
   [junit4]    > hit=4: doc152=1.0, doc193=1.0
   [junit4]    > hit=5: doc159=1.0, doc228=1.0
   [junit4]    > hit=6: doc163=1.0, doc244=1.0
   [junit4]    > hit=7: doc169=1.0, doc291=1.0
   [junit4]    > hit=8: doc173=1.0, doc300=1.0
   [junit4]    > hit=9: doc183=1.0, doc347=1.0
   [junit4]    > hit=10: doc188=1.0, doc349=1.0
   [junit4]    > hit=11: doc193=1.0, doc405=1.0
   [junit4]    > hit=12: doc228=1.0, doc418=1.0
   [junit4]    > hit=13: doc244=1.0, doc431=1.0
   [junit4]    > hit=14: doc291=1.0, doc443=1.0
   [junit4]    > hit=15: doc300=1.0, doc490=1.0
   [junit4]    > hit=16: doc347=1.0, doc555=1.0
   [junit4]    > hit=17: doc349=1.0, doc563=1.0
   [junit4]    > hit=18: doc405=1.0, doc566=1.0
   [junit4]    > hit=19: doc418=1.0, doc571=1.0
   [junit4]    > hit=20: doc431=1.0, doc633=1.0
   [junit4]    > hit=21: doc443=1.0, doc636=1.0
   [junit4]    > hit=22: doc490=1.0, doc649=1.0
   [junit4]    > hit=23: doc555=1.0, doc679=1.0
   [junit4]    > hit=24: doc563=1.0, doc692=1.0
   [junit4]    > for query://
   [junit4]    > at __randomizedtesting.SeedInfo.seed([E712F4979E38CFD8:64EB58640929850]:0)
   [junit4]    > at junit.framework.Assert.fail(Assert.java:57)
   [junit4]    > at org.apache.lucene.search.CheckHits.checkEqual(CheckHits.java:205)
   [junit4]    > at org.apache.lucene.search.TestFieldCacheRewriteMethod.assertSame(TestFieldCacheRewriteMethod.java:42)
   [junit4]    > at org.apache.lucene.search.TestRegexpRandom2.testRegexps(TestRegexpRandom2.java:164)
   [junit4]    > at java.base/jdk.internal.reflect.NativeMethodAccessorImpl.invoke0(Native Method)
   [junit4]    > at java.base/jdk.internal.reflect.NativeMethodAccessorImpl.invoke(NativeMethodAccessorImpl.java:62)
   [junit4]    > at java.base/jdk.internal.reflect.DelegatingMethodAccessorImpl.invoke(DelegatingMethodAccessorImpl.java:43)
   [junit4]    > at java.base/java.lang.reflect.Method.invoke(Method.java:567)
   [junit4]    > at java.base/java.lang.Thread.run(Thread.java:835)
   [junit4] OK      0.34s J0 | TestFieldCacheRewriteMethod.testEquals
   [junit4]   2> NOTE: test params are: codec=Asserting(Lucene80): {=PostingsFormat(name=LuceneFixedGap), field=PostingsFormat(name=Direct)}, docValues:{=DocValuesFormat(name=Lucene80), field=DocValuesFormat(name=Direct)}, maxPointsInLeafNode=730, maxMBSortInHeap=7.733851075164457, sim=Asserting(org.apache.lucene.search.similarities.AssertingSimilarity@628ec059), locale=fr-HT, timezone=America/New_York
   [junit4]   2> NOTE: Linux 4.18.0-17-generic amd64/Oracle Corporation 13-ea (64-bit)/cpus=8,threads=1,free=405985840,total=514850816
   [junit4]   2> NOTE: All tests run in this JVM: [TestRegexpRandom2, TestFieldCacheRewriteMethod]
   [junit4] Completed [6/10 (6!)] on J0 in 1.28s, 2 tests, 1 failure <<< FAILURES!

[...truncated 1 lines...]
   [junit4] Suite: org.apache.lucene.search.TestFieldCacheRewriteMethod
   [junit4]   2> NOTE: reproduce with: ant test  -Dtestcase=TestFieldCacheRewriteMethod -Dtests.method=testRegexps -Dtests.seed=E712F4979E38CFD8 -Dtests.multiplier=3 -Dtests.slow=true -Dtests.badapples=true -Dtests.locale=fr-HT -Dtests.timezone=America/New_York -Dtests.asserts=true -Dtests.file.encoding=US-ASCII
   [junit4] FAILURE 0.43s J2 | TestFieldCacheRewriteMethod.testRegexps <<<
   [junit4]    > Throwable #1: junit.framework.AssertionFailedError: Hit 2 docnumbers don't match
   [junit4]    > Hits length1=25 length2=25
   [junit4]    > hit=0: doc24=1.

[...truncated too long message...]

 OK      0.11s J1 | TestFieldCacheRewriteMethod.testEquals
   [junit4]   2> NOTE: test params are: codec=Asserting(Lucene80): {=PostingsFormat(name=LuceneFixedGap), field=PostingsFormat(name=Direct)}, docValues:{=DocValuesFormat(name=Lucene80), field=DocValuesFormat(name=Direct)}, maxPointsInLeafNode=730, maxMBSortInHeap=7.733851075164457, sim=Asserting(org.apache.lucene.search.similarities.AssertingSimilarity@25166338), locale=fr-HT, timezone=America/New_York
   [junit4]   2> NOTE: Linux 4.18.0-17-generic amd64/Oracle Corporation 13-ea (64-bit)/cpus=8,threads=1,free=449643896,total=514850816
   [junit4]   2> NOTE: All tests run in this JVM: [TestFieldCacheRewriteMethod, TestRegexpRandom2, TestFieldCacheRewriteMethod]
   [junit4] Completed [8/10 (8!)] on J1 in 0.76s, 2 tests, 1 failure <<< FAILURES!

[...truncated 1 lines...]
   [junit4] Suite: org.apache.lucene.search.TestRegexpRandom2
   [junit4]   2> NOTE: reproduce with: ant test  -Dtestcase=TestRegexpRandom2 -Dtests.method=testRegexps -Dtests.seed=E712F4979E38CFD8 -Dtests.multiplier=3 -Dtests.slow=true -Dtests.badapples=true -Dtests.locale=fr-HT -Dtests.timezone=America/New_York -Dtests.asserts=true -Dtests.file.encoding=US-ASCII
   [junit4] FAILURE 0.62s J0 | TestRegexpRandom2.testRegexps <<<
   [junit4]    > Throwable #1: junit.framework.AssertionFailedError: Hit 5 docnumbers don't match
   [junit4]    > Hits length1=25 length2=25
   [junit4]    > hit=0: doc24=1.0, doc24=1.0
   [junit4]    > hit=1: doc33=1.0, doc33=1.0
   [junit4]    > hit=2: doc34=1.0, doc34=1.0
   [junit4]    > hit=3: doc38=1.0, doc38=1.0
   [junit4]    > hit=4: doc43=1.0, doc43=1.0
   [junit4]    > hit=5: doc119=1.0, doc183=1.0
   [junit4]    > hit=6: doc142=1.0, doc188=1.0
   [junit4]    > hit=7: doc146=1.0, doc193=1.0
   [junit4]    > hit=8: doc152=1.0, doc228=1.0
   [junit4]    > hit=9: doc159=1.0, doc244=1.0
   [junit4]    > hit=10: doc163=1.0, doc250=1.0
   [junit4]    > hit=11: doc169=1.0, doc282=1.0
   [junit4]    > hit=12: doc173=1.0, doc284=1.0
   [junit4]    > hit=13: doc183=1.0, doc291=1.0
   [junit4]    > hit=14: doc188=1.0, doc300=1.0
   [junit4]    > hit=15: doc193=1.0, doc320=1.0
   [junit4]    > hit=16: doc228=1.0, doc347=1.0
   [junit4]    > hit=17: doc244=1.0, doc349=1.0
   [junit4]    > hit=18: doc250=1.0, doc405=1.0
   [junit4]    > hit=19: doc282=1.0, doc418=1.0
   [junit4]    > hit=20: doc284=1.0, doc431=1.0
   [junit4]    > hit=21: doc291=1.0, doc443=1.0
   [junit4]    > hit=22: doc300=1.0, doc490=1.0
   [junit4]    > hit=23: doc320=1.0, doc513=1.0
   [junit4]    > hit=24: doc347=1.0, doc555=1.0
   [junit4]    > for query:/[)*-|핯Ѿ]*+/
   [junit4]    > at __randomizedtesting.SeedInfo.seed([E712F4979E38CFD8:64EB58640929850]:0)
   [junit4]    > at junit.framework.Assert.fail(Assert.java:57)
   [junit4]    > at org.apache.lucene.search.CheckHits.checkEqual(CheckHits.java:205)
   [junit4]    > at org.apache.lucene.search.TestRegexpRandom2.assertSame(TestRegexpRandom2.java:178)
   [junit4]    > at org.apache.lucene.search.TestRegexpRandom2.testRegexps(TestRegexpRandom2.java:164)
   [junit4]    > at java.base/jdk.internal.reflect.NativeMethodAccessorImpl.invoke0(Native Method)
   [junit4]    > at java.base/jdk.internal.reflect.NativeMethodAccessorImpl.invoke(NativeMethodAccessorImpl.java:62)
   [junit4]    > at java.base/jdk.internal.reflect.DelegatingMethodAccessorImpl.invoke(DelegatingMethodAccessorImpl.java:43)
   [junit4]    > at java.base/java.lang.reflect.Method.invoke(Method.java:567)
   [junit4]    > at java.base/java.lang.Thread.run(Thread.java:835)
   [junit4]   2> NOTE: test params are: codec=Asserting(Lucene80): {=PostingsFormat(name=Asserting)}, docValues:{=DocValuesFormat(name=Lucene80)}, maxPointsInLeafNode=99, maxMBSortInHeap=6.5001116595178905, sim=Asserting(org.apache.lucene.search.similarities.AssertingSimilarity@29bd087d), locale=fr-HT, timezone=America/New_York
   [junit4]   2> NOTE: Linux 4.18.0-17-generic amd64/Oracle Corporation 13-ea (64-bit)/cpus=8,threads=1,free=472461256,total=514850816
   [junit4]   2> NOTE: All tests run in this JVM: [TestRegexpRandom2, TestFieldCacheRewriteMethod, TestRegexpRandom2]
   [junit4] Completed [9/10 (9!)] on J0 in 0.78s, 1 test, 1 failure <<< FAILURES!

[...truncated 1 lines...]
   [junit4] Suite: org.apache.lucene.search.TestRegexpRandom2
   [junit4]   2> NOTE: reproduce with: ant test  -Dtestcase=TestRegexpRandom2 -Dtests.method=testRegexps -Dtests.seed=E712F4979E38CFD8 -Dtests.multiplier=3 -Dtests.slow=true -Dtests.badapples=true -Dtests.locale=fr-HT -Dtests.timezone=America/New_York -Dtests.asserts=true -Dtests.file.encoding=US-ASCII
   [junit4] FAILURE 0.15s J2 | TestRegexpRandom2.testRegexps <<<
   [junit4]    > Throwable #1: junit.framework.AssertionFailedError: Hit 5 docnumbers don't match
   [junit4]    > Hits length1=25 length2=25
   [junit4]    > hit=0: doc24=1.0, doc24=1.0
   [junit4]    > hit=1: doc33=1.0, doc33=1.0
   [junit4]    > hit=2: doc34=1.0, doc34=1.0
   [junit4]    > hit=3: doc38=1.0, doc38=1.0
   [junit4]    > hit=4: doc43=1.0, doc43=1.0
   [junit4]    > hit=5: doc119=1.0, doc183=1.0
   [junit4]    > hit=6: doc142=1.0, doc188=1.0
   [junit4]    > hit=7: doc146=1.0, doc193=1.0
   [junit4]    > hit=8: doc152=1.0, doc228=1.0
   [junit4]    > hit=9: doc159=1.0, doc244=1.0
   [junit4]    > hit=10: doc163=1.0, doc250=1.0
   [junit4]    > hit=11: doc169=1.0, doc282=1.0
   [junit4]    > hit=12: doc173=1.0, doc284=1.0
   [junit4]    > hit=13: doc183=1.0, doc291=1.0
   [junit4]    > hit=14: doc188=1.0, doc300=1.0
   [junit4]    > hit=15: doc193=1.0, doc320=1.0
   [junit4]    > hit=16: doc228=1.0, doc347=1.0
   [junit4]    > hit=17: doc244=1.0, doc349=1.0
   [junit4]    > hit=18: doc250=1.0, doc405=1.0
   [junit4]    > hit=19: doc282=1.0, doc418=1.0
   [junit4]    > hit=20: doc284=1.0, doc431=1.0
   [junit4]    > hit=21: doc291=1.0, doc443=1.0
   [junit4]    > hit=22: doc300=1.0, doc490=1.0
   [junit4]    > hit=23: doc320=1.0, doc513=1.0
   [junit4]    > hit=24: doc347=1.0, doc555=1.0
   [junit4]    > for query:/[)*-|핯Ѿ]*+/
   [junit4]    > at __randomizedtesting.SeedInfo.seed([E712F4979E38CFD8:64EB58640929850]:0)
   [junit4]    > at junit.framework.Assert.fail(Assert.java:57)
   [junit4]    > at org.apache.lucene.search.CheckHits.checkEqual(CheckHits.java:205)
   [junit4]    > at org.apache.lucene.search.TestRegexpRandom2.assertSame(TestRegexpRandom2.java:178)
   [junit4]    > at org.apache.lucene.search.TestRegexpRandom2.testRegexps(TestRegexpRandom2.java:164)
   [junit4]    > at java.base/jdk.internal.reflect.NativeMethodAccessorImpl.invoke0(Native Method)
   [junit4]    > at java.base/jdk.internal.reflect.NativeMethodAccessorImpl.invoke(NativeMethodAccessorImpl.java:62)
   [junit4]    > at java.base/jdk.internal.reflect.DelegatingMethodAccessorImpl.invoke(DelegatingMethodAccessorImpl.java:43)
   [junit4]    > at java.base/java.lang.reflect.Method.invoke(Method.java:567)
   [junit4]    > at java.base/java.lang.Thread.run(Thread.java:835)
   [junit4]   2> NOTE: test params are: codec=Asserting(Lucene80): {=PostingsFormat(name=Asserting)}, docValues:{=DocValuesFormat(name=Lucene80)}, maxPointsInLeafNode=99, maxMBSortInHeap=6.5001116595178905, sim=Asserting(org.apache.lucene.search.similarities.AssertingSimilarity@32b6b2bc), locale=fr-HT, timezone=America/New_York
   [junit4]   2> NOTE: Linux 4.18.0-17-generic amd64/Oracle Corporation 13-ea (64-bit)/cpus=8,threads=1,free=385166232,total=514850816
   [junit4]   2> NOTE: All tests run in this JVM: [TestFieldCacheRewriteMethod, TestRegexpRandom2, TestFieldCacheRewriteMethod, TestRegexpRandom2]
   [junit4] Completed [10/10 (10!)] on J2 in 0.25s, 1 test, 1 failure <<< FAILURES!

[...truncated 20 lines...]
BUILD FAILED
/home/jenkins/workspace/Lucene-Solr-8.x-Linux/lucene/common-build.xml:1572: The following error occurred while executing this line:
/home/jenkins/workspace/Lucene-Solr-8.x-Linux/lucene/common-build.xml:1099: There were test failures: 10 suites, 15 tests, 10 failures [seed: E712F4979E38CFD8]

Total time: 8 seconds

[repro] Setting last failure code to 256

[repro] Failures:
[repro]   5/5 failed: org.apache.lucene.search.TestFieldCacheRewriteMethod
[repro]   5/5 failed: org.apache.lucene.search.TestRegexpRandom2
[repro] Exiting with code 256
+ mv lucene/build lucene/build.repro
+ mv solr/build solr/build.repro
mv: cannot stat 'solr/build': No such file or directory
+ true
+ mv lucene/build.orig lucene/build
+ mv solr/build.orig solr/build
Archiving artifacts
Setting ANT_1_8_2_HOME=/home/jenkins/tools/hudson.tasks.Ant_AntInstallation/ANT_1.8.2
[WARNINGS] Parsing warnings in console log with parser Java Compiler (javac)
Setting ANT_1_8_2_HOME=/home/jenkins/tools/hudson.tasks.Ant_AntInstallation/ANT_1.8.2
No credentials specified
Setting ANT_1_8_2_HOME=/home/jenkins/tools/hudson.tasks.Ant_AntInstallation/ANT_1.8.2
<Git Blamer> Using GitBlamer to create author and commit information for all warnings.
<Git Blamer> GIT_COMMIT=b92ae784c7f0aa0208c7463a44a77622d719122e, workspace=/home/jenkins/workspace/Lucene-Solr-8.x-Linux
[WARNINGS] Computing warning deltas based on reference build #671
Recording test results
Setting ANT_1_8_2_HOME=/home/jenkins/tools/hudson.tasks.Ant_AntInstallation/ANT_1.8.2
Build step 'Publish JUnit test result report' changed build result to UNSTABLE
Email was triggered for: Unstable (Test Failures)
Sending email for trigger: Unstable (Test Failures)
Setting ANT_1_8_2_HOME=/home/jenkins/tools/hudson.tasks.Ant_AntInstallation/ANT_1.8.2
Setting ANT_1_8_2_HOME=/home/jenkins/tools/hudson.tasks.Ant_AntInstallation/ANT_1.8.2
Setting ANT_1_8_2_HOME=/home/jenkins/tools/hudson.tasks.Ant_AntInstallation/ANT_1.8.2
Setting ANT_1_8_2_HOME=/home/jenkins/tools/hudson.tasks.Ant_AntInstallation/ANT_1.8.2
Setting ANT_1_8_2_HOME=/home/jenkins/tools/hudson.tasks.Ant_AntInstallation/ANT_1.8.2
Setting ANT_1_8_2_HOME=/home/jenkins/tools/hudson.tasks.Ant_AntInstallation/ANT_1.8.2


---------------------------------------------------------------------
To unsubscribe, e-mail: [hidden email]
For additional commands, e-mail: [hidden email]