[JENKINS-EA] Lucene-Solr-master-Linux (64bit/jdk-13-ea+shipilev-fastdebug) - Build # 24287 - Unstable!

classic Classic list List threaded Threaded
2 messages Options
Reply | Threaded
Open this post in threaded view
|

[JENKINS-EA] Lucene-Solr-master-Linux (64bit/jdk-13-ea+shipilev-fastdebug) - Build # 24287 - Unstable!

Policeman Jenkins Server-2
Build: https://jenkins.thetaphi.de/job/Lucene-Solr-master-Linux/24287/
Java: 64bit/jdk-13-ea+shipilev-fastdebug -XX:-UseCompressedOops -XX:+UseG1GC

8 tests failed.
FAILED:  org.apache.solr.update.processor.ParsingFieldUpdateProcessorsTest.testParseFloatNonRootLocale

Error Message:


Stack Trace:
java.lang.AssertionError
        at __randomizedtesting.SeedInfo.seed([917D4659E782D7C8:8AA1BB8847272BD5]:0)
        at org.junit.Assert.fail(Assert.java:86)
        at org.junit.Assert.assertTrue(Assert.java:41)
        at org.junit.Assert.assertTrue(Assert.java:52)
        at org.apache.solr.update.processor.ParsingFieldUpdateProcessorsTest.testParseFloatNonRootLocale(ParsingFieldUpdateProcessorsTest.java:471)
        at java.base/jdk.internal.reflect.NativeMethodAccessorImpl.invoke0(Native Method)
        at java.base/jdk.internal.reflect.NativeMethodAccessorImpl.invoke(NativeMethodAccessorImpl.java:62)
        at java.base/jdk.internal.reflect.DelegatingMethodAccessorImpl.invoke(DelegatingMethodAccessorImpl.java:43)
        at java.base/java.lang.reflect.Method.invoke(Method.java:567)
        at com.carrotsearch.randomizedtesting.RandomizedRunner.invoke(RandomizedRunner.java:1750)
        at com.carrotsearch.randomizedtesting.RandomizedRunner$8.evaluate(RandomizedRunner.java:938)
        at com.carrotsearch.randomizedtesting.RandomizedRunner$9.evaluate(RandomizedRunner.java:974)
        at com.carrotsearch.randomizedtesting.RandomizedRunner$10.evaluate(RandomizedRunner.java:988)
        at com.carrotsearch.randomizedtesting.rules.SystemPropertiesRestoreRule$1.evaluate(SystemPropertiesRestoreRule.java:57)
        at org.apache.lucene.util.TestRuleSetupTeardownChained$1.evaluate(TestRuleSetupTeardownChained.java:49)
        at org.apache.lucene.util.AbstractBeforeAfterRule$1.evaluate(AbstractBeforeAfterRule.java:45)
        at org.apache.lucene.util.TestRuleThreadAndTestName$1.evaluate(TestRuleThreadAndTestName.java:48)
        at org.apache.lucene.util.TestRuleIgnoreAfterMaxFailures$1.evaluate(TestRuleIgnoreAfterMaxFailures.java:64)
        at org.apache.lucene.util.TestRuleMarkFailure$1.evaluate(TestRuleMarkFailure.java:47)
        at com.carrotsearch.randomizedtesting.rules.StatementAdapter.evaluate(StatementAdapter.java:36)
        at com.carrotsearch.randomizedtesting.ThreadLeakControl$StatementRunner.run(ThreadLeakControl.java:368)
        at com.carrotsearch.randomizedtesting.ThreadLeakControl.forkTimeoutingTask(ThreadLeakControl.java:817)
        at com.carrotsearch.randomizedtesting.ThreadLeakControl$3.evaluate(ThreadLeakControl.java:468)
        at com.carrotsearch.randomizedtesting.RandomizedRunner.runSingleTest(RandomizedRunner.java:947)
        at com.carrotsearch.randomizedtesting.RandomizedRunner$5.evaluate(RandomizedRunner.java:832)
        at com.carrotsearch.randomizedtesting.RandomizedRunner$6.evaluate(RandomizedRunner.java:883)
        at com.carrotsearch.randomizedtesting.RandomizedRunner$7.evaluate(RandomizedRunner.java:894)
        at com.carrotsearch.randomizedtesting.rules.StatementAdapter.evaluate(StatementAdapter.java:36)
        at com.carrotsearch.randomizedtesting.rules.SystemPropertiesRestoreRule$1.evaluate(SystemPropertiesRestoreRule.java:57)
        at org.apache.lucene.util.AbstractBeforeAfterRule$1.evaluate(AbstractBeforeAfterRule.java:45)
        at com.carrotsearch.randomizedtesting.rules.StatementAdapter.evaluate(StatementAdapter.java:36)
        at org.apache.lucene.util.TestRuleStoreClassName$1.evaluate(TestRuleStoreClassName.java:41)
        at com.carrotsearch.randomizedtesting.rules.NoShadowingOrOverridesOnMethodsRule$1.evaluate(NoShadowingOrOverridesOnMethodsRule.java:40)
        at com.carrotsearch.randomizedtesting.rules.NoShadowingOrOverridesOnMethodsRule$1.evaluate(NoShadowingOrOverridesOnMethodsRule.java:40)
        at com.carrotsearch.randomizedtesting.rules.StatementAdapter.evaluate(StatementAdapter.java:36)
        at com.carrotsearch.randomizedtesting.rules.StatementAdapter.evaluate(StatementAdapter.java:36)
        at org.apache.lucene.util.TestRuleAssertionsRequired$1.evaluate(TestRuleAssertionsRequired.java:53)
        at org.apache.lucene.util.TestRuleMarkFailure$1.evaluate(TestRuleMarkFailure.java:47)
        at org.apache.lucene.util.TestRuleIgnoreAfterMaxFailures$1.evaluate(TestRuleIgnoreAfterMaxFailures.java:64)
        at org.apache.lucene.util.TestRuleIgnoreTestSuites$1.evaluate(TestRuleIgnoreTestSuites.java:54)
        at com.carrotsearch.randomizedtesting.rules.StatementAdapter.evaluate(StatementAdapter.java:36)
        at com.carrotsearch.randomizedtesting.ThreadLeakControl$StatementRunner.run(ThreadLeakControl.java:368)
        at java.base/java.lang.Thread.run(Thread.java:830)


FAILED:  org.apache.solr.update.processor.ParsingFieldUpdateProcessorsTest.testParseDoubleNonRootLocale

Error Message:


Stack Trace:
java.lang.AssertionError
        at __randomizedtesting.SeedInfo.seed([917D4659E782D7C8:86868BBEE3FABD2A]:0)
        at org.junit.Assert.fail(Assert.java:86)
        at org.junit.Assert.assertTrue(Assert.java:41)
        at org.junit.Assert.assertTrue(Assert.java:52)
        at org.apache.solr.update.processor.ParsingFieldUpdateProcessorsTest.testParseDoubleNonRootLocale(ParsingFieldUpdateProcessorsTest.java:573)
        at java.base/jdk.internal.reflect.NativeMethodAccessorImpl.invoke0(Native Method)
        at java.base/jdk.internal.reflect.NativeMethodAccessorImpl.invoke(NativeMethodAccessorImpl.java:62)
        at java.base/jdk.internal.reflect.DelegatingMethodAccessorImpl.invoke(DelegatingMethodAccessorImpl.java:43)
        at java.base/java.lang.reflect.Method.invoke(Method.java:567)
        at com.carrotsearch.randomizedtesting.RandomizedRunner.invoke(RandomizedRunner.java:1750)
        at com.carrotsearch.randomizedtesting.RandomizedRunner$8.evaluate(RandomizedRunner.java:938)
        at com.carrotsearch.randomizedtesting.RandomizedRunner$9.evaluate(RandomizedRunner.java:974)
        at com.carrotsearch.randomizedtesting.RandomizedRunner$10.evaluate(RandomizedRunner.java:988)
        at com.carrotsearch.randomizedtesting.rules.SystemPropertiesRestoreRule$1.evaluate(SystemPropertiesRestoreRule.java:57)
        at org.apache.lucene.util.TestRuleSetupTeardownChained$1.evaluate(TestRuleSetupTeardownChained.java:49)
        at org.apache.lucene.util.AbstractBeforeAfterRule$1.evaluate(AbstractBeforeAfterRule.java:45)
        at org.apache.lucene.util.TestRuleThreadAndTestName$1.evaluate(TestRuleThreadAndTestName.java:48)
        at org.apache.lucene.util.TestRuleIgnoreAfterMaxFailures$1.evaluate(TestRuleIgnoreAfterMaxFailures.java:64)
        at org.apache.lucene.util.TestRuleMarkFailure$1.evaluate(TestRuleMarkFailure.java:47)
        at com.carrotsearch.randomizedtesting.rules.StatementAdapter.evaluate(StatementAdapter.java:36)
        at com.carrotsearch.randomizedtesting.ThreadLeakControl$StatementRunner.run(ThreadLeakControl.java:368)
        at com.carrotsearch.randomizedtesting.ThreadLeakControl.forkTimeoutingTask(ThreadLeakControl.java:817)
        at com.carrotsearch.randomizedtesting.ThreadLeakControl$3.evaluate(ThreadLeakControl.java:468)
        at com.carrotsearch.randomizedtesting.RandomizedRunner.runSingleTest(RandomizedRunner.java:947)
        at com.carrotsearch.randomizedtesting.RandomizedRunner$5.evaluate(RandomizedRunner.java:832)
        at com.carrotsearch.randomizedtesting.RandomizedRunner$6.evaluate(RandomizedRunner.java:883)
        at com.carrotsearch.randomizedtesting.RandomizedRunner$7.evaluate(RandomizedRunner.java:894)
        at com.carrotsearch.randomizedtesting.rules.StatementAdapter.evaluate(StatementAdapter.java:36)
        at com.carrotsearch.randomizedtesting.rules.SystemPropertiesRestoreRule$1.evaluate(SystemPropertiesRestoreRule.java:57)
        at org.apache.lucene.util.AbstractBeforeAfterRule$1.evaluate(AbstractBeforeAfterRule.java:45)
        at com.carrotsearch.randomizedtesting.rules.StatementAdapter.evaluate(StatementAdapter.java:36)
        at org.apache.lucene.util.TestRuleStoreClassName$1.evaluate(TestRuleStoreClassName.java:41)
        at com.carrotsearch.randomizedtesting.rules.NoShadowingOrOverridesOnMethodsRule$1.evaluate(NoShadowingOrOverridesOnMethodsRule.java:40)
        at com.carrotsearch.randomizedtesting.rules.NoShadowingOrOverridesOnMethodsRule$1.evaluate(NoShadowingOrOverridesOnMethodsRule.java:40)
        at com.carrotsearch.randomizedtesting.rules.StatementAdapter.evaluate(StatementAdapter.java:36)
        at com.carrotsearch.randomizedtesting.rules.StatementAdapter.evaluate(StatementAdapter.java:36)
        at org.apache.lucene.util.TestRuleAssertionsRequired$1.evaluate(TestRuleAssertionsRequired.java:53)
        at org.apache.lucene.util.TestRuleMarkFailure$1.evaluate(TestRuleMarkFailure.java:47)
        at org.apache.lucene.util.TestRuleIgnoreAfterMaxFailures$1.evaluate(TestRuleIgnoreAfterMaxFailures.java:64)
        at org.apache.lucene.util.TestRuleIgnoreTestSuites$1.evaluate(TestRuleIgnoreTestSuites.java:54)
        at com.carrotsearch.randomizedtesting.rules.StatementAdapter.evaluate(StatementAdapter.java:36)
        at com.carrotsearch.randomizedtesting.ThreadLeakControl$StatementRunner.run(ThreadLeakControl.java:368)
        at java.base/java.lang.Thread.run(Thread.java:830)


FAILED:  org.apache.solr.update.processor.ParsingFieldUpdateProcessorsTest.testParseFloatNonRootLocale

Error Message:


Stack Trace:
java.lang.AssertionError
        at __randomizedtesting.SeedInfo.seed([917D4659E782D7C8:8AA1BB8847272BD5]:0)
        at org.junit.Assert.fail(Assert.java:86)
        at org.junit.Assert.assertTrue(Assert.java:41)
        at org.junit.Assert.assertTrue(Assert.java:52)
        at org.apache.solr.update.processor.ParsingFieldUpdateProcessorsTest.testParseFloatNonRootLocale(ParsingFieldUpdateProcessorsTest.java:471)
        at java.base/jdk.internal.reflect.NativeMethodAccessorImpl.invoke0(Native Method)
        at java.base/jdk.internal.reflect.NativeMethodAccessorImpl.invoke(NativeMethodAccessorImpl.java:62)
        at java.base/jdk.internal.reflect.DelegatingMethodAccessorImpl.invoke(DelegatingMethodAccessorImpl.java:43)
        at java.base/java.lang.reflect.Method.invoke(Method.java:567)
        at com.carrotsearch.randomizedtesting.RandomizedRunner.invoke(RandomizedRunner.java:1750)
        at com.carrotsearch.randomizedtesting.RandomizedRunner$8.evaluate(RandomizedRunner.java:938)
        at com.carrotsearch.randomizedtesting.RandomizedRunner$9.evaluate(RandomizedRunner.java:974)
        at com.carrotsearch.randomizedtesting.RandomizedRunner$10.evaluate(RandomizedRunner.java:988)
        at com.carrotsearch.randomizedtesting.rules.SystemPropertiesRestoreRule$1.evaluate(SystemPropertiesRestoreRule.java:57)
        at org.apache.lucene.util.TestRuleSetupTeardownChained$1.evaluate(TestRuleSetupTeardownChained.java:49)
        at org.apache.lucene.util.AbstractBeforeAfterRule$1.evaluate(AbstractBeforeAfterRule.java:45)
        at org.apache.lucene.util.TestRuleThreadAndTestName$1.evaluate(TestRuleThreadAndTestName.java:48)
        at org.apache.lucene.util.TestRuleIgnoreAfterMaxFailures$1.evaluate(TestRuleIgnoreAfterMaxFailures.java:64)
        at org.apache.lucene.util.TestRuleMarkFailure$1.evaluate(TestRuleMarkFailure.java:47)
        at com.carrotsearch.randomizedtesting.rules.StatementAdapter.evaluate(StatementAdapter.java:36)
        at com.carrotsearch.randomizedtesting.ThreadLeakControl$StatementRunner.run(ThreadLeakControl.java:368)
        at com.carrotsearch.randomizedtesting.ThreadLeakControl.forkTimeoutingTask(ThreadLeakControl.java:817)
        at com.carrotsearch.randomizedtesting.ThreadLeakControl$3.evaluate(ThreadLeakControl.java:468)
        at com.carrotsearch.randomizedtesting.RandomizedRunner.runSingleTest(RandomizedRunner.java:947)
        at com.carrotsearch.randomizedtesting.RandomizedRunner$5.evaluate(RandomizedRunner.java:832)
        at com.carrotsearch.randomizedtesting.RandomizedRunner$6.evaluate(RandomizedRunner.java:883)
        at com.carrotsearch.randomizedtesting.RandomizedRunner$7.evaluate(RandomizedRunner.java:894)
        at com.carrotsearch.randomizedtesting.rules.StatementAdapter.evaluate(StatementAdapter.java:36)
        at com.carrotsearch.randomizedtesting.rules.SystemPropertiesRestoreRule$1.evaluate(SystemPropertiesRestoreRule.java:57)
        at org.apache.lucene.util.AbstractBeforeAfterRule$1.evaluate(AbstractBeforeAfterRule.java:45)
        at com.carrotsearch.randomizedtesting.rules.StatementAdapter.evaluate(StatementAdapter.java:36)
        at org.apache.lucene.util.TestRuleStoreClassName$1.evaluate(TestRuleStoreClassName.java:41)
        at com.carrotsearch.randomizedtesting.rules.NoShadowingOrOverridesOnMethodsRule$1.evaluate(NoShadowingOrOverridesOnMethodsRule.java:40)
        at com.carrotsearch.randomizedtesting.rules.NoShadowingOrOverridesOnMethodsRule$1.evaluate(NoShadowingOrOverridesOnMethodsRule.java:40)
        at com.carrotsearch.randomizedtesting.rules.StatementAdapter.evaluate(StatementAdapter.java:36)
        at com.carrotsearch.randomizedtesting.rules.StatementAdapter.evaluate(StatementAdapter.java:36)
        at org.apache.lucene.util.TestRuleAssertionsRequired$1.evaluate(TestRuleAssertionsRequired.java:53)
        at org.apache.lucene.util.TestRuleMarkFailure$1.evaluate(TestRuleMarkFailure.java:47)
        at org.apache.lucene.util.TestRuleIgnoreAfterMaxFailures$1.evaluate(TestRuleIgnoreAfterMaxFailures.java:64)
        at org.apache.lucene.util.TestRuleIgnoreTestSuites$1.evaluate(TestRuleIgnoreTestSuites.java:54)
        at com.carrotsearch.randomizedtesting.rules.StatementAdapter.evaluate(StatementAdapter.java:36)
        at com.carrotsearch.randomizedtesting.ThreadLeakControl$StatementRunner.run(ThreadLeakControl.java:368)
        at java.base/java.lang.Thread.run(Thread.java:830)


FAILED:  org.apache.solr.update.processor.ParsingFieldUpdateProcessorsTest.testParseDoubleNonRootLocale

Error Message:


Stack Trace:
java.lang.AssertionError
        at __randomizedtesting.SeedInfo.seed([917D4659E782D7C8:86868BBEE3FABD2A]:0)
        at org.junit.Assert.fail(Assert.java:86)
        at org.junit.Assert.assertTrue(Assert.java:41)
        at org.junit.Assert.assertTrue(Assert.java:52)
        at org.apache.solr.update.processor.ParsingFieldUpdateProcessorsTest.testParseDoubleNonRootLocale(ParsingFieldUpdateProcessorsTest.java:573)
        at java.base/jdk.internal.reflect.NativeMethodAccessorImpl.invoke0(Native Method)
        at java.base/jdk.internal.reflect.NativeMethodAccessorImpl.invoke(NativeMethodAccessorImpl.java:62)
        at java.base/jdk.internal.reflect.DelegatingMethodAccessorImpl.invoke(DelegatingMethodAccessorImpl.java:43)
        at java.base/java.lang.reflect.Method.invoke(Method.java:567)
        at com.carrotsearch.randomizedtesting.RandomizedRunner.invoke(RandomizedRunner.java:1750)
        at com.carrotsearch.randomizedtesting.RandomizedRunner$8.evaluate(RandomizedRunner.java:938)
        at com.carrotsearch.randomizedtesting.RandomizedRunner$9.evaluate(RandomizedRunner.java:974)
        at com.carrotsearch.randomizedtesting.RandomizedRunner$10.evaluate(RandomizedRunner.java:988)
        at com.carrotsearch.randomizedtesting.rules.SystemPropertiesRestoreRule$1.evaluate(SystemPropertiesRestoreRule.java:57)
        at org.apache.lucene.util.TestRuleSetupTeardownChained$1.evaluate(TestRuleSetupTeardownChained.java:49)
        at org.apache.lucene.util.AbstractBeforeAfterRule$1.evaluate(AbstractBeforeAfterRule.java:45)
        at org.apache.lucene.util.TestRuleThreadAndTestName$1.evaluate(TestRuleThreadAndTestName.java:48)
        at org.apache.lucene.util.TestRuleIgnoreAfterMaxFailures$1.evaluate(TestRuleIgnoreAfterMaxFailures.java:64)
        at org.apache.lucene.util.TestRuleMarkFailure$1.evaluate(TestRuleMarkFailure.java:47)
        at com.carrotsearch.randomizedtesting.rules.StatementAdapter.evaluate(StatementAdapter.java:36)
        at com.carrotsearch.randomizedtesting.ThreadLeakControl$StatementRunner.run(ThreadLeakControl.java:368)
        at com.carrotsearch.randomizedtesting.ThreadLeakControl.forkTimeoutingTask(ThreadLeakControl.java:817)
        at com.carrotsearch.randomizedtesting.ThreadLeakControl$3.evaluate(ThreadLeakControl.java:468)
        at com.carrotsearch.randomizedtesting.RandomizedRunner.runSingleTest(RandomizedRunner.java:947)
        at com.carrotsearch.randomizedtesting.RandomizedRunner$5.evaluate(RandomizedRunner.java:832)
        at com.carrotsearch.randomizedtesting.RandomizedRunner$6.evaluate(RandomizedRunner.java:883)
        at com.carrotsearch.randomizedtesting.RandomizedRunner$7.evaluate(RandomizedRunner.java:894)
        at com.carrotsearch.randomizedtesting.rules.StatementAdapter.evaluate(StatementAdapter.java:36)
        at com.carrotsearch.randomizedtesting.rules.SystemPropertiesRestoreRule$1.evaluate(SystemPropertiesRestoreRule.java:57)
        at org.apache.lucene.util.AbstractBeforeAfterRule$1.evaluate(AbstractBeforeAfterRule.java:45)
        at com.carrotsearch.randomizedtesting.rules.StatementAdapter.evaluate(StatementAdapter.java:36)
        at org.apache.lucene.util.TestRuleStoreClassName$1.evaluate(TestRuleStoreClassName.java:41)
        at com.carrotsearch.randomizedtesting.rules.NoShadowingOrOverridesOnMethodsRule$1.evaluate(NoShadowingOrOverridesOnMethodsRule.java:40)
        at com.carrotsearch.randomizedtesting.rules.NoShadowingOrOverridesOnMethodsRule$1.evaluate(NoShadowingOrOverridesOnMethodsRule.java:40)
        at com.carrotsearch.randomizedtesting.rules.StatementAdapter.evaluate(StatementAdapter.java:36)
        at com.carrotsearch.randomizedtesting.rules.StatementAdapter.evaluate(StatementAdapter.java:36)
        at org.apache.lucene.util.TestRuleAssertionsRequired$1.evaluate(TestRuleAssertionsRequired.java:53)
        at org.apache.lucene.util.TestRuleMarkFailure$1.evaluate(TestRuleMarkFailure.java:47)
        at org.apache.lucene.util.TestRuleIgnoreAfterMaxFailures$1.evaluate(TestRuleIgnoreAfterMaxFailures.java:64)
        at org.apache.lucene.util.TestRuleIgnoreTestSuites$1.evaluate(TestRuleIgnoreTestSuites.java:54)
        at com.carrotsearch.randomizedtesting.rules.StatementAdapter.evaluate(StatementAdapter.java:36)
        at com.carrotsearch.randomizedtesting.ThreadLeakControl$StatementRunner.run(ThreadLeakControl.java:368)
        at java.base/java.lang.Thread.run(Thread.java:830)


FAILED:  org.apache.solr.update.processor.ParsingFieldUpdateProcessorsTest.testParseFloatNonRootLocale

Error Message:


Stack Trace:
java.lang.AssertionError
        at __randomizedtesting.SeedInfo.seed([917D4659E782D7C8:8AA1BB8847272BD5]:0)
        at org.junit.Assert.fail(Assert.java:86)
        at org.junit.Assert.assertTrue(Assert.java:41)
        at org.junit.Assert.assertTrue(Assert.java:52)
        at org.apache.solr.update.processor.ParsingFieldUpdateProcessorsTest.testParseFloatNonRootLocale(ParsingFieldUpdateProcessorsTest.java:471)
        at java.base/jdk.internal.reflect.NativeMethodAccessorImpl.invoke0(Native Method)
        at java.base/jdk.internal.reflect.NativeMethodAccessorImpl.invoke(NativeMethodAccessorImpl.java:62)
        at java.base/jdk.internal.reflect.DelegatingMethodAccessorImpl.invoke(DelegatingMethodAccessorImpl.java:43)
        at java.base/java.lang.reflect.Method.invoke(Method.java:567)
        at com.carrotsearch.randomizedtesting.RandomizedRunner.invoke(RandomizedRunner.java:1750)
        at com.carrotsearch.randomizedtesting.RandomizedRunner$8.evaluate(RandomizedRunner.java:938)
        at com.carrotsearch.randomizedtesting.RandomizedRunner$9.evaluate(RandomizedRunner.java:974)
        at com.carrotsearch.randomizedtesting.RandomizedRunner$10.evaluate(RandomizedRunner.java:988)
        at com.carrotsearch.randomizedtesting.rules.SystemPropertiesRestoreRule$1.evaluate(SystemPropertiesRestoreRule.java:57)
        at org.apache.lucene.util.TestRuleSetupTeardownChained$1.evaluate(TestRuleSetupTeardownChained.java:49)
        at org.apache.lucene.util.AbstractBeforeAfterRule$1.evaluate(AbstractBeforeAfterRule.java:45)
        at org.apache.lucene.util.TestRuleThreadAndTestName$1.evaluate(TestRuleThreadAndTestName.java:48)
        at org.apache.lucene.util.TestRuleIgnoreAfterMaxFailures$1.evaluate(TestRuleIgnoreAfterMaxFailures.java:64)
        at org.apache.lucene.util.TestRuleMarkFailure$1.evaluate(TestRuleMarkFailure.java:47)
        at com.carrotsearch.randomizedtesting.rules.StatementAdapter.evaluate(StatementAdapter.java:36)
        at com.carrotsearch.randomizedtesting.ThreadLeakControl$StatementRunner.run(ThreadLeakControl.java:368)
        at com.carrotsearch.randomizedtesting.ThreadLeakControl.forkTimeoutingTask(ThreadLeakControl.java:817)
        at com.carrotsearch.randomizedtesting.ThreadLeakControl$3.evaluate(ThreadLeakControl.java:468)
        at com.carrotsearch.randomizedtesting.RandomizedRunner.runSingleTest(RandomizedRunner.java:947)
        at com.carrotsearch.randomizedtesting.RandomizedRunner$5.evaluate(RandomizedRunner.java:832)
        at com.carrotsearch.randomizedtesting.RandomizedRunner$6.evaluate(RandomizedRunner.java:883)
        at com.carrotsearch.randomizedtesting.RandomizedRunner$7.evaluate(RandomizedRunner.java:894)
        at com.carrotsearch.randomizedtesting.rules.StatementAdapter.evaluate(StatementAdapter.java:36)
        at com.carrotsearch.randomizedtesting.rules.SystemPropertiesRestoreRule$1.evaluate(SystemPropertiesRestoreRule.java:57)
        at org.apache.lucene.util.AbstractBeforeAfterRule$1.evaluate(AbstractBeforeAfterRule.java:45)
        at com.carrotsearch.randomizedtesting.rules.StatementAdapter.evaluate(StatementAdapter.java:36)
        at org.apache.lucene.util.TestRuleStoreClassName$1.evaluate(TestRuleStoreClassName.java:41)
        at com.carrotsearch.randomizedtesting.rules.NoShadowingOrOverridesOnMethodsRule$1.evaluate(NoShadowingOrOverridesOnMethodsRule.java:40)
        at com.carrotsearch.randomizedtesting.rules.NoShadowingOrOverridesOnMethodsRule$1.evaluate(NoShadowingOrOverridesOnMethodsRule.java:40)
        at com.carrotsearch.randomizedtesting.rules.StatementAdapter.evaluate(StatementAdapter.java:36)
        at com.carrotsearch.randomizedtesting.rules.StatementAdapter.evaluate(StatementAdapter.java:36)
        at org.apache.lucene.util.TestRuleAssertionsRequired$1.evaluate(TestRuleAssertionsRequired.java:53)
        at org.apache.lucene.util.TestRuleMarkFailure$1.evaluate(TestRuleMarkFailure.java:47)
        at org.apache.lucene.util.TestRuleIgnoreAfterMaxFailures$1.evaluate(TestRuleIgnoreAfterMaxFailures.java:64)
        at org.apache.lucene.util.TestRuleIgnoreTestSuites$1.evaluate(TestRuleIgnoreTestSuites.java:54)
        at com.carrotsearch.randomizedtesting.rules.StatementAdapter.evaluate(StatementAdapter.java:36)
        at com.carrotsearch.randomizedtesting.ThreadLeakControl$StatementRunner.run(ThreadLeakControl.java:368)
        at java.base/java.lang.Thread.run(Thread.java:830)


FAILED:  org.apache.solr.update.processor.ParsingFieldUpdateProcessorsTest.testParseDoubleNonRootLocale

Error Message:


Stack Trace:
java.lang.AssertionError
        at __randomizedtesting.SeedInfo.seed([917D4659E782D7C8:86868BBEE3FABD2A]:0)
        at org.junit.Assert.fail(Assert.java:86)
        at org.junit.Assert.assertTrue(Assert.java:41)
        at org.junit.Assert.assertTrue(Assert.java:52)
        at org.apache.solr.update.processor.ParsingFieldUpdateProcessorsTest.testParseDoubleNonRootLocale(ParsingFieldUpdateProcessorsTest.java:573)
        at java.base/jdk.internal.reflect.NativeMethodAccessorImpl.invoke0(Native Method)
        at java.base/jdk.internal.reflect.NativeMethodAccessorImpl.invoke(NativeMethodAccessorImpl.java:62)
        at java.base/jdk.internal.reflect.DelegatingMethodAccessorImpl.invoke(DelegatingMethodAccessorImpl.java:43)
        at java.base/java.lang.reflect.Method.invoke(Method.java:567)
        at com.carrotsearch.randomizedtesting.RandomizedRunner.invoke(RandomizedRunner.java:1750)
        at com.carrotsearch.randomizedtesting.RandomizedRunner$8.evaluate(RandomizedRunner.java:938)
        at com.carrotsearch.randomizedtesting.RandomizedRunner$9.evaluate(RandomizedRunner.java:974)
        at com.carrotsearch.randomizedtesting.RandomizedRunner$10.evaluate(RandomizedRunner.java:988)
        at com.carrotsearch.randomizedtesting.rules.SystemPropertiesRestoreRule$1.evaluate(SystemPropertiesRestoreRule.java:57)
        at org.apache.lucene.util.TestRuleSetupTeardownChained$1.evaluate(TestRuleSetupTeardownChained.java:49)
        at org.apache.lucene.util.AbstractBeforeAfterRule$1.evaluate(AbstractBeforeAfterRule.java:45)
        at org.apache.lucene.util.TestRuleThreadAndTestName$1.evaluate(TestRuleThreadAndTestName.java:48)
        at org.apache.lucene.util.TestRuleIgnoreAfterMaxFailures$1.evaluate(TestRuleIgnoreAfterMaxFailures.java:64)
        at org.apache.lucene.util.TestRuleMarkFailure$1.evaluate(TestRuleMarkFailure.java:47)
        at com.carrotsearch.randomizedtesting.rules.StatementAdapter.evaluate(StatementAdapter.java:36)
        at com.carrotsearch.randomizedtesting.ThreadLeakControl$StatementRunner.run(ThreadLeakControl.java:368)
        at com.carrotsearch.randomizedtesting.ThreadLeakControl.forkTimeoutingTask(ThreadLeakControl.java:817)
        at com.carrotsearch.randomizedtesting.ThreadLeakControl$3.evaluate(ThreadLeakControl.java:468)
        at com.carrotsearch.randomizedtesting.RandomizedRunner.runSingleTest(RandomizedRunner.java:947)
        at com.carrotsearch.randomizedtesting.RandomizedRunner$5.evaluate(RandomizedRunner.java:832)
        at com.carrotsearch.randomizedtesting.RandomizedRunner$6.evaluate(RandomizedRunner.java:883)
        at com.carrotsearch.randomizedtesting.RandomizedRunner$7.evaluate(RandomizedRunner.java:894)
        at com.carrotsearch.randomizedtesting.rules.StatementAdapter.evaluate(StatementAdapter.java:36)
        at com.carrotsearch.randomizedtesting.rules.SystemPropertiesRestoreRule$1.evaluate(SystemPropertiesRestoreRule.java:57)
        at org.apache.lucene.util.AbstractBeforeAfterRule$1.evaluate(AbstractBeforeAfterRule.java:45)
        at com.carrotsearch.randomizedtesting.rules.StatementAdapter.evaluate(StatementAdapter.java:36)
        at org.apache.lucene.util.TestRuleStoreClassName$1.evaluate(TestRuleStoreClassName.java:41)
        at com.carrotsearch.randomizedtesting.rules.NoShadowingOrOverridesOnMethodsRule$1.evaluate(NoShadowingOrOverridesOnMethodsRule.java:40)
        at com.carrotsearch.randomizedtesting.rules.NoShadowingOrOverridesOnMethodsRule$1.evaluate(NoShadowingOrOverridesOnMethodsRule.java:40)
        at com.carrotsearch.randomizedtesting.rules.StatementAdapter.evaluate(StatementAdapter.java:36)
        at com.carrotsearch.randomizedtesting.rules.StatementAdapter.evaluate(StatementAdapter.java:36)
        at org.apache.lucene.util.TestRuleAssertionsRequired$1.evaluate(TestRuleAssertionsRequired.java:53)
        at org.apache.lucene.util.TestRuleMarkFailure$1.evaluate(TestRuleMarkFailure.java:47)
        at org.apache.lucene.util.TestRuleIgnoreAfterMaxFailures$1.evaluate(TestRuleIgnoreAfterMaxFailures.java:64)
        at org.apache.lucene.util.TestRuleIgnoreTestSuites$1.evaluate(TestRuleIgnoreTestSuites.java:54)
        at com.carrotsearch.randomizedtesting.rules.StatementAdapter.evaluate(StatementAdapter.java:36)
        at com.carrotsearch.randomizedtesting.ThreadLeakControl$StatementRunner.run(ThreadLeakControl.java:368)
        at java.base/java.lang.Thread.run(Thread.java:830)


FAILED:  org.apache.solr.update.processor.ParsingFieldUpdateProcessorsTest.testParseFloatNonRootLocale

Error Message:


Stack Trace:
java.lang.AssertionError
        at __randomizedtesting.SeedInfo.seed([917D4659E782D7C8:8AA1BB8847272BD5]:0)
        at org.junit.Assert.fail(Assert.java:86)
        at org.junit.Assert.assertTrue(Assert.java:41)
        at org.junit.Assert.assertTrue(Assert.java:52)
        at org.apache.solr.update.processor.ParsingFieldUpdateProcessorsTest.testParseFloatNonRootLocale(ParsingFieldUpdateProcessorsTest.java:471)
        at java.base/jdk.internal.reflect.NativeMethodAccessorImpl.invoke0(Native Method)
        at java.base/jdk.internal.reflect.NativeMethodAccessorImpl.invoke(NativeMethodAccessorImpl.java:62)
        at java.base/jdk.internal.reflect.DelegatingMethodAccessorImpl.invoke(DelegatingMethodAccessorImpl.java:43)
        at java.base/java.lang.reflect.Method.invoke(Method.java:567)
        at com.carrotsearch.randomizedtesting.RandomizedRunner.invoke(RandomizedRunner.java:1750)
        at com.carrotsearch.randomizedtesting.RandomizedRunner$8.evaluate(RandomizedRunner.java:938)
        at com.carrotsearch.randomizedtesting.RandomizedRunner$9.evaluate(RandomizedRunner.java:974)
        at com.carrotsearch.randomizedtesting.RandomizedRunner$10.evaluate(RandomizedRunner.java:988)
        at com.carrotsearch.randomizedtesting.rules.SystemPropertiesRestoreRule$1.evaluate(SystemPropertiesRestoreRule.java:57)
        at org.apache.lucene.util.TestRuleSetupTeardownChained$1.evaluate(TestRuleSetupTeardownChained.java:49)
        at org.apache.lucene.util.AbstractBeforeAfterRule$1.evaluate(AbstractBeforeAfterRule.java:45)
        at org.apache.lucene.util.TestRuleThreadAndTestName$1.evaluate(TestRuleThreadAndTestName.java:48)
        at org.apache.lucene.util.TestRuleIgnoreAfterMaxFailures$1.evaluate(TestRuleIgnoreAfterMaxFailures.java:64)
        at org.apache.lucene.util.TestRuleMarkFailure$1.evaluate(TestRuleMarkFailure.java:47)
        at com.carrotsearch.randomizedtesting.rules.StatementAdapter.evaluate(StatementAdapter.java:36)
        at com.carrotsearch.randomizedtesting.ThreadLeakControl$StatementRunner.run(ThreadLeakControl.java:368)
        at com.carrotsearch.randomizedtesting.ThreadLeakControl.forkTimeoutingTask(ThreadLeakControl.java:817)
        at com.carrotsearch.randomizedtesting.ThreadLeakControl$3.evaluate(ThreadLeakControl.java:468)
        at com.carrotsearch.randomizedtesting.RandomizedRunner.runSingleTest(RandomizedRunner.java:947)
        at com.carrotsearch.randomizedtesting.RandomizedRunner$5.evaluate(RandomizedRunner.java:832)
        at com.carrotsearch.randomizedtesting.RandomizedRunner$6.evaluate(RandomizedRunner.java:883)
        at com.carrotsearch.randomizedtesting.RandomizedRunner$7.evaluate(RandomizedRunner.java:894)
        at com.carrotsearch.randomizedtesting.rules.StatementAdapter.evaluate(StatementAdapter.java:36)
        at com.carrotsearch.randomizedtesting.rules.SystemPropertiesRestoreRule$1.evaluate(SystemPropertiesRestoreRule.java:57)
        at org.apache.lucene.util.AbstractBeforeAfterRule$1.evaluate(AbstractBeforeAfterRule.java:45)
        at com.carrotsearch.randomizedtesting.rules.StatementAdapter.evaluate(StatementAdapter.java:36)
        at org.apache.lucene.util.TestRuleStoreClassName$1.evaluate(TestRuleStoreClassName.java:41)
        at com.carrotsearch.randomizedtesting.rules.NoShadowingOrOverridesOnMethodsRule$1.evaluate(NoShadowingOrOverridesOnMethodsRule.java:40)
        at com.carrotsearch.randomizedtesting.rules.NoShadowingOrOverridesOnMethodsRule$1.evaluate(NoShadowingOrOverridesOnMethodsRule.java:40)
        at com.carrotsearch.randomizedtesting.rules.StatementAdapter.evaluate(StatementAdapter.java:36)
        at com.carrotsearch.randomizedtesting.rules.StatementAdapter.evaluate(StatementAdapter.java:36)
        at org.apache.lucene.util.TestRuleAssertionsRequired$1.evaluate(TestRuleAssertionsRequired.java:53)
        at org.apache.lucene.util.TestRuleMarkFailure$1.evaluate(TestRuleMarkFailure.java:47)
        at org.apache.lucene.util.TestRuleIgnoreAfterMaxFailures$1.evaluate(TestRuleIgnoreAfterMaxFailures.java:64)
        at org.apache.lucene.util.TestRuleIgnoreTestSuites$1.evaluate(TestRuleIgnoreTestSuites.java:54)
        at com.carrotsearch.randomizedtesting.rules.StatementAdapter.evaluate(StatementAdapter.java:36)
        at com.carrotsearch.randomizedtesting.ThreadLeakControl$StatementRunner.run(ThreadLeakControl.java:368)
        at java.base/java.lang.Thread.run(Thread.java:830)


FAILED:  org.apache.solr.update.processor.ParsingFieldUpdateProcessorsTest.testParseDoubleNonRootLocale

Error Message:


Stack Trace:
java.lang.AssertionError
        at __randomizedtesting.SeedInfo.seed([917D4659E782D7C8:86868BBEE3FABD2A]:0)
        at org.junit.Assert.fail(Assert.java:86)
        at org.junit.Assert.assertTrue(Assert.java:41)
        at org.junit.Assert.assertTrue(Assert.java:52)
        at org.apache.solr.update.processor.ParsingFieldUpdateProcessorsTest.testParseDoubleNonRootLocale(ParsingFieldUpdateProcessorsTest.java:573)
        at java.base/jdk.internal.reflect.NativeMethodAccessorImpl.invoke0(Native Method)
        at java.base/jdk.internal.reflect.NativeMethodAccessorImpl.invoke(NativeMethodAccessorImpl.java:62)
        at java.base/jdk.internal.reflect.DelegatingMethodAccessorImpl.invoke(DelegatingMethodAccessorImpl.java:43)
        at java.base/java.lang.reflect.Method.invoke(Method.java:567)
        at com.carrotsearch.randomizedtesting.RandomizedRunner.invoke(RandomizedRunner.java:1750)
        at com.carrotsearch.randomizedtesting.RandomizedRunner$8.evaluate(RandomizedRunner.java:938)
        at com.carrotsearch.randomizedtesting.RandomizedRunner$9.evaluate(RandomizedRunner.java:974)
        at com.carrotsearch.randomizedtesting.RandomizedRunner$10.evaluate(RandomizedRunner.java:988)
        at com.carrotsearch.randomizedtesting.rules.SystemPropertiesRestoreRule$1.evaluate(SystemPropertiesRestoreRule.java:57)
        at org.apache.lucene.util.TestRuleSetupTeardownChained$1.evaluate(TestRuleSetupTeardownChained.java:49)
        at org.apache.lucene.util.AbstractBeforeAfterRule$1.evaluate(AbstractBeforeAfterRule.java:45)
        at org.apache.lucene.util.TestRuleThreadAndTestName$1.evaluate(TestRuleThreadAndTestName.java:48)
        at org.apache.lucene.util.TestRuleIgnoreAfterMaxFailures$1.evaluate(TestRuleIgnoreAfterMaxFailures.java:64)
        at org.apache.lucene.util.TestRuleMarkFailure$1.evaluate(TestRuleMarkFailure.java:47)
        at com.carrotsearch.randomizedtesting.rules.StatementAdapter.evaluate(StatementAdapter.java:36)
        at com.carrotsearch.randomizedtesting.ThreadLeakControl$StatementRunner.run(ThreadLeakControl.java:368)
        at com.carrotsearch.randomizedtesting.ThreadLeakControl.forkTimeoutingTask(ThreadLeakControl.java:817)
        at com.carrotsearch.randomizedtesting.ThreadLeakControl$3.evaluate(ThreadLeakControl.java:468)
        at com.carrotsearch.randomizedtesting.RandomizedRunner.runSingleTest(RandomizedRunner.java:947)
        at com.carrotsearch.randomizedtesting.RandomizedRunner$5.evaluate(RandomizedRunner.java:832)
        at com.carrotsearch.randomizedtesting.RandomizedRunner$6.evaluate(RandomizedRunner.java:883)
        at com.carrotsearch.randomizedtesting.RandomizedRunner$7.evaluate(RandomizedRunner.java:894)
        at com.carrotsearch.randomizedtesting.rules.StatementAdapter.evaluate(StatementAdapter.java:36)
        at com.carrotsearch.randomizedtesting.rules.SystemPropertiesRestoreRule$1.evaluate(SystemPropertiesRestoreRule.java:57)
        at org.apache.lucene.util.AbstractBeforeAfterRule$1.evaluate(AbstractBeforeAfterRule.java:45)
        at com.carrotsearch.randomizedtesting.rules.StatementAdapter.evaluate(StatementAdapter.java:36)
        at org.apache.lucene.util.TestRuleStoreClassName$1.evaluate(TestRuleStoreClassName.java:41)
        at com.carrotsearch.randomizedtesting.rules.NoShadowingOrOverridesOnMethodsRule$1.evaluate(NoShadowingOrOverridesOnMethodsRule.java:40)
        at com.carrotsearch.randomizedtesting.rules.NoShadowingOrOverridesOnMethodsRule$1.evaluate(NoShadowingOrOverridesOnMethodsRule.java:40)
        at com.carrotsearch.randomizedtesting.rules.StatementAdapter.evaluate(StatementAdapter.java:36)
        at com.carrotsearch.randomizedtesting.rules.StatementAdapter.evaluate(StatementAdapter.java:36)
        at org.apache.lucene.util.TestRuleAssertionsRequired$1.evaluate(TestRuleAssertionsRequired.java:53)
        at org.apache.lucene.util.TestRuleMarkFailure$1.evaluate(TestRuleMarkFailure.java:47)
        at org.apache.lucene.util.TestRuleIgnoreAfterMaxFailures$1.evaluate(TestRuleIgnoreAfterMaxFailures.java:64)
        at org.apache.lucene.util.TestRuleIgnoreTestSuites$1.evaluate(TestRuleIgnoreTestSuites.java:54)
        at com.carrotsearch.randomizedtesting.rules.StatementAdapter.evaluate(StatementAdapter.java:36)
        at com.carrotsearch.randomizedtesting.ThreadLeakControl$StatementRunner.run(ThreadLeakControl.java:368)
        at java.base/java.lang.Thread.run(Thread.java:830)




Build Log:
[...truncated 15728 lines...]
   [junit4] Suite: org.apache.solr.update.processor.ParsingFieldUpdateProcessorsTest
   [junit4]   2> Creating dataDir: /home/jenkins/workspace/Lucene-Solr-master-Linux/solr/build/solr-core/test/J1/temp/solr.update.processor.ParsingFieldUpdateProcessorsTest_917D4659E782D7C8-001/init-core-data-001
   [junit4]   2> 4496786 INFO  (SUITE-ParsingFieldUpdateProcessorsTest-seed#[917D4659E782D7C8]-worker) [     ] o.a.s.c.SolrResourceLoader [null] Added 2 libs to classloader, from paths: [/home/jenkins/workspace/Lucene-Solr-master-Linux/solr/core/src/test-files/solr/collection1/lib, /home/jenkins/workspace/Lucene-Solr-master-Linux/solr/core/src/test-files/solr/collection1/lib/classes]
   [junit4]   2> 4496801 INFO  (SUITE-ParsingFieldUpdateProcessorsTest-seed#[917D4659E782D7C8]-worker) [     ] o.a.s.c.SolrConfig Using Lucene MatchVersion: 9.0.0
   [junit4]   2> 4496816 INFO  (SUITE-ParsingFieldUpdateProcessorsTest-seed#[917D4659E782D7C8]-worker) [     ] o.a.s.s.IndexSchema [null] Schema name=test
   [junit4]   2> 4496923 WARN  (SUITE-ParsingFieldUpdateProcessorsTest-seed#[917D4659E782D7C8]-worker) [     ] o.a.s.s.IndexSchema Field text is not multivalued and destination for multiple copyFields (2)
   [junit4]   2> 4496923 INFO  (SUITE-ParsingFieldUpdateProcessorsTest-seed#[917D4659E782D7C8]-worker) [     ] o.a.s.s.IndexSchema Loaded schema test/1.4 with uniqueid field id
   [junit4]   2> 4497120 INFO  (SUITE-ParsingFieldUpdateProcessorsTest-seed#[917D4659E782D7C8]-worker) [     ] o.a.s.h.c.HttpShardHandlerFactory Host whitelist initialized: WhitelistHostChecker [whitelistHosts=null, whitelistHostCheckingEnabled=true]
   [junit4]   2> 4497153 WARN  (SUITE-ParsingFieldUpdateProcessorsTest-seed#[917D4659E782D7C8]-worker) [     ] o.e.j.u.s.S.config Trusting all certificates configured for Client@2cf4d450[provider=null,keyStore=null,trustStore=null]
   [junit4]   2> 4497153 WARN  (SUITE-ParsingFieldUpdateProcessorsTest-seed#[917D4659E782D7C8]-worker) [     ] o.e.j.u.s.S.config No Client EndPointIdentificationAlgorithm configured for Client@2cf4d450[provider=null,keyStore=null,trustStore=null]
   [junit4]   2> 4497156 WARN  (SUITE-ParsingFieldUpdateProcessorsTest-seed#[917D4659E782D7C8]-worker) [     ] o.e.j.u.s.S.config Trusting all certificates configured for Client@15fe977e[provider=null,keyStore=null,trustStore=null]
   [junit4]   2> 4497156 WARN  (SUITE-ParsingFieldUpdateProcessorsTest-seed#[917D4659E782D7C8]-worker) [     ] o.e.j.u.s.S.config No Client EndPointIdentificationAlgorithm configured for Client@15fe977e[provider=null,keyStore=null,trustStore=null]
   [junit4]   2> 4497173 INFO  (SUITE-ParsingFieldUpdateProcessorsTest-seed#[917D4659E782D7C8]-worker) [     ] o.a.s.c.TransientSolrCoreCacheDefault Allocating transient cache for 2147483647 transient cores
   [junit4]   2> 4497173 INFO  (SUITE-ParsingFieldUpdateProcessorsTest-seed#[917D4659E782D7C8]-worker) [     ] o.a.s.h.a.MetricsHistoryHandler No .system collection, keeping metrics history in memory.
   [junit4]   2> 4497207 INFO  (SUITE-ParsingFieldUpdateProcessorsTest-seed#[917D4659E782D7C8]-worker) [     ] o.a.s.m.r.SolrJmxReporter JMX monitoring for 'solr.node' (registry 'solr.node') enabled at server: com.sun.jmx.mbeanserver.JmxMBeanServer@33f72520
   [junit4]   2> 4497229 INFO  (SUITE-ParsingFieldUpdateProcessorsTest-seed#[917D4659E782D7C8]-worker) [     ] o.a.s.m.r.SolrJmxReporter JMX monitoring for 'solr.jvm' (registry 'solr.jvm') enabled at server: com.sun.jmx.mbeanserver.JmxMBeanServer@33f72520
   [junit4]   2> 4497229 INFO  (SUITE-ParsingFieldUpdateProcessorsTest-seed#[917D4659E782D7C8]-worker) [     ] o.a.s.m.r.SolrJmxReporter JMX monitoring for 'solr.jetty' (registry 'solr.jetty') enabled at server: com.sun.jmx.mbeanserver.JmxMBeanServer@33f72520
   [junit4]   2> 4497232 INFO  (coreLoadExecutor-14850-thread-1) [    x:collection1 ] o.a.s.c.SolrResourceLoader [null] Added 2 libs to classloader, from paths: [/home/jenkins/workspace/Lucene-Solr-master-Linux/solr/core/src/test-files/solr/collection1/lib, /home/jenkins/workspace/Lucene-Solr-master-Linux/solr/core/src/test-files/solr/collection1/lib/classes]
   [junit4]   2> 4497250 INFO  (coreLoadExecutor-14850-thread-1) [    x:collection1 ] o.a.s.c.SolrConfig Using Lucene MatchVersion: 9.0.0
   [junit4]   2> 4497301 INFO  (coreLoadExecutor-14850-thread-1) [    x:collection1 ] o.a.s.s.IndexSchema [collection1] Schema name=test
   [junit4]   2> 4497378 WARN  (coreLoadExecutor-14850-thread-1) [    x:collection1 ] o.a.s.s.IndexSchema Field text is not multivalued and destination for multiple copyFields (2)
   [junit4]   2> 4497378 INFO  (coreLoadExecutor-14850-thread-1) [    x:collection1 ] o.a.s.s.IndexSchema Loaded schema test/1.4 with uniqueid field id
   [junit4]   2> 4497386 INFO  (coreLoadExecutor-14850-thread-1) [    x:collection1 ] o.a.s.c.CoreContainer Creating SolrCore 'collection1' using configuration from instancedir /home/jenkins/workspace/Lucene-Solr-master-Linux/solr/core/src/test-files/solr/collection1, trusted=true
   [junit4]   2> 4497386 INFO  (coreLoadExecutor-14850-thread-1) [    x:collection1 ] o.a.s.m.r.SolrJmxReporter JMX monitoring for 'solr.core.collection1' (registry 'solr.core.collection1') enabled at server: com.sun.jmx.mbeanserver.JmxMBeanServer@33f72520
   [junit4]   2> 4497386 INFO  (coreLoadExecutor-14850-thread-1) [    x:collection1 ] o.a.s.c.SolrCore [[collection1] ] Opening new SolrCore at [/home/jenkins/workspace/Lucene-Solr-master-Linux/solr/core/src/test-files/solr/collection1], dataDir=[/home/jenkins/workspace/Lucene-Solr-master-Linux/solr/build/solr-core/test/J1/temp/solr.update.processor.ParsingFieldUpdateProcessorsTest_917D4659E782D7C8-001/init-core-data-001/]
   [junit4]   2> 4497870 INFO  (coreLoadExecutor-14850-thread-1) [    x:collection1 ] o.a.s.u.CommitTracker Hard AutoCommit: disabled
   [junit4]   2> 4497870 INFO  (coreLoadExecutor-14850-thread-1) [    x:collection1 ] o.a.s.u.CommitTracker Soft AutoCommit: disabled
   [junit4]   2> 4497872 INFO  (coreLoadExecutor-14850-thread-1) [    x:collection1 ] o.a.s.s.SolrIndexSearcher Opening [Searcher@64c87c9f[collection1] main]
   [junit4]   2> 4497873 WARN  (coreLoadExecutor-14850-thread-1) [    x:collection1 ] o.a.s.r.ManagedResourceStorage Cannot write to config directory /home/jenkins/workspace/Lucene-Solr-master-Linux/solr/core/src/test-files/solr/collection1/conf; switching to use InMemory storage instead.
   [junit4]   2> 4497874 INFO  (coreLoadExecutor-14850-thread-1) [    x:collection1 ] o.a.s.h.ReplicationHandler Commits will be reserved for 10000ms.
   [junit4]   2> 4497875 INFO  (searcherExecutor-14851-thread-1-processing-x:collection1) [    x:collection1 ] o.a.s.c.SolrCore [collection1] Registered new searcher Searcher@64c87c9f[collection1] main{ExitableDirectoryReader(UninvertingDirectoryReader())}
   [junit4]   2> 4497932 INFO  (TEST-ParsingFieldUpdateProcessorsTest.testParseTrieDateRoundTrip-seed#[917D4659E782D7C8]) [     ] o.a.s.u.DirectUpdateHandler2 start commit{,optimize=false,openSearcher=true,waitSearcher=true,expungeDeletes=false,softCommit=false,prepareCommit=false}
   [junit4]   2> 4497932 INFO  (TEST-ParsingFieldUpdateProcessorsTest.testParseTrieDateRoundTrip-seed#[917D4659E782D7C8]) [     ] o.a.s.u.SolrIndexWriter Calling setCommitData with IW:org.apache.solr.update.SolrIndexWriter@2cebb8f8 commitCommandVersion:0
   [junit4]   2> 4497938 INFO  (TEST-ParsingFieldUpdateProcessorsTest.testParseTrieDateRoundTrip-seed#[917D4659E782D7C8]) [     ] o.a.s.s.SolrIndexSearcher Opening [Searcher@35211c71[collection1] main]
   [junit4]   2> 4497938 INFO  (TEST-ParsingFieldUpdateProcessorsTest.testParseTrieDateRoundTrip-seed#[917D4659E782D7C8]) [     ] o.a.s.u.DirectUpdateHandler2 end_commit_flush
   [junit4]   2> 4497940 INFO  (searcherExecutor-14851-thread-1) [     ] o.a.s.c.SolrCore [collection1] Registered new searcher Searcher@35211c71[collection1] main{ExitableDirectoryReader(UninvertingDirectoryReader(Uninverting(_0(9.0.0):C2:[diagnostics={os.arch=amd64, java.runtime.version=13-testing+0-builds.shipilev.net-openjdk-jdk13-b9-20190621-jdk-1326, os.version=4.18.0-17-generic, os=Linux, java.vendor=Aleksey Shipilev, timestamp=1561457168767, java.version=13-testing, java.vm.version=13-testing+0-builds.shipilev.net-openjdk-jdk13-b9-20190621-jdk-1326, lucene.version=9.0.0, source=flush}]:[attributes={Lucene50StoredFieldsFormat.mode=BEST_SPEED}])))}
   [junit4]   2> 4497940 INFO  (TEST-ParsingFieldUpdateProcessorsTest.testParseTrieDateRoundTrip-seed#[917D4659E782D7C8]) [     ] o.a.s.u.p.LogUpdateProcessorFactory [collection1]  webapp=null path=null params={}{commit=} 0 8
   [junit4]   2> 4497942 INFO  (TEST-ParsingFieldUpdateProcessorsTest.testParseTrieDateRoundTrip-seed#[917D4659E782D7C8]) [     ] o.a.s.c.S.Request [collection1]  webapp=null path=null params={q=id:39&qt=&start=0&rows=20&version=2.2} hits=1 status=0 QTime=0
   [junit4]   2> 4497948 INFO  (TEST-ParsingFieldUpdateProcessorsTest.testParseBooleanRoundTrip-seed#[917D4659E782D7C8]) [     ] o.a.s.u.DirectUpdateHandler2 start commit{,optimize=false,openSearcher=true,waitSearcher=true,expungeDeletes=false,softCommit=false,prepareCommit=false}
   [junit4]   2> 4497948 INFO  (TEST-ParsingFieldUpdateProcessorsTest.testParseBooleanRoundTrip-seed#[917D4659E782D7C8]) [     ] o.a.s.u.SolrIndexWriter Calling setCommitData with IW:org.apache.solr.update.SolrIndexWriter@2cebb8f8 commitCommandVersion:0
   [junit4]   2> 4497950 INFO  (TEST-ParsingFieldUpdateProcessorsTest.testParseBooleanRoundTrip-seed#[917D4659E782D7C8]) [     ] o.a.s.s.SolrIndexSearcher Opening [Searcher@f01b35c[collection1] main]
   [junit4]   2> 4497950 INFO  (TEST-ParsingFieldUpdateProcessorsTest.testParseBooleanRoundTrip-seed#[917D4659E782D7C8]) [     ] o.a.s.u.DirectUpdateHandler2 end_commit_flush
   [junit4]   2> 4497952 INFO  (searcherExecutor-14851-thread-1) [     ] o.a.s.c.SolrCore [collection1] Registered new searcher Searcher@f01b35c[collection1] main{ExitableDirectoryReader(UninvertingDirectoryReader(Uninverting(_0(9.0.0):C2:[diagnostics={os.arch=amd64, java.runtime.version=13-testing+0-builds.shipilev.net-openjdk-jdk13-b9-20190621-jdk-1326, os.version=4.18.0-17-generic, os=Linux, java.vendor=Aleksey Shipilev, timestamp=1561457168767, java.version=13-testing, java.vm.version=13-testing+0-builds.shipilev.net-openjdk-jdk13-b9-20190621-jdk-1326, lucene.version=9.0.0, source=flush}]:[attributes={Lucene50StoredFieldsFormat.mode=BEST_SPEED}]) Uninverting(_1(9.0.0):C1:[diagnostics={os.arch=amd64, java.runtime.version=13-testing+0-builds.shipilev.net-openjdk-jdk13-b9-20190621-jdk-1326, os.version=4.18.0-17-generic, os=Linux, java.vendor=Aleksey Shipilev, timestamp=1561457168781, java.version=13-testing, java.vm.version=13-testing+0-builds.shipilev.net-openjdk-jdk13-b9-20190621-jdk-1326, lucene.version=9.0.0, source=flush}]:[attributes={Lucene50StoredFieldsFormat.mode=BEST_SPEED}])))}
   [junit4]   2> 4497952 INFO  (TEST-ParsingFieldUpdateProcessorsTest.testParseBooleanRoundTrip-seed#[917D4659E782D7C8]) [     ] o.a.s.u.p.LogUpdateProcessorFactory [collection1]  webapp=null path=null params={}{commit=} 0 4
   [junit4]   2> 4497952 INFO  (TEST-ParsingFieldUpdateProcessorsTest.testParseBooleanRoundTrip-seed#[917D4659E782D7C8]) [     ] o.a.s.c.S.Request [collection1]  webapp=null path=null params={q=id:141&qt=&start=0&rows=20&version=2.2} hits=1 status=0 QTime=0
   [junit4]   2> 4497962 INFO  (TEST-ParsingFieldUpdateProcessorsTest.testParseLongRoundTrip-seed#[917D4659E782D7C8]) [     ] o.a.s.u.DirectUpdateHandler2 start commit{,optimize=false,openSearcher=true,waitSearcher=true,expungeDeletes=false,softCommit=false,prepareCommit=false}
   [junit4]   2> 4497963 INFO  (TEST-ParsingFieldUpdateProcessorsTest.testParseLongRoundTrip-seed#[917D4659E782D7C8]) [     ] o.a.s.u.SolrIndexWriter Calling setCommitData with IW:org.apache.solr.update.SolrIndexWriter@2cebb8f8 commitCommandVersion:0
   [junit4]   2> 4497969 INFO  (TEST-ParsingFieldUpdateProcessorsTest.testParseLongRoundTrip-seed#[917D4659E782D7C8]) [     ] o.a.s.s.SolrIndexSearcher Opening [Searcher@7fffb0c[collection1] main]
   [junit4]   2> 4497971 INFO  (TEST-ParsingFieldUpdateProcessorsTest.testParseLongRoundTrip-seed#[917D4659E782D7C8]) [     ] o.a.s.u.DirectUpdateHandler2 end_commit_flush
   [junit4]   2> 4497973 INFO  (searcherExecutor-14851-thread-1) [     ] o.a.s.c.SolrCore [collection1] Registered new searcher Searcher@7fffb0c[collection1] main{ExitableDirectoryReader(UninvertingDirectoryReader(Uninverting(_0(9.0.0):C2:[diagnostics={os.arch=amd64, java.runtime.version=13-testing+0-builds.shipilev.net-openjdk-jdk13-b9-20190621-jdk-1326, os.version=4.18.0-17-generic, os=Linux, java.vendor=Aleksey Shipilev, timestamp=1561457168767, java.version=13-testing, java.vm.version=13-testing+0-builds.shipilev.net-openjdk-jdk13-b9-20190621-jdk-1326, lucene.version=9.0.0, source=flush}]:[attributes={Lucene50StoredFieldsFormat.mode=BEST_SPEED}]) Uninverting(_1(9.0.0):C1:[diagnostics={os.arch=amd64, java.runtime.version=13-testing+0-builds.shipilev.net-openjdk-jdk13-b9-20190621-jdk-1326, os.version=4.18.0-17-generic, os=Linux, java.vendor=Aleksey Shipilev, timestamp=1561457168781, java.version=13-testing, java.vm.version=13-testing+0-builds.shipilev.net-openjdk-jdk13-b9-20190621-jdk-1326, lucene.version=9.0.0, source=flush}]:[attributes={Lucene50StoredFieldsFormat.mode=BEST_SPEED}]) Uninverting(_2(9.0.0):C1:[diagnostics={os.arch=amd64, java.runtime.version=13-testing+0-builds.shipilev.net-openjdk-jdk13-b9-20190621-jdk-1326, os.version=4.18.0-17-generic, os=Linux, java.vendor=Aleksey Shipilev, timestamp=1561457168797, java.version=13-testing, java.vm.version=13-testing+0-builds.shipilev.net-openjdk-jdk13-b9-20190621-jdk-1326, lucene.version=9.0.0, source=flush}]:[attributes={Lucene50StoredFieldsFormat.mode=BEST_SPEED}])))}
   [junit4]   2> 4497973 INFO  (TEST-ParsingFieldUpdateProcessorsTest.testParseLongRoundTrip-seed#[917D4659E782D7C8]) [     ] o.a.s.u.p.LogUpdateProcessorFactory [collection1]  webapp=null path=null params={}{commit=} 0 10
   [junit4]   2> 4498115 INFO  (TEST-ParsingFieldUpdateProcessorsTest.testParseLongRoundTrip-seed#[917D4659E782D7C8]) [     ] o.a.s.c.S.Request [collection1]  webapp=null path=null params={q=id:113&qt=&start=0&rows=20&version=2.2} hits=1 status=0 QTime=141
   [junit4]   2> 4498121 INFO  (TEST-ParsingFieldUpdateProcessorsTest.testParseDoubleRoundTrip-seed#[917D4659E782D7C8]) [     ] o.a.s.u.DirectUpdateHandler2 start commit{,optimize=false,openSearcher=true,waitSearcher=true,expungeDeletes=false,softCommit=false,prepareCommit=false}
   [junit4]   2> 4498121 INFO  (TEST-ParsingFieldUpdateProcessorsTest.testParseDoubleRoundTrip-seed#[917D4659E782D7C8]) [     ] o.a.s.u.SolrIndexWriter Calling setCommitData with IW:org.apache.solr.update.SolrIndexWriter@2cebb8f8 commitCommandVersion:0
   [junit4]   2> 4498124 INFO  (TEST-ParsingFieldUpdateProcessorsTest.testParseDoubleRoundTrip-seed#[917D4659E782D7C8]) [     ] o.a.s.s.SolrIndexSearcher Opening [Searcher@246a7b[collection1] main]
   [junit4]   2> 4498124 INFO  (TEST-ParsingFieldUpdateProcessorsTest.testParseDoubleRoundTrip-seed#[917D4659E782D7C8]) [     ] o.a.s.u.DirectUpdateHandler2 end_commit_flush
   [junit4]   2> 4498126 INFO  (searcherExecutor-14851-thread-1) [     ] o.a.s.c.SolrCore [collection1] Registered new searcher Searcher@246a7b[collection1] main{ExitableDirectoryReader(UninvertingDirectoryReader(Uninverting(_0(9.0.0):C2:[diagnostics={os.arch=amd64, java.runtime.version=13-testing+0-builds.shipilev.net-openjdk-jdk13-b9-20190621-jdk-1326, os.version=4.18.0-17-generic, os=Linux, java.vendor=Aleksey Shipilev, timestamp=1561457168767, java.version=13-testing, java.vm.version=13-testing+0-builds.shipilev.net-openjdk-jdk13-b9-20190621-jdk-1326, lucene.version=9.0.0, source=flush}]:[attributes={Lucene50StoredFieldsFormat.mode=BEST_SPEED}]) Uninverting(_1(9.0.0):C1:[diagnostics={os.arch=amd64, java.runtime.version=13-testing+0-builds.shipilev.net-openjdk-jdk13-b9-20190621-jdk-1326, os.version=4.18.0-17-generic, os=Linux, java.vendor=Aleksey Shipilev, timestamp=1561457168781, java.version=13-testing, java.vm.version=13-testing+0-builds.shipilev.net-openjdk-jdk13-b9-20190621-jdk-1326, lucene.version=9.0.0, source=flush}]:[attributes={Lucene50StoredFieldsFormat.mode=BEST_SPEED}]) Uninverting(_2(9.0.0):C1:[diagnostics={os.arch=amd64, java.runtime.version=13-testing+0-builds.shipilev.net-openjdk-jdk13-b9-20190621-jdk-1326, os.version=4.18.0-17-generic, os=Linux, java.vendor=Aleksey Shipilev, timestamp=1561457168797, java.version=13-testing, java.vm.version=13-testing+0-builds.shipilev.net-openjdk-jdk13-b9-20190621-jdk-1326, lucene.version=9.0.0, source=flush}]:[attributes={Lucene50StoredFieldsFormat.mode=BEST_SPEED}]) Uninverting(_3(9.0.0):C1:[diagnostics={os.arch=amd64, java.runtime.version=13-testing+0-builds.shipilev.net-openjdk-jdk13-b9-20190621-jdk-1326, os.version=4.18.0-17-generic, os=Linux, java.vendor=Aleksey Shipilev, timestamp=1561457168954, java.version=13-testing, java.vm.version=13-testing+0-builds.shipilev.net-openjdk-jdk13-b9-20190621-jdk-1326, lucene.version=9.0.0, source=flush}]:[attributes={Lucene50StoredFieldsFormat.mode=BEST_SPEED}])))}
   [junit4]   2> 4498126 INFO  (TEST-ParsingFieldUpdateProcessorsTest.testParseDoubleRoundTrip-seed#[917D4659E782D7C8]) [     ] o.a.s.u.p.LogUpdateProcessorFactory [collection1]  webapp=null path=null params={}{commit=} 0 4
   [junit4]   2> 4498127 INFO  (TEST-ParsingFieldUpdateProcessorsTest.testParseDoubleRoundTrip-seed#[917D4659E782D7C8]) [     ] o.a.s.c.S.Request [collection1]  webapp=null path=null params={q=id:128&qt=&start=0&rows=20&version=2.2} hits=1 status=0 QTime=1
   [junit4]   2> 4498192 INFO  (TEST-ParsingFieldUpdateProcessorsTest.testParseTrieFloatRoundTrip-seed#[917D4659E782D7C8]) [     ] o.a.s.u.DirectUpdateHandler2 start commit{,optimize=false,openSearcher=true,waitSearcher=true,expungeDeletes=false,softCommit=false,prepareCommit=false}
   [junit4]   2> 4498192 INFO  (TEST-ParsingFieldUpdateProcessorsTest.testParseTrieFloatRoundTrip-seed#[917D4659E782D7C8]) [     ] o.a.s.u.SolrIndexWriter Calling setCommitData with IW:org.apache.solr.update.SolrIndexWriter@2cebb8f8 commitCommandVersion:0
   [junit4]   2> 4498195 INFO  (TEST-ParsingFieldUpdateProcessorsTest.testParseTrieFloatRoundTrip-seed#[917D4659E782D7C8]) [     ] o.a.s.s.SolrIndexSearcher Opening [Searcher@6a4edc51[collection1] main]
   [junit4]   2> 4498196 INFO  (TEST-ParsingFieldUpdateProcessorsTest.testParseTrieFloatRoundTrip-seed#[917D4659E782D7C8]) [     ] o.a.s.u.DirectUpdateHandler2 end_commit_flush
   [junit4]   2> 4498197 INFO  (searcherExecutor-14851-thread-1) [     ] o.a.s.c.SolrCore [collection1] Registered new searcher Searcher@6a4edc51[collection1] main{ExitableDirectoryReader(UninvertingDirectoryReader(Uninverting(_0(9.0.0):C2:[diagnostics={os.arch=amd64, java.runtime.version=13-testing+0-builds.shipilev.net-openjdk-jdk13-b9-20190621-jdk-1326, os.version=4.18.0-17-generic, os=Linux, java.vendor=Aleksey Shipilev, timestamp=1561457168767, java.version=13-testing, java.vm.version=13-testing+0-builds.shipilev.net-openjdk-jdk13-b9-20190621-jdk-1326, lucene.version=9.0.0, source=flush}]:[attributes={Lucene50StoredFieldsFormat.mode=BEST_SPEED}]) Uninverting(_1(9.0.0):C1:[diagnostics={os.arch=amd64, java.runtime.version=13-testing+0-builds.shipilev.net-openjdk-jdk13-b9-20190621-jdk-1326, os.version=4.18.0-17-generic, os=Linux, java.vendor=Aleksey Shipilev, timestamp=1561457168781, java.version=13-testing, java.vm.version=13-testing+0-builds.shipilev.net-openjdk-jdk13-b9-20190621-jdk-1326, lucene.version=9.0.0, source=flush}]:[attributes={Lucene50StoredFieldsFormat.mode=BEST_SPEED}]) Uninverting(_2(9.0.0):C1:[diagnostics={os.arch=amd64, java.runtime.version=13-testing+0-builds.shipilev.net-openjdk-jdk13-b9-20190621-jdk-1326, os.version=4.18.0-17-generic, os=Linux, java.vendor=Aleksey Shipilev, timestamp=1561457168797, java.version=13-testing, java.vm.version=13-testing+0-builds.shipilev.net-openjdk-jdk13-b9-20190621-jdk-1326, lucene.version=9.0.0, source=flush}]:[attributes={Lucene50StoredFieldsFormat.mode=BEST_SPEED}]) Uninverting(_3(9.0.0):C1:[diagnostics={os.arch=amd64, java.runtime.version=13-testing+0-builds.shipilev.net-openjdk-jdk13-b9-20190621-jdk-1326, os.version=4.18.0-17-generic, os=Linux, java.vendor=Aleksey Shipilev, timestamp=1561457168954, java.version=13-testing, java.vm.version=13-testing+0-builds.shipilev.net-openjdk-jdk13-b9-20190621-jdk-1326, lucene.version=9.0.0, source=flush}]:[attributes={Lucene50StoredFieldsFormat.mode=BEST_SPEED}]) Uninverting(_4(9.0.0):C1:[diagnostics={os.arch=amd64, java.runtime.version=13-testing+0-builds.shipilev.net-openjdk-jdk13-b9-20190621-jdk-1326, os.version=4.18.0-17-generic, os=Linux, java.vendor=Aleksey Shipilev, timestamp=1561457169026, java.version=13-testing, java.vm.version=13-testing+0-builds.shipilev.net-openjdk-jdk13-b9-20190621-jdk-1326, lucene.version=9.0.0, source=flush}]:[attributes={Lucene50StoredFieldsFormat.mode=BEST_SPEED}])))}
   [junit4]   2> 4498198 INFO  (TEST-ParsingFieldUpdateProcessorsTest.testParseTrieFloatRoundTrip-seed#[917D4659E782D7C8]) [     ] o.a.s.u.p.LogUpdateProcessorFactory [collection1]  webapp=null path=null params={}{commit=} 0 5
   [junit4]   2> 4498199 INFO  (TEST-ParsingFieldUpdateProcessorsTest.testParseTrieFloatRoundTrip-seed#[917D4659E782D7C8]) [     ] o.a.s.c.S.Request [collection1]  webapp=null path=null params={q=id:728&qt=&start=0&rows=20&version=2.2} hits=1 status=0 QTime=1
   [junit4]   2> 4498205 INFO  (TEST-ParsingFieldUpdateProcessorsTest.testParseFloatRoundTrip-seed#[917D4659E782D7C8]) [     ] o.a.s.u.DirectUpdateHandler2 start commit{,optimize=false,openSearcher=true,waitSearcher=true,expungeDeletes=false,softCommit=false,prepareCommit=false}
   [junit4]   2> 4498205 INFO  (TEST-ParsingFieldUpdateProcessorsTest.testParseFloatRoundTrip-seed#[917D4659E782D7C8]) [     ] o.a.s.u.SolrIndexWriter Calling setCommitData with IW:org.apache.solr.update.SolrIndexWriter@2cebb8f8 commitCommandVersion:0
   [junit4]   2> 4498207 INFO  (TEST-ParsingFieldUpdateProcessorsTest.testParseFloatRoundTrip-seed#[917D4659E782D7C8]) [     ] o.a.s.s.SolrIndexSearcher Opening [Searcher@30fde73a[collection1] main]
   [junit4]   2> 4498208 INFO  (TEST-ParsingFieldUpdateProcessorsTest.testParseFloatRoundTrip-seed#[917D4659E782D7C8]) [     ] o.a.s.u.DirectUpdateHandler2 end_commit_flush
   [junit4]   2> 4498209 INFO  (searcherExecutor-14851-thread-1) [     ] o.a.s.c.SolrCore [collection1] Registered new searcher Searcher@30fde73a[collection1] main{ExitableDirectoryReader(UninvertingDirectoryReader(Uninverting(_0(9.0.0):C2:[diagnostics={os.arch=amd64, java.runtime.version=13-testing+0-builds.shipilev.net-openjdk-jdk13-b9-20190621-jdk-1326, os.version=4.18.0-17-generic, os=Linux, java.vendor=Aleksey Shipilev, timestamp=1561457168767, java.version=13-testing, java.vm.version=13-testing+0-builds.shipilev.net-openjdk-jdk13-b9-20190621-jdk-1326, lucene.version=9.0.0, source=flush}]:[attributes={Lucene50StoredFieldsFormat.mode=BEST_SPEED}]) Uninverting(_1(9.0.0):C1:[diagnostics={os.arch=amd64, java.runtime.version=13-testing+0-builds.shipilev.net-openjdk-jdk13-b9-20190621-jdk-1326, os.version=4.18.0-17-generic, os=Linux, java.vendor=Aleksey Shipilev, timestamp=1561457168781, java.version=13-testing, java.vm.version=13-testing+0-builds.shipilev.net-openjdk-jdk13-b9-20190621-jdk-1326, lucene.version=9.0.0, source=flush}]:[attributes={Lucene50StoredFieldsFormat.mode=BEST_SPEED}]) Uninverting(_2(9.0.0):C1:[diagnostics={os.arch=amd64, java.runtime.version=13-testing+0-builds.shipilev.net-openjdk-jdk13-b9-20190621-jdk-1326, os.version=4.18.0-17-generic, os=Linux, java.vendor=Aleksey Shipilev, timestamp=1561457168797, java.version=13-testing, java.vm.version=13-testing+0-builds.shipilev.net-openjdk-jdk13-b9-20190621-jdk-1326, lucene.version=9.0.0, source=flush}]:[attributes={Lucene50StoredFieldsFormat.mode=BEST_SPEED}]) Uninverting(_4(9.0.0):C1:[diagnostics={os.arch=amd64, java.runtime.version=13-testing+0-builds.shipilev.net-openjdk-jdk13-b9-20190621-jdk-1326, os.version=4.18.0-17-generic, os=Linux, java.vendor=Aleksey Shipilev, timestamp=1561457169026, java.version=13-testing, java.vm.version=13-testing+0-builds.shipilev.net-openjdk-jdk13-b9-20190621-jdk-1326, lucene.version=9.0.0, source=flush}]:[attributes={Lucene50StoredFieldsFormat.mode=BEST_SPEED}]) Uninverting(_5(9.0.0):C1:[diagnostics={os.arch=amd64, java.runtime.version=13-testing+0-builds.shipilev.net-openjdk-jdk13-b9-20190621-jdk-1326, os.version=4.18.0-17-generic, os=Linux, java.vendor=Aleksey Shipilev, timestamp=1561457169038, java.version=13-testing, java.vm.version=13-testing+0-builds.shipilev.net-openjdk-jdk13-b9-20190621-jdk-1326, lucene.version=9.0.0, source=flush}]:[attributes={Lucene50StoredFieldsFormat.mode=BEST_SPEED}])))}
   [junit4]   2> 4498210 INFO  (TEST-ParsingFieldUpdateProcessorsTest.testParseFloatRoundTrip-seed#[917D4659E782D7C8]) [     ] o.a.s.u.p.LogUpdateProcessorFactory [collection1]  webapp=null path=null params={}{commit=} 0 5
   [junit4]   2> 4498211 INFO  (TEST-ParsingFieldUpdateProcessorsTest.testParseFloatRoundTrip-seed#[917D4659E782D7C8]) [     ] o.a.s.c.S.Request [collection1]  webapp=null path=null params={q=id:128&qt=&start=0&rows=20&version=2.2} hits=1 status=0 QTime=1
   [junit4]   2> 4498794 INFO  (TEST-ParsingFieldUpdateProcessorsTest.testParseIntRoundTrip-seed#[917D4659E782D7C8]) [     ] o.a.s.u.DirectUpdateHandler2 start commit{,optimize=false,openSearcher=true,waitSearcher=true,expungeDeletes=false,softCommit=false,prepareCommit=false}
   [junit4]   2> 4498794 INFO  (TEST-ParsingFieldUpdateProcessorsTest.testParseIntRoundTrip-seed#[917D4659E782D7C8]) [     ] o.a.s.u.SolrIndexWriter Calling setCommitData with IW:org.apache.solr.update.SolrIndexWriter@2cebb8f8 commitCommandVersion:0
   [junit4]   2> 4498820 INFO  (TEST-ParsingFieldUpdateProcessorsTest.testParseIntRoundTrip-seed#[917D4659E782D7C8]) [     ] o.a.s.s.SolrIndexSearcher Opening [Searcher@28858be4[collection1] main]
   [junit4]   2> 4498823 INFO  (TEST-ParsingFieldUpdateProcessorsTest.testParseIntRoundTrip-seed#[917D4659E782D7C8]) [     ] o.a.s.u.DirectUpdateHandler2 end_commit_flush
   [junit4]   2> 4498823 INFO  (searcherExecutor-14851-thread-1) [     ] o.a.s.c.SolrCore [collection1] Registered new searcher Searcher@28858be4[collection1] main{ExitableDirectoryReader(UninvertingDirectoryReader(Uninverting(_0(9.0.0):C2/1:[diagnostics={os.arch=amd64, java.runtime.version=13-testing+0-builds.shipilev.net-openjdk-jdk13-b9-20190621-jdk-1326, os.version=4.18.0-17-generic, os=Linux, java.vendor=Aleksey Shipilev, timestamp=1561457168767, java.version=13-testing, java.vm.version=13-testing+0-builds.shipilev.net-openjdk-jdk13-b9-20190621-jdk-1326, lucene.version=9.0.0, source=flush}]:[attributes={Lucene50StoredFieldsFormat.mode=BEST_SPEED}]:delGen=1) Uninverting(_1(9.0.0):C1:[diagnostics={os.arch=amd64, java.runtime.version=13-testing+0-builds.shipilev.net-openjdk-jdk13-b9-20190621-jdk-1326, os.version=4.18.0-17-generic, os=Linux, java.vendor=Aleksey Shipilev, timestamp=1561457168781, java.version=13-testing, java.vm.version=13-testing+0-builds.shipilev.net-openjdk-jdk13-b9-20190621-jdk-1326, lucene.version=9.0.0, source=flush}]:[attributes={Lucene50StoredFieldsFormat.mode=BEST_SPEED}]) Uninverting(_4(9.0.0):C1:[diagnostics={os.arch=amd64, java.runtime.version=13-testing+0-builds.shipilev.net-openjdk-jdk13-b9-20190621-jdk-1326, os.version=4.18.0-17-generic, os=Linux, java.vendor=Aleksey Shipilev, timestamp=1561457169026, java.version=13-testing, java.vm.version=13-testing+0-builds.shipilev.net-openjdk-jdk13-b9-20190621-jdk-1326, lucene.version=9.0.0, source=flush}]:[attributes={Lucene50StoredFieldsFormat.mode=BEST_SPEED}]) Uninverting(_5(9.0.0):C1:[diagnostics={os.arch=amd64, java.runtime.version=13-testing+0-builds.shipilev.net-openjdk-jdk13-b9-20190621-jdk-1326, os.version=4.18.0-17-generic, os=Linux, java.vendor=Aleksey Shipilev, timestamp=1561457169038, java.version=13-testing, java.vm.version=13-testing+0-builds.shipilev.net-openjdk-jdk13-b9-20190621-jdk-1326, lucene.version=9.0.0, source=flush}]:[attributes={Lucene50StoredFieldsFormat.mode=BEST_SPEED}]) Uninverting(_6(9.0.0):C6/4:[diagnostics={os.arch=amd64, java.runtime.version=13-testing+0-builds.shipilev.net-openjdk-jdk13-b9-20190621-jdk-1326, os.version=4.18.0-17-generic, os=Linux, java.vendor=Aleksey Shipilev, timestamp=1561457169629, java.version=13-testing, java.vm.version=13-testing+0-builds.shipilev.net-openjdk-jdk13-b9-20190621-jdk-1326, lucene.version=9.0.0, source=flush}]:[attributes={Lucene50StoredFieldsFormat.mode=BEST_SPEED}]:delGen=1)))}
   [junit4]   2> 4498832 INFO  (TEST-ParsingFieldUpdateProcessorsTest.testParseIntRoundTrip-seed#[917D4659E782D7C8]) [     ] o.a.s.u.p.LogUpdateProcessorFactory [collection1]  webapp=null path=null params={}{commit=} 0 38
   [junit4]   2> 4498833 INFO  (TEST-ParsingFieldUpdateProcessorsTest.testParseIntRoundTrip-seed#[917D4659E782D7C8]) [     ] o.a.s.c.S.Request [collection1]  webapp=null path=null params={q=id:113&qt=&start=0&rows=20&version=2.2} hits=1 status=0 QTime=0
   [junit4]   2> NOTE: reproduce with: ant test  -Dtestcase=ParsingFieldUpdateProcessorsTest -Dtests.method=testParseFloatNonRootLocale -Dtests.seed=917D4659E782D7C8 -Dtests.multiplier=3 -Dtests.slow=true -Dtests.locale=pa -Dtests.timezone=America/Atikokan -Dtests.asserts=true -Dtests.file.encoding=UTF-8
   [junit4] FAILURE 0.08s J1 | ParsingFieldUpdateProcessorsTest.testParseFloatNonRootLocale <<<
   [junit4]    > Throwable #1: java.lang.AssertionError
   [junit4]    > at __randomizedtesting.SeedInfo.seed([917D4659E782D7C8:8AA1BB8847272BD5]:0)
   [junit4]    > at org.apache.solr.update.processor.ParsingFieldUpdateProcessorsTest.testParseFloatNonRootLocale(ParsingFieldUpdateProcessorsTest.java:471)
   [junit4]    > at java.base/jdk.internal.reflect.NativeMethodAccessorImpl.invoke0(Native Method)
   [junit4]    > at java.base/jdk.internal.reflect.NativeMethodAccessorImpl.invoke(NativeMethodAccessorImpl.java:62)
   [junit4]    > at java.base/jdk.internal.reflect.DelegatingMethodAccessorImpl.invoke(DelegatingMethodAccessorImpl.java:43)
   [junit4]    > at java.base/java.lang.reflect.Method.invoke(Method.java:567)
   [junit4]    > at java.base/java.lang.Thread.run(Thread.java:830)
   [junit4]   2> 4498979 INFO  (TEST-ParsingFieldUpdateProcessorsTest.testParseTrieDoubleRoundTrip-seed#[917D4659E782D7C8]) [     ] o.a.s.u.DirectUpdateHandler2 start commit{,optimize=false,openSearcher=true,waitSearcher=true,expungeDeletes=false,softCommit=false,prepareCommit=false}
   [junit4]   2> 4498979 INFO  (TEST-ParsingFieldUpdateProcessorsTest.testParseTrieDoubleRoundTrip-seed#[917D4659E782D7C8]) [     ] o.a.s.u.SolrIndexWriter Calling setCommitData with IW:org.apache.solr.update.SolrIndexWriter@2cebb8f8 commitCommandVersion:0
   [junit4]   2> 4498984 INFO  (TEST-ParsingFieldUpdateProcessorsTest.testParseTrieDoubleRoundTrip-seed#[917D4659E782D7C8]) [     ] o.a.s.s.SolrIndexSearcher Opening [Searcher@3e87c912[collection1] main]
   [junit4]   2> 4498985 INFO  (TEST-ParsingFieldUpdateProcessorsTest.testParseTrieDoubleRoundTrip-seed#[917D4659E782D7C8]) [     ] o.a.s.u.DirectUpdateHandler2 end_commit_flush
   [junit4]   2> 4498987 INFO  (searcherExecutor-14851-thread-1) [     ] o.a.s.c.SolrCore [collection1] Registered new searcher Searcher@3e87c912[collection1] main{ExitableDirectoryReader(UninvertingDirectoryReader(Uninverting(_7(9.0.0):C6/2:[diagnostics={java.vendor=Aleksey Shipilev, os.version=4.18.0-17-generic, mergeMaxNumSegments=-1, java.version=13-testing, java.vm.version=13-testing+0-builds.shipilev.net-openjdk-jdk13-b9-20190621-jdk-1326, lucene.version=9.0.0, timestamp=1561457169660, os=Linux, java.runtime.version=13-testing+0-builds.shipilev.net-openjdk-jdk13-b9-20190621-jdk-1326, mergeFactor=5, os.arch=amd64, source=merge}]:[attributes={Lucene50StoredFieldsFormat.mode=BEST_SPEED}]:delGen=1) Uninverting(_8(9.0.0):C3/1:[diagnostics={os.arch=amd64, java.runtime.version=13-testing+0-builds.shipilev.net-openjdk-jdk13-b9-20190621-jdk-1326, os.version=4.18.0-17-generic, os=Linux, java.vendor=Aleksey Shipilev, timestamp=1561457169812, java.version=13-testing, java.vm.version=13-testing+0-builds.shipilev.net-openjdk-jdk13-b9-20190621-jdk-1326, lucene.version=9.0.0, source=flush}]:[attributes={Lucene50StoredFieldsFormat.mode=BEST_SPEED}]:delGen=1)))}
   [junit4]   2> 4498988 INFO  (TEST-ParsingFieldUpdateProcessorsTest.testParseTrieDoubleRoundTrip-seed#[917D4659E782D7C8]) [     ] o.a.s.u.p.LogUpdateProcessorFactory [collection1]  webapp=null path=null params={}{commit=} 0 9
   [junit4]   2> 4498990 INFO  (TEST-ParsingFieldUpdateProcessorsTest.testParseTrieDoubleRoundTrip-seed#[917D4659E782D7C8]) [     ] o.a.s.c.S.Request [collection1]  webapp=null path=null params={q=id:728&qt=&start=0&rows=20&version=2.2} hits=1 status=0 QTime=1
   [junit4]   2> 4499001 INFO  (TEST-ParsingFieldUpdateProcessorsTest.testParseDateNonUTCdefaultTimeZoneRoundTrip-seed#[917D4659E782D7C8]) [     ] o.a.s.u.DirectUpdateHandler2 start commit{,optimize=false,openSearcher=true,waitSearcher=true,expungeDeletes=false,softCommit=false,prepareCommit=false}
   [junit4]   2> 4499001 INFO  (TEST-ParsingFieldUpdateProcessorsTest.testParseDateNonUTCdefaultTimeZoneRoundTrip-seed#[917D4659E782D7C8]) [     ] o.a.s.u.SolrIndexWriter Calling setCommitData with IW:org.apache.solr.update.SolrIndexWriter@2cebb8f8 commitCommandVersion:0
   [junit4]   2> 4499006 INFO  (TEST-ParsingFieldUpdateProcessorsTest.testParseDateNonUTCdefaultTimeZoneRoundTrip-seed#[917D4659E782D7C8]) [     ] o.a.s.s.SolrIndexSearcher Opening [Searcher@af982ee[collection1] main]
   [junit4]   2> 4499007 INFO  (TEST-ParsingFieldUpdateProcessorsTest.testParseDateNonUTCdefaultTimeZoneRoundTrip-seed#[917D4659E782D7C8]) [     ] o.a.s.u.DirectUpdateHandler2 end_commit_flush
   [junit4]   2> 4499009 INFO  (searcherExecutor-14851-thread-1) [     ] o.a.s.c.SolrCore [collection1] Registered new searcher Searcher@af982ee[collection1] main{ExitableDirectoryReader(UninvertingDirectoryReader(Uninverting(_9(9.0.0):C6:[diagnostics={java.vendor=Aleksey Shipilev, os.version=4.18.0-17-generic, mergeMaxNumSegments=-1, java.version=13-testing, java.vm.version=13-testing+0-builds.shipilev.net-openjdk-jdk13-b9-20190621-jdk-1326, lucene.version=9.0.0, timestamp=1561457169815, os=Linux, java.runtime.version=13-testing+0-builds.shipilev.net-openjdk-jdk13-b9-20190621-jdk-1326, mergeFactor=2, os.arch=amd64, source=merge}]:[attributes={Lucene50StoredFieldsFormat.mode=BEST_SPEED}]) Uninverting(_a(9.0.0):C1:[diagnostics={os.arch=amd64, java.runtime.version=13-testing+0-builds.shipilev.net-openjdk-jdk13-b9-20190621-jdk-1326, os.version=4.18.0-17-generic, os=Linux, java.vendor=Aleksey Shipilev, timestamp=1561457169835, java.version=13-testing, java.vm.version=13-testing+0-builds.shipilev.net-openjdk-jdk13-b9-20190621-jdk-1326, lucene.version=9.0.0, source=flush}]:[attributes={Lucene50StoredFieldsFormat.mode=BEST_SPEED}])))}
   [junit4]   2> 4499010 INFO  (TEST-ParsingFieldUpdateProcessorsTest.testParseDateNonUTCdefaultTimeZoneRoundTrip-seed#[917D4659E782D7C8]) [     ] o.a.s.u.p.LogUpdateProcessorFactory [collection1]  webapp=null path=null params={}{commit=} 0 8
   [junit4]   2> 4499010 INFO  (TEST-ParsingFieldUpdateProcessorsTest.testParseDateNonUTCdefaultTimeZoneRoundTrip-seed#[917D4659E782D7C8]) [     ] o.a.s.c.S.Request [collection1]  webapp=null path=null params={q=id:99&qt=&start=0&rows=20&version=2.2} hits=1 status=0 QTime=0
   [junit4]   2> Didn't test AKDT because only Java 1.8 does this right!  This Java version is: 13-testing
   [junit4]   2> 4499207 INFO  (TEST-ParsingFieldUpdateProcessorsTest.testParseTrieIntRoundTrip-seed#[917D4659E782D7C8]) [     ] o.a.s.u.DirectUpdateHandler2 start commit{,optimize=false,openSearcher=true,waitSearcher=true,expungeDeletes=false,softCommit=false,prepareCommit=false}
   [junit4]   2> 4499207 INFO  (TEST-ParsingFieldUpdateProcessorsTest.testParseTrieIntRoundTrip-seed#[917D4659E782D7C8]) [     ] o.a.s.u.SolrIndexWriter Calling setCommitData with IW:org.apache.solr.update.SolrIndexWriter@2cebb8f8 commitCommandVersion:0
   [junit4]   2> 4499213 INFO  (TEST-ParsingFieldUpdateProcessorsTest.testParseTrieIntRoundTrip-seed#[917D4659E782D7C8]) [     ] o.a.s.s.SolrIndexSearcher Opening [Searcher@31a286a3[collection1] main]
   [junit4]   2> 4499216 INFO  (searcherExecutor-14851-thread-1) [     ] o.a.s.c.SolrCore [collection1] Registered new searcher Searcher@31a286a3[collection1] main{ExitableDirectoryReader(UninvertingDirectoryReader(Uninverting(_9(9.0.0):C6/2:[diagnostics={java.vendor=Aleksey Shipilev, os.version=4.18.0-17-generic, mergeMaxNumSegments=-1, java.version=13-testing, java.vm.version=13-testing+0-builds.shipilev.net-openjdk-jdk13-b9-20190621-jdk-1326, lucene.version=9.0.0, timestamp=1561457169815, os=Linux, java.runtime.version=13-testing+0-builds.shipilev.net-openjdk-jdk13-b9-20190621-jdk-1326, mergeFactor=2, os.arch=amd64, source=merge}]:[attributes={Lucene50StoredFieldsFormat.mode=BEST_SPEED}]:delGen=1) Uninverting(_a(9.0.0):C1:[diagnostics={os.arch=amd64, java.runtime.version=13-testing+0-builds.shipilev.net-openjdk-jdk13-b9-20190621-jdk-1326, os.version=4.18.0-17-generic, os=Linux, java.vendor=Aleksey Shipilev, timestamp=1561457169835, java.version=13-testing, java.vm.version=13-testing+0-builds.shipilev.net-openjdk-jdk13-b9-20190621-jdk-1326, lucene.version=9.0.0, source=flush}]:[attributes={Lucene50StoredFieldsFormat.mode=BEST_SPEED}]) Uninverting(_b(9.0.0):C3/1:[diagnostics={os.arch=amd64, java.runtime.version=13-testing+0-builds.shipilev.net-openjdk-jdk13-b9-20190621-jdk-1326, os.version=4.18.0-17-generic, os=Linux, java.vendor=Aleksey Shipilev, timestamp=1561457170040, java.version=13-testing, java.vm.version=13-testing+0-builds.shipilev.net-openjdk-jdk13-b9-20190621-jdk-1326, lucene.version=9.0.0, source=flush}]:[attributes={Lucene50StoredFieldsFormat.mode=BEST_SPEED}]:delGen=1)))}
   [junit4]   2> 4499216 INFO  (TEST-ParsingFieldUpdateProcessorsTest.testParseTrieIntRoundTrip-seed#[917D4659E782D7C8]) [     ] o.a.s.u.DirectUpdateHandler2 end_commit_flush
   [junit4]   2> 4499216 INFO  (TEST-ParsingFieldUpdateProcessorsTest.testParseTrieIntRoundTrip-seed#[917D4659E782D7C8]) [     ] o.a.s.u.p.LogUpdateProcessorFactory [collection1]  webapp=null path=null params={}{commit=} 0 8
   [junit4]   2> 4499217 INFO  (TEST-ParsingFieldUpdateProcessorsTest.testParseTrieIntRoundTrip-seed#[917D4659E782D7C8]) [     ] o.a.s.c.S.Request [collection1]  webapp=null path=null params={q=id:113&qt=&start=0&rows=20&version=2.2} hits=1 status=0 QTime=0
   [junit4]   2> 4499237 INFO  (TEST-ParsingFieldUpdateProcessorsTest.testParseDateRoundTrip-seed#[917D4659E782D7C8]) [     ] o.a.s.u.DirectUpdateHandler2 start commit{,optimize=false,openSearcher=true,waitSearcher=true,expungeDeletes=false,softCommit=false,prepareCommit=false}
   [junit4]   2> 4499237 INFO  (TEST-ParsingFieldUpdateProcessorsTest.testParseDateRoundTrip-seed#[917D4659E782D7C8]) [     ] o.a.s.u.SolrIndexWriter Calling setCommitData with IW:org.apache.solr.update.SolrIndexWriter@2cebb8f8 commitCommandVersion:0
   [junit4]   2> 4499240 INFO  (TEST-ParsingFieldUpdateProcessorsTest.testParseDateRoundTrip-seed#[917D4659E782D7C8]) [     ] o.a.s.s.SolrIndexSearcher Opening [Searcher@246b28f5[collection1] main]
   [junit4]   2> 4499241 INFO  (TEST-ParsingFieldUpdateProcessorsTest.testParseDateRoundTrip-seed#[917D4659E782D7C8]) [     ] o.a.s.u.DirectUpdateHandler2 end_commit_flush
   [junit4]   2> 4499242 INFO  (searcherExecutor-14851-thread-1) [     ] o.a.s.c.SolrCore [collection1] Registered new searcher Searcher@246b28f5[collection1] main{ExitableDirectoryReader(UninvertingDirectoryReader(Uninverting(_9(9.0.0):C6/2:[diagnostics={java.vendor=Aleksey Shipilev, os.version=4.18.0-17-generic, mergeMaxNumSegments=-1, java.version=13-testing, java.vm.version=13-testing+0-builds.shipilev.net-openjdk-jdk13-b9-20190621-jdk-1326, lucene.version=9.0.0, timestamp=1561457169815, os=Linux, java.runtime.version=13-testing+0-builds.shipilev.net-openjdk-jdk13-b9-20190621-jdk-1326, mergeFactor=2, os.arch=amd64, source=merge}]:[attributes={Lucene50StoredFieldsFormat.mode=BEST_SPEED}]:delGen=1) Uninverting(_a(9.0.0):C1:[diagnostics={os.arch=amd64, java.runtime.version=13-testing+0-builds.shipilev.net-openjdk-jdk13-b9-20190621-jdk-1326, os.version=4.18.0-17-generic, os=Linux, java.vendor=Aleksey Shipilev, timestamp=1561457169835, java.version=13-testing, java.vm.version=13-testing+0-builds.shipilev.net-openjdk-jdk13-b9-20190621-jdk-1326, lucene.version=9.0.0, source=flush}]:[attributes={Lucene50StoredFieldsFormat.mode=BEST_SPEED}]) Uninverting(_b(9.0.0):C3/1:[diagnostics={os.arch=amd64, java.runtime.version=13-testing+0-builds.shipilev.net-openjdk-jdk13-b9-20190621-jdk-1326, os.version=4.18.0-17-generic, os=Linux, java.vendor=Aleksey Shipilev, timestamp=1561457170040, java.version=13-testing, java.vm.version=13-testing+0-builds.shipilev.net-openjdk-jdk13-b9-20190621-jdk-1326, lucene.version=9.0.0, source=flush}]:[attributes={Lucene50StoredFieldsFormat.mode=BEST_SPEED}]:delGen=1) Uninverting(_c(9.0.0):C1:[diagnostics={os.arch=amd64, java.runtime.version=13-testing+0-builds.shipilev.net-openjdk-jdk13-b9-20190621-jdk-1326, os.version=4.18.0-17-generic, os=Linux, java.vendor=Aleksey Shipilev, timestamp=1561457170070, java.version=13-testing, java.vm.version=13-testing+0-builds.shipilev.net-openjdk-jdk13-b9-20190621-jdk-1326, lucene.version=9.0.0, source=flush}]:[attributes={Lucene50StoredFieldsFormat.mode=BEST_SPEED}])))}
   [junit4]   2> 4499242 INFO  (TEST-ParsingFieldUpdateProcessorsTest.testParseDateRoundTrip-seed#[917D4659E782D7C8]) [     ] o.a.s.u.p.LogUpdateProcessorFactory [collection1]  webapp=null path=null params={}{commit=} 0 5
   [junit4]   2> 4499243 INFO  (TEST-ParsingFieldUpdateProcessorsTest.testParseDateRoundTrip-seed#[917D4659E782D7C8]) [     ] o.a.s.c.S.Request [collection1]  webapp=null path=null params={q=id:9&qt=&start=0&rows=20&version=2.2} hits=1 status=0 QTime=0
   [junit4]   2> 4499262 INFO  (TEST-ParsingFieldUpdateProcessorsTest.testISO8601-seed#[917D4659E782D7C8]) [     ] o.a.s.u.DirectUpdateHandler2 start commit{,optimize=false,openSearcher=true,waitSearcher=true,expungeDeletes=false,softCommit=false,prepareCommit=false}
   [junit4]   2> 4499262 INFO  (TEST-ParsingFieldUpdateProcessorsTest.testISO8601-seed#[917D4659E782D7C8]) [     ] o.a.s.u.SolrIndexWriter Calling setCommitData with IW:org.apache.solr.update.SolrIndexWriter@2cebb8f8 commitCommandVersion:0
   [junit4]   2> 4499264 INFO  (TEST-ParsingFieldUpdateProcessorsTest.testISO8601-seed#[917D4659E782D7C8]) [     ] o.a.s.s.SolrIndexSearcher Opening [Searcher@18d59291[collection1] main]
   [junit4]   2> 4499265 INFO  (TEST-ParsingFieldUpdateProcessorsTest.testISO8601-seed#[917D4659E782D7C8]) [     ] o.a.s.u.DirectUpdateHandler2 end_commit_flush
   [junit4]   2> 4499267 INFO  (searcherExecutor-14851-thread-1) [     ] o.a.s.c.SolrCore [collection1] Registered new searcher Searcher@18d59291[collection1] main{ExitableDirectoryReader(UninvertingDirectoryReader(Uninverting(_9(9.0.0):C6/2:[diagnostics={java.vendor=Aleksey Shipilev, os.version=4.18.0-17-generic, mergeMaxNumSegments=-1, java.version=13-testing, java.vm.version=13-testing+0-builds.shipilev.net-openjdk-jdk13-b9-20190621-jdk-1326, lucene.version=9.0.0, timestamp=1561457169815, os=Linux, java.runtime.version=13-testing+0-builds.shipilev.net-openjdk-jdk13-b9-20190621-jdk-1326, mergeFactor=2, os.arch=amd64, source=merge}]:[attributes={Lucene50StoredFieldsFormat.mode=BEST_SPEED}]:delGen=1) Uninverting(_a(9.0.0):C1:[diagnostics={os.arch=amd64, java.runtime.version=13-testing+0-builds.shipilev.net-openjdk-jdk13-b9-20190621-jdk-1326, os.version=4.18.0-17-generic, os=Linux, java.vendor=Aleksey Shipilev, timestamp=1561457169835, java.version=13-testing, java.vm.version=13-testing+0-builds.shipilev.net-openjdk-jdk13-b9-20190621-jdk-1326, lucene.version=9.0.0, source=flush}]:[attributes={Lucene50StoredFieldsFormat.mode=BEST_SPEED}]) Uninverting(_b(9.0.0):C3/2:[diagnostics={os.arch=amd64, java.runtime.version=13-testing+0-builds.shipilev.net-openjdk-jdk13-b9-20190621-jdk-1326, os.version=4.18.0-17-generic, os=Linux, java.vendor=Aleksey Shipilev, timestamp=1561457170040, java.version=13-testing, java.vm.version=13-testing+0-builds.shipilev.net-openjdk-jdk13-b9-20190621-jdk-1326, lucene.version=9.0.0, source=flush}]:[attributes={Lucene50StoredFieldsFormat.mode=BEST_SPEED}]:delGen=2) Uninverting(_c(9.0.0):C1:[diagnostics={os.arch=amd64, java.runtime.version=13-testing+0-builds.shipilev.net-openjdk-jdk13-b9-20190621-jdk-1326, os.version=4.18.0-17-generic, os=Linux, java.vendor=Aleksey Shipilev, timestamp=1561457170070, java.version=13-testing, java.vm.version=13-testing+0-builds.shipilev.net-openjdk-jdk13-b9-20190621-jdk-1326, lucene.version=9.0.0, source=flush}]:[attributes={Lucene50StoredFieldsFormat.mode=BEST_SPEED}]) Uninverting(_d(9.0.0):C1:[diagnostics={os.arch=amd64, java.runtime.version=13-testing+0-builds.shipilev.net-openjdk-jdk13-b9-20190621-jdk-1326, os.version=4.18.0-17-generic, os=Linux, java.vendor=Aleksey Shipilev, timestamp=1561457170095, java.version=13-testing, java.vm.version=13-testing+0-builds.shipilev.net-openjdk-jdk13-b9-20190621-jdk-1326, lucene.version=9.0.0, source=flush}]:[attributes={Lucene50StoredFieldsFormat.mode=BEST_SPEED}])))}
   [junit4]   2> 4499267 INFO  (TEST-ParsingFieldUpdateProcessorsTest.testISO8601-seed#[917D4659E782D7C8]) [     ] o.a.s.u.p.LogUpdateProcessorFactory [collection1]  webapp=null path=null params={}{commit=} 0 5
   [junit4]   2> 4499268 INFO  (TEST-ParsingFieldUpdateProcessorsTest.testISO8601-seed#[917D4659E782D7C8]) [     ] o.a.s.c.S.Request [collection1]  webapp=null path=null params={q=id:1&qt=&start=0&rows=20&version=2.2} hits=1 status=0 QTime=0
   [junit4]   2> 4499269 INFO  (TEST-ParsingFieldUpdateProcessorsTest.testISO8601-seed#[917D4659E782D7C8]) [     ] o.a.s.u.DirectUpdateHandler2 start commit{,optimize=false,openSearcher=true,waitSearcher=true,expungeDeletes=false,softCommit=false,prepareCommit=false}
   [junit4]   2> 4499269 INFO  (TEST-ParsingFieldUpdateProcessorsTest.testISO8601-seed#[917D4659E782D7C8]) [     ] o.a.s.u.SolrIndexWriter Calling setCommitData with IW:org.apache.solr.update.SolrIndexWriter@2cebb8f8 commitCommandVersion:0
   [junit4]   2> 4499273 INFO  (TEST-ParsingFieldUpdateProcessorsTest.testISO8601-seed#[917D4659E782D7C8]) [     ] o.a.s.s.SolrIndexSearcher Opening [Searcher@5f1f1d7e[collection1] main]
   [junit4]   2> 4499273 INFO  (TEST-ParsingFieldUpdateProcessorsTest.testISO8601-seed#[917D4659E782D7C8]) [     ] o.a.s.u.DirectUpdateHandler2 end_commit_flush
   [junit4]   2> 4499275 INFO  (searcherExecutor-14851-thread-1) [     ] o.a.s.c.SolrCore [collection1] Registered new searcher Searcher@5f1f1d7e[collection1] main{ExitableDirectoryReader(UninvertingDirectoryReader(Uninverting(_e(9.0.0):C8:[diagnostics={java.vendor=Aleksey Shipilev, os.version=4.18.0-17-generic, mergeMaxNumSegments=-1, java.version=13-testing, java.vm.version=13-testing+0-builds.shipilev.net-openjdk-jdk13-b9-20190621-jdk-1326, lucene.version=9.0.0, timestamp=1561457170096, os=Linux, java.runtime.version=13-testing+0-builds.shipilev.net-openjdk-jdk13-b9-20190621-jdk-1326, mergeFactor=5, os.arch=amd64, source=merge}]:[attributes={Lucene50StoredFieldsFormat.mode=BEST_SPEED}]) Uninverting(_f(9.0.0):C1:[diagnostics={os.arch=amd64, java.runtime.version=13-testing+0-builds.shipilev.net-openjdk-jdk13-b9-20190621-jdk-1326, os.version=4.18.0-17-generic, os=Linux, java.vendor=Aleksey Shipilev, timestamp=1561457170102, java.version=13-testing, java.vm.version=13-testing+0-builds.shipilev.net-openjdk-jdk13-b9-20190621-jdk-1326, lucene.version=9.0.0, source=flush}]:[attributes={Lucene50StoredFieldsFormat.mode=BEST_SPEED}])))}
   [junit4]   2> 4499276 INFO  (TEST-ParsingFieldUpdateProcessorsTest.testISO8601-seed#[917D4659E782D7C8]) [     ] o.a.s.u.p.LogUpdateProcessorFactory [collection1]  webapp=null path=null params={}{commit=} 0 6
   [junit4]   2> 4499276 INFO  (TEST-ParsingFieldUpdateProcessorsTest.testISO8601-seed#[917D4659E782D7C8]) [     ] o.a.s.c.S.Request [collection1]  webapp=null path=null params={q=id:2&qt=&start=0&rows=20&version=2.2} hits=1 status=0 QTime=0
   [junit4]   2> 4499280 INFO  (TEST-ParsingFieldUpdateProcessorsTest.testISO8601-seed#[917D4659E782D7C8]) [     ] o.a.s.u.DirectUpdateHandler2 start commit{,optimize=false,openSearcher=true,waitSearcher=true,expungeDeletes=false,softCommit=false,prepareCommit=false}
   [junit4]   2> 4499280 INFO  (TEST-ParsingFieldUpdateProcessorsTest.testISO8601-seed#[917D4659E782D7C8]) [     ] o.a.s.u.SolrIndexWriter Calling setCommitData with IW:org.apache.solr.update.SolrIndexWriter@2cebb8f8 commitCommandVersion:0
   [junit4]   2> 4499283 INFO  (TEST-ParsingFieldUpdateProcessorsTest.testISO8601-seed#[917D4659E782D7C8]) [     ] o.a.s.s.SolrIndexSearcher Opening [Searcher@8a39936[collection1] main]
   [junit4]   2> 4499284 INFO  (TEST-ParsingFieldUpdateProcessorsTest.testISO8601-seed#[917D4659E782D7C8]) [     ] o.a.s.u.DirectUpdateHandler2 end_commit_flush
   [junit4]   2> 4499286 INFO  (searcherExecutor-14851-thread-1) [     ] o.a.s.c.SolrCore [collection1] Registered new searcher Searcher@8a39936[collection1] main{ExitableDirectoryReader(UninvertingDirectoryReader(Uninverting(_e(9.0.0):C8:[diagnostics={java.vendor=Aleksey Shipilev, os.version=4.18.0-17-generic, mergeMaxNumSegments=-1, java.version=13-testing, java.vm.version=13-testing+0-builds.shipilev.net-openjdk-jdk13-b9-20190621-jdk-1326, lucene.version=9.0.0, timestamp=1561457170096, os=Linux, java.runtime.version=13-testing+0-builds.shipilev.net-openjdk-jdk13-b9-20190621-jdk-1326, mergeFactor=5, os.arch=amd64, source=merge}]:[attributes={Lucene50StoredFieldsFormat.mode=BEST_SPEED}]) Uninverting(_f(9.0.0):C1:[diagnostics={os.arch=amd64, java.runtime.version=13-testing+0-builds.shipilev.net-openjdk-jdk13-b9-20190621-jdk-1326, os.version=4.18.0-17-generic, os=Linux, java.vendor=Aleksey Shipilev, timestamp=1561457170102, java.version=13-testing, java.vm.version=13-testing+0-builds.shipilev.net-openjdk-jdk13-b9-20190621-jdk-1326, lucene.version=9.0.0, source=flush}]:[attributes={Lucene50StoredFieldsFormat.mode=BEST_SPEED}]) Uninverting(_g(9.0.0):C1:[diagnostics={os.arch=amd64, java.runtime.version=13-testing+0-builds.shipilev.net-openjdk-jdk13-b9-20190621-jdk-1326, os.version=4.18.0-17-generic, os=Linux, java.vendor=Aleksey Shipilev, timestamp=1561457170113, java.version=13-testing, java.vm.version=13-testing+0-builds.shipilev.net-openjdk-jdk13-b9-20190621-jdk-1326, lucene.version=9.0.0, source=flush}]:[attributes={Lucene50StoredFieldsFormat.mode=BEST_SPEED}])))}
   [junit4]   2> 4499286 INFO  (TEST-ParsingFieldUpdateProcessorsTest.testISO8601-seed#[917D4659E782D7C8]) [     ] o.a.s.u.p.LogUpdateProcessorFactory [collection1]  webapp=null path=null params={}{commit=} 0 6
   [junit4]   2> 4499287 INFO  (TEST-ParsingFieldUpdateProcessorsTest.testISO8601-seed#[917D4659E782D7C8]) [     ] o.a.s.c.S.Request [collection1]  webapp=null path=null params={q=id:3&qt=&start=0&rows=20&version=2.2} hits=1 status=0 QTime=0
   [junit4]   2> 4499288 INFO  (TEST-ParsingFieldUpdateProcessorsTest.testISO8601-seed#[917D4659E782D7C8]) [     ] o.a.s.u.DirectUpdateHandler2 start commit{,optimize=false,openSearcher=true,waitSearcher=true,expungeDeletes=false,softCommit=false,prepareCommit=false}
   [junit4]   2> 4499288 INFO  (TEST-ParsingFieldUpdateProcessorsTest.testISO8601-seed#[917D4659E782D7C8]) [     ] o.a.s.u.SolrIndexWriter Calling setCommitData with IW:org.apache.solr.update.SolrIndexWriter@2cebb8f8 commitCommandVersion:0
   [junit4]   2> 4499291 INFO  (TEST-ParsingFieldUpdateProcessorsTest.testISO8601-seed#[917D4659E782D7C8]) [     ] o.a.s.s.SolrIndexSearcher Opening [Searcher@38e7f110[collection1] main]
   [junit4]   2> 4499292 INFO  (TEST-ParsingFieldUpdateProcessorsTest.testISO8601-seed#[917D4659E782D7C8]) [     ] o.a.s.u.DirectUpdateHandler2 end_commit_flush
   [junit4]   2> 4499294 INFO  (searcherExecutor-14851-thread-1) [     ] o.a.s.c.SolrCore [collection1] Registered new searcher Searcher@38e7f110[collection1] main{ExitableDirectoryReader(UninvertingDirectoryReader(Uninverting(_e(9.0.0):C8:[diagnostics={java.vendor=Aleksey Shipilev, os.version=4.18.0-17-generic, mergeMaxNumSegments=-1, java.version=13-testing, java.vm.version=13-testing+0-builds.shipilev.net-openjdk-jdk13-b9-20190621-jdk-1326, lucene.version=9.0.0, timestamp=1561457170096, os=Linux, java.runtime.version=13-testing+0-builds.shipilev.net-openjdk-jdk13-b9-20190621-jdk-1326, mergeFactor=5, os.arch=amd64, source=merge}]:[attributes={Lucene50StoredFieldsFormat.mode=BEST_SPEED}]) Uninverting(_f(9.0.0):C1:[diagnostics={os.arch=amd64, java.runtime.version=13-testing+0-builds.shipilev.net-openjdk-jdk13-b9-20190621-jdk-1326, os.version=4.18.0-17-generic, os=Linux, java.vendor=Aleksey Shipilev, timestamp=1561457170102, java.version=13-testing, java.vm.version=13-testing+0-builds.shipilev.net-openjdk-jdk13-b9-20190621-jdk-1326, lucene.version=9.0.0, source=flush}]:[attributes={Lucene50StoredFieldsFormat.mode=BEST_SPEED}]) Uninverting(_g(9.0.0):C1:[diagnostics={os.arch=amd64, java.runtime.version=13-testing+0-builds.shipilev.net-openjdk-jdk13-b9-20190621-jdk-1326, os.version=4.18.0-17-generic, os=Linux, java.vendor=Aleksey Shipilev, timestamp=1561457170113, java.version=13-testing, java.vm.version=13-testing+0-builds.shipilev.net-openjdk-jdk13-b9-20190621-jdk-1326, lucene.version=9.0.0, source=flush}]:[attributes={Lucene50StoredFieldsFormat.mode=BEST_SPEED}]) Uninverting(_h(9.0.0):C1:[diagnostics={os.arch=amd64, java.runtime.version=13-testing+0-builds.shipilev.net-openjdk-jdk13-b9-20190621-jdk-1326, os.version=4.18.0-17-generic, os=Linux, java.vendor=Aleksey Shipilev, timestamp=1561457170121, java.version=13-testing, java.vm.version=13-testing+0-builds.shipilev.net-openjdk-jdk13-b9-20190621-jdk-1326, lucene.version=9.0.0, source=flush}]:[attributes={Lucene50StoredFieldsFormat.mode=BEST_SPEED}])))}
   [junit4]   2> 4499294 INFO  (TEST-ParsingFieldUpdateProcessorsTest.testISO8601-seed#[917D4659E782D7C8]) [     ] o.a.s.u.p.LogUpdateProcessorFactory [collection1]  webapp=null path=null params={}{commit=} 0 6
   [junit4]   2> 4499296 INFO  (TEST-ParsingFieldUpdateProcessorsTest.testISO8601-seed#[917D4659E782D7C8]) [     ] o.a.s.c.S.Request [collection1]  webapp=null path=null params={q=id:4&qt=&start=0&rows=20&version=2.2} hits=1 status=0 QTime=1
   [junit4]   2> 4499302 INFO  (TEST-ParsingFieldUpdateProcessorsTest.testISO8601-seed#[917D4659E782D7C8]) [     ] o.a.s.u.DirectUpdateHandler2 start commit{,optimize=false,openSearcher=true,waitSearcher=true,expungeDeletes=false,softCommit=false,prepareCommit=false}
   [junit4]   2> 4499302 INFO  (TEST-ParsingFieldUpdateProcessorsTest.testISO8601-seed#[917D4659E782D7C8]) [     ] o.a.s.u.SolrIndexWriter Calling setCommitData with IW:org.apache.solr.update.SolrIndexWriter@2cebb8f8 commitCommandVersion:0
   [junit4]   2> 4499306 INFO  (TEST-ParsingFieldUpdateProcessorsTest.testISO8601-seed#[917D4659E782D7C8]) [     ] o.a.s.s.SolrIndexSearcher Opening [Searcher@6fb43775[collection1] main]
   [junit4]   2> 4499306 INFO  (TEST-ParsingFieldUpdateProcessorsTest.testISO8601-seed#[917D4659E782D7C8]) [     ] o.a.s.u.DirectUpdateHandler2 end_commit_flush
   [junit4]   2> 4499308 INFO  (searcherExecutor-14851-thread-1) [     ] o.a.s.c.SolrCore [col

[...truncated too long message...]

_flush
   [junit4]   2> 37387 INFO  (TEST-ParsingFieldUpdateProcessorsTest.testParseTrieLongRoundTrip-seed#[917D4659E782D7C8]) [     ] o.a.s.u.p.LogUpdateProcessorFactory [collection1]  webapp=null path=null params={}{commit=} 0 17
   [junit4]   2> 37389 INFO  (TEST-ParsingFieldUpdateProcessorsTest.testParseTrieLongRoundTrip-seed#[917D4659E782D7C8]) [     ] o.a.s.c.S.Request [collection1]  webapp=null path=null params={q=id:113&qt=&start=0&rows=20&version=2.2} hits=1 status=0 QTime=1
   [junit4]   2> 37391 INFO  (TEST-ParsingFieldUpdateProcessorsTest.testParseTrieLongRoundTrip-seed#[917D4659E782D7C8]) [     ] o.a.s.SolrTestCaseJ4 ###Ending testParseTrieLongRoundTrip
   [junit4] OK      0.04s J1 | ParsingFieldUpdateProcessorsTest.testParseTrieLongRoundTrip
   [junit4]   2> 37414 INFO  (TEST-ParsingFieldUpdateProcessorsTest.testParseAlternateSingleValuesBooleans-seed#[917D4659E782D7C8]) [     ] o.a.s.SolrTestCaseJ4 ###Starting testParseAlternateSingleValuesBooleans
   [junit4]   2> 37414 INFO  (TEST-ParsingFieldUpdateProcessorsTest.testParseAlternateSingleValuesBooleans-seed#[917D4659E782D7C8]) [     ] o.a.s.SolrTestCaseJ4 ###Ending testParseAlternateSingleValuesBooleans
   [junit4] OK      0.02s J1 | ParsingFieldUpdateProcessorsTest.testParseAlternateSingleValuesBooleans
   [junit4]   2> 37430 INFO  (TEST-ParsingFieldUpdateProcessorsTest.testParseDoubleNonRootLocale-seed#[917D4659E782D7C8]) [     ] o.a.s.SolrTestCaseJ4 ###Starting testParseDoubleNonRootLocale
   [junit4]   2> 37431 INFO  (TEST-ParsingFieldUpdateProcessorsTest.testParseDoubleNonRootLocale-seed#[917D4659E782D7C8]) [     ] o.a.s.SolrTestCaseJ4 ###Ending testParseDoubleNonRootLocale
   [junit4]   2> NOTE: reproduce with: ant test  -Dtestcase=ParsingFieldUpdateProcessorsTest -Dtests.method=testParseDoubleNonRootLocale -Dtests.seed=917D4659E782D7C8 -Dtests.multiplier=3 -Dtests.slow=true -Dtests.badapples=true -Dtests.locale=pa -Dtests.timezone=America/Atikokan -Dtests.asserts=true -Dtests.file.encoding=UTF-8
   [junit4] FAILURE 0.02s J1 | ParsingFieldUpdateProcessorsTest.testParseDoubleNonRootLocale <<<
   [junit4]    > Throwable #1: java.lang.AssertionError
   [junit4]    > at __randomizedtesting.SeedInfo.seed([917D4659E782D7C8:86868BBEE3FABD2A]:0)
   [junit4]    > at org.apache.solr.update.processor.ParsingFieldUpdateProcessorsTest.testParseDoubleNonRootLocale(ParsingFieldUpdateProcessorsTest.java:573)
   [junit4]    > at java.base/jdk.internal.reflect.NativeMethodAccessorImpl.invoke0(Native Method)
   [junit4]    > at java.base/jdk.internal.reflect.NativeMethodAccessorImpl.invoke(NativeMethodAccessorImpl.java:62)
   [junit4]    > at java.base/jdk.internal.reflect.DelegatingMethodAccessorImpl.invoke(DelegatingMethodAccessorImpl.java:43)
   [junit4]    > at java.base/java.lang.reflect.Method.invoke(Method.java:567)
   [junit4]    > at java.base/java.lang.Thread.run(Thread.java:830)
   [junit4] OK      0.01s J1 | ParsingFieldUpdateProcessorsTest.testMixedFloats
   [junit4]   2> 37449 INFO  (TEST-ParsingFieldUpdateProcessorsTest.testMixedFloats-seed#[917D4659E782D7C8]) [     ] o.a.s.SolrTestCaseJ4 ###Starting testMixedFloats
   [junit4]   2> 37450 INFO  (TEST-ParsingFieldUpdateProcessorsTest.testMixedFloats-seed#[917D4659E782D7C8]) [     ] o.a.s.SolrTestCaseJ4 ###Ending testMixedFloats
   [junit4]   2> 37466 INFO  (TEST-ParsingFieldUpdateProcessorsTest.testFailedParseMixedFloat-seed#[917D4659E782D7C8]) [     ] o.a.s.SolrTestCaseJ4 ###Starting testFailedParseMixedFloat
   [junit4]   2> 37467 INFO  (TEST-ParsingFieldUpdateProcessorsTest.testFailedParseMixedFloat-seed#[917D4659E782D7C8]) [     ] o.a.s.SolrTestCaseJ4 ###Ending testFailedParseMixedFloat
   [junit4] OK      0.02s J1 | ParsingFieldUpdateProcessorsTest.testFailedParseMixedFloat
   [junit4]   2> 37475 INFO  (TEST-ParsingFieldUpdateProcessorsTest.testParseDateFieldNotInSchema-seed#[917D4659E782D7C8]) [     ] o.a.s.SolrTestCaseJ4 ###Starting testParseDateFieldNotInSchema
   [junit4]   2> 37476 INFO  (TEST-ParsingFieldUpdateProcessorsTest.testParseDateFieldNotInSchema-seed#[917D4659E782D7C8]) [     ] o.a.s.SolrTestCaseJ4 ###Ending testParseDateFieldNotInSchema
   [junit4] OK      0.01s J1 | ParsingFieldUpdateProcessorsTest.testParseDateFieldNotInSchema
   [junit4]   2> 37477 INFO  (SUITE-ParsingFieldUpdateProcessorsTest-seed#[917D4659E782D7C8]-worker) [     ] o.a.s.SolrTestCaseJ4 ###deleteCore
   [junit4]   2> 37477 INFO  (SUITE-ParsingFieldUpdateProcessorsTest-seed#[917D4659E782D7C8]-worker) [     ] o.a.s.c.CoreContainer Shutting down CoreContainer instance=1944075764
   [junit4]   2> 37480 INFO  (coreCloseExecutor-29-thread-1) [    x:collection1 ] o.a.s.c.SolrCore [collection1]  CLOSING SolrCore org.apache.solr.core.SolrCore@9274b1c
   [junit4]   2> 37481 INFO  (coreCloseExecutor-29-thread-1) [    x:collection1 ] o.a.s.m.SolrMetricManager Closing metric reporters for registry=solr.core.collection1, tag=9274b1c
   [junit4]   2> 37481 INFO  (coreCloseExecutor-29-thread-1) [    x:collection1 ] o.a.s.m.r.SolrJmxReporter Closing reporter [org.apache.solr.metrics.reporters.SolrJmxReporter@124bb5f3: rootName = null, domain = solr.core.collection1, service url = null, agent id = null] for registry solr.core.collection1 / com.codahale.metrics.MetricRegistry@bc4a410
   [junit4]   2> 37709 INFO  (SUITE-ParsingFieldUpdateProcessorsTest-seed#[917D4659E782D7C8]-worker) [     ] o.a.s.m.SolrMetricManager Closing metric reporters for registry=solr.node, tag=null
   [junit4]   2> 37709 INFO  (SUITE-ParsingFieldUpdateProcessorsTest-seed#[917D4659E782D7C8]-worker) [     ] o.a.s.m.r.SolrJmxReporter Closing reporter [org.apache.solr.metrics.reporters.SolrJmxReporter@208bead9: rootName = null, domain = solr.node, service url = null, agent id = null] for registry solr.node / com.codahale.metrics.MetricRegistry@2e72877a
   [junit4]   2> 37723 INFO  (SUITE-ParsingFieldUpdateProcessorsTest-seed#[917D4659E782D7C8]-worker) [     ] o.a.s.m.SolrMetricManager Closing metric reporters for registry=solr.jvm, tag=null
   [junit4]   2> 37723 INFO  (SUITE-ParsingFieldUpdateProcessorsTest-seed#[917D4659E782D7C8]-worker) [     ] o.a.s.m.r.SolrJmxReporter Closing reporter [org.apache.solr.metrics.reporters.SolrJmxReporter@1737c54d: rootName = null, domain = solr.jvm, service url = null, agent id = null] for registry solr.jvm / com.codahale.metrics.MetricRegistry@5a8395a0
   [junit4]   2> 37723 INFO  (SUITE-ParsingFieldUpdateProcessorsTest-seed#[917D4659E782D7C8]-worker) [     ] o.a.s.m.SolrMetricManager Closing metric reporters for registry=solr.jetty, tag=null
   [junit4]   2> 37723 INFO  (SUITE-ParsingFieldUpdateProcessorsTest-seed#[917D4659E782D7C8]-worker) [     ] o.a.s.m.r.SolrJmxReporter Closing reporter [org.apache.solr.metrics.reporters.SolrJmxReporter@539299b6: rootName = null, domain = solr.jetty, service url = null, agent id = null] for registry solr.jetty / com.codahale.metrics.MetricRegistry@60dfc8e5
   [junit4]   2> NOTE: leaving temporary files on disk at: /home/jenkins/workspace/Lucene-Solr-master-Linux/solr/build/solr-core/test/J1/temp/solr.update.processor.ParsingFieldUpdateProcessorsTest_917D4659E782D7C8-002
   [junit4]   2> NOTE: test params are: codec=Asserting(Lucene80): {id=Lucene50(blocksize=128), boolean1_b=BlockTreeOrds(blocksize=128), boolean2_b=Lucene50(blocksize=128)}, docValues:{}, maxPointsInLeafNode=1351, maxMBSortInHeap=5.230085574569893, sim=Asserting(org.apache.lucene.search.similarities.AssertingSimilarity@446865ae), locale=pa, timezone=America/Atikokan
   [junit4]   2> NOTE: Linux 4.18.0-17-generic amd64/Aleksey Shipilev 13-testing (64-bit)/cpus=8,threads=1,free=41061296,total=175112192
   [junit4]   2> NOTE: All tests run in this JVM: [ParsingFieldUpdateProcessorsTest, ParsingFieldUpdateProcessorsTest]
   [junit4] Completed [5/5 (5!)] on J1 in 5.24s, 42 tests, 2 failures <<< FAILURES!

[...truncated 20 lines...]
BUILD FAILED
/home/jenkins/workspace/Lucene-Solr-master-Linux/lucene/common-build.xml:1492: The following error occurred while executing this line:
/home/jenkins/workspace/Lucene-Solr-master-Linux/lucene/common-build.xml:1019: There were test failures: 5 suites, 210 tests, 10 failures [seed: 917D4659E782D7C8]

Total time: 44 seconds

[repro] Setting last failure code to 256

[repro] Failures:
[repro]   5/5 failed: org.apache.solr.update.processor.ParsingFieldUpdateProcessorsTest
[repro] Exiting with code 256
+ mv lucene/build lucene/build.repro
+ mv solr/build solr/build.repro
+ mv lucene/build.orig lucene/build
+ mv solr/build.orig solr/build
Archiving artifacts
Setting ANT_1_8_2_HOME=/home/jenkins/tools/hudson.tasks.Ant_AntInstallation/ANT_1.8.2
[WARNINGS] Parsing warnings in console log with parser Java Compiler (javac)
Setting ANT_1_8_2_HOME=/home/jenkins/tools/hudson.tasks.Ant_AntInstallation/ANT_1.8.2
No credentials specified
Setting ANT_1_8_2_HOME=/home/jenkins/tools/hudson.tasks.Ant_AntInstallation/ANT_1.8.2
<Git Blamer> Using GitBlamer to create author and commit information for all warnings.
<Git Blamer> GIT_COMMIT=742c80550c3c353f6b420e7f39487b78f034eb12, workspace=/home/jenkins/workspace/Lucene-Solr-master-Linux
[WARNINGS] Computing warning deltas based on reference build #24286
Recording test results
Setting ANT_1_8_2_HOME=/home/jenkins/tools/hudson.tasks.Ant_AntInstallation/ANT_1.8.2
Build step 'Publish JUnit test result report' changed build result to UNSTABLE
Email was triggered for: Unstable (Test Failures)
Sending email for trigger: Unstable (Test Failures)
Setting ANT_1_8_2_HOME=/home/jenkins/tools/hudson.tasks.Ant_AntInstallation/ANT_1.8.2
Setting ANT_1_8_2_HOME=/home/jenkins/tools/hudson.tasks.Ant_AntInstallation/ANT_1.8.2
Setting ANT_1_8_2_HOME=/home/jenkins/tools/hudson.tasks.Ant_AntInstallation/ANT_1.8.2
Setting ANT_1_8_2_HOME=/home/jenkins/tools/hudson.tasks.Ant_AntInstallation/ANT_1.8.2
Setting ANT_1_8_2_HOME=/home/jenkins/tools/hudson.tasks.Ant_AntInstallation/ANT_1.8.2
Setting ANT_1_8_2_HOME=/home/jenkins/tools/hudson.tasks.Ant_AntInstallation/ANT_1.8.2


---------------------------------------------------------------------
To unsubscribe, e-mail: [hidden email]
For additional commands, e-mail: [hidden email]
Reply | Threaded
Open this post in threaded view
|

[JENKINS] Lucene-Solr-master-Linux (64bit/jdk-11.0.3) - Build # 24288 - Failure!

Policeman Jenkins Server-2
Build: https://jenkins.thetaphi.de/job/Lucene-Solr-master-Linux/24288/
Java: 64bit/jdk-11.0.3 -XX:+UseCompressedOops -XX:+UseConcMarkSweepGC

All tests passed

Build Log:
[...truncated 2027 lines...]
   [junit4] JVM J2: stderr was not empty, see: /home/jenkins/workspace/Lucene-Solr-master-Linux/lucene/build/core/test/temp/junit4-J2-20190625_123131_99716972631816653492323.syserr
   [junit4] >>> JVM J2 emitted unexpected output (verbatim) ----
   [junit4] OpenJDK 64-Bit Server VM warning: Option UseConcMarkSweepGC was deprecated in version 9.0 and will likely be removed in a future release.
   [junit4] <<< JVM J2: EOF ----

[...truncated 3 lines...]
   [junit4] JVM J1: stderr was not empty, see: /home/jenkins/workspace/Lucene-Solr-master-Linux/lucene/build/core/test/temp/junit4-J1-20190625_123131_9979098626527546276364.syserr
   [junit4] >>> JVM J1 emitted unexpected output (verbatim) ----
   [junit4] OpenJDK 64-Bit Server VM warning: Option UseConcMarkSweepGC was deprecated in version 9.0 and will likely be removed in a future release.
   [junit4] <<< JVM J1: EOF ----

[...truncated 5 lines...]
   [junit4] JVM J0: stderr was not empty, see: /home/jenkins/workspace/Lucene-Solr-master-Linux/lucene/build/core/test/temp/junit4-J0-20190625_123131_9944618424786924930939.syserr
   [junit4] >>> JVM J0 emitted unexpected output (verbatim) ----
   [junit4] OpenJDK 64-Bit Server VM warning: Option UseConcMarkSweepGC was deprecated in version 9.0 and will likely be removed in a future release.
   [junit4] <<< JVM J0: EOF ----

[...truncated 304 lines...]
   [junit4] JVM J2: stderr was not empty, see: /home/jenkins/workspace/Lucene-Solr-master-Linux/lucene/build/test-framework/test/temp/junit4-J2-20190625_124450_5845196885864413129047.syserr
   [junit4] >>> JVM J2 emitted unexpected output (verbatim) ----
   [junit4] OpenJDK 64-Bit Server VM warning: Option UseConcMarkSweepGC was deprecated in version 9.0 and will likely be removed in a future release.
   [junit4] <<< JVM J2: EOF ----

   [junit4] JVM J0: stderr was not empty, see: /home/jenkins/workspace/Lucene-Solr-master-Linux/lucene/build/test-framework/test/temp/junit4-J0-20190625_124450_58312855730684505555463.syserr
   [junit4] >>> JVM J0 emitted unexpected output (verbatim) ----
   [junit4] OpenJDK 64-Bit Server VM warning: Option UseConcMarkSweepGC was deprecated in version 9.0 and will likely be removed in a future release.
   [junit4] <<< JVM J0: EOF ----

[...truncated 3 lines...]
   [junit4] JVM J1: stderr was not empty, see: /home/jenkins/workspace/Lucene-Solr-master-Linux/lucene/build/test-framework/test/temp/junit4-J1-20190625_124450_58415361790429310196683.syserr
   [junit4] >>> JVM J1 emitted unexpected output (verbatim) ----
   [junit4] OpenJDK 64-Bit Server VM warning: Option UseConcMarkSweepGC was deprecated in version 9.0 and will likely be removed in a future release.
   [junit4] <<< JVM J1: EOF ----

[...truncated 1075 lines...]
   [junit4] JVM J2: stderr was not empty, see: /home/jenkins/workspace/Lucene-Solr-master-Linux/lucene/build/analysis/common/test/temp/junit4-J2-20190625_124709_6147289507420539632540.syserr
   [junit4] >>> JVM J2 emitted unexpected output (verbatim) ----
   [junit4] OpenJDK 64-Bit Server VM warning: Option UseConcMarkSweepGC was deprecated in version 9.0 and will likely be removed in a future release.
   [junit4] <<< JVM J2: EOF ----

[...truncated 3 lines...]
   [junit4] JVM J1: stderr was not empty, see: /home/jenkins/workspace/Lucene-Solr-master-Linux/lucene/build/analysis/common/test/temp/junit4-J1-20190625_124709_6141341161645547638191.syserr
   [junit4] >>> JVM J1 emitted unexpected output (verbatim) ----
   [junit4] OpenJDK 64-Bit Server VM warning: Option UseConcMarkSweepGC was deprecated in version 9.0 and will likely be removed in a future release.
   [junit4] <<< JVM J1: EOF ----

[...truncated 3 lines...]
   [junit4] JVM J0: stderr was not empty, see: /home/jenkins/workspace/Lucene-Solr-master-Linux/lucene/build/analysis/common/test/temp/junit4-J0-20190625_124709_61416371864529539155358.syserr
   [junit4] >>> JVM J0 emitted unexpected output (verbatim) ----
   [junit4] OpenJDK 64-Bit Server VM warning: Option UseConcMarkSweepGC was deprecated in version 9.0 and will likely be removed in a future release.
   [junit4] <<< JVM J0: EOF ----

[...truncated 238 lines...]
   [junit4] JVM J1: stderr was not empty, see: /home/jenkins/workspace/Lucene-Solr-master-Linux/lucene/build/analysis/icu/test/temp/junit4-J1-20190625_125037_19417900935109246381755.syserr
   [junit4] >>> JVM J1 emitted unexpected output (verbatim) ----
   [junit4] OpenJDK 64-Bit Server VM warning: Option UseConcMarkSweepGC was deprecated in version 9.0 and will likely be removed in a future release.
   [junit4] <<< JVM J1: EOF ----

[...truncated 9 lines...]
   [junit4] JVM J2: stderr was not empty, see: /home/jenkins/workspace/Lucene-Solr-master-Linux/lucene/build/analysis/icu/test/temp/junit4-J2-20190625_125037_19410869585898251063004.syserr
   [junit4] >>> JVM J2 emitted unexpected output (verbatim) ----
   [junit4] OpenJDK 64-Bit Server VM warning: Option UseConcMarkSweepGC was deprecated in version 9.0 and will likely be removed in a future release.
   [junit4] <<< JVM J2: EOF ----

   [junit4] JVM J0: stderr was not empty, see: /home/jenkins/workspace/Lucene-Solr-master-Linux/lucene/build/analysis/icu/test/temp/junit4-J0-20190625_125037_1942148828980533455641.syserr
   [junit4] >>> JVM J0 emitted unexpected output (verbatim) ----
   [junit4] OpenJDK 64-Bit Server VM warning: Option UseConcMarkSweepGC was deprecated in version 9.0 and will likely be removed in a future release.
   [junit4] <<< JVM J0: EOF ----

[...truncated 233 lines...]
   [junit4] JVM J1: stderr was not empty, see: /home/jenkins/workspace/Lucene-Solr-master-Linux/lucene/build/analysis/kuromoji/test/temp/junit4-J1-20190625_125056_8436258820011960652908.syserr
   [junit4] >>> JVM J1 emitted unexpected output (verbatim) ----
   [junit4] OpenJDK 64-Bit Server VM warning: Option UseConcMarkSweepGC was deprecated in version 9.0 and will likely be removed in a future release.
   [junit4] <<< JVM J1: EOF ----

[...truncated 14 lines...]
   [junit4] JVM J2: stderr was not empty, see: /home/jenkins/workspace/Lucene-Solr-master-Linux/lucene/build/analysis/kuromoji/test/temp/junit4-J2-20190625_125056_8436532858311890872239.syserr
   [junit4] >>> JVM J2 emitted unexpected output (verbatim) ----
   [junit4] OpenJDK 64-Bit Server VM warning: Option UseConcMarkSweepGC was deprecated in version 9.0 and will likely be removed in a future release.
   [junit4] <<< JVM J2: EOF ----

   [junit4] JVM J0: stderr was not empty, see: /home/jenkins/workspace/Lucene-Solr-master-Linux/lucene/build/analysis/kuromoji/test/temp/junit4-J0-20190625_125056_8432253098890227029589.syserr
   [junit4] >>> JVM J0 emitted unexpected output (verbatim) ----
   [junit4] OpenJDK 64-Bit Server VM warning: Option UseConcMarkSweepGC was deprecated in version 9.0 and will likely be removed in a future release.
   [junit4] <<< JVM J0: EOF ----

[...truncated 154 lines...]
   [junit4] JVM J1: stderr was not empty, see: /home/jenkins/workspace/Lucene-Solr-master-Linux/lucene/build/analysis/morfologik/test/temp/junit4-J1-20190625_125138_6016199524326495896079.syserr
   [junit4] >>> JVM J1 emitted unexpected output (verbatim) ----
   [junit4] OpenJDK 64-Bit Server VM warning: Option UseConcMarkSweepGC was deprecated in version 9.0 and will likely be removed in a future release.
   [junit4] <<< JVM J1: EOF ----

[...truncated 3 lines...]
   [junit4] JVM J0: stderr was not empty, see: /home/jenkins/workspace/Lucene-Solr-master-Linux/lucene/build/analysis/morfologik/test/temp/junit4-J0-20190625_125138_60117411844252576030740.syserr
   [junit4] >>> JVM J0 emitted unexpected output (verbatim) ----
   [junit4] OpenJDK 64-Bit Server VM warning: Option UseConcMarkSweepGC was deprecated in version 9.0 and will likely be removed in a future release.
   [junit4] <<< JVM J0: EOF ----

[...truncated 3 lines...]
   [junit4] JVM J2: stderr was not empty, see: /home/jenkins/workspace/Lucene-Solr-master-Linux/lucene/build/analysis/morfologik/test/temp/junit4-J2-20190625_125138_6011428732009400238328.syserr
   [junit4] >>> JVM J2 emitted unexpected output (verbatim) ----
   [junit4] OpenJDK 64-Bit Server VM warning: Option UseConcMarkSweepGC was deprecated in version 9.0 and will likely be removed in a future release.
   [junit4] <<< JVM J2: EOF ----

[...truncated 206 lines...]
   [junit4] JVM J0: stderr was not empty, see: /home/jenkins/workspace/Lucene-Solr-master-Linux/lucene/build/analysis/nori/test/temp/junit4-J0-20190625_125145_6633130783130435654748.syserr
   [junit4] >>> JVM J0 emitted unexpected output (verbatim) ----
   [junit4] OpenJDK 64-Bit Server VM warning: Option UseConcMarkSweepGC was deprecated in version 9.0 and will likely be removed in a future release.
   [junit4] <<< JVM J0: EOF ----

[...truncated 6 lines...]
   [junit4] JVM J1: stderr was not empty, see: /home/jenkins/workspace/Lucene-Solr-master-Linux/lucene/build/analysis/nori/test/temp/junit4-J1-20190625_125145_6631899396054378896516.syserr
   [junit4] >>> JVM J1 emitted unexpected output (verbatim) ----
   [junit4] OpenJDK 64-Bit Server VM warning: Option UseConcMarkSweepGC was deprecated in version 9.0 and will likely be removed in a future release.
   [junit4] <<< JVM J1: EOF ----

[...truncated 3 lines...]
   [junit4] JVM J2: stderr was not empty, see: /home/jenkins/workspace/Lucene-Solr-master-Linux/lucene/build/analysis/nori/test/temp/junit4-J2-20190625_125145_6634767187492986614472.syserr
   [junit4] >>> JVM J2 emitted unexpected output (verbatim) ----
   [junit4] OpenJDK 64-Bit Server VM warning: Option UseConcMarkSweepGC was deprecated in version 9.0 and will likely be removed in a future release.
   [junit4] <<< JVM J2: EOF ----

[...truncated 163 lines...]
   [junit4] JVM J2: stderr was not empty, see: /home/jenkins/workspace/Lucene-Solr-master-Linux/lucene/build/analysis/opennlp/test/temp/junit4-J2-20190625_125207_2931158791861030898626.syserr
   [junit4] >>> JVM J2 emitted unexpected output (verbatim) ----
   [junit4] OpenJDK 64-Bit Server VM warning: Option UseConcMarkSweepGC was deprecated in version 9.0 and will likely be removed in a future release.
   [junit4] <<< JVM J2: EOF ----

   [junit4] JVM J1: stderr was not empty, see: /home/jenkins/workspace/Lucene-Solr-master-Linux/lucene/build/analysis/opennlp/test/temp/junit4-J1-20190625_125207_29318041205177140215907.syserr
   [junit4] >>> JVM J1 emitted unexpected output (verbatim) ----
   [junit4] OpenJDK 64-Bit Server VM warning: Option UseConcMarkSweepGC was deprecated in version 9.0 and will likely be removed in a future release.
   [junit4] <<< JVM J1: EOF ----

[...truncated 3 lines...]
   [junit4] JVM J0: stderr was not empty, see: /home/jenkins/workspace/Lucene-Solr-master-Linux/lucene/build/analysis/opennlp/test/temp/junit4-J0-20190625_125207_29314716055349422997860.syserr
   [junit4] >>> JVM J0 emitted unexpected output (verbatim) ----
   [junit4] OpenJDK 64-Bit Server VM warning: Option UseConcMarkSweepGC was deprecated in version 9.0 and will likely be removed in a future release.
   [junit4] <<< JVM J0: EOF ----

[...truncated 168 lines...]
   [junit4] JVM J2: stderr was not empty, see: /home/jenkins/workspace/Lucene-Solr-master-Linux/lucene/build/analysis/phonetic/test/temp/junit4-J2-20190625_125211_55326126596668568176.syserr
   [junit4] >>> JVM J2 emitted unexpected output (verbatim) ----
   [junit4] OpenJDK 64-Bit Server VM warning: Option UseConcMarkSweepGC was deprecated in version 9.0 and will likely be removed in a future release.
   [junit4] <<< JVM J2: EOF ----

[...truncated 6 lines...]
   [junit4] JVM J1: stderr was not empty, see: /home/jenkins/workspace/Lucene-Solr-master-Linux/lucene/build/analysis/phonetic/test/temp/junit4-J1-20190625_125211_5532027300486461332504.syserr
   [junit4] >>> JVM J1 emitted unexpected output (verbatim) ----
   [junit4] OpenJDK 64-Bit Server VM warning: Option UseConcMarkSweepGC was deprecated in version 9.0 and will likely be removed in a future release.
   [junit4] <<< JVM J1: EOF ----

   [junit4] JVM J0: stderr was not empty, see: /home/jenkins/workspace/Lucene-Solr-master-Linux/lucene/build/analysis/phonetic/test/temp/junit4-J0-20190625_125211_5536227600121013775615.syserr
   [junit4] >>> JVM J0 emitted unexpected output (verbatim) ----
   [junit4] OpenJDK 64-Bit Server VM warning: Option UseConcMarkSweepGC was deprecated in version 9.0 and will likely be removed in a future release.
   [junit4] <<< JVM J0: EOF ----

[...truncated 153 lines...]
   [junit4] JVM J0: stderr was not empty, see: /home/jenkins/workspace/Lucene-Solr-master-Linux/lucene/build/analysis/smartcn/test/temp/junit4-J0-20190625_125225_1471152934056048052153.syserr
   [junit4] >>> JVM J0 emitted unexpected output (verbatim) ----
   [junit4] OpenJDK 64-Bit Server VM warning: Option UseConcMarkSweepGC was deprecated in version 9.0 and will likely be removed in a future release.
   [junit4] <<< JVM J0: EOF ----

[...truncated 3 lines...]
   [junit4] JVM J1: stderr was not empty, see: /home/jenkins/workspace/Lucene-Solr-master-Linux/lucene/build/analysis/smartcn/test/temp/junit4-J1-20190625_125225_147987031687806475705.syserr
   [junit4] >>> JVM J1 emitted unexpected output (verbatim) ----
   [junit4] OpenJDK 64-Bit Server VM warning: Option UseConcMarkSweepGC was deprecated in version 9.0 and will likely be removed in a future release.
   [junit4] <<< JVM J1: EOF ----

[...truncated 154 lines...]
   [junit4] JVM J2: stderr was not empty, see: /home/jenkins/workspace/Lucene-Solr-master-Linux/lucene/build/analysis/stempel/test/temp/junit4-J2-20190625_125236_3856124777621487436348.syserr
   [junit4] >>> JVM J2 emitted unexpected output (verbatim) ----
   [junit4] OpenJDK 64-Bit Server VM warning: Option UseConcMarkSweepGC was deprecated in version 9.0 and will likely be removed in a future release.
   [junit4] <<< JVM J2: EOF ----

[...truncated 3 lines...]
   [junit4] JVM J1: stderr was not empty, see: /home/jenkins/workspace/Lucene-Solr-master-Linux/lucene/build/analysis/stempel/test/temp/junit4-J1-20190625_125236_38415784298785999123156.syserr
   [junit4] >>> JVM J1 emitted unexpected output (verbatim) ----
   [junit4] OpenJDK 64-Bit Server VM warning: Option UseConcMarkSweepGC was deprecated in version 9.0 and will likely be removed in a future release.
   [junit4] <<< JVM J1: EOF ----

[...truncated 3 lines...]
   [junit4] JVM J0: stderr was not empty, see: /home/jenkins/workspace/Lucene-Solr-master-Linux/lucene/build/analysis/stempel/test/temp/junit4-J0-20190625_125236_3847140582862970673516.syserr
   [junit4] >>> JVM J0 emitted unexpected output (verbatim) ----
   [junit4] OpenJDK 64-Bit Server VM warning: Option UseConcMarkSweepGC was deprecated in version 9.0 and will likely be removed in a future release.
   [junit4] <<< JVM J0: EOF ----

[...truncated 178 lines...]
   [junit4] JVM J0: stderr was not empty, see: /home/jenkins/workspace/Lucene-Solr-master-Linux/lucene/build/backward-codecs/test/temp/junit4-J0-20190625_125240_62118039020423066202541.syserr
   [junit4] >>> JVM J0 emitted unexpected output (verbatim) ----
   [junit4] OpenJDK 64-Bit Server VM warning: Option UseConcMarkSweepGC was deprecated in version 9.0 and will likely be removed in a future release.
   [junit4] <<< JVM J0: EOF ----

[...truncated 9 lines...]
   [junit4] JVM J1: stderr was not empty, see: /home/jenkins/workspace/Lucene-Solr-master-Linux/lucene/build/backward-codecs/test/temp/junit4-J1-20190625_125240_62112125050323797541637.syserr
   [junit4] >>> JVM J1 emitted unexpected output (verbatim) ----
   [junit4] OpenJDK 64-Bit Server VM warning: Option UseConcMarkSweepGC was deprecated in version 9.0 and will likely be removed in a future release.
   [junit4] <<< JVM J1: EOF ----

[...truncated 9 lines...]
   [junit4] JVM J2: stderr was not empty, see: /home/jenkins/workspace/Lucene-Solr-master-Linux/lucene/build/backward-codecs/test/temp/junit4-J2-20190625_125240_6213971527401033272388.syserr
   [junit4] >>> JVM J2 emitted unexpected output (verbatim) ----
   [junit4] OpenJDK 64-Bit Server VM warning: Option UseConcMarkSweepGC was deprecated in version 9.0 and will likely be removed in a future release.
   [junit4] <<< JVM J2: EOF ----

[...truncated 1434 lines...]
   [junit4] JVM J2: stderr was not empty, see: /home/jenkins/workspace/Lucene-Solr-master-Linux/lucene/build/benchmark/test/temp/junit4-J2-20190625_125630_34817697035950003202773.syserr
   [junit4] >>> JVM J2 emitted unexpected output (verbatim) ----
   [junit4] OpenJDK 64-Bit Server VM warning: Option UseConcMarkSweepGC was deprecated in version 9.0 and will likely be removed in a future release.
   [junit4] <<< JVM J2: EOF ----

[...truncated 3 lines...]
   [junit4] JVM J1: stderr was not empty, see: /home/jenkins/workspace/Lucene-Solr-master-Linux/lucene/build/benchmark/test/temp/junit4-J1-20190625_125630_3488086099242592114150.syserr
   [junit4] >>> JVM J1 emitted unexpected output (verbatim) ----
   [junit4] OpenJDK 64-Bit Server VM warning: Option UseConcMarkSweepGC was deprecated in version 9.0 and will likely be removed in a future release.
   [junit4] <<< JVM J1: EOF ----

[...truncated 6 lines...]
   [junit4] JVM J0: stderr was not empty, see: /home/jenkins/workspace/Lucene-Solr-master-Linux/lucene/build/benchmark/test/temp/junit4-J0-20190625_125630_3489478886465900391238.syserr
   [junit4] >>> JVM J0 emitted unexpected output (verbatim) ----
   [junit4] OpenJDK 64-Bit Server VM warning: Option UseConcMarkSweepGC was deprecated in version 9.0 and will likely be removed in a future release.
   [junit4] <<< JVM J0: EOF ----

[...truncated 235 lines...]
   [junit4] JVM J0: stderr was not empty, see: /home/jenkins/workspace/Lucene-Solr-master-Linux/lucene/build/classification/test/temp/junit4-J0-20190625_125644_7261494626560627426229.syserr
   [junit4] >>> JVM J0 emitted unexpected output (verbatim) ----
   [junit4] OpenJDK 64-Bit Server VM warning: Option UseConcMarkSweepGC was deprecated in version 9.0 and will likely be removed in a future release.
   [junit4] <<< JVM J0: EOF ----

[...truncated 6 lines...]
   [junit4] JVM J2: stderr was not empty, see: /home/jenkins/workspace/Lucene-Solr-master-Linux/lucene/build/classification/test/temp/junit4-J2-20190625_125644_72618181772249238794059.syserr
   [junit4] >>> JVM J2 emitted unexpected output (verbatim) ----
   [junit4] OpenJDK 64-Bit Server VM warning: Option UseConcMarkSweepGC was deprecated in version 9.0 and will likely be removed in a future release.
   [junit4] <<< JVM J2: EOF ----

   [junit4] JVM J1: stderr was not empty, see: /home/jenkins/workspace/Lucene-Solr-master-Linux/lucene/build/classification/test/temp/junit4-J1-20190625_125644_7262317289900275212883.syserr
   [junit4] >>> JVM J1 emitted unexpected output (verbatim) ----
   [junit4] OpenJDK 64-Bit Server VM warning: Option UseConcMarkSweepGC was deprecated in version 9.0 and will likely be removed in a future release.
   [junit4] <<< JVM J1: EOF ----

[...truncated 250 lines...]
   [junit4] JVM J2: stderr was not empty, see: /home/jenkins/workspace/Lucene-Solr-master-Linux/lucene/build/codecs/test/temp/junit4-J2-20190625_125700_4824448052167712278570.syserr
   [junit4] >>> JVM J2 emitted unexpected output (verbatim) ----
   [junit4] OpenJDK 64-Bit Server VM warning: Option UseConcMarkSweepGC was deprecated in version 9.0 and will likely be removed in a future release.
   [junit4] <<< JVM J2: EOF ----

[...truncated 7 lines...]
   [junit4] JVM J1: stderr was not empty, see: /home/jenkins/workspace/Lucene-Solr-master-Linux/lucene/build/codecs/test/temp/junit4-J1-20190625_125700_4829870972949838835454.syserr
   [junit4] >>> JVM J1 emitted unexpected output (verbatim) ----
   [junit4] OpenJDK 64-Bit Server VM warning: Option UseConcMarkSweepGC was deprecated in version 9.0 and will likely be removed in a future release.
   [junit4] <<< JVM J1: EOF ----

[...truncated 9 lines...]
   [junit4] JVM J0: stderr was not empty, see: /home/jenkins/workspace/Lucene-Solr-master-Linux/lucene/build/codecs/test/temp/junit4-J0-20190625_125700_48211393183938786460133.syserr
   [junit4] >>> JVM J0 emitted unexpected output (verbatim) ----
   [junit4] OpenJDK 64-Bit Server VM warning: Option UseConcMarkSweepGC was deprecated in version 9.0 and will likely be removed in a future release.
   [junit4] <<< JVM J0: EOF ----

[...truncated 209 lines...]
   [junit4] JVM J2: stderr was not empty, see: /home/jenkins/workspace/Lucene-Solr-master-Linux/lucene/build/demo/test/temp/junit4-J2-20190625_130052_21417569715208759305630.syserr
   [junit4] >>> JVM J2 emitted unexpected output (verbatim) ----
   [junit4] OpenJDK 64-Bit Server VM warning: Option UseConcMarkSweepGC was deprecated in version 9.0 and will likely be removed in a future release.
   [junit4] <<< JVM J2: EOF ----

[...truncated 3 lines...]
   [junit4] JVM J1: stderr was not empty, see: /home/jenkins/workspace/Lucene-Solr-master-Linux/lucene/build/demo/test/temp/junit4-J1-20190625_130052_213242050156085832380.syserr
   [junit4] >>> JVM J1 emitted unexpected output (verbatim) ----
   [junit4] OpenJDK 64-Bit Server VM warning: Option UseConcMarkSweepGC was deprecated in version 9.0 and will likely be removed in a future release.
   [junit4] <<< JVM J1: EOF ----

   [junit4] JVM J0: stderr was not empty, see: /home/jenkins/workspace/Lucene-Solr-master-Linux/lucene/build/demo/test/temp/junit4-J0-20190625_130052_21314996499138347920813.syserr
   [junit4] >>> JVM J0 emitted unexpected output (verbatim) ----
   [junit4] OpenJDK 64-Bit Server VM warning: Option UseConcMarkSweepGC was deprecated in version 9.0 and will likely be removed in a future release.
   [junit4] <<< JVM J0: EOF ----

[...truncated 173 lines...]
   [junit4] JVM J1: stderr was not empty, see: /home/jenkins/workspace/Lucene-Solr-master-Linux/lucene/build/expressions/test/temp/junit4-J1-20190625_130056_50310423398437562746917.syserr
   [junit4] >>> JVM J1 emitted unexpected output (verbatim) ----
   [junit4] OpenJDK 64-Bit Server VM warning: Option UseConcMarkSweepGC was deprecated in version 9.0 and will likely be removed in a future release.
   [junit4] <<< JVM J1: EOF ----

   [junit4] JVM J0: stderr was not empty, see: /home/jenkins/workspace/Lucene-Solr-master-Linux/lucene/build/expressions/test/temp/junit4-J0-20190625_130056_50315027254347583819336.syserr
   [junit4] >>> JVM J0 emitted unexpected output (verbatim) ----
   [junit4] OpenJDK 64-Bit Server VM warning: Option UseConcMarkSweepGC was deprecated in version 9.0 and will likely be removed in a future release.
   [junit4] <<< JVM J0: EOF ----

[...truncated 3 lines...]
   [junit4] JVM J2: stderr was not empty, see: /home/jenkins/workspace/Lucene-Solr-master-Linux/lucene/build/expressions/test/temp/junit4-J2-20190625_130056_50313209235291206455176.syserr
   [junit4] >>> JVM J2 emitted unexpected output (verbatim) ----
   [junit4] OpenJDK 64-Bit Server VM warning: Option UseConcMarkSweepGC was deprecated in version 9.0 and will likely be removed in a future release.
   [junit4] <<< JVM J2: EOF ----

[...truncated 232 lines...]
   [junit4] JVM J2: stderr was not empty, see: /home/jenkins/workspace/Lucene-Solr-master-Linux/lucene/build/facet/test/temp/junit4-J2-20190625_130106_97611084405231528762985.syserr
   [junit4] >>> JVM J2 emitted unexpected output (verbatim) ----
   [junit4] OpenJDK 64-Bit Server VM warning: Option UseConcMarkSweepGC was deprecated in version 9.0 and will likely be removed in a future release.
   [junit4] <<< JVM J2: EOF ----

   [junit4] JVM J0: stderr was not empty, see: /home/jenkins/workspace/Lucene-Solr-master-Linux/lucene/build/facet/test/temp/junit4-J0-20190625_130106_97616224160874631290284.syserr
   [junit4] >>> JVM J0 emitted unexpected output (verbatim) ----
   [junit4] OpenJDK 64-Bit Server VM warning: Option UseConcMarkSweepGC was deprecated in version 9.0 and will likely be removed in a future release.
   [junit4] <<< JVM J0: EOF ----

   [junit4] JVM J1: stderr was not empty, see: /home/jenkins/workspace/Lucene-Solr-master-Linux/lucene/build/facet/test/temp/junit4-J1-20190625_130106_97610815355986672122716.syserr
   [junit4] >>> JVM J1 emitted unexpected output (verbatim) ----
   [junit4] OpenJDK 64-Bit Server VM warning: Option UseConcMarkSweepGC was deprecated in version 9.0 and will likely be removed in a future release.
   [junit4] <<< JVM J1: EOF ----

[...truncated 179 lines...]
   [junit4] JVM J0: stderr was not empty, see: /home/jenkins/workspace/Lucene-Solr-master-Linux/lucene/build/grouping/test/temp/junit4-J0-20190625_130147_1505225010436265842459.syserr
   [junit4] >>> JVM J0 emitted unexpected output (verbatim) ----
   [junit4] OpenJDK 64-Bit Server VM warning: Option UseConcMarkSweepGC was deprecated in version 9.0 and will likely be removed in a future release.
   [junit4] <<< JVM J0: EOF ----

[...truncated 6 lines...]
   [junit4] JVM J2: stderr was not empty, see: /home/jenkins/workspace/Lucene-Solr-master-Linux/lucene/build/grouping/test/temp/junit4-J2-20190625_130147_15017154512637692553028.syserr
   [junit4] >>> JVM J2 emitted unexpected output (verbatim) ----
   [junit4] OpenJDK 64-Bit Server VM warning: Option UseConcMarkSweepGC was deprecated in version 9.0 and will likely be removed in a future release.
   [junit4] <<< JVM J2: EOF ----

   [junit4] JVM J1: stderr was not empty, see: /home/jenkins/workspace/Lucene-Solr-master-Linux/lucene/build/grouping/test/temp/junit4-J1-20190625_130147_1502653016054511984070.syserr
   [junit4] >>> JVM J1 emitted unexpected output (verbatim) ----
   [junit4] OpenJDK 64-Bit Server VM warning: Option UseConcMarkSweepGC was deprecated in version 9.0 and will likely be removed in a future release.
   [junit4] <<< JVM J1: EOF ----

[...truncated 243 lines...]
   [junit4] JVM J1: stderr was not empty, see: /home/jenkins/workspace/Lucene-Solr-master-Linux/lucene/build/highlighter/test/temp/junit4-J1-20190625_130203_51410902139392460376554.syserr
   [junit4] >>> JVM J1 emitted unexpected output (verbatim) ----
   [junit4] OpenJDK 64-Bit Server VM warning: Option UseConcMarkSweepGC was deprecated in version 9.0 and will likely be removed in a future release.
   [junit4] <<< JVM J1: EOF ----

[...truncated 3 lines...]
   [junit4] JVM J0: stderr was not empty, see: /home/jenkins/workspace/Lucene-Solr-master-Linux/lucene/build/highlighter/test/temp/junit4-J0-20190625_130203_51413823774835027834237.syserr
   [junit4] >>> JVM J0 emitted unexpected output (verbatim) ----
   [junit4] OpenJDK 64-Bit Server VM warning: Option UseConcMarkSweepGC was deprecated in version 9.0 and will likely be removed in a future release.
   [junit4] <<< JVM J0: EOF ----

[...truncated 3 lines...]
   [junit4] JVM J2: stderr was not empty, see: /home/jenkins/workspace/Lucene-Solr-master-Linux/lucene/build/highlighter/test/temp/junit4-J2-20190625_130203_51417117129441158260314.syserr
   [junit4] >>> JVM J2 emitted unexpected output (verbatim) ----
   [junit4] OpenJDK 64-Bit Server VM warning: Option UseConcMarkSweepGC was deprecated in version 9.0 and will likely be removed in a future release.
   [junit4] <<< JVM J2: EOF ----

[...truncated 166 lines...]
   [junit4] JVM J2: stderr was not empty, see: /home/jenkins/workspace/Lucene-Solr-master-Linux/lucene/build/join/test/temp/junit4-J2-20190625_130241_05913545887330750080464.syserr
   [junit4] >>> JVM J2 emitted unexpected output (verbatim) ----
   [junit4] OpenJDK 64-Bit Server VM warning: Option UseConcMarkSweepGC was deprecated in version 9.0 and will likely be removed in a future release.
   [junit4] <<< JVM J2: EOF ----

   [junit4] JVM J1: stderr was not empty, see: /home/jenkins/workspace/Lucene-Solr-master-Linux/lucene/build/join/test/temp/junit4-J1-20190625_130241_05913503635145604150436.syserr
   [junit4] >>> JVM J1 emitted unexpected output (verbatim) ----
   [junit4] OpenJDK 64-Bit Server VM warning: Option UseConcMarkSweepGC was deprecated in version 9.0 and will likely be removed in a future release.
   [junit4] <<< JVM J1: EOF ----

[...truncated 6 lines...]
   [junit4] JVM J0: stderr was not empty, see: /home/jenkins/workspace/Lucene-Solr-master-Linux/lucene/build/join/test/temp/junit4-J0-20190625_130241_05915325620153345859796.syserr
   [junit4] >>> JVM J0 emitted unexpected output (verbatim) ----
   [junit4] OpenJDK 64-Bit Server VM warning: Option UseConcMarkSweepGC was deprecated in version 9.0 and will likely be removed in a future release.
   [junit4] <<< JVM J0: EOF ----

[...truncated 268 lines...]
   [junit4] JVM J1: stderr was not empty, see: /home/jenkins/workspace/Lucene-Solr-master-Linux/lucene/build/luke/test/temp/junit4-J1-20190625_130321_5043561150594027590326.syserr
   [junit4] >>> JVM J1 emitted unexpected output (verbatim) ----
   [junit4] OpenJDK 64-Bit Server VM warning: Option UseConcMarkSweepGC was deprecated in version 9.0 and will likely be removed in a future release.
   [junit4] <<< JVM J1: EOF ----

[...truncated 3 lines...]
   [junit4] JVM J2: stderr was not empty, see: /home/jenkins/workspace/Lucene-Solr-master-Linux/lucene/build/luke/test/temp/junit4-J2-20190625_130321_50416733806920901824734.syserr
   [junit4] >>> JVM J2 emitted unexpected output (verbatim) ----
   [junit4] OpenJDK 64-Bit Server VM warning: Option UseConcMarkSweepGC was deprecated in version 9.0 and will likely be removed in a future release.
   [junit4] <<< JVM J2: EOF ----

[...truncated 3 lines...]
   [junit4] JVM J0: stderr was not empty, see: /home/jenkins/workspace/Lucene-Solr-master-Linux/lucene/build/luke/test/temp/junit4-J0-20190625_130321_5042255989896787298898.syserr
   [junit4] >>> JVM J0 emitted unexpected output (verbatim) ----
   [junit4] OpenJDK 64-Bit Server VM warning: Option UseConcMarkSweepGC was deprecated in version 9.0 and will likely be removed in a future release.
   [junit4] <<< JVM J0: EOF ----

[...truncated 149 lines...]
   [junit4] JVM J0: stderr was not empty, see: /home/jenkins/workspace/Lucene-Solr-master-Linux/lucene/build/memory/test/temp/junit4-J0-20190625_130329_69716278452912814481884.syserr
   [junit4] >>> JVM J0 emitted unexpected output (verbatim) ----
   [junit4] OpenJDK 64-Bit Server VM warning: Option UseConcMarkSweepGC was deprecated in version 9.0 and will likely be removed in a future release.
   [junit4] <<< JVM J0: EOF ----

[...truncated 3 lines...]
   [junit4] JVM J1: stderr was not empty, see: /home/jenkins/workspace/Lucene-Solr-master-Linux/lucene/build/memory/test/temp/junit4-J1-20190625_130329_69711998838820662938369.syserr
   [junit4] >>> JVM J1 emitted unexpected output (verbatim) ----
   [junit4] OpenJDK 64-Bit Server VM warning: Option UseConcMarkSweepGC was deprecated in version 9.0 and will likely be removed in a future release.
   [junit4] <<< JVM J1: EOF ----

[...truncated 182 lines...]
   [junit4] JVM J0: stderr was not empty, see: /home/jenkins/workspace/Lucene-Solr-master-Linux/lucene/build/misc/test/temp/junit4-J0-20190625_130344_73114176420617443493813.syserr
   [junit4] >>> JVM J0 emitted unexpected output (verbatim) ----
   [junit4] OpenJDK 64-Bit Server VM warning: Option UseConcMarkSweepGC was deprecated in version 9.0 and will likely be removed in a future release.
   [junit4] <<< JVM J0: EOF ----

[...truncated 3 lines...]
   [junit4] JVM J2: stderr was not empty, see: /home/jenkins/workspace/Lucene-Solr-master-Linux/lucene/build/misc/test/temp/junit4-J2-20190625_130344_73113603963819287743201.syserr
   [junit4] >>> JVM J2 emitted unexpected output (verbatim) ----
   [junit4] OpenJDK 64-Bit Server VM warning: Option UseConcMarkSweepGC was deprecated in version 9.0 and will likely be removed in a future release.
   [junit4] <<< JVM J2: EOF ----

[...truncated 3 lines...]
   [junit4] JVM J1: stderr was not empty, see: /home/jenkins/workspace/Lucene-Solr-master-Linux/lucene/build/misc/test/temp/junit4-J1-20190625_130344_7319556942404295634192.syserr
   [junit4] >>> JVM J1 emitted unexpected output (verbatim) ----
   [junit4] OpenJDK 64-Bit Server VM warning: Option UseConcMarkSweepGC was deprecated in version 9.0 and will likely be removed in a future release.
   [junit4] <<< JVM J1: EOF ----

[...truncated 254 lines...]
   [junit4] JVM J1: stderr was not empty, see: /home/jenkins/workspace/Lucene-Solr-master-Linux/lucene/build/monitor/test/temp/junit4-J1-20190625_130413_49917919653278572407118.syserr
   [junit4] >>> JVM J1 emitted unexpected output (verbatim) ----
   [junit4] OpenJDK 64-Bit Server VM warning: Option UseConcMarkSweepGC was deprecated in version 9.0 and will likely be removed in a future release.
   [junit4] <<< JVM J1: EOF ----

   [junit4] JVM J0: stderr was not empty, see: /home/jenkins/workspace/Lucene-Solr-master-Linux/lucene/build/monitor/test/temp/junit4-J0-20190625_130413_49914081910635368027931.syserr
   [junit4] >>> JVM J0 emitted unexpected output (verbatim) ----
   [junit4] OpenJDK 64-Bit Server VM warning: Option UseConcMarkSweepGC was deprecated in version 9.0 and will likely be removed in a future release.
   [junit4] <<< JVM J0: EOF ----

[...truncated 3 lines...]
   [junit4] JVM J2: stderr was not empty, see: /home/jenkins/workspace/Lucene-Solr-master-Linux/lucene/build/monitor/test/temp/junit4-J2-20190625_130413_49918190496781520181312.syserr
   [junit4] >>> JVM J2 emitted unexpected output (verbatim) ----
   [junit4] OpenJDK 64-Bit Server VM warning: Option UseConcMarkSweepGC was deprecated in version 9.0 and will likely be removed in a future release.
   [junit4] <<< JVM J2: EOF ----

[...truncated 298 lines...]
   [junit4] JVM J0: stderr was not empty, see: /home/jenkins/workspace/Lucene-Solr-master-Linux/lucene/build/queries/test/temp/junit4-J0-20190625_130425_7787124511006487014177.syserr
   [junit4] >>> JVM J0 emitted unexpected output (verbatim) ----
   [junit4] OpenJDK 64-Bit Server VM warning: Option UseConcMarkSweepGC was deprecated in version 9.0 and will likely be removed in a future release.
   [junit4] <<< JVM J0: EOF ----

[...truncated 6 lines...]
   [junit4] JVM J1: stderr was not empty, see: /home/jenkins/workspace/Lucene-Solr-master-Linux/lucene/build/queries/test/temp/junit4-J1-20190625_130425_77817306069551291842762.syserr
   [junit4] >>> JVM J1 emitted unexpected output (verbatim) ----
   [junit4] OpenJDK 64-Bit Server VM warning: Option UseConcMarkSweepGC was deprecated in version 9.0 and will likely be removed in a future release.
   [junit4] <<< JVM J1: EOF ----

   [junit4] JVM J2: stderr was not empty, see: /home/jenkins/workspace/Lucene-Solr-master-Linux/lucene/build/queries/test/temp/junit4-J2-20190625_130425_77812671420721882682339.syserr
   [junit4] >>> JVM J2 emitted unexpected output (verbatim) ----
   [junit4] OpenJDK 64-Bit Server VM warning: Option UseConcMarkSweepGC was deprecated in version 9.0 and will likely be removed in a future release.
   [junit4] <<< JVM J2: EOF ----

[...truncated 223 lines...]
   [junit4] JVM J0: stderr was not empty, see: /home/jenkins/workspace/Lucene-Solr-master-Linux/lucene/build/queryparser/test/temp/junit4-J0-20190625_130437_60616862380721891906495.syserr
   [junit4] >>> JVM J0 emitted unexpected output (verbatim) ----
   [junit4] OpenJDK 64-Bit Server VM warning: Option UseConcMarkSweepGC was deprecated in version 9.0 and will likely be removed in a future release.
   [junit4] <<< JVM J0: EOF ----

[...truncated 6 lines...]
   [junit4] JVM J1: stderr was not empty, see: /home/jenkins/workspace/Lucene-Solr-master-Linux/lucene/build/queryparser/test/temp/junit4-J1-20190625_130437_60616059008461962471933.syserr
   [junit4] >>> JVM J1 emitted unexpected output (verbatim) ----
   [junit4] OpenJDK 64-Bit Server VM warning: Option UseConcMarkSweepGC was deprecated in version 9.0 and will likely be removed in a future release.
   [junit4] <<< JVM J1: EOF ----

   [junit4] JVM J2: stderr was not empty, see: /home/jenkins/workspace/Lucene-Solr-master-Linux/lucene/build/queryparser/test/temp/junit4-J2-20190625_130437_60617097239054285809816.syserr
   [junit4] >>> JVM J2 emitted unexpected output (verbatim) ----
   [junit4] OpenJDK 64-Bit Server VM warning: Option UseConcMarkSweepGC was deprecated in version 9.0 and will likely be removed in a future release.
   [junit4] <<< JVM J2: EOF ----

[...truncated 212 lines...]
   [junit4] JVM J2: stderr was not empty, see: /home/jenkins/workspace/Lucene-Solr-master-Linux/lucene/build/replicator/test/temp/junit4-J2-20190625_130451_08315257318080604855527.syserr
   [junit4] >>> JVM J2 emitted unexpected output (verbatim) ----
   [junit4] OpenJDK 64-Bit Server VM warning: Option UseConcMarkSweepGC was deprecated in version 9.0 and will likely be removed in a future release.
   [junit4] <<< JVM J2: EOF ----

   [junit4] JVM J1: stderr was not empty, see: /home/jenkins/workspace/Lucene-Solr-master-Linux/lucene/build/replicator/test/temp/junit4-J1-20190625_130451_0833907530072219858086.syserr
   [junit4] >>> JVM J1 emitted unexpected output (verbatim) ----
   [junit4] OpenJDK 64-Bit Server VM warning: Option UseConcMarkSweepGC was deprecated in version 9.0 and will likely be removed in a future release.
   [junit4] <<< JVM J1: EOF ----

[...truncated 3 lines...]
   [junit4] JVM J0: stderr was not empty, see: /home/jenkins/workspace/Lucene-Solr-master-Linux/lucene/build/replicator/test/temp/junit4-J0-20190625_130451_08315096131142595595922.syserr
   [junit4] >>> JVM J0 emitted unexpected output (verbatim) ----
   [junit4] OpenJDK 64-Bit Server VM warning: Option UseConcMarkSweepGC was deprecated in version 9.0 and will likely be removed in a future release.
   [junit4] <<< JVM J0: EOF ----

[...truncated 247 lines...]
   [junit4] JVM J2: stderr was not empty, see: /home/jenkins/workspace/Lucene-Solr-master-Linux/lucene/build/sandbox/test/temp/junit4-J2-20190625_130505_7792555194230150292362.syserr
   [junit4] >>> JVM J2 emitted unexpected output (verbatim) ----
   [junit4] OpenJDK 64-Bit Server VM warning: Option UseConcMarkSweepGC was deprecated in version 9.0 and will likely be removed in a future release.
   [junit4] <<< JVM J2: EOF ----

[...truncated 3 lines...]
   [junit4] JVM J0: stderr was not empty, see: /home/jenkins/workspace/Lucene-Solr-master-Linux/lucene/build/sandbox/test/temp/junit4-J0-20190625_130505_7792394735719610214299.syserr
   [junit4] >>> JVM J0 emitted unexpected output (verbatim) ----
   [junit4] OpenJDK 64-Bit Server VM warning: Option UseConcMarkSweepGC was deprecated in version 9.0 and will likely be removed in a future release.
   [junit4] <<< JVM J0: EOF ----

[...truncated 3 lines...]
   [junit4] JVM J1: stderr was not empty, see: /home/jenkins/workspace/Lucene-Solr-master-Linux/lucene/build/sandbox/test/temp/junit4-J1-20190625_130505_779307196341157975100.syserr
   [junit4] >>> JVM J1 emitted unexpected output (verbatim) ----
   [junit4] OpenJDK 64-Bit Server VM warning: Option UseConcMarkSweepGC was deprecated in version 9.0 and will likely be removed in a future release.
   [junit4] <<< JVM J1: EOF ----

[...truncated 297 lines...]
   [junit4] JVM J1: stderr was not empty, see: /home/jenkins/workspace/Lucene-Solr-master-Linux/lucene/build/spatial-extras/test/temp/junit4-J1-20190625_130620_54314583873812598436936.syserr
   [junit4] >>> JVM J1 emitted unexpected output (verbatim) ----
   [junit4] OpenJDK 64-Bit Server VM warning: Option UseConcMarkSweepGC was deprecated in version 9.0 and will likely be removed in a future release.
   [junit4] <<< JVM J1: EOF ----

[...truncated 3 lines...]
   [junit4] JVM J2: stderr was not empty, see: /home/jenkins/workspace/Lucene-Solr-master-Linux/lucene/build/spatial-extras/test/temp/junit4-J2-20190625_130620_54515563207165231744954.syserr
   [junit4] >>> JVM J2 emitted unexpected output (verbatim) ----
   [junit4] OpenJDK 64-Bit Server VM warning: Option UseConcMarkSweepGC was deprecated in version 9.0 and will likely be removed in a future release.
   [junit4] <<< JVM J2: EOF ----

[...truncated 3 lines...]
   [junit4] JVM J0: stderr was not empty, see: /home/jenkins/workspace/Lucene-Solr-master-Linux/lucene/build/spatial-extras/test/temp/junit4-J0-20190625_130620_54316922808331579990564.syserr
   [junit4] >>> JVM J0 emitted unexpected output (verbatim) ----
   [junit4] OpenJDK 64-Bit Server VM warning: Option UseConcMarkSweepGC was deprecated in version 9.0 and will likely be removed in a future release.
   [junit4] <<< JVM J0: EOF ----

[...truncated 148 lines...]
   [junit4] JVM J0: stderr was not empty, see: /home/jenkins/workspace/Lucene-Solr-master-Linux/lucene/build/spatial/test/temp/junit4-J0-20190625_130653_49715781322903555477925.syserr
   [junit4] >>> JVM J0 emitted unexpected output (verbatim) ----
   [junit4] OpenJDK 64-Bit Server VM warning: Option UseConcMarkSweepGC was deprecated in version 9.0 and will likely be removed in a future release.
   [junit4] <<< JVM J0: EOF ----

[...truncated 175 lines...]
   [junit4] JVM J2: stderr was not empty, see: /home/jenkins/workspace/Lucene-Solr-master-Linux/lucene/build/spatial3d/test/temp/junit4-J2-20190625_130655_7349062894578517524321.syserr
   [junit4] >>> JVM J2 emitted unexpected output (verbatim) ----
   [junit4] OpenJDK 64-Bit Server VM warning: Option UseConcMarkSweepGC was deprecated in version 9.0 and will likely be removed in a future release.
   [junit4] <<< JVM J2: EOF ----

[...truncated 3 lines...]
   [junit4] JVM J0: stderr was not empty, see: /home/jenkins/workspace/Lucene-Solr-master-Linux/lucene/build/spatial3d/test/temp/junit4-J0-20190625_130655_7348892480892509091514.syserr
   [junit4] >>> JVM J0 emitted unexpected output (verbatim) ----
   [junit4] OpenJDK 64-Bit Server VM warning: Option UseConcMarkSweepGC was deprecated in version 9.0 and will likely be removed in a future release.
   [junit4] <<< JVM J0: EOF ----

[...truncated 11 lines...]
   [junit4] JVM J1: stderr was not empty, see: /home/jenkins/workspace/Lucene-Solr-master-Linux/lucene/build/spatial3d/test/temp/junit4-J1-20190625_130655_73412724001688555240924.syserr
   [junit4] >>> JVM J1 emitted unexpected output (verbatim) ----
   [junit4] OpenJDK 64-Bit Server VM warning: Option UseConcMarkSweepGC was deprecated in version 9.0 and will likely be removed in a future release.
   [junit4] <<< JVM J1: EOF ----

[...truncated 251 lines...]
   [junit4] JVM J0: stderr was not empty, see: /home/jenkins/workspace/Lucene-Solr-master-Linux/lucene/build/suggest/test/temp/junit4-J0-20190625_130829_4414329315922506388975.syserr
   [junit4] >>> JVM J0 emitted unexpected output (verbatim) ----
   [junit4] OpenJDK 64-Bit Server VM warning: Option UseConcMarkSweepGC was deprecated in version 9.0 and will likely be removed in a future release.
   [junit4] <<< JVM J0: EOF ----

[...truncated 3 lines...]
   [junit4] JVM J2: stderr was not empty, see: /home/jenkins/workspace/Lucene-Solr-master-Linux/lucene/build/suggest/test/temp/junit4-J2-20190625_130829_441659883495967610781.syserr
   [junit4] >>> JVM J2 emitted unexpected output (verbatim) ----
   [junit4] OpenJDK 64-Bit Server VM warning: Option UseConcMarkSweepGC was deprecated in version 9.0 and will likely be removed in a future release.
   [junit4] <<< JVM J2: EOF ----

[...truncated 3 lines...]
   [junit4] JVM J1: stderr was not empty, see: /home/jenkins/workspace/Lucene-Solr-master-Linux/lucene/build/suggest/test/temp/junit4-J1-20190625_130829_44117016341264293426930.syserr
   [junit4] >>> JVM J1 emitted unexpected output (verbatim) ----
   [junit4] OpenJDK 64-Bit Server VM warning: Option UseConcMarkSweepGC was deprecated in version 9.0 and will likely be removed in a future release.
   [junit4] <<< JVM J1: EOF ----

[...truncated 4612 lines...]
   [junit4] JVM J0: stderr was not empty, see: /home/jenkins/workspace/Lucene-Solr-master-Linux/solr/build/solr-core/test/temp/junit4-J0-20190625_130959_97317213883246660134069.syserr
   [junit4] >>> JVM J0 emitted unexpected output (verbatim) ----
   [junit4] OpenJDK 64-Bit Server VM warning: Option UseConcMarkSweepGC was deprecated in version 9.0 and will likely be removed in a future release.
   [junit4] <<< JVM J0: EOF ----

[...truncated 3 lines...]
   [junit4] JVM J2: stderr was not empty, see: /home/jenkins/workspace/Lucene-Solr-master-Linux/solr/build/solr-core/test/temp/junit4-J2-20190625_130959_973822317243808242420.syserr
   [junit4] >>> JVM J2 emitted unexpected output (verbatim) ----
   [junit4] OpenJDK 64-Bit Server VM warning: Option UseConcMarkSweepGC was deprecated in version 9.0 and will likely be removed in a future release.
   [junit4] <<< JVM J2: EOF ----

[...truncated 3 lines...]
   [junit4] JVM J1: stderr was not empty, see: /home/jenkins/workspace/Lucene-Solr-master-Linux/solr/build/solr-core/test/temp/junit4-J1-20190625_130959_9733957770646873774435.syserr
   [junit4] >>> JVM J1 emitted unexpected output (verbatim) ----
   [junit4] OpenJDK 64-Bit Server VM warning: Option UseConcMarkSweepGC was deprecated in version 9.0 and will likely be removed in a future release.
   [junit4] <<< JVM J1: EOF ----

[...truncated 1069 lines...]
   [junit4] JVM J2: stderr was not empty, see: /home/jenkins/workspace/Lucene-Solr-master-Linux/solr/build/solr-solrj/test/temp/junit4-J2-20190625_134955_9986357552415075851054.syserr
   [junit4] >>> JVM J2 emitted unexpected output (verbatim) ----
   [junit4] OpenJDK 64-Bit Server VM warning: Option UseConcMarkSweepGC was deprecated in version 9.0 and will likely be removed in a future release.
   [junit4] <<< JVM J2: EOF ----

[...truncated 3 lines...]
   [junit4] JVM J1: stderr was not empty, see: /home/jenkins/workspace/Lucene-Solr-master-Linux/solr/build/solr-solrj/test/temp/junit4-J1-20190625_134955_99813543867178714062736.syserr
   [junit4] >>> JVM J1 emitted unexpected output (verbatim) ----
   [junit4] OpenJDK 64-Bit Server VM warning: Option UseConcMarkSweepGC was deprecated in version 9.0 and will likely be removed in a future release.
   [junit4] <<< JVM J1: EOF ----

[...truncated 3 lines...]
   [junit4] JVM J0: stderr was not empty, see: /home/jenkins/workspace/Lucene-Solr-master-Linux/solr/build/solr-solrj/test/temp/junit4-J0-20190625_134955_9981672894186143877050.syserr
   [junit4] >>> JVM J0 emitted unexpected output (verbatim) ----
   [junit4] OpenJDK 64-Bit Server VM warning: Option UseConcMarkSweepGC was deprecated in version 9.0 and will likely be removed in a future release.
   [junit4] <<< JVM J0: EOF ----

[...truncated 1503 lines...]
   [junit4] JVM J1: stderr was not empty, see: /home/jenkins/workspace/Lucene-Solr-master-Linux/solr/build/contrib/solr-analysis-extras/test/temp/junit4-J1-20190625_135504_49116348753255324284828.syserr
   [junit4] >>> JVM J1 emitted unexpected output (verbatim) ----
   [junit4] OpenJDK 64-Bit Server VM warning: Option UseConcMarkSweepGC was deprecated in version 9.0 and will likely be removed in a future release.
   [junit4] <<< JVM J1: EOF ----

[...truncated 6 lines...]
   [junit4] JVM J0: stderr was not empty, see: /home/jenkins/workspace/Lucene-Solr-master-Linux/solr/build/contrib/solr-analysis-extras/test/temp/junit4-J0-20190625_135504_4917082412965973209183.syserr
   [junit4] >>> JVM J0 emitted unexpected output (verbatim) ----
   [junit4] OpenJDK 64-Bit Server VM warning: Option UseConcMarkSweepGC was deprecated in version 9.0 and will likely be removed in a future release.
   [junit4] <<< JVM J0: EOF ----

   [junit4] JVM J2: stderr was not empty, see: /home/jenkins/workspace/Lucene-Solr-master-Linux/solr/build/contrib/solr-analysis-extras/test/temp/junit4-J2-20190625_135504_4914954007988703716772.syserr
   [junit4] >>> JVM J2 emitted unexpected output (verbatim) ----
   [junit4] OpenJDK 64-Bit Server VM warning: Option UseConcMarkSweepGC was deprecated in version 9.0 and will likely be removed in a future release.
   [junit4] <<< JVM J2: EOF ----

[...truncated 796 lines...]
   [junit4] JVM J2: stderr was not empty, see: /home/jenkins/workspace/Lucene-Solr-master-Linux/solr/build/contrib/solr-analytics/test/temp/junit4-J2-20190625_135517_730977350876469349184.syserr
   [junit4] >>> JVM J2 emitted unexpected output (verbatim) ----
   [junit4] OpenJDK 64-Bit Server VM warning: Option UseConcMarkSweepGC was deprecated in version 9.0 and will likely be removed in a future release.
   [junit4] <<< JVM J2: EOF ----

[...truncated 6 lines...]
   [junit4] JVM J0: stderr was not empty, see: /home/jenkins/workspace/Lucene-Solr-master-Linux/solr/build/contrib/solr-analytics/test/temp/junit4-J0-20190625_135517_72916953109103335449500.syserr
   [junit4] >>> JVM J0 emitted unexpected output (verbatim) ----
   [junit4] OpenJDK 64-Bit Server VM warning: Option UseConcMarkSweepGC was deprecated in version 9.0 and will likely be removed in a future release.
   [junit4] <<< JVM J0: EOF ----

[...truncated 3 lines...]
   [junit4] JVM J1: stderr was not empty, see: /home/jenkins/workspace/Lucene-Solr-master-Linux/solr/build/contrib/solr-analytics/test/temp/junit4-J1-20190625_135517_72912138137816848759042.syserr
   [junit4] >>> JVM J1 emitted unexpected output (verbatim) ----
   [junit4] OpenJDK 64-Bit Server VM warning: Option UseConcMarkSweepGC was deprecated in version 9.0 and will likely be removed in a future release.
   [junit4] <<< JVM J1: EOF ----

[...truncated 570 lines...]
   [junit4] JVM J0: stderr was not empty, see: /home/jenkins/workspace/Lucene-Solr-master-Linux/solr/build/contrib/solr-clustering/test/temp/junit4-J0-20190625_135643_21916014204190609328924.syserr
   [junit4] >>> JVM J0 emitted unexpected output (verbatim) ----
   [junit4] OpenJDK 64-Bit Server VM warning: Option UseConcMarkSweepGC was deprecated in version 9.0 and will likely be removed in a future release.
   [junit4] <<< JVM J0: EOF ----

[...truncated 3 lines...]
   [junit4] JVM J2: stderr was not empty, see: /home/jenkins/workspace/Lucene-Solr-master-Linux/solr/build/contrib/solr-clustering/test/temp/junit4-J2-20190625_135643_2193470310409347692981.syserr
   [junit4] >>> JVM J2 emitted unexpected output (verbatim) ----
   [junit4] OpenJDK 64-Bit Server VM warning: Option UseConcMarkSweepGC was deprecated in version 9.0 and will likely be removed in a future release.
   [junit4] <<< JVM J2: EOF ----

[...truncated 3 lines...]
   [junit4] JVM J1: stderr was not empty, see: /home/jenkins/workspace/Lucene-Solr-master-Linux/solr/build/contrib/solr-clustering/test/temp/junit4-J1-20190625_135643_2199340527707833922294.syserr
   [junit4] >>> JVM J1 emitted unexpected output (verbatim) ----
   [junit4] OpenJDK 64-Bit Server VM warning: Option UseConcMarkSweepGC was deprecated in version 9.0 and will likely be removed in a future release.
   [junit4] <<< JVM J1: EOF ----

[...truncated 1301 lines...]
   [junit4] JVM J0: stderr was not empty, see: /home/jenkins/workspace/Lucene-Solr-master-Linux/solr/build/contrib/solr-dataimporthandler-extras/test/temp/junit4-J0-20190625_135703_63112507536619091683397.syserr
   [junit4] >>> JVM J0 emitted unexpected output (verbatim) ----
   [junit4] OpenJDK 64-Bit Server VM warning: Option UseConcMarkSweepGC was deprecated in version 9.0 and will likely be removed in a future release.
   [junit4] <<< JVM J0: EOF ----

[...truncated 3 lines...]
   [junit4] JVM J1: stderr was not empty, see: /home/jenkins/workspace/Lucene-Solr-master-Linux/solr/build/contrib/solr-dataimporthandler-extras/test/temp/junit4-J1-20190625_135703_63112922058622502834682.syserr
   [junit4] >>> JVM J1 emitted unexpected output (verbatim) ----
   [junit4] OpenJDK 64-Bit Server VM warning: Option UseConcMarkSweepGC was deprecated in version 9.0 and will likely be removed in a future release.
   [junit4] <<< JVM J1: EOF ----

[...truncated 666 lines...]
   [junit4] JVM J2: stderr was not empty, see: /home/jenkins/workspace/Lucene-Solr-master-Linux/solr/build/contrib/solr-dataimporthandler/test/temp/junit4-J2-20190625_135713_01413167188485196931293.syserr
   [junit4] >>> JVM J2 emitted unexpected output (verbatim) ----
   [junit4] OpenJDK 64-Bit Server VM warning: Option UseConcMarkSweepGC was deprecated in version 9.0 and will likely be removed in a future release.
   [junit4] <<< JVM J2: EOF ----

   [junit4] JVM J1: stderr was not empty, see: /home/jenkins/workspace/Lucene-Solr-master-Linux/solr/build/contrib/solr-dataimporthandler/test/temp/junit4-J1-20190625_135713_0149272133737088804732.syserr
   [junit4] >>> JVM J1 emitted unexpected output (verbatim) ----
   [junit4] OpenJDK 64-Bit Server VM warning: Option UseConcMarkSweepGC was deprecated in version 9.0 and will likely be removed in a future release.
   [junit4] <<< JVM J1: EOF ----

[...truncated 3 lines...]
   [junit4] JVM J0: stderr was not empty, see: /home/jenkins/workspace/Lucene-Solr-master-Linux/solr/build/contrib/solr-dataimporthandler/test/temp/junit4-J0-20190625_135713_0137503461082078762731.syserr
   [junit4] >>> JVM J0 emitted unexpected output (verbatim) ----
   [junit4] OpenJDK 64-Bit Server VM warning: Option UseConcMarkSweepGC was deprecated in version 9.0 and will likely be removed in a future release.
   [junit4] <<< JVM J0: EOF ----

[...truncated 572 lines...]
   [junit4] JVM J1: stderr was not empty, see: /home/jenkins/workspace/Lucene-Solr-master-Linux/solr/build/contrib/solr-cell/test/temp/junit4-J1-20190625_135743_09418288009415920363443.syserr
   [junit4] >>> JVM J1 emitted unexpected output (verbatim) ----
   [junit4] OpenJDK 64-Bit Server VM warning: Option UseConcMarkSweepGC was deprecated in version 9.0 and will likely be removed in a future release.
   [junit4] <<< JVM J1: EOF ----

[...truncated 3 lines...]
   [junit4] JVM J2: stderr was not empty, see: /home/jenkins/workspace/Lucene-Solr-master-Linux/solr/build/contrib/solr-cell/test/temp/junit4-J2-20190625_135743_09416386250665378881938.syserr
   [junit4] >>> JVM J2 emitted unexpected output (verbatim) ----
   [junit4] OpenJDK 64-Bit Server VM warning: Option UseConcMarkSweepGC was deprecated in version 9.0 and will likely be removed in a future release.
   [junit4] <<< JVM J2: EOF ----

[...truncated 3 lines...]
   [junit4] JVM J0: stderr was not empty, see: /home/jenkins/workspace/Lucene-Solr-master-Linux/solr/build/contrib/solr-cell/test/temp/junit4-J0-20190625_135743_0941295815281893937221.syserr
   [junit4] >>> JVM J0 emitted unexpected output (verbatim) ----
   [junit4] OpenJDK 64-Bit Server VM warning: Option UseConcMarkSweepGC was deprecated in version 9.0 and will likely be removed in a future release.
   [junit4] <<< JVM J0: EOF ----

[...truncated 566 lines...]
   [junit4] JVM J0: stderr was not empty, see: /home/jenkins/workspace/Lucene-Solr-master-Linux/solr/build/contrib/solr-jaegertracer-configurator/test/temp/junit4-J0-20190625_135757_7307336770258701141941.syserr
   [junit4] >>> JVM J0 emitted unexpected output (verbatim) ----
   [junit4] OpenJDK 64-Bit Server VM warning: Option UseConcMarkSweepGC was deprecated in version 9.0 and will likely be removed in a future release.
   [junit4] <<< JVM J0: EOF ----

[...truncated 574 lines...]
   [junit4] JVM J0: stderr was not empty, see: /home/jenkins/workspace/Lucene-Solr-master-Linux/solr/build/contrib/solr-langid/test/temp/junit4-J0-20190625_135805_2742223200898182848563.syserr
   [junit4] >>> JVM J0 emitted unexpected output (verbatim) ----
   [junit4] OpenJDK 64-Bit Server VM warning: Option UseConcMarkSweepGC was deprecated in version 9.0 and will likely be removed in a future release.
   [junit4] <<< JVM J0: EOF ----

[...truncated 6 lines...]
   [junit4] JVM J1: stderr was not empty, see: /home/jenkins/workspace/Lucene-Solr-master-Linux/solr/build/contrib/solr-langid/test/temp/junit4-J1-20190625_135805_2749215297741201629748.syserr
   [junit4] >>> JVM J1 emitted unexpected output (verbatim) ----
   [junit4] OpenJDK 64-Bit Server VM warning: Option UseConcMarkSweepGC was deprecated in version 9.0 and will likely be removed in a future release.
   [junit4] <<< JVM J1: EOF ----

   [junit4] JVM J2: stderr was not empty, see: /home/jenkins/workspace/Lucene-Solr-master-Linux/solr/build/contrib/solr-langid/test/temp/junit4-J2-20190625_135805_2742043125030533248489.syserr
   [junit4] >>> JVM J2 emitted unexpected output (verbatim) ----
   [junit4] OpenJDK 64-Bit Server VM warning: Option UseConcMarkSweepGC was deprecated in version 9.0 and will likely be removed in a future release.
   [junit4] <<< JVM J2: EOF ----

[...truncated 679 lines...]
   [junit4] JVM J1: stderr was not empty, see: /home/jenkins/workspace/Lucene-Solr-master-Linux/solr/build/contrib/solr-ltr/test/temp/junit4-J1-20190625_135817_7473105548404490991741.syserr
   [junit4] >>> JVM J1 emitted unexpected output (verbatim) ----
   [junit4] OpenJDK 64-Bit Server VM warning: Option UseConcMarkSweepGC was deprecated in version 9.0 and will likely be removed in a future release.
   [junit4] <<< JVM J1: EOF ----

[...truncated 3 lines...]
   [junit4] JVM J2: stderr was not empty, see: /home/jenkins/workspace/Lucene-Solr-master-Linux/solr/build/contrib/solr-ltr/test/temp/junit4-J2-20190625_135817_7474527128355510379423.syserr
   [junit4] >>> JVM J2 emitted unexpected output (verbatim) ----
   [junit4] OpenJDK 64-Bit Server VM warning: Option UseConcMarkSweepGC was deprecated in version 9.0 and will likely be removed in a future release.
   [junit4] <<< JVM J2: EOF ----

[...truncated 3 lines...]
   [junit4] JVM J0: stderr was not empty, see: /home/jenkins/workspace/Lucene-Solr-master-Linux/solr/build/contrib/solr-ltr/test/temp/junit4-J0-20190625_135817_74714959101193828169862.syserr
   [junit4] >>> JVM J0 emitted unexpected output (verbatim) ----
   [junit4] OpenJDK 64-Bit Server VM warning: Option UseConcMarkSweepGC was deprecated in version 9.0 and will likely be removed in a future release.
   [junit4] <<< JVM J0: EOF ----

[...truncated 580 lines...]
   [junit4] JVM J2: stderr was not empty, see: /home/jenkins/workspace/Lucene-Solr-master-Linux/solr/build/contrib/solr-prometheus-exporter/test/temp/junit4-J2-20190625_135849_1814198776895180887503.syserr
   [junit4] >>> JVM J2 emitted unexpected output (verbatim) ----
   [junit4] OpenJDK 64-Bit Server VM warning: Option UseConcMarkSweepGC was deprecated in version 9.0 and will likely be removed in a future release.
   [junit4] <<< JVM J2: EOF ----

[...truncated 3 lines...]
   [junit4] JVM J0: stderr was not empty, see: /home/jenkins/workspace/Lucene-Solr-master-Linux/solr/build/contrib/solr-prometheus-exporter/test/temp/junit4-J0-20190625_135849_1813919579622437035275.syserr
   [junit4] >>> JVM J0 emitted unexpected output (verbatim) ----
   [junit4] OpenJDK 64-Bit Server VM warning: Option UseConcMarkSweepGC was deprecated in version 9.0 and will likely be removed in a future release.
   [junit4] <<< JVM J0: EOF ----

[...truncated 3 lines...]
   [junit4] JVM J1: stderr was not empty, see: /home/jenkins/workspace/Lucene-Solr-master-Linux/solr/build/contrib/solr-prometheus-exporter/test/temp/junit4-J1-20190625_135849_18114060369934049203443.syserr
   [junit4] >>> JVM J1 emitted unexpected output (verbatim) ----
   [junit4] OpenJDK 64-Bit Server VM warning: Option UseConcMarkSweepGC was deprecated in version 9.0 and will likely be removed in a future release.
   [junit4] <<< JVM J1: EOF ----

[...truncated 568 lines...]
   [junit4] JVM J0: stderr was not empty, see: /home/jenkins/workspace/Lucene-Solr-master-Linux/solr/build/contrib/solr-velocity/test/temp/junit4-J0-20190625_135913_81710820793706338548930.syserr
   [junit4] >>> JVM J0 emitted unexpected output (verbatim) ----
   [junit4] OpenJDK 64-Bit Server VM warning: Option UseConcMarkSweepGC was deprecated in version 9.0 and will likely be removed in a future release.
   [junit4] <<< JVM J0: EOF ----

[...truncated 39124 lines...]
-ecj-javadoc-lint-src:
    [mkdir] Created dir: /tmp/ecj1384490855
 [ecj-lint] Compiling 1279 source files to /tmp/ecj1384490855
 [ecj-lint] Processing annotations
 [ecj-lint] Annotations processed
 [ecj-lint] Processing annotations
 [ecj-lint] No elements to process
 [ecj-lint] invalid Class-Path header in manifest of jar file: /home/jenkins/.ivy2/cache/org.restlet.jee/org.restlet/jars/org.restlet-2.3.0.jar
 [ecj-lint] invalid Class-Path header in manifest of jar file: /home/jenkins/.ivy2/cache/org.restlet.jee/org.restlet.ext.servlet/jars/org.restlet.ext.servlet-2.3.0.jar
 [ecj-lint] ----------
 [ecj-lint] 1. WARNING in /home/jenkins/workspace/Lucene-Solr-master-Linux/solr/core/src/java/org/apache/solr/client/solrj/embedded/EmbeddedSolrServer.java (at line 219)
 [ecj-lint] return (NamedList<Object>) new JavaBinCodec(resolver).unmarshal(in);
 [ecj-lint]                           ^^^^^^^^^^^^^^^^^^^^^^^^^^
 [ecj-lint] Resource leak: '<unassigned Closeable value>' is never closed
 [ecj-lint] ----------
 [ecj-lint] ----------
 [ecj-lint] 2. WARNING in /home/jenkins/workspace/Lucene-Solr-master-Linux/solr/core/src/java/org/apache/solr/cloud/autoscaling/sim/SimCloudManager.java (at line 788)
 [ecj-lint] throw new UnsupportedOperationException("must add at least 1 node first");
 [ecj-lint] ^^^^^^^^^^^^^^^^^^^^^^^^^^^^^^^^^^^^^^^^^^^^^^^^^^^^^^^^^^^^^^^^^^^^^^^^^^
 [ecj-lint] Resource leak: 'queryRequest' is not closed at this location
 [ecj-lint] ----------
 [ecj-lint] 3. WARNING in /home/jenkins/workspace/Lucene-Solr-master-Linux/solr/core/src/java/org/apache/solr/cloud/autoscaling/sim/SimCloudManager.java (at line 794)
 [ecj-lint] throw new UnsupportedOperationException("must add at least 1 node first");
 [ecj-lint] ^^^^^^^^^^^^^^^^^^^^^^^^^^^^^^^^^^^^^^^^^^^^^^^^^^^^^^^^^^^^^^^^^^^^^^^^^^
 [ecj-lint] Resource leak: 'queryRequest' is not closed at this location
 [ecj-lint] ----------
 [ecj-lint] ----------
 [ecj-lint] 4. ERROR in /home/jenkins/workspace/Lucene-Solr-master-Linux/solr/core/src/java/org/apache/solr/core/SolrResourceLoader.java (at line 19)
 [ecj-lint] import javax.naming.Context;
 [ecj-lint]       ^^^^^^^^^^^^^^^^^^^^
 [ecj-lint] The type javax.naming.Context is not accessible
 [ecj-lint] ----------
 [ecj-lint] 5. ERROR in /home/jenkins/workspace/Lucene-Solr-master-Linux/solr/core/src/java/org/apache/solr/core/SolrResourceLoader.java (at line 20)
 [ecj-lint] import javax.naming.InitialContext;
 [ecj-lint]       ^^^^^^^^^^^^^^^^^^^^^^^^^^^
 [ecj-lint] The type javax.naming.InitialContext is not accessible
 [ecj-lint] ----------
 [ecj-lint] 6. ERROR in /home/jenkins/workspace/Lucene-Solr-master-Linux/solr/core/src/java/org/apache/solr/core/SolrResourceLoader.java (at line 21)
 [ecj-lint] import javax.naming.NamingException;
 [ecj-lint]       ^^^^^^^^^^^^^^^^^^^^^^^^^^^^
 [ecj-lint] The type javax.naming.NamingException is not accessible
 [ecj-lint] ----------
 [ecj-lint] 7. ERROR in /home/jenkins/workspace/Lucene-Solr-master-Linux/solr/core/src/java/org/apache/solr/core/SolrResourceLoader.java (at line 22)
 [ecj-lint] import javax.naming.NoInitialContextException;
 [ecj-lint]       ^^^^^^^^^^^^^^^^^^^^^^^^^^^^^^^^^^^^^^
 [ecj-lint] The type javax.naming.NoInitialContextException is not accessible
 [ecj-lint] ----------
 [ecj-lint] 8. ERROR in /home/jenkins/workspace/Lucene-Solr-master-Linux/solr/core/src/java/org/apache/solr/core/SolrResourceLoader.java (at line 776)
 [ecj-lint] Context c = new InitialContext();
 [ecj-lint] ^^^^^^^
 [ecj-lint] Context cannot be resolved to a type
 [ecj-lint] ----------
 [ecj-lint] 9. ERROR in /home/jenkins/workspace/Lucene-Solr-master-Linux/solr/core/src/java/org/apache/solr/core/SolrResourceLoader.java (at line 776)
 [ecj-lint] Context c = new InitialContext();
 [ecj-lint]                ^^^^^^^^^^^^^^
 [ecj-lint] InitialContext cannot be resolved to a type
 [ecj-lint] ----------
 [ecj-lint] 10. ERROR in /home/jenkins/workspace/Lucene-Solr-master-Linux/solr/core/src/java/org/apache/solr/core/SolrResourceLoader.java (at line 779)
 [ecj-lint] } catch (NoInitialContextException e) {
 [ecj-lint]         ^^^^^^^^^^^^^^^^^^^^^^^^^
 [ecj-lint] NoInitialContextException cannot be resolved to a type
 [ecj-lint] ----------
 [ecj-lint] 11. ERROR in /home/jenkins/workspace/Lucene-Solr-master-Linux/solr/core/src/java/org/apache/solr/core/SolrResourceLoader.java (at line 781)
 [ecj-lint] } catch (NamingException e) {
 [ecj-lint]         ^^^^^^^^^^^^^^^
 [ecj-lint] NamingException cannot be resolved to a type
 [ecj-lint] ----------
 [ecj-lint] ----------
 [ecj-lint] 12. WARNING in /home/jenkins/workspace/Lucene-Solr-master-Linux/solr/core/src/java/org/apache/solr/handler/SolrConfigHandler.java (at line 535)
 [ecj-lint] new PluginBag.RuntimeLib(req.getCore()).init(new PluginInfo(info.tag, op.getDataMap()));
 [ecj-lint] ^^^^^^^^^^^^^^^^^^^^^^^^^^^^^^^^^^^^^^^
 [ecj-lint] Resource leak: '<unassigned Closeable value>' is never closed
 [ecj-lint] ----------
 [ecj-lint] ----------
 [ecj-lint] 13. WARNING in /home/jenkins/workspace/Lucene-Solr-master-Linux/solr/core/src/java/org/apache/solr/handler/admin/SegmentsInfoRequestHandler.java (at line 244)
 [ecj-lint] leafReader = ((FilterLeafReader)leafReader).getDelegate();
 [ecj-lint] ^^^^^^^^^^^^^^^^^^^^^^^^^^^^^^^^^^^^^^^^^^^^^^^^^^^^^^^^^
 [ecj-lint] Resource leak: 'leafReader' is not closed at this location
 [ecj-lint] ----------
 [ecj-lint] ----------
 [ecj-lint] 14. WARNING in /home/jenkins/workspace/Lucene-Solr-master-Linux/solr/core/src/java/org/apache/solr/handler/component/HttpShardHandler.java (at line 148)
 [ecj-lint] return new JavaBinCodec(null, stringCache).setReadStringAsCharSeq(true);
 [ecj-lint]       ^^^^^^^^^^^^^^^^^^^^^^^^^^^^^^^^^^^
 [ecj-lint] Resource leak: '<unassigned Closeable value>' is never closed
 [ecj-lint] ----------
 [ecj-lint] ----------
 [ecj-lint] 15. WARNING in /home/jenkins/workspace/Lucene-Solr-master-Linux/solr/core/src/java/org/apache/solr/handler/loader/JavabinLoader.java (at line 137)
 [ecj-lint] new JavaBinCodec() {
 [ecj-lint]       SolrParams params;
 [ecj-lint]       AddUpdateCommand addCmd = null;
 [ecj-lint]
 [ecj-lint]       @Override
 [ecj-lint]       public List<Object> readIterator(DataInputInputStream fis) throws IOException {
 [ecj-lint]         while (true) {
 [ecj-lint]           Object o = readVal(fis);
 [ecj-lint]           if (o == END_OBJ) break;
 [ecj-lint]           if (o instanceof NamedList) {
 [ecj-lint]             params = ((NamedList) o).toSolrParams();
 [ecj-lint]           } else {
 [ecj-lint]             try {
 [ecj-lint]               if (o instanceof byte[]) {
 [ecj-lint]                 if (params != null) req.setParams(params);
 [ecj-lint]                 byte[] buf = (byte[]) o;
 [ecj-lint]                 contentStreamLoader.load(req, rsp, new ContentStreamBase.ByteArrayStream(buf, null), processor);
 [ecj-lint]               } else {
 [ecj-lint]                 throw new RuntimeException("unsupported type ");
 [ecj-lint]               }
 [ecj-lint]             } catch (Exception e) {
 [ecj-lint]               throw new RuntimeException(e);
 [ecj-lint]             } finally {
 [ecj-lint]               params = null;
 [ecj-lint]               req.setParams(old);
 [ecj-lint]             }
 [ecj-lint]           }
 [ecj-lint]         }
 [ecj-lint]         return Collections.emptyList();
 [ecj-lint]       }
 [ecj-lint]
 [ecj-lint]     }.unmarshal(in);
 [ecj-lint] ^^^^^^^^^^^^^^^^^^^^^^^^^^^^^^^^^^^^^^^^^^^^^^^^^^^^^^^^^^^^^^^^^^^^^^^^^^^^^^^^^^^^^^^^^^^^^^^^^^^^^^^^^^^^^^^^^^^^^^^^^^^^^^^^^^^^^^^^^^^^^^^^^^^^^^^^^^^^^^^^^^^^^^^^^^^^^^^^^^^^^^^^^^^^^^^^^^^^^^^^^^^^^^^^^^^^^^^^^^^^^^^^^^^^^^^^^^^^^^^^^^^^^^^^^^^^^^^^^^^^^^^^^^^^^^^^^^^^^^^^^^^^^^^^^^^^^^^^^^^^^^^^^^^^^^^^^^^^^^^^^^^^^^^^^^^^^^^^^^^^^^^^^^^^^^^^^^^^^^^^^^^^^^^^^^^^^^^^^^^^^^^^^^^^^^^^^^^^^^^^^^^^^^^^^^^^^^^^^^^^^^^^^^^^^^^^^^^^^^^^^^^^^^^^^^^^^^^^^^^^^^^^^^^^^^^^^^^^^^^^^^^^^^^^^^^^^^^^^^^^^^^^^^^^^^^^^^^^^^^^^^^^^^^^^^^^^^^^^^^^^^^^^^^^^^^^^^^^^^^^^^^^^^^^^^^^^^^^^^^^^^^^^^^^^^^^^^^^^^^^^^^^^^^^^^^^^^^^^^^^^^^^^^^^^^^^^^^^^^^^^^^^^^^^^^^^^^^^^^^^^^^^^^^^^^^^^^^^^^^^^^^^^^^^^^^^^^^^^^^^^^^^^^^^^^^^^^^^^^^^^^^^^^^^^^^^^^^^^^^^^^^^^^^^^^^^^^^^^^^^^^^^^^^^^^^^^^^^^^^^^^^^^^^^^^^^^^^^^^^^^^^^^^^^^^^^^^^^^^^^^^^^^^^^^^^^^^^^^^^^^^^^^^^^^^^^^^^^^^^^^^^^^^^^^^^^^^^^^^^^^^^^^^^^^^^^^^^^^^^^^^^^^^^^^^^^^^^^^^^^^^^^^^^^^^^^^^^^^^^^^^^^^^^^^^^^^^^^^^^^^^^^^^^^^^^^^^^^^^^^^^^^^^^^^^^^^^^^^^^^^^^^^^^^^^^^^^^^^^^^^^^^^^
 [ecj-lint] Resource leak: '<unassigned Closeable value>' is never closed
 [ecj-lint] ----------
 [ecj-lint] ----------
 [ecj-lint] 16. INFO in /home/jenkins/workspace/Lucene-Solr-master-Linux/solr/core/src/java/org/apache/solr/logging/log4j2/Log4j2Watcher.java (at line 187)
 [ecj-lint] if (logger == root || root.equals(logger) || isRootLogger(name) || "".equals(name)) {
 [ecj-lint]                                  ^^^^^^
 [ecj-lint] Unlikely argument type for equals(): Map.Entry<String,LoggerConfig> seems to be unrelated to Logger
 [ecj-lint] ----------
 [ecj-lint] ----------
 [ecj-lint] 17. WARNING in /home/jenkins/workspace/Lucene-Solr-master-Linux/solr/core/src/java/org/apache/solr/update/SolrIndexSplitter.java (at line 258)
 [ecj-lint] HardlinkCopyDirectoryWrapper hardLinkedDir = new HardlinkCopyDirectoryWrapper(splitDir);
 [ecj-lint]                             ^^^^^^^^^^^^^
 [ecj-lint] Resource leak: 'hardLinkedDir' is never closed
 [ecj-lint] ----------
 [ecj-lint] ----------
 [ecj-lint] 18. WARNING in /home/jenkins/workspace/Lucene-Solr-master-Linux/solr/core/src/java/org/apache/solr/util/FileUtils.java (at line 50)
 [ecj-lint] in = new FileInputStream(src).getChannel();
 [ecj-lint]     ^^^^^^^^^^^^^^^^^^^^^^^^
 [ecj-lint] Resource leak: '<unassigned Closeable value>' is never closed
 [ecj-lint] ----------
 [ecj-lint] 19. WARNING in /home/jenkins/workspace/Lucene-Solr-master-Linux/solr/core/src/java/org/apache/solr/util/FileUtils.java (at line 51)
 [ecj-lint] out = new FileOutputStream(destination).getChannel();
 [ecj-lint]      ^^^^^^^^^^^^^^^^^^^^^^^^^^^^^^^^^
 [ecj-lint] Resource leak: '<unassigned Closeable value>' is never closed
 [ecj-lint] ----------
 [ecj-lint] ----------
 [ecj-lint] 20. WARNING in /home/jenkins/workspace/Lucene-Solr-master-Linux/solr/core/src/java/org/apache/solr/util/SolrCLI.java (at line 1143)
 [ecj-lint] SnapshotCloudManager snapshotCloudManager = new SnapshotCloudManager(simCloudManager, config);
 [ecj-lint]                     ^^^^^^^^^^^^^^^^^^^^
 [ecj-lint] Resource leak: 'snapshotCloudManager' is never closed
 [ecj-lint] ----------
 [ecj-lint] ----------
 [ecj-lint] 21. WARNING in /home/jenkins/workspace/Lucene-Solr-master-Linux/solr/core/src/java/org/apache/solr/util/TestInjection.java (at line 263)
 [ecj-lint] timers.remove(this);
 [ecj-lint]              ^^^^
 [ecj-lint] Unlikely argument type new TimerTask(){} for remove(Object) on a Collection<Timer>
 [ecj-lint] ----------
 [ecj-lint] 21 problems (8 errors, 12 warnings, 1 info)

BUILD FAILED
/home/jenkins/workspace/Lucene-Solr-master-Linux/build.xml:634: The following error occurred while executing this line:
/home/jenkins/workspace/Lucene-Solr-master-Linux/build.xml:101: The following error occurred while executing this line:
/home/jenkins/workspace/Lucene-Solr-master-Linux/solr/build.xml:645: The following error occurred while executing this line:
/home/jenkins/workspace/Lucene-Solr-master-Linux/lucene/common-build.xml:2009: The following error occurred while executing this line:
/home/jenkins/workspace/Lucene-Solr-master-Linux/lucene/common-build.xml:2048: Compile failed; see the compiler error output for details.

Total time: 93 minutes 53 seconds
Build step 'Invoke Ant' marked build as failure
Archiving artifacts
Setting ANT_1_8_2_HOME=/home/jenkins/tools/hudson.tasks.Ant_AntInstallation/ANT_1.8.2
[WARNINGS] Skipping publisher since build result is FAILURE
Recording test results
Setting ANT_1_8_2_HOME=/home/jenkins/tools/hudson.tasks.Ant_AntInstallation/ANT_1.8.2
Email was triggered for: Failure - Any
Sending email for trigger: Failure - Any
Setting ANT_1_8_2_HOME=/home/jenkins/tools/hudson.tasks.Ant_AntInstallation/ANT_1.8.2
Setting ANT_1_8_2_HOME=/home/jenkins/tools/hudson.tasks.Ant_AntInstallation/ANT_1.8.2
Setting ANT_1_8_2_HOME=/home/jenkins/tools/hudson.tasks.Ant_AntInstallation/ANT_1.8.2
Setting ANT_1_8_2_HOME=/home/jenkins/tools/hudson.tasks.Ant_AntInstallation/ANT_1.8.2
Setting ANT_1_8_2_HOME=/home/jenkins/tools/hudson.tasks.Ant_AntInstallation/ANT_1.8.2
Setting ANT_1_8_2_HOME=/home/jenkins/tools/hudson.tasks.Ant_AntInstallation/ANT_1.8.2


---------------------------------------------------------------------
To unsubscribe, e-mail: [hidden email]
For additional commands, e-mail: [hidden email]