[JENKINS] Lucene-Solr-4.x-Linux (32bit/jdk1.8.0_20-ea-b11) - Build # 10156 - Failure!

classic Classic list List threaded Threaded
1 message Options
Reply | Threaded
Open this post in threaded view
|

[JENKINS] Lucene-Solr-4.x-Linux (32bit/jdk1.8.0_20-ea-b11) - Build # 10156 - Failure!

Policeman Jenkins Server-2
Build: http://jenkins.thetaphi.de/job/Lucene-Solr-4.x-Linux/10156/
Java: 32bit/jdk1.8.0_20-ea-b11 -client -XX:+UseConcMarkSweepGC

1 tests failed.
FAILED:  junit.framework.TestSuite.org.apache.solr.morphlines.cell.SolrCellMorphlineTest

Error Message:
Suite timeout exceeded (>= 7200000 msec).

Stack Trace:
java.lang.Exception: Suite timeout exceeded (>= 7200000 msec).
        at __randomizedtesting.SeedInfo.seed([6E7687867E6A0B34]:0)




Build Log:
[...truncated 19317 lines...]
   [junit4] Suite: org.apache.solr.morphlines.cell.SolrCellMorphlineTest
   [junit4]   2> log4j:WARN No such property [conversionPattern] in org.apache.solr.util.SolrLogLayout.
   [junit4]   2> Creating dataDir: /mnt/ssd/jenkins/workspace/Lucene-Solr-4.x-Linux/solr/build/contrib/solr-morphlines-cell/test/J0/./solr.morphlines.cell.SolrCellMorphlineTest-6E7687867E6A0B34-001/init-core-data-001
   [junit4]   2> 622 T10 oas.SolrTestCaseJ4.buildSSLConfig Randomized ssl (true) and clientAuth (false)
   [junit4]   2> 650 T10 oas.SolrTestCaseJ4.initCore ####initCore
   [junit4]   2> 683 T10 oasc.SolrResourceLoader.<init> new SolrResourceLoader for directory: '/mnt/ssd/jenkins/workspace/Lucene-Solr-4.x-Linux/solr/contrib/morphlines-core/src/test-files/solr/collection1/'
   [junit4]   2> 1268 T10 oasc.SolrConfig.initLibs Adding specified lib dirs to ClassLoader
   [junit4]   2> 1289 T10 oasc.SolrResourceLoader.addToClassLoader WARN Can't find (or read) directory to add to classloader: ../../../contrib/extraction/lib (resolved as: /mnt/ssd/jenkins/workspace/Lucene-Solr-4.x-Linux/solr/contrib/morphlines-core/src/test-files/solr/collection1/../../../contrib/extraction/lib).
   [junit4]   2> 1290 T10 oasc.SolrResourceLoader.addToClassLoader WARN Can't find (or read) directory to add to classloader: ../../../dist/ (resolved as: /mnt/ssd/jenkins/workspace/Lucene-Solr-4.x-Linux/solr/contrib/morphlines-core/src/test-files/solr/collection1/../../../dist).
   [junit4]   2> 1291 T10 oasc.SolrResourceLoader.addToClassLoader WARN Can't find (or read) directory to add to classloader: ../../../contrib/clustering/lib/ (resolved as: /mnt/ssd/jenkins/workspace/Lucene-Solr-4.x-Linux/solr/contrib/morphlines-core/src/test-files/solr/collection1/../../../contrib/clustering/lib).
   [junit4]   2> 1291 T10 oasc.SolrResourceLoader.addToClassLoader WARN Can't find (or read) directory to add to classloader: ../../../dist/ (resolved as: /mnt/ssd/jenkins/workspace/Lucene-Solr-4.x-Linux/solr/contrib/morphlines-core/src/test-files/solr/collection1/../../../dist).
   [junit4]   2> 1292 T10 oasc.SolrResourceLoader.addToClassLoader WARN Can't find (or read) directory to add to classloader: ../../../contrib/langid/lib/ (resolved as: /mnt/ssd/jenkins/workspace/Lucene-Solr-4.x-Linux/solr/contrib/morphlines-core/src/test-files/solr/collection1/../../../contrib/langid/lib).
   [junit4]   2> 1293 T10 oasc.SolrResourceLoader.addToClassLoader WARN Can't find (or read) directory to add to classloader: ../../../dist/ (resolved as: /mnt/ssd/jenkins/workspace/Lucene-Solr-4.x-Linux/solr/contrib/morphlines-core/src/test-files/solr/collection1/../../../dist).
   [junit4]   2> 1293 T10 oasc.SolrResourceLoader.addToClassLoader WARN Can't find (or read) directory to add to classloader: ../../../contrib/velocity/lib (resolved as: /mnt/ssd/jenkins/workspace/Lucene-Solr-4.x-Linux/solr/contrib/morphlines-core/src/test-files/solr/collection1/../../../contrib/velocity/lib).
   [junit4]   2> 1294 T10 oasc.SolrResourceLoader.addToClassLoader WARN Can't find (or read) directory to add to classloader: ../../../dist/ (resolved as: /mnt/ssd/jenkins/workspace/Lucene-Solr-4.x-Linux/solr/contrib/morphlines-core/src/test-files/solr/collection1/../../../dist).
   [junit4]   2> 1294 T10 oasc.SolrResourceLoader.addToClassLoader WARN Can't find (or read) directory to add to classloader: /non/existent/dir/yields/warning (resolved as: /non/existent/dir/yields/warning).
   [junit4]   2> 1356 T10 oasc.SolrConfig.<init> Using Lucene MatchVersion: LUCENE_4_9
   [junit4]   2> 1548 T10 oasc.SolrConfig.<init> Loaded SolrConfig: solrconfig.xml
   [junit4]   2> 1556 T10 oass.IndexSchema.readSchema Reading Solr Schema from schema.xml
   [junit4]   2> 1597 T10 oass.IndexSchema.readSchema [null] Schema name=example
   [junit4]   2> 1752 T10 oasc.SolrResourceLoader.findClass WARN Solr loaded a deprecated plugin/analysis class [solr.IntField]. Please consult documentation how to replace it accordingly.
   [junit4]   2> 1758 T10 oasc.SolrResourceLoader.findClass WARN Solr loaded a deprecated plugin/analysis class [solr.LongField]. Please consult documentation how to replace it accordingly.
   [junit4]   2> 1764 T10 oasc.SolrResourceLoader.findClass WARN Solr loaded a deprecated plugin/analysis class [solr.FloatField]. Please consult documentation how to replace it accordingly.
   [junit4]   2> 1778 T10 oasc.SolrResourceLoader.findClass WARN Solr loaded a deprecated plugin/analysis class [solr.DoubleField]. Please consult documentation how to replace it accordingly.
   [junit4]   2> 1784 T10 oasc.SolrResourceLoader.findClass WARN Solr loaded a deprecated plugin/analysis class [solr.DateField]. Please consult documentation how to replace it accordingly.
   [junit4]   2> 2189 T10 oasc.SolrResourceLoader.findClass WARN Solr loaded a deprecated plugin/analysis class [solr.ThaiWordFilterFactory]. Please consult documentation how to replace it accordingly.
   [junit4]   2> 2221 T10 oass.IndexSchema.readSchema unique key field: id
   [junit4]   2> 2385 T10 oass.FileExchangeRateProvider.reload Reloading exchange rates from file currency.xml
   [junit4]   2> 2393 T10 oass.FileExchangeRateProvider.reload Reloading exchange rates from file currency.xml
   [junit4]   2> 2483 T10 oasc.SolrResourceLoader.locateSolrHome JNDI not configured for solr (NoInitialContextEx)
   [junit4]   2> 2483 T10 oasc.SolrResourceLoader.locateSolrHome using system property solr.solr.home: /mnt/ssd/jenkins/workspace/Lucene-Solr-4.x-Linux/solr/contrib/morphlines-core/src/test-files/solr
   [junit4]   2> 2484 T10 oasc.SolrResourceLoader.<init> new SolrResourceLoader for directory: '/mnt/ssd/jenkins/workspace/Lucene-Solr-4.x-Linux/solr/contrib/morphlines-core/src/test-files/solr/'
   [junit4]   2> 2571 T10 oasc.CoreContainer.<init> New CoreContainer 5444450
   [junit4]   2> 2572 T10 oasc.CoreContainer.load Loading cores into CoreContainer [instanceDir=/mnt/ssd/jenkins/workspace/Lucene-Solr-4.x-Linux/solr/contrib/morphlines-core/src/test-files/solr/]
   [junit4]   2> 2607 T10 oashc.HttpShardHandlerFactory.getParameter Setting socketTimeout to: 0
   [junit4]   2> 2608 T10 oashc.HttpShardHandlerFactory.getParameter Setting urlScheme to: null
   [junit4]   2> 2614 T10 oashc.HttpShardHandlerFactory.getParameter Setting connTimeout to: 0
   [junit4]   2> 2615 T10 oashc.HttpShardHandlerFactory.getParameter Setting maxConnectionsPerHost to: 20
   [junit4]   2> 2615 T10 oashc.HttpShardHandlerFactory.getParameter Setting corePoolSize to: 0
   [junit4]   2> 2615 T10 oashc.HttpShardHandlerFactory.getParameter Setting maximumPoolSize to: 2147483647
   [junit4]   2> 2616 T10 oashc.HttpShardHandlerFactory.getParameter Setting maxThreadIdleTime to: 5
   [junit4]   2> 2616 T10 oashc.HttpShardHandlerFactory.getParameter Setting sizeOfQueue to: -1
   [junit4]   2> 2616 T10 oashc.HttpShardHandlerFactory.getParameter Setting fairnessPolicy to: false
   [junit4]   2> 2840 T10 oasl.LogWatcher.createWatcher SLF4J impl is org.slf4j.impl.Log4jLoggerFactory
   [junit4]   2> 2842 T10 oasl.LogWatcher.newRegisteredLogWatcher Registering Log Listener [Log4j (org.slf4j.impl.Log4jLoggerFactory)]
   [junit4]   2> 2844 T10 oasc.CoreContainer.load Host Name:
   [junit4]   2> 2951 T11 oasc.SolrResourceLoader.<init> new SolrResourceLoader for directory: '/mnt/ssd/jenkins/workspace/Lucene-Solr-4.x-Linux/solr/contrib/morphlines-core/src/test-files/solr/collection1/'
   [junit4]   2> 3000 T11 oasc.SolrConfig.initLibs Adding specified lib dirs to ClassLoader
   [junit4]   2> 3001 T11 oasc.SolrResourceLoader.addToClassLoader WARN Can't find (or read) directory to add to classloader: ../../../contrib/extraction/lib (resolved as: /mnt/ssd/jenkins/workspace/Lucene-Solr-4.x-Linux/solr/contrib/morphlines-core/src/test-files/solr/collection1/../../../contrib/extraction/lib).
   [junit4]   2> 3001 T11 oasc.SolrResourceLoader.addToClassLoader WARN Can't find (or read) directory to add to classloader: ../../../dist/ (resolved as: /mnt/ssd/jenkins/workspace/Lucene-Solr-4.x-Linux/solr/contrib/morphlines-core/src/test-files/solr/collection1/../../../dist).
   [junit4]   2> 3002 T11 oasc.SolrResourceLoader.addToClassLoader WARN Can't find (or read) directory to add to classloader: ../../../contrib/clustering/lib/ (resolved as: /mnt/ssd/jenkins/workspace/Lucene-Solr-4.x-Linux/solr/contrib/morphlines-core/src/test-files/solr/collection1/../../../contrib/clustering/lib).
   [junit4]   2> 3002 T11 oasc.SolrResourceLoader.addToClassLoader WARN Can't find (or read) directory to add to classloader: ../../../dist/ (resolved as: /mnt/ssd/jenkins/workspace/Lucene-Solr-4.x-Linux/solr/contrib/morphlines-core/src/test-files/solr/collection1/../../../dist).
   [junit4]   2> 3003 T11 oasc.SolrResourceLoader.addToClassLoader WARN Can't find (or read) directory to add to classloader: ../../../contrib/langid/lib/ (resolved as: /mnt/ssd/jenkins/workspace/Lucene-Solr-4.x-Linux/solr/contrib/morphlines-core/src/test-files/solr/collection1/../../../contrib/langid/lib).
   [junit4]   2> 3003 T11 oasc.SolrResourceLoader.addToClassLoader WARN Can't find (or read) directory to add to classloader: ../../../dist/ (resolved as: /mnt/ssd/jenkins/workspace/Lucene-Solr-4.x-Linux/solr/contrib/morphlines-core/src/test-files/solr/collection1/../../../dist).
   [junit4]   2> 3003 T11 oasc.SolrResourceLoader.addToClassLoader WARN Can't find (or read) directory to add to classloader: ../../../contrib/velocity/lib (resolved as: /mnt/ssd/jenkins/workspace/Lucene-Solr-4.x-Linux/solr/contrib/morphlines-core/src/test-files/solr/collection1/../../../contrib/velocity/lib).
   [junit4]   2> 3004 T11 oasc.SolrResourceLoader.addToClassLoader WARN Can't find (or read) directory to add to classloader: ../../../dist/ (resolved as: /mnt/ssd/jenkins/workspace/Lucene-Solr-4.x-Linux/solr/contrib/morphlines-core/src/test-files/solr/collection1/../../../dist).
   [junit4]   2> 3004 T11 oasc.SolrResourceLoader.addToClassLoader WARN Can't find (or read) directory to add to classloader: /non/existent/dir/yields/warning (resolved as: /non/existent/dir/yields/warning).
   [junit4]   2> 3036 T11 oasc.SolrConfig.<init> Using Lucene MatchVersion: LUCENE_4_9
   [junit4]   2> 3089 T11 oasc.SolrConfig.<init> Loaded SolrConfig: solrconfig.xml
   [junit4]   2> 3090 T11 oass.IndexSchema.readSchema Reading Solr Schema from schema.xml
   [junit4]   2> 3106 T11 oass.IndexSchema.readSchema [collection1] Schema name=example
   [junit4]   2> 3426 T11 oass.IndexSchema.readSchema unique key field: id
   [junit4]   2> 3444 T11 oass.FileExchangeRateProvider.reload Reloading exchange rates from file currency.xml
   [junit4]   2> 3449 T11 oass.FileExchangeRateProvider.reload Reloading exchange rates from file currency.xml
   [junit4]   2> 3472 T11 oasc.CoreContainer.create Creating SolrCore 'collection1' using configuration from instancedir /mnt/ssd/jenkins/workspace/Lucene-Solr-4.x-Linux/solr/contrib/morphlines-core/src/test-files/solr/collection1/
   [junit4]   2> 3505 T11 oasc.SolrCore.initDirectoryFactory org.apache.solr.core.MockDirectoryFactory
   [junit4]   2> 3514 T11 oasc.SolrCore.<init> [collection1] Opening new SolrCore at /mnt/ssd/jenkins/workspace/Lucene-Solr-4.x-Linux/solr/contrib/morphlines-core/src/test-files/solr/collection1/, dataDir=/mnt/ssd/jenkins/workspace/Lucene-Solr-4.x-Linux/solr/build/contrib/solr-morphlines-cell/test/J0/./solr.morphlines.cell.SolrCellMorphlineTest-6E7687867E6A0B34-001/init-core-data-001/
   [junit4]   2> 3516 T11 oasc.JmxMonitoredMap.<init> No JMX servers found, not exposing Solr information with JMX.
   [junit4]   2> 3528 T11 oasc.SolrCore.initListeners [collection1] Added SolrEventListener for newSearcher: org.apache.solr.core.QuerySenderListener{queries=[]}
   [junit4]   2> 3528 T11 oasc.SolrCore.initListeners [collection1] Added SolrEventListener for firstSearcher: org.apache.solr.core.QuerySenderListener{queries=[{q=static firstSearcher warming in solrconfig.xml}]}
   [junit4]   2> 3564 T11 oasc.CachingDirectoryFactory.get return new directory for /mnt/ssd/jenkins/workspace/Lucene-Solr-4.x-Linux/solr/build/contrib/solr-morphlines-cell/test/J0/./solr.morphlines.cell.SolrCellMorphlineTest-6E7687867E6A0B34-001/init-core-data-001
   [junit4]   2> 3565 T11 oasc.SolrCore.getNewIndexDir New index directory detected: old=null new=/mnt/ssd/jenkins/workspace/Lucene-Solr-4.x-Linux/solr/build/contrib/solr-morphlines-cell/test/J0/./solr.morphlines.cell.SolrCellMorphlineTest-6E7687867E6A0B34-001/init-core-data-001/index/
   [junit4]   2> 3566 T11 oasc.SolrCore.initIndex WARN [collection1] Solr index directory '/mnt/ssd/jenkins/workspace/Lucene-Solr-4.x-Linux/solr/build/contrib/solr-morphlines-cell/test/J0/./solr.morphlines.cell.SolrCellMorphlineTest-6E7687867E6A0B34-001/init-core-data-001/index' doesn't exist. Creating new index...
   [junit4]   2> 3577 T11 oasc.CachingDirectoryFactory.get return new directory for /mnt/ssd/jenkins/workspace/Lucene-Solr-4.x-Linux/solr/build/contrib/solr-morphlines-cell/test/J0/./solr.morphlines.cell.SolrCellMorphlineTest-6E7687867E6A0B34-001/init-core-data-001/index
   [junit4]   2> 3630 T11 oasc.SolrDeletionPolicy.onCommit SolrDeletionPolicy.onCommit: commits: num=1
   [junit4]   2> commit{dir=MockDirectoryWrapper(RAMDirectory@739f20 lockFactory=NativeFSLockFactory@/mnt/ssd/jenkins/workspace/Lucene-Solr-4.x-Linux/solr/build/contrib/solr-morphlines-cell/test/J0/./solr.morphlines.cell.SolrCellMorphlineTest-6E7687867E6A0B34-001/init-core-data-001/index),segFN=segments_1,generation=1}
   [junit4]   2> 3631 T11 oasc.SolrDeletionPolicy.updateCommits newest commit generation = 1
   [junit4]   2> 3642 T11 oasc.SolrCore.initWriters created json: solr.JSONResponseWriter
   [junit4]   2> 3642 T11 oasc.SolrCore.initWriters adding lazy queryResponseWriter: solr.VelocityResponseWriter
   [junit4]   2> 3643 T11 oasc.SolrCore.initWriters created velocity: solr.VelocityResponseWriter
   [junit4]   2> 3655 T11 oasc.SolrCore.initWriters created xslt: solr.XSLTResponseWriter
   [junit4]   2> 3655 T11 oasr.XSLTResponseWriter.init xsltCacheLifetimeSeconds=5
   [junit4]   2> 3948 T11 oasc.SolrCore.loadUpdateProcessorChains no updateRequestProcessorChain defined as default, creating implicit default
   [junit4]   2> 3976 T11 oasc.RequestHandlers.initHandlersFromConfig created /select: solr.SearchHandler
   [junit4]   2> 3976 T11 oasc.RequestHandlers.initHandlersFromConfig created /query: solr.SearchHandler
   [junit4]   2> 3983 T11 oasc.RequestHandlers.initHandlersFromConfig created /get: solr.RealTimeGetHandler
   [junit4]   2> 3983 T11 oasc.RequestHandlers.initHandlersFromConfig created /browse: solr.SearchHandler
   [junit4]   2> 3991 T11 oasc.RequestHandlers.initHandlersFromConfig created /update: solr.UpdateRequestHandler
   [junit4]   2> 3997 T11 oasc.SolrResourceLoader.findClass WARN Solr loaded a deprecated plugin/analysis class [solr.JsonUpdateRequestHandler]. Please consult documentation how to replace it accordingly.
   [junit4]   2> 3997 T11 oasc.RequestHandlers.initHandlersFromConfig created /update/json: solr.JsonUpdateRequestHandler
   [junit4]   2> 4003 T11 oasc.SolrResourceLoader.findClass WARN Solr loaded a deprecated plugin/analysis class [solr.CSVRequestHandler]. Please consult documentation how to replace it accordingly.
   [junit4]   2> 4003 T11 oasc.RequestHandlers.initHandlersFromConfig created /update/csv: solr.CSVRequestHandler
   [junit4]   2> 4003 T11 oasc.RequestHandlers.initHandlersFromConfig adding lazy requestHandler: solr.FieldAnalysisRequestHandler
   [junit4]   2> 4004 T11 oasc.RequestHandlers.initHandlersFromConfig created /analysis/field: solr.FieldAnalysisRequestHandler
   [junit4]   2> 4005 T11 oasc.RequestHandlers.initHandlersFromConfig adding lazy requestHandler: solr.DocumentAnalysisRequestHandler
   [junit4]   2> 4005 T11 oasc.RequestHandlers.initHandlersFromConfig created /analysis/document: solr.DocumentAnalysisRequestHandler
   [junit4]   2> 4011 T11 oasc.RequestHandlers.initHandlersFromConfig created /admin/: solr.admin.AdminHandlers
   [junit4]   2> 4019 T11 oasc.RequestHandlers.initHandlersFromConfig created /admin/ping: solr.PingRequestHandler
   [junit4]   2> 4026 T11 oasc.RequestHandlers.initHandlersFromConfig created /debug/dump: solr.DumpRequestHandler
   [junit4]   2> 4046 T11 oasc.RequestHandlers.initHandlersFromConfig created /replication: solr.ReplicationHandler
   [junit4]   2> 4046 T11 oasc.RequestHandlers.initHandlersFromConfig adding lazy requestHandler: solr.SearchHandler
   [junit4]   2> 4046 T11 oasc.RequestHandlers.initHandlersFromConfig created /spell: solr.SearchHandler
   [junit4]   2> 4047 T11 oasc.RequestHandlers.initHandlersFromConfig adding lazy requestHandler: solr.SearchHandler
   [junit4]   2> 4047 T11 oasc.RequestHandlers.initHandlersFromConfig created /tvrh: solr.SearchHandler
   [junit4]   2> 4048 T11 oasc.RequestHandlers.initHandlersFromConfig adding lazy requestHandler: solr.SearchHandler
   [junit4]   2> 4048 T11 oasc.RequestHandlers.initHandlersFromConfig created /terms: solr.SearchHandler
   [junit4]   2> 4048 T11 oasc.RequestHandlers.initHandlersFromConfig adding lazy requestHandler: solr.SearchHandler
   [junit4]   2> 4049 T11 oasc.RequestHandlers.initHandlersFromConfig created /elevate: solr.SearchHandler
   [junit4]   2> 4087 T11 oashl.XMLLoader.init xsltCacheLifetimeSeconds=60
   [junit4]   2> 4093 T11 oashl.XMLLoader.init xsltCacheLifetimeSeconds=60
   [junit4]   2> 4094 T11 oashl.XMLLoader.init xsltCacheLifetimeSeconds=60
   [junit4]   2> 4130 T11 oasu.CommitTracker.<init> Hard AutoCommit: if uncommited for 60000ms;
   [junit4]   2> 4131 T11 oasu.CommitTracker.<init> Soft AutoCommit: if uncommited for 1000ms;
   [junit4]   2> 4133 T11 oasc.SolrDeletionPolicy.onInit SolrDeletionPolicy.onInit: commits: num=1
   [junit4]   2> commit{dir=MockDirectoryWrapper(RAMDirectory@739f20 lockFactory=NativeFSLockFactory@/mnt/ssd/jenkins/workspace/Lucene-Solr-4.x-Linux/solr/build/contrib/solr-morphlines-cell/test/J0/./solr.morphlines.cell.SolrCellMorphlineTest-6E7687867E6A0B34-001/init-core-data-001/index),segFN=segments_1,generation=1}
   [junit4]   2> 4133 T11 oasc.SolrDeletionPolicy.updateCommits newest commit generation = 1
   [junit4]   2> 4147 T11 oass.SolrIndexSearcher.<init> Opening Searcher@1d496ef[collection1] main
   [junit4]   2> 4161 T11 oasr.ManagedResourceStorage$FileStorageIO.configure File-based storage initialized to use dir: /mnt/ssd/jenkins/workspace/Lucene-Solr-4.x-Linux/solr/contrib/morphlines-core/src/test-files/solr/collection1/conf
   [junit4]   2> 4162 T11 oasr.RestManager.init Initializing RestManager with initArgs: {storageDir=/mnt/ssd/jenkins/workspace/Lucene-Solr-4.x-Linux/solr/contrib/morphlines-core/src/test-files/solr/collection1/conf/}
   [junit4]   2> 4183 T11 oasr.ManagedResourceStorage.load Reading _rest_managed.json using file:dir=/mnt/ssd/jenkins/workspace/Lucene-Solr-4.x-Linux/solr/contrib/morphlines-core/src/test-files/solr/collection1/conf
   [junit4]   2> 4184 T11 oasr.ManagedResource.reloadFromStorage WARN No stored data found for /rest/managed
   [junit4]   2> 4184 T11 oasr.ManagedResource.notifyObserversDuringInit WARN No registered observers for /rest/managed
   [junit4]   2> 4184 T11 oasr.RestManager.init Initializing 0 registered ManagedResources
   [junit4]   2> 4185 T11 oashc.SpellCheckComponent.inform Initializing spell checkers
   [junit4]   2> 4207 T11 oass.DirectSolrSpellChecker.init init: {name=default,field=name,classname=solr.DirectSolrSpellChecker,distanceMeasure=internal,accuracy=0.5,maxEdits=2,minPrefix=1,maxInspections=5,minQueryLength=4,maxQueryFrequency=0.01}
   [junit4]   2> 4243 T11 oashc.SpellCheckComponent.inform No queryConverter defined, using default converter
   [junit4]   2> 4247 T11 oashc.QueryElevationComponent.inform Loading QueryElevation from: /mnt/ssd/jenkins/workspace/Lucene-Solr-4.x-Linux/solr/contrib/morphlines-core/src/test-files/solr/collection1/conf/elevate.xml
   [junit4]   2> 4309 T11 oash.ReplicationHandler.inform Commits will be reserved for  10000
   [junit4]   2> 4310 T12 oasc.QuerySenderListener.newSearcher QuerySenderListener sending requests to Searcher@1d496ef[collection1] main{StandardDirectoryReader(segments_1:1:nrt)}
   [junit4]   2> 4311 T11 oasc.CoreContainer.registerCore registering core: collection1
   [junit4]   2> 4317 T10 oas.SolrTestCaseJ4.initCore ####initCore end
   [junit4]   2> 4318 T10 oas.SolrTestCaseJ4.deleteCore ###deleteCore
   [junit4]   2> 4318 T10 oasc.CoreContainer.shutdown Shutting down CoreContainer instance=5444450
   [junit4]   2> ASYNC  NEW_CORE C0 name=collection1 org.apache.solr.core.SolrCore@1440d92
   [junit4]   2> 4405 T12 C0 oasc.SolrCore.execute [collection1] webapp=null path=null params={q=static+firstSearcher+warming+in+solrconfig.xml&distrib=false&event=firstSearcher} hits=0 status=0 QTime=92
   [junit4]   2> 4407 T12 oasc.QuerySenderListener.newSearcher QuerySenderListener done.
   [junit4]   2> 4407 T12 oashc.SpellCheckComponent$SpellCheckerListener.newSearcher Loading spell index for spellchecker: default
   [junit4]   2> 4407 T12 oashc.SpellCheckComponent$SpellCheckerListener.newSearcher Loading spell index for spellchecker: wordbreak
   [junit4]   2> 4408 T12 oasc.SolrCore.registerSearcher [collection1] Registered new searcher Searcher@1d496ef[collection1] main{StandardDirectoryReader(segments_1:1:nrt)}
   [junit4]   2> 7199692 T9 ccr.ThreadLeakControl$2.evaluate WARNING Suite execution timed out: org.apache.solr.morphlines.cell.SolrCellMorphlineTest
   [junit4]   2> ==== jstack at approximately timeout time ====
   [junit4]   2> "Thread-1" ID=13 WAITING on java.lang.Object@1ba673
   [junit4]   2> at java.lang.Object.wait(Native Method)
   [junit4]   2> - waiting on java.lang.Object@1ba673
   [junit4]   2> at java.lang.Object.wait(Object.java:502)
   [junit4]   2> at org.apache.solr.core.CloserThread.run(CoreContainer.java:944)
   [junit4]   2>
   [junit4]   2> "searcherExecutor-5-thread-1" ID=12 WAITING on java.util.concurrent.locks.AbstractQueuedSynchronizer$ConditionObject@ab137b
   [junit4]   2> at sun.misc.Unsafe.park(Native Method)
   [junit4]   2> - waiting on java.util.concurrent.locks.AbstractQueuedSynchronizer$ConditionObject@ab137b
   [junit4]   2> at java.util.concurrent.locks.LockSupport.park(LockSupport.java:175)
   [junit4]   2> at java.util.concurrent.locks.AbstractQueuedSynchronizer$ConditionObject.await(AbstractQueuedSynchronizer.java:2039)
   [junit4]   2> at java.util.concurrent.LinkedBlockingQueue.take(LinkedBlockingQueue.java:442)
   [junit4]   2> at java.util.concurrent.ThreadPoolExecutor.getTask(ThreadPoolExecutor.java:1067)
   [junit4]   2> at java.util.concurrent.ThreadPoolExecutor.runWorker(ThreadPoolExecutor.java:1127)
   [junit4]   2> at java.util.concurrent.ThreadPoolExecutor$Worker.run(ThreadPoolExecutor.java:617)
   [junit4]   2> at java.lang.Thread.run(Thread.java:745)
   [junit4]   2>
   [junit4]   2> "SUITE-SolrCellMorphlineTest-seed#[6E7687867E6A0B34]-worker" ID=10 WAITING on org.apache.solr.core.CloserThread@3bc947
   [junit4]   2> at java.lang.Object.wait(Native Method)
   [junit4]   2> - waiting on org.apache.solr.core.CloserThread@3bc947
   [junit4]   2> at java.lang.Thread.join(Thread.java:1245)
   [junit4]   2> at java.lang.Thread.join(Thread.java:1319)
   [junit4]   2> at org.apache.solr.core.CoreContainer.shutdown(CoreContainer.java:388)
   [junit4]   2> at org.apache.solr.util.TestHarness.close(TestHarness.java:337)
   [junit4]   2> at org.apache.solr.SolrTestCaseJ4.deleteCore(SolrTestCaseJ4.java:615)
   [junit4]   2> at org.apache.solr.SolrTestCaseJ4.afterClass(SolrTestCaseJ4.java:179)
   [junit4]   2> at sun.reflect.NativeMethodAccessorImpl.invoke0(Native Method)
   [junit4]   2> at sun.reflect.NativeMethodAccessorImpl.invoke(NativeMethodAccessorImpl.java:62)
   [junit4]   2> at sun.reflect.DelegatingMethodAccessorImpl.invoke(DelegatingMethodAccessorImpl.java:43)
   [junit4]   2> at java.lang.reflect.Method.invoke(Method.java:483)
   [junit4]   2> at com.carrotsearch.randomizedtesting.RandomizedRunner.invoke(RandomizedRunner.java:1618)
   [junit4]   2> at com.carrotsearch.randomizedtesting.RandomizedRunner$5.evaluate(RandomizedRunner.java:790)
   [junit4]   2> at com.carrotsearch.randomizedtesting.rules.StatementAdapter.evaluate(StatementAdapter.java:36)
   [junit4]   2> at com.carrotsearch.randomizedtesting.rules.SystemPropertiesRestoreRule$1.evaluate(SystemPropertiesRestoreRule.java:53)
   [junit4]   2> at org.apache.lucene.util.AbstractBeforeAfterRule$1.evaluate(AbstractBeforeAfterRule.java:46)
   [junit4]   2> at org.apache.lucene.util.TestRuleStoreClassName$1.evaluate(TestRuleStoreClassName.java:42)
   [junit4]   2> at com.carrotsearch.randomizedtesting.rules.SystemPropertiesInvariantRule$1.evaluate(SystemPropertiesInvariantRule.java:55)
   [junit4]   2> at com.carrotsearch.randomizedtesting.rules.NoShadowingOrOverridesOnMethodsRule$1.evaluate(NoShadowingOrOverridesOnMethodsRule.java:39)
   [junit4]   2> at com.carrotsearch.randomizedtesting.rules.NoShadowingOrOverridesOnMethodsRule$1.evaluate(NoShadowingOrOverridesOnMethodsRule.java:39)
   [junit4]   2> at com.carrotsearch.randomizedtesting.rules.StatementAdapter.evaluate(StatementAdapter.java:36)
   [junit4]   2> at com.carrotsearch.randomizedtesting.rules.StatementAdapter.evaluate(StatementAdapter.java:36)
   [junit4]   2> at com.carrotsearch.randomizedtesting.rules.StatementAdapter.evaluate(StatementAdapter.java:36)
   [junit4]   2> at org.apache.lucene.util.TestRuleAssertionsRequired$1.evaluate(TestRuleAssertionsRequired.java:43)
   [junit4]   2> at org.apache.lucene.util.TestRuleMarkFailure$1.evaluate(TestRuleMarkFailure.java:48)
   [junit4]   2> at org.apache.lucene.util.TestRuleIgnoreAfterMaxFailures$1.evaluate(TestRuleIgnoreAfterMaxFailures.java:65)
   [junit4]   2> at org.apache.lucene.util.TestRuleIgnoreTestSuites$1.evaluate(TestRuleIgnoreTestSuites.java:55)
   [junit4]   2> at com.carrotsearch.randomizedtesting.rules.StatementAdapter.evaluate(StatementAdapter.java:36)
   [junit4]   2> at com.carrotsearch.randomizedtesting.ThreadLeakControl$StatementRunner.run(ThreadLeakControl.java:360)
   [junit4]   2> at java.lang.Thread.run(Thread.java:745)
   [junit4]   2>
   [junit4]   2> "SUITE-SolrCellMorphlineTest-seed#[6E7687867E6A0B34]" ID=9 RUNNABLE
   [junit4]   2> at sun.management.ThreadImpl.dumpThreads0(Native Method)
   [junit4]   2> at sun.management.ThreadImpl.dumpAllThreads(ThreadImpl.java:446)
   [junit4]   2> at com.carrotsearch.randomizedtesting.ThreadLeakControl.formatThreadStacksFull(ThreadLeakControl.java:666)
   [junit4]   2> at com.carrotsearch.randomizedtesting.ThreadLeakControl.access$900(ThreadLeakControl.java:62)
   [junit4]   2> at com.carrotsearch.randomizedtesting.ThreadLeakControl$2.evaluate(ThreadLeakControl.java:407)
   [junit4]   2> - locked java.lang.Object@d67343
   [junit4]   2> at com.carrotsearch.randomizedtesting.RandomizedRunner.runSuite(RandomizedRunner.java:642)
   [junit4]   2> at com.carrotsearch.randomizedtesting.RandomizedRunner.access$200(RandomizedRunner.java:129)
   [junit4]   2> at com.carrotsearch.randomizedtesting.RandomizedRunner$1.run(RandomizedRunner.java:559)
   [junit4]   2>
   [junit4]   2> "Signal Dispatcher" ID=5 RUNNABLE
   [junit4]   2>
   [junit4]   2> "Finalizer" ID=3 WAITING on java.lang.ref.ReferenceQueue$Lock@11f6c94
   [junit4]   2> at java.lang.Object.wait(Native Method)
   [junit4]   2> - waiting on java.lang.ref.ReferenceQueue$Lock@11f6c94
   [junit4]   2> at java.lang.ref.ReferenceQueue.remove(ReferenceQueue.java:142)
   [junit4]   2> at java.lang.ref.ReferenceQueue.remove(ReferenceQueue.java:158)
   [junit4]   2> at java.lang.ref.Finalizer$FinalizerThread.run(Finalizer.java:209)
   [junit4]   2>
   [junit4]   2> "Reference Handler" ID=2 WAITING on java.lang.ref.Reference$Lock@1338287
   [junit4]   2> at java.lang.Object.wait(Native Method)
   [junit4]   2> - waiting on java.lang.ref.Reference$Lock@1338287
   [junit4]   2> at java.lang.Object.wait(Object.java:502)
   [junit4]   2> at java.lang.ref.Reference$ReferenceHandler.run(Reference.java:157)
   [junit4]   2>
   [junit4]   2> "main" ID=1 WAITING on com.carrotsearch.randomizedtesting.RandomizedRunner$1@111872
   [junit4]   2> at java.lang.Object.wait(Native Method)
   [junit4]   2> - waiting on com.carrotsearch.randomizedtesting.RandomizedRunner$1@111872
   [junit4]   2> at java.lang.Thread.join(Thread.java:1245)
   [junit4]   2> at java.lang.Thread.join(Thread.java:1319)
   [junit4]   2> at com.carrotsearch.randomizedtesting.RandomizedRunner.runSuite(RandomizedRunner.java:569)
   [junit4]   2> at com.carrotsearch.randomizedtesting.RandomizedRunner.run(RandomizedRunner.java:435)
   [junit4]   2> at com.carrotsearch.ant.tasks.junit4.slave.SlaveMain.execute(SlaveMain.java:180)
   [junit4]   2> at com.carrotsearch.ant.tasks.junit4.slave.SlaveMain.main(SlaveMain.java:276)
   [junit4]   2> at com.carrotsearch.ant.tasks.junit4.slave.SlaveMainSafe.main(SlaveMainSafe.java:12)
   [junit4]   2>
   [junit4]   2> ^^==============================================
   [junit4]   2>
   [junit4]   2> 7199697 T9 ccr.ThreadLeakControl.checkThreadLeaks WARNING Will linger awaiting termination of 3 leaked thread(s).
   [junit4]   2> 7219803 T9 ccr.ThreadLeakControl.checkThreadLeaks SEVERE 3 threads leaked from SUITE scope at org.apache.solr.morphlines.cell.SolrCellMorphlineTest:
   [junit4]   2>   1) Thread[id=12, name=searcherExecutor-5-thread-1, state=WAITING, group=TGRP-SolrCellMorphlineTest]
   [junit4]   2>        at sun.misc.Unsafe.park(Native Method)
   [junit4]   2>        at java.util.concurrent.locks.LockSupport.park(LockSupport.java:175)
   [junit4]   2>        at java.util.concurrent.locks.AbstractQueuedSynchronizer$ConditionObject.await(AbstractQueuedSynchronizer.java:2039)
   [junit4]   2>        at java.util.concurrent.LinkedBlockingQueue.take(LinkedBlockingQueue.java:442)
   [junit4]   2>        at java.util.concurrent.ThreadPoolExecutor.getTask(ThreadPoolExecutor.java:1067)
   [junit4]   2>        at java.util.concurrent.ThreadPoolExecutor.runWorker(ThreadPoolExecutor.java:1127)
   [junit4]   2>        at java.util.concurrent.ThreadPoolExecutor$Worker.run(ThreadPoolExecutor.java:617)
   [junit4]   2>        at java.lang.Thread.run(Thread.java:745)
   [junit4]   2>   2) Thread[id=10, name=SUITE-SolrCellMorphlineTest-seed#[6E7687867E6A0B34]-worker, state=WAITING, group=TGRP-SolrCellMorphlineTest]
   [junit4]   2>        at java.lang.Object.wait(Native Method)
   [junit4]   2>        at java.lang.Thread.join(Thread.java:1245)
   [junit4]   2>        at java.lang.Thread.join(Thread.java:1319)
   [junit4]   2>        at org.apache.solr.core.CoreContainer.shutdown(CoreContainer.java:388)
   [junit4]   2>        at org.apache.solr.util.TestHarness.close(TestHarness.java:337)
   [junit4]   2>        at org.apache.solr.SolrTestCaseJ4.deleteCore(SolrTestCaseJ4.java:615)
   [junit4]   2>        at org.apache.solr.SolrTestCaseJ4.afterClass(SolrTestCaseJ4.java:179)
   [junit4]   2>        at sun.reflect.NativeMethodAccessorImpl.invoke0(Native Method)
   [junit4]   2>        at sun.reflect.NativeMethodAccessorImpl.invoke(NativeMethodAccessorImpl.java:62)
   [junit4]   2>        at sun.reflect.DelegatingMethodAccessorImpl.invoke(DelegatingMethodAccessorImpl.java:43)
   [junit4]   2>        at java.lang.reflect.Method.invoke(Method.java:483)
   [junit4]   2>        at com.carrotsearch.randomizedtesting.RandomizedRunner.invoke(RandomizedRunner.java:1618)
   [junit4]   2>        at com.carrotsearch.randomizedtesting.RandomizedRunner$5.evaluate(RandomizedRunner.java:790)
   [junit4]   2>        at com.carrotsearch.randomizedtesting.rules.StatementAdapter.evaluate(StatementAdapter.java:36)
   [junit4]   2>        at com.carrotsearch.randomizedtesting.rules.SystemPropertiesRestoreRule$1.evaluate(SystemPropertiesRestoreRule.java:53)
   [junit4]   2>        at org.apache.lucene.util.AbstractBeforeAfterRule$1.evaluate(AbstractBeforeAfterRule.java:46)
   [junit4]   2>        at org.apache.lucene.util.TestRuleStoreClassName$1.evaluate(TestRuleStoreClassName.java:42)
   [junit4]   2>        at com.carrotsearch.randomizedtesting.rules.SystemPropertiesInvariantRule$1.evaluate(SystemPropertiesInvariantRule.java:55)
   [junit4]   2>        at com.carrotsearch.randomizedtesting.rules.NoShadowingOrOverridesOnMethodsRule$1.evaluate(NoShadowingOrOverridesOnMethodsRule.java:39)
   [junit4]   2>        at com.carrotsearch.randomizedtesting.rules.NoShadowingOrOverridesOnMethodsRule$1.evaluate(NoShadowingOrOverridesOnMethodsRule.java:39)
   [junit4]   2>        at com.carrotsearch.randomizedtesting.rules.StatementAdapter.evaluate(StatementAdapter.java:36)
   [junit4]   2>        at com.carrotsearch.randomizedtesting.rules.StatementAdapter.evaluate(StatementAdapter.java:36)
   [junit4]   2>        at com.carrotsearch.randomizedtesting.rules.StatementAdapter.evaluate(StatementAdapter.java:36)
   [junit4]   2>        at org.apache.lucene.util.TestRuleAssertionsRequired$1.evaluate(TestRuleAssertionsRequired.java:43)
   [junit4]   2>        at org.apache.lucene.util.TestRuleMarkFailure$1.evaluate(TestRuleMarkFailure.java:48)
   [junit4]   2>        at org.apache.lucene.util.TestRuleIgnoreAfterMaxFailures$1.evaluate(TestRuleIgnoreAfterMaxFailures.java:65)
   [junit4]   2>        at org.apache.lucene.util.TestRuleIgnoreTestSuites$1.evaluate(TestRuleIgnoreTestSuites.java:55)
   [junit4]   2>        at com.carrotsearch.randomizedtesting.rules.StatementAdapter.evaluate(StatementAdapter.java:36)
   [junit4]   2>        at com.carrotsearch.randomizedtesting.ThreadLeakControl$StatementRunner.run(ThreadLeakControl.java:360)
   [junit4]   2>        at java.lang.Thread.run(Thread.java:745)
   [junit4]   2>   3) Thread[id=13, name=Thread-1, state=WAITING, group=TGRP-SolrCellMorphlineTest]
   [junit4]   2>        at java.lang.Object.wait(Native Method)
   [junit4]   2>        at java.lang.Object.wait(Object.java:502)
   [junit4]   2>        at org.apache.solr.core.CloserThread.run(CoreContainer.java:944)
   [junit4]   2> 7219804 T9 ccr.ThreadLeakControl.tryToInterruptAll Starting to interrupt leaked threads:
   [junit4]   2>   1) Thread[id=12, name=searcherExecutor-5-thread-1, state=WAITING, group=TGRP-SolrCellMorphlineTest]
   [junit4]   2>   2) Thread[id=10, name=SUITE-SolrCellMorphlineTest-seed#[6E7687867E6A0B34]-worker, state=WAITING, group=TGRP-SolrCellMorphlineTest]
   [junit4]   2>   3) Thread[id=13, name=Thread-1, state=WAITING, group=TGRP-SolrCellMorphlineTest]
   [junit4]   2> 7220214 T10 oasc.SolrCore.close [collection1]  CLOSING SolrCore org.apache.solr.core.SolrCore@1440d92
   [junit4]   2> 7220215 T10 oasu.DirectUpdateHandler2.close closing DirectUpdateHandler2{commits=0,autocommit maxTime=60000ms,autocommits=0,soft autocommit maxTime=1000ms,soft autocommits=0,optimizes=0,rollbacks=0,expungeDeletes=0,docsPending=0,adds=0,deletesById=0,deletesByQuery=0,errors=0,cumulative_adds=0,cumulative_deletesById=0,cumulative_deletesByQuery=0,cumulative_errors=0,transaction_logs_total_size=0,transaction_logs_total_number=0}
   [junit4]   2> 7220215 T10 oasu.SolrCoreState.decrefSolrCoreState Closing SolrCoreState
   [junit4]   2> 7220216 T10 oasu.DefaultSolrCoreState.closeIndexWriter SolrCoreState ref count has reached 0 - closing IndexWriter
   [junit4]   2> 7220216 T10 oasu.DefaultSolrCoreState.closeIndexWriter closing IndexWriter with IndexWriterCloser
   [junit4]   2> 7220219 T10 oasc.SolrCore.closeSearcher [collection1] Closing main searcher on request.
   [junit4]   2> 7220221 T10 oasc.CachingDirectoryFactory.close Closing MockDirectoryFactory - 2 directories currently being tracked
   [junit4]   2> 7220224 T10 oasc.CachingDirectoryFactory.closeCacheValue looking to close /mnt/ssd/jenkins/workspace/Lucene-Solr-4.x-Linux/solr/build/contrib/solr-morphlines-cell/test/J0/./solr.morphlines.cell.SolrCellMorphlineTest-6E7687867E6A0B34-001/init-core-data-001/index [CachedDir<<refCount=0;path=/mnt/ssd/jenkins/workspace/Lucene-Solr-4.x-Linux/solr/build/contrib/solr-morphlines-cell/test/J0/./solr.morphlines.cell.SolrCellMorphlineTest-6E7687867E6A0B34-001/init-core-data-001/index;done=false>>]
   [junit4]   2> 7220225 T10 oasc.CachingDirectoryFactory.close Closing directory: /mnt/ssd/jenkins/workspace/Lucene-Solr-4.x-Linux/solr/build/contrib/solr-morphlines-cell/test/J0/./solr.morphlines.cell.SolrCellMorphlineTest-6E7687867E6A0B34-001/init-core-data-001/index
   [junit4]   2> 7220226 T10 oasc.CachingDirectoryFactory.closeCacheValue looking to close /mnt/ssd/jenkins/workspace/Lucene-Solr-4.x-Linux/solr/build/contrib/solr-morphlines-cell/test/J0/./solr.morphlines.cell.SolrCellMorphlineTest-6E7687867E6A0B34-001/init-core-data-001 [CachedDir<<refCount=0;path=/mnt/ssd/jenkins/workspace/Lucene-Solr-4.x-Linux/solr/build/contrib/solr-morphlines-cell/test/J0/./solr.morphlines.cell.SolrCellMorphlineTest-6E7687867E6A0B34-001/init-core-data-001;done=false>>]
   [junit4]   2> 7220226 T10 oasc.CachingDirectoryFactory.close Closing directory: /mnt/ssd/jenkins/workspace/Lucene-Solr-4.x-Linux/solr/build/contrib/solr-morphlines-cell/test/J0/./solr.morphlines.cell.SolrCellMorphlineTest-6E7687867E6A0B34-001/init-core-data-001
   [junit4]   2> 7219841 T9 ccr.ThreadLeakControl.tryToInterruptAll All leaked threads terminated.
   [junit4]   2> NOTE: test params are: codec=Lucene3x, sim=DefaultSimilarity, locale=es_CO, timezone=Australia/Queensland
   [junit4]   2> NOTE: Linux 3.8.0-39-generic i386/Oracle Corporation 1.8.0_20-ea (32-bit)/cpus=8,threads=1,free=11325952,total=26071040
   [junit4]   2> NOTE: All tests run in this JVM: [SolrCellMorphlineTest]
   [junit4]   2> NOTE: reproduce with: ant test  -Dtestcase=SolrCellMorphlineTest -Dtests.seed=6E7687867E6A0B34 -Dtests.multiplier=3 -Dtests.slow=true -Dtests.locale=es_CO -Dtests.timezone=Australia/Queensland -Dtests.file.encoding=UTF-8
   [junit4] ERROR   0.00s | SolrCellMorphlineTest (suite) <<<
   [junit4]    > Throwable #1: java.lang.Exception: Suite timeout exceeded (>= 7200000 msec).
   [junit4]    > at __randomizedtesting.SeedInfo.seed([6E7687867E6A0B34]:0)
   [junit4] Completed in 7220.43s, 0 tests, 1 error <<< FAILURES!

[...truncated 9 lines...]
BUILD FAILED
/mnt/ssd/jenkins/workspace/Lucene-Solr-4.x-Linux/build.xml:467: The following error occurred while executing this line:
/mnt/ssd/jenkins/workspace/Lucene-Solr-4.x-Linux/build.xml:447: The following error occurred while executing this line:
/mnt/ssd/jenkins/workspace/Lucene-Solr-4.x-Linux/build.xml:45: The following error occurred while executing this line:
/mnt/ssd/jenkins/workspace/Lucene-Solr-4.x-Linux/extra-targets.xml:37: The following error occurred while executing this line:
/mnt/ssd/jenkins/workspace/Lucene-Solr-4.x-Linux/solr/build.xml:209: The following error occurred while executing this line:
/mnt/ssd/jenkins/workspace/Lucene-Solr-4.x-Linux/solr/common-build.xml:440: The following error occurred while executing this line:
/mnt/ssd/jenkins/workspace/Lucene-Solr-4.x-Linux/solr/common-build.xml:496: The following error occurred while executing this line:
/mnt/ssd/jenkins/workspace/Lucene-Solr-4.x-Linux/lucene/common-build.xml:1297: The following error occurred while executing this line:
/mnt/ssd/jenkins/workspace/Lucene-Solr-4.x-Linux/lucene/common-build.xml:921: There were test failures: 1 suite, 0 tests, 1 suite-level error

Total time: 191 minutes 22 seconds
Build step 'Invoke Ant' marked build as failure
Description set: Java: 32bit/jdk1.8.0_20-ea-b11 -client -XX:+UseConcMarkSweepGC
Archiving artifacts
Recording test results
Email was triggered for: Failure
Sending email for trigger: Failure




---------------------------------------------------------------------
To unsubscribe, e-mail: [hidden email]
For additional commands, e-mail: [hidden email]