[JENKINS] Lucene-Solr-4.x-Linux (64bit/jdk1.8.0-ea-b49) - Build # 219 - Failure!

classic Classic list List threaded Threaded
2 messages Options
Reply | Threaded
Open this post in threaded view
|

[JENKINS] Lucene-Solr-4.x-Linux (64bit/jdk1.8.0-ea-b49) - Build # 219 - Failure!

Policeman Jenkins Server
Build: http://jenkins.sd-datasolutions.de/job/Lucene-Solr-4.x-Linux/219/
Java: 64bit/jdk1.8.0-ea-b49 -XX:+UseSerialGC

1 tests failed.
REGRESSION:  org.apache.solr.handler.component.DistributedQueryElevationComponentTest.testDistribSearch

Error Message:
.responseHeader.params.size()==9,9skipped=4,5

Stack Trace:
junit.framework.AssertionFailedError: .responseHeader.params.size()==9,9skipped=4,5
        at __randomizedtesting.SeedInfo.seed([F50759B86D99CD42:74E1D7A01AC6AD7E]:0)
        at junit.framework.Assert.fail(Assert.java:50)
        at org.apache.solr.BaseDistributedSearchTestCase.compareResponses(BaseDistributedSearchTestCase.java:670)
        at org.apache.solr.BaseDistributedSearchTestCase.query(BaseDistributedSearchTestCase.java:392)
        at org.apache.solr.handler.component.DistributedQueryElevationComponentTest.doTest(DistributedQueryElevationComponentTest.java:81)
        at org.apache.solr.BaseDistributedSearchTestCase.testDistribSearch(BaseDistributedSearchTestCase.java:679)
        at sun.reflect.NativeMethodAccessorImpl.invoke0(Native Method)
        at sun.reflect.NativeMethodAccessorImpl.invoke(NativeMethodAccessorImpl.java:57)
        at sun.reflect.DelegatingMethodAccessorImpl.invoke(DelegatingMethodAccessorImpl.java:43)
        at java.lang.reflect.Method.invoke(Method.java:474)
        at com.carrotsearch.randomizedtesting.RandomizedRunner.invoke(RandomizedRunner.java:1995)
        at com.carrotsearch.randomizedtesting.RandomizedRunner.access$1100(RandomizedRunner.java:132)
        at com.carrotsearch.randomizedtesting.RandomizedRunner$6.evaluate(RandomizedRunner.java:818)
        at com.carrotsearch.randomizedtesting.RandomizedRunner$7.evaluate(RandomizedRunner.java:877)
        at com.carrotsearch.randomizedtesting.RandomizedRunner$8.evaluate(RandomizedRunner.java:891)
        at com.carrotsearch.randomizedtesting.rules.SystemPropertiesRestoreRule$1.evaluate(SystemPropertiesRestoreRule.java:53)
        at org.apache.lucene.util.TestRuleSetupTeardownChained$1.evaluate(TestRuleSetupTeardownChained.java:50)
        at org.apache.lucene.util.TestRuleFieldCacheSanity$1.evaluate(TestRuleFieldCacheSanity.java:32)
        at org.apache.lucene.util.AbstractBeforeAfterRule$1.evaluate(AbstractBeforeAfterRule.java:45)
        at com.carrotsearch.randomizedtesting.rules.SystemPropertiesInvariantRule$1.evaluate(SystemPropertiesInvariantRule.java:55)
        at org.apache.lucene.util.TestRuleReportUncaughtExceptions$1.evaluate(TestRuleReportUncaughtExceptions.java:68)
        at org.apache.lucene.util.TestRuleThreadAndTestName$1.evaluate(TestRuleThreadAndTestName.java:48)
        at org.apache.lucene.util.TestRuleIgnoreAfterMaxFailures$1.evaluate(TestRuleIgnoreAfterMaxFailures.java:70)
        at org.apache.lucene.util.TestRuleMarkFailure$1.evaluate(TestRuleMarkFailure.java:48)
        at com.carrotsearch.randomizedtesting.RandomizedRunner.runSingleTest(RandomizedRunner.java:825)
        at com.carrotsearch.randomizedtesting.RandomizedRunner.access$700(RandomizedRunner.java:132)
        at com.carrotsearch.randomizedtesting.RandomizedRunner$3$1.run(RandomizedRunner.java:671)
        at com.carrotsearch.randomizedtesting.RandomizedRunner$3.evaluate(RandomizedRunner.java:697)
        at com.carrotsearch.randomizedtesting.RandomizedRunner$4.evaluate(RandomizedRunner.java:736)
        at com.carrotsearch.randomizedtesting.RandomizedRunner$5.evaluate(RandomizedRunner.java:747)
        at com.carrotsearch.randomizedtesting.rules.SystemPropertiesRestoreRule$1.evaluate(SystemPropertiesRestoreRule.java:53)
        at org.apache.lucene.util.AbstractBeforeAfterRule$1.evaluate(AbstractBeforeAfterRule.java:45)
        at org.apache.lucene.util.TestRuleReportUncaughtExceptions$1.evaluate(TestRuleReportUncaughtExceptions.java:68)
        at org.apache.lucene.util.TestRuleStoreClassName$1.evaluate(TestRuleStoreClassName.java:38)
        at com.carrotsearch.randomizedtesting.rules.SystemPropertiesInvariantRule$1.evaluate(SystemPropertiesInvariantRule.java:55)
        at org.apache.lucene.util.TestRuleNoInstanceHooksOverrides$1.evaluate(TestRuleNoInstanceHooksOverrides.java:53)
        at org.apache.lucene.util.TestRuleNoStaticHooksShadowing$1.evaluate(TestRuleNoStaticHooksShadowing.java:52)
        at org.apache.lucene.util.TestRuleAssertionsRequired$1.evaluate(TestRuleAssertionsRequired.java:36)
        at org.apache.lucene.util.TestRuleMarkFailure$1.evaluate(TestRuleMarkFailure.java:48)
        at org.apache.lucene.util.TestRuleIgnoreAfterMaxFailures$1.evaluate(TestRuleIgnoreAfterMaxFailures.java:70)
        at org.apache.lucene.util.TestRuleIgnoreTestSuites$1.evaluate(TestRuleIgnoreTestSuites.java:55)
        at com.carrotsearch.randomizedtesting.RandomizedRunner.runSuite(RandomizedRunner.java:605)
        at com.carrotsearch.randomizedtesting.RandomizedRunner.access$400(RandomizedRunner.java:132)
        at com.carrotsearch.randomizedtesting.RandomizedRunner$2.run(RandomizedRunner.java:551)




Build Log:
[...truncated 7432 lines...]
[junit4:junit4] Suite: org.apache.solr.handler.component.DistributedQueryElevationComponentTest
[junit4:junit4] FAILURE 1.43s J0 | DistributedQueryElevationComponentTest.testDistribSearch
[junit4:junit4]    > Throwable #1: junit.framework.AssertionFailedError: .responseHeader.params.size()==9,9skipped=4,5
[junit4:junit4]    > at __randomizedtesting.SeedInfo.seed([F50759B86D99CD42:74E1D7A01AC6AD7E]:0)
[junit4:junit4]    > at junit.framework.Assert.fail(Assert.java:50)
[junit4:junit4]    > at org.apache.solr.BaseDistributedSearchTestCase.compareResponses(BaseDistributedSearchTestCase.java:670)
[junit4:junit4]    > at org.apache.solr.BaseDistributedSearchTestCase.query(BaseDistributedSearchTestCase.java:392)
[junit4:junit4]    > at org.apache.solr.handler.component.DistributedQueryElevationComponentTest.doTest(DistributedQueryElevationComponentTest.java:81)
[junit4:junit4]    > at org.apache.solr.BaseDistributedSearchTestCase.testDistribSearch(BaseDistributedSearchTestCase.java:679)
[junit4:junit4]    > at sun.reflect.NativeMethodAccessorImpl.invoke0(Native Method)
[junit4:junit4]    > at sun.reflect.NativeMethodAccessorImpl.invoke(NativeMethodAccessorImpl.java:57)
[junit4:junit4]    > at sun.reflect.DelegatingMethodAccessorImpl.invoke(DelegatingMethodAccessorImpl.java:43)
[junit4:junit4]    > at java.lang.reflect.Method.invoke(Method.java:474)
[junit4:junit4]    > at com.carrotsearch.randomizedtesting.RandomizedRunner.invoke(RandomizedRunner.java:1995)
[junit4:junit4]    > at com.carrotsearch.randomizedtesting.RandomizedRunner.access$1100(RandomizedRunner.java:132)
[junit4:junit4]    > at com.carrotsearch.randomizedtesting.RandomizedRunner$6.evaluate(RandomizedRunner.java:818)
[junit4:junit4]    > at com.carrotsearch.randomizedtesting.RandomizedRunner$7.evaluate(RandomizedRunner.java:877)
[junit4:junit4]    > at com.carrotsearch.randomizedtesting.RandomizedRunner$8.evaluate(RandomizedRunner.java:891)
[junit4:junit4]    > at com.carrotsearch.randomizedtesting.rules.SystemPropertiesRestoreRule$1.evaluate(SystemPropertiesRestoreRule.java:53)
[junit4:junit4]    > at org.apache.lucene.util.TestRuleSetupTeardownChained$1.evaluate(TestRuleSetupTeardownChained.java:50)
[junit4:junit4]    > at org.apache.lucene.util.TestRuleFieldCacheSanity$1.evaluate(TestRuleFieldCacheSanity.java:32)
[junit4:junit4]    > at org.apache.lucene.util.AbstractBeforeAfterRule$1.evaluate(AbstractBeforeAfterRule.java:45)
[junit4:junit4]    > at com.carrotsearch.randomizedtesting.rules.SystemPropertiesInvariantRule$1.evaluate(SystemPropertiesInvariantRule.java:55)
[junit4:junit4]    > at org.apache.lucene.util.TestRuleReportUncaughtExceptions$1.evaluate(TestRuleReportUncaughtExceptions.java:68)
[junit4:junit4]    > at org.apache.lucene.util.TestRuleThreadAndTestName$1.evaluate(TestRuleThreadAndTestName.java:48)
[junit4:junit4]    > at org.apache.lucene.util.TestRuleIgnoreAfterMaxFailures$1.evaluate(TestRuleIgnoreAfterMaxFailures.java:70)
[junit4:junit4]    > at org.apache.lucene.util.TestRuleMarkFailure$1.evaluate(TestRuleMarkFailure.java:48)
[junit4:junit4]    > at com.carrotsearch.randomizedtesting.RandomizedRunner.runSingleTest(RandomizedRunner.java:825)
[junit4:junit4]    > at com.carrotsearch.randomizedtesting.RandomizedRunner.access$700(RandomizedRunner.java:132)
[junit4:junit4]    > at com.carrotsearch.randomizedtesting.RandomizedRunner$3$1.run(RandomizedRunner.java:671)
[junit4:junit4]    > at com.carrotsearch.randomizedtesting.RandomizedRunner$3.evaluate(RandomizedRunner.java:697)
[junit4:junit4]    > at com.carrotsearch.randomizedtesting.RandomizedRunner$4.evaluate(RandomizedRunner.java:736)
[junit4:junit4]    > at com.carrotsearch.randomizedtesting.RandomizedRunner$5.evaluate(RandomizedRunner.java:747)
[junit4:junit4]    > at com.carrotsearch.randomizedtesting.rules.SystemPropertiesRestoreRule$1.evaluate(SystemPropertiesRestoreRule.java:53)
[junit4:junit4]    > at org.apache.lucene.util.AbstractBeforeAfterRule$1.evaluate(AbstractBeforeAfterRule.java:45)
[junit4:junit4]    > at org.apache.lucene.util.TestRuleReportUncaughtExceptions$1.evaluate(TestRuleReportUncaughtExceptions.java:68)
[junit4:junit4]    > at org.apache.lucene.util.TestRuleStoreClassName$1.evaluate(TestRuleStoreClassName.java:38)
[junit4:junit4]    > at com.carrotsearch.randomizedtesting.rules.SystemPropertiesInvariantRule$1.evaluate(SystemPropertiesInvariantRule.java:55)
[junit4:junit4]    > at org.apache.lucene.util.TestRuleNoInstanceHooksOverrides$1.evaluate(TestRuleNoInstanceHooksOverrides.java:53)
[junit4:junit4]    > at org.apache.lucene.util.TestRuleNoStaticHooksShadowing$1.evaluate(TestRuleNoStaticHooksShadowing.java:52)
[junit4:junit4]    > at org.apache.lucene.util.TestRuleAssertionsRequired$1.evaluate(TestRuleAssertionsRequired.java:36)
[junit4:junit4]    > at org.apache.lucene.util.TestRuleMarkFailure$1.evaluate(TestRuleMarkFailure.java:48)
[junit4:junit4]    > at org.apache.lucene.util.TestRuleIgnoreAfterMaxFailures$1.evaluate(TestRuleIgnoreAfterMaxFailures.java:70)
[junit4:junit4]    > at org.apache.lucene.util.TestRuleIgnoreTestSuites$1.evaluate(TestRuleIgnoreTestSuites.java:55)
[junit4:junit4]    > at com.carrotsearch.randomizedtesting.RandomizedRunner.runSuite(RandomizedRunner.java:605)
[junit4:junit4]    > at com.carrotsearch.randomizedtesting.RandomizedRunner.access$400(RandomizedRunner.java:132)
[junit4:junit4]    > at com.carrotsearch.randomizedtesting.RandomizedRunner$2.run(RandomizedRunner.java:551)
[junit4:junit4]    >
[junit4:junit4]   2> 1 T826 oas.SolrTestCaseJ4.setUp ###Starting testDistribSearch
[junit4:junit4]   2> 2 T826 oejs.Server.doStart jetty-8.1.2.v20120308
[junit4:junit4]   2> 5 T826 oejs.AbstractConnector.doStart Started SocketConnector@0.0.0.0:43090
[junit4:junit4]   2> 5 T826 oasc.SolrResourceLoader.locateSolrHome JNDI not configured for solr (NoInitialContextEx)
[junit4:junit4]   2> 5 T826 oasc.SolrResourceLoader.locateSolrHome using system property solr.solr.home: /mnt/ssd/jenkins/workspace/Lucene-Solr-4.x-Linux/checkout/solr/build/solr-core/test-files/solr
[junit4:junit4]   2> 6 T826 oasc.SolrResourceLoader.<init> new SolrResourceLoader for deduced Solr Home: '/mnt/ssd/jenkins/workspace/Lucene-Solr-4.x-Linux/checkout/solr/build/solr-core/test-files/solr/'
[junit4:junit4]   2> 15 T826 oass.SolrDispatchFilter.init SolrDispatchFilter.init()
[junit4:junit4]   2> 15 T826 oasc.SolrResourceLoader.locateSolrHome JNDI not configured for solr (NoInitialContextEx)
[junit4:junit4]   2> 15 T826 oasc.SolrResourceLoader.locateSolrHome using system property solr.solr.home: /mnt/ssd/jenkins/workspace/Lucene-Solr-4.x-Linux/checkout/solr/build/solr-core/test-files/solr
[junit4:junit4]   2> 16 T826 oasc.CoreContainer$Initializer.initialize looking for solr.xml: /mnt/ssd/jenkins/workspace/Lucene-Solr-4.x-Linux/checkout/solr/build/solr-core/test-files/solr/solr.xml
[junit4:junit4]   2> 16 T826 oasc.CoreContainer.<init> New CoreContainer 1976062495
[junit4:junit4]   2> 16 T826 oasc.CoreContainer.load Loading CoreContainer using Solr Home: '/mnt/ssd/jenkins/workspace/Lucene-Solr-4.x-Linux/checkout/solr/build/solr-core/test-files/solr/'
[junit4:junit4]   2> 16 T826 oasc.SolrResourceLoader.<init> new SolrResourceLoader for directory: '/mnt/ssd/jenkins/workspace/Lucene-Solr-4.x-Linux/checkout/solr/build/solr-core/test-files/solr/'
[junit4:junit4]   2> 28 T826 oasc.CoreContainer.load Registering Log Listener
[junit4:junit4]   2> 46 T826 oasc.CoreContainer.create Creating SolrCore 'collection1' using instanceDir: /mnt/ssd/jenkins/workspace/Lucene-Solr-4.x-Linux/checkout/solr/build/solr-core/test-files/solr/collection1
[junit4:junit4]   2> 46 T826 oasc.SolrResourceLoader.<init> new SolrResourceLoader for directory: '/mnt/ssd/jenkins/workspace/Lucene-Solr-4.x-Linux/checkout/solr/build/solr-core/test-files/solr/collection1/'
[junit4:junit4]   2> 47 T826 oasc.SolrResourceLoader.replaceClassLoader Adding 'file:/mnt/ssd/jenkins/workspace/Lucene-Solr-4.x-Linux/checkout/solr/build/solr-core/test-files/solr/collection1/lib/README' to classloader
[junit4:junit4]   2> 47 T826 oasc.SolrResourceLoader.replaceClassLoader Adding 'file:/mnt/ssd/jenkins/workspace/Lucene-Solr-4.x-Linux/checkout/solr/build/solr-core/test-files/solr/collection1/lib/classes/' to classloader
[junit4:junit4]   2> 72 T826 oasc.SolrConfig.<init> Using Lucene MatchVersion: LUCENE_40
[junit4:junit4]   2> 104 T826 oasc.SolrConfig.<init> Loaded SolrConfig: solrconfig-elevate.xml
[junit4:junit4]   2> 105 T826 oass.IndexSchema.readSchema Reading Solr Schema
[junit4:junit4]   2> 107 T826 oass.IndexSchema.readSchema Schema name=example
[junit4:junit4]   2> 223 T826 oass.IndexSchema.readSchema default search field in schema is text
[junit4:junit4]   2> 225 T826 oass.IndexSchema.readSchema unique key field: id
[junit4:junit4]   2> 227 T826 oasc.SolrCore.<init> [collection1] Opening new SolrCore at /mnt/ssd/jenkins/workspace/Lucene-Solr-4.x-Linux/checkout/solr/build/solr-core/test-files/solr/collection1/, dataDir=./org.apache.solr.handler.component.DistributedQueryElevationComponentTest-1344267201327/control/data/
[junit4:junit4]   2> 227 T826 oasc.JmxMonitoredMap.<init> JMX monitoring is enabled. Adding Solr mbeans to JMX Server: com.sun.jmx.mbeanserver.JmxMBeanServer@13d33ff5
[junit4:junit4]   2> 228 T826 oasc.SolrCore.getNewIndexDir WARNING New index directory detected: old=null new=./org.apache.solr.handler.component.DistributedQueryElevationComponentTest-1344267201327/control/data/index/
[junit4:junit4]   2> 228 T826 oasc.SolrCore.initIndex WARNING [collection1] Solr index directory './org.apache.solr.handler.component.DistributedQueryElevationComponentTest-1344267201327/control/data/index' doesn't exist. Creating new index...
[junit4:junit4]   2> 229 T826 oasc.SolrDeletionPolicy.onCommit SolrDeletionPolicy.onCommit: commits:num=1
[junit4:junit4]   2> commit{dir=MockDirWrapper(org.apache.lucene.store.RAMDirectory@6a5ccbee lockFactory=org.apache.lucene.store.SingleInstanceLockFactory@e8184ab),segFN=segments_1,generation=1,filenames=[segments_1]
[junit4:junit4]   2> 229 T826 oasc.SolrDeletionPolicy.updateCommits newest commit = 1
[junit4:junit4]   2> 230 T826 oasc.RequestHandlers.initHandlersFromConfig created /update: solr.UpdateRequestHandler
[junit4:junit4]   2> 230 T826 oasc.RequestHandlers.initHandlersFromConfig created /elevate: org.apache.solr.handler.component.SearchHandler
[junit4:junit4]   2> 230 T826 oasc.RequestHandlers.initHandlersFromConfig created /dataElevate: org.apache.solr.handler.component.SearchHandler
[junit4:junit4]   2> 231 T826 oashl.XMLLoader.init xsltCacheLifetimeSeconds=60
[junit4:junit4]   2> 231 T826 oasc.RequestHandlers.initHandlersFromConfig WARNING no default request handler is registered (either '/select' or 'standard')
[junit4:junit4]   2> 232 T826 oasc.SolrCore.initDeprecatedSupport WARNING solrconfig.xml uses deprecated <admin/gettableFiles>, Please update your config to use the ShowFileRequestHandler.
[junit4:junit4]   2> 233 T826 oasc.SolrCore.initDeprecatedSupport WARNING adding ShowFileRequestHandler with hidden files: [BAD-SCHEMA-EXTERNAL-FILEFIELD.XML, SCHEMA-DFR.XML, BAD-SCHEMA-UNIQUEKEY-USES-DEFAULT.XML, HYPHENATION.DTD, SOLRCONFIG-LAZYWRITER.XML, SOLRCONFIG-SCRIPT-UPDATEPROCESSOR.XML, STOPWORDS.TXT, PROTWORDS.TXT, SCHEMA.XML, SOLRCONFIG-ELEVATE.XML, SCHEMA12.XML, STOP-1.TXT, BAD-SOLRCONFIG-INVALID-SCRIPTFILE.XML, STOPTYPES-2.TXT, BAD-SCHEMA-NOT-INDEXED-BUT-TF.XML, SCHEMA_CODEC.XML, SCHEMA-STOP-KEEP.XML, SCHEMA-PHRASESUGGEST.XML, SOLRCONFIG-PROPINJECT.XML, SCHEMA-FOLDING.XML, COMPOUNDDICTIONARY.TXT, ADDFIELDS.UPDATEPROCESSOR.JS, SCHEMA-BM25.XML, TRIVIAL.UPDATEPROCESSOR1.JS, STOPWITHBOM.TXT, PHRASESUGGEST.TXT, SOLRCONFIG-REQHANDLER.INCL, SCHEMA-REPLICATION2.XML, DA_COMPOUNDDICTIONARY.TXT, MAPPING-ISOLATIN1ACCENT.TXT, SCHEMA-SPELLCHECKER.XML, BAD-SCHEMA-CODEC-GLOBAL-VS-FT-MISMATCH.XML, BAD-SOLRCONFIG-BOGUS-SCRIPTENGINE-NAME.XML, SOLRCONFIG-SPELLCHECKCOMPONENT.XML, SOLRCONFIG-SIMPLELOCK.XML, SOLRCONFIG-NOCACHE.XML, SCHEMA-NUMERIC.XML, KEEP-1.TXT, SCHEMA-COLLATE.XML, CONDITIONAL.UPDATEPROCESSOR.JS, THROW.ERROR.ON.ADD.UPDATEPROCESSOR.JS, SOLRCONFIG-SPELLCHECKER.XML, SOLRCONFIG-NATIVELOCK.XML, BAD_SOLRCONFIG.XML, TRIVIAL.UPDATEPROCESSOR0.JS, SOLRCONFIG-DELPOLICY2.XML, OLD_SYNONYMS.TXT, SOLRCONFIG-TRANSFORMERS.XML, KEEP-2.TXT, SOLRCONFIG-MASTER1.XML, SOLRCONFIG-TLOG.XML, BAD-SCHEMA-DUP-FIELD.XML, SCHEMA-LUCENEMATCHVERSION.XML, BAD-SOLRCONFIG-MISSING-SCRIPTFILE.XML, SOLRCONFIG-REPEATER.XML, BAD-SCHEMA-DUP-FIELDTYPE.XML, SCHEMA-REQUIRED-FIELDS.XML, STOPTYPES-1.TXT, BAD-SCHEMA-UNIQUEKEY-IS-COPYFIELD-DEST.XML, BAD-SCHEMA-NONTEXT-ANALYZER.XML, SOLRCONFIG-HIGHLIGHT.XML, SCHEMA11.XML, SCHEMA15.XML, SOLRCONFIG-SLAVE.XML, SOLRCONFIG-ALTDIRECTORY.XML, SOLRCONFIG-XINCLUDE.XML, SOLRCONFIG_CODEC.XML, SCHEMA-BINARYFIELD.XML, SCHEMA-TFIDF.XML, SOLRCONFIG-MASTER1-KEEPONEBACKUP.XML, STEMDICT.TXT, BAD-MP-SOLRCONFIG.XML, SOLRCONFIG-PROPINJECT-INDEXDEFAULT.XML, STOP-SNOWBALL.TXT, SOLRCONFIG-FUNCTIONQUERY.XML, STOP-2.TXT, BAD-SCHEMA-OMIT-TF-BUT-NOT-POS.XML, MISSING.FUNCTIONS.UPDATEPROCESSOR.JS, SOLRCONFIG-QUERYSENDER-NOQUERY.XML, SOLRCONFIG-PHRASESUGGEST.XML, HUNSPELL-TEST.AFF, SOLRCONFIG_PERF.XML, SOLRCONFIG-ENABLEPLUGIN.XML, SCHEMA-MINIMAL.XML, DA_UTF8.XML, SOLRCONFIG-MASTER.XML, FRENCHARTICLES.TXT, SOLRCONFIG-MASTER2.XML, SOLRCONFIG-BASIC.XML, BAD-SCHEMA-UNIQUEKEY-MULTIVALUED.XML, SOLRCONFIG-CACHING.XML, BAD-SCHEMA-NOT-INDEXED-BUT-NORMS.XML, SCHEMA-COPYFIELD-TEST.XML, SYNONYMS.TXT, SCHEMA-LMJELINEKMERCER.XML, SOLRCONFIG-SLAVE1.XML, SOLRCONFIG-MASTER3.XML, MISSLEADING.EXTENSION.UPDATEPROCESSOR.JS.TXT, BAD-SCHEMA-DUP-DYNAMICFIELD.XML, WDFTYPES.TXT, BAD-SCHEMA-ANALYZER-CLASS-AND-NESTED.XML, SOLRCONFIG-MERGEPOLICY.XML, SCHEMA-CHARFILTERS.XML, SOLRCONFIG-SOLCOREPROPERTIES.XML, SCHEMA-IB.XML, SCHEMA-REPLICATION1.XML, SOLRCONFIG-SOLR-749.XML, SCHEMA-LMDIRICHLET.XML, BAD-SCHEMA-SIM-GLOBAL-VS-FT-MISMATCH.XML, SOLRCONFIG-TERMINDEX.XML, ELEVATE.XML, SCHEMA-REVERSED.XML, CURRENCY.XML, XSLT, BAD-SCHEMA-NOT-INDEXED-BUT-POS.XML, SOLRCONFIG-BASIC-LUCENEVERSION31.XML, SCHEMASURROUND.XML, SOLRCONFIG-UPDATE-PROCESSOR-CHAINS.XML, SCHEMA-COLLATEFILTER.XML, OPEN-EXCHANGE-RATES.JSON, SCHEMA-TRIE.XML, STOPWORDSWRONGENCODING.TXT, SOLRCONFIG-QUERYSENDER.XML, SOLRCONFIG-DELPOLICY1.XML, HUNSPELL-TEST.DIC, SCHEMA-NOT-REQUIRED-UNIQUE-KEY.XML, SCHEMA-SIM.XML]
[junit4:junit4]   2> 234 T826 oass.SolrIndexSearcher.<init> Opening Searcher@54d0e770 main
[junit4:junit4]   2> 235 T826 oass.SolrIndexSearcher.getIndexDir WARNING WARNING: Directory impl does not support setting indexDir: org.apache.lucene.store.MockDirectoryWrapper
[junit4:junit4]   2> 235 T826 oasu.CommitTracker.<init> Hard AutoCommit: disabled
[junit4:junit4]   2> 235 T826 oasu.CommitTracker.<init> Soft AutoCommit: disabled
[junit4:junit4]   2> 235 T826 oashc.QueryElevationComponent.inform Loading QueryElevation from: /mnt/ssd/jenkins/workspace/Lucene-Solr-4.x-Linux/checkout/solr/build/solr-core/test-files/solr/collection1/conf/elevate.xml
[junit4:junit4]   2> 241 T826 oashc.QueryElevationComponent.inform Loading QueryElevation from: /mnt/ssd/jenkins/workspace/Lucene-Solr-4.x-Linux/checkout/solr/build/solr-core/test-files/solr/collection1/conf/elevate.xml
[junit4:junit4]   2> 246 T826 oashc.HttpShardHandlerFactory.getParameter Setting socketTimeout to: 0
[junit4:junit4]   2> 246 T826 oashc.HttpShardHandlerFactory.getParameter Setting urlScheme to: http://
[junit4:junit4]   2> 246 T826 oashc.HttpShardHandlerFactory.getParameter Setting connTimeout to: 0
[junit4:junit4]   2> 247 T826 oashc.HttpShardHandlerFactory.getParameter Setting maxConnectionsPerHost to: 20
[junit4:junit4]   2> 247 T826 oashc.HttpShardHandlerFactory.getParameter Setting corePoolSize to: 0
[junit4:junit4]   2> 247 T826 oashc.HttpShardHandlerFactory.getParameter Setting maximumPoolSize to: 2147483647
[junit4:junit4]   2> 247 T826 oashc.HttpShardHandlerFactory.getParameter Setting maxThreadIdleTime to: 5
[junit4:junit4]   2> 247 T826 oashc.HttpShardHandlerFactory.getParameter Setting sizeOfQueue to: -1
[junit4:junit4]   2> 247 T826 oashc.HttpShardHandlerFactory.getParameter Setting fairnessPolicy to: false
[junit4:junit4]   2> 248 T826 oascsi.HttpClientUtil.createClient Creating new http client, config:maxConnectionsPerHost=20&maxConnections=10000&socketTimeout=0&connTimeout=0&retry=false
[junit4:junit4]   2> 250 T836 oasc.SolrCore.registerSearcher [collection1] Registered new searcher Searcher@54d0e770 main{StandardDirectoryReader(segments_1:1)}
[junit4:junit4]   2> 250 T826 oasc.CoreContainer.register registering core: collection1
[junit4:junit4]   2> 251 T826 oass.SolrDispatchFilter.init user.dir=/mnt/ssd/jenkins/workspace/Lucene-Solr-4.x-Linux/checkout/solr/build/solr-core/test/J0
[junit4:junit4]   2> 251 T826 oass.SolrDispatchFilter.init SolrDispatchFilter.init() done
[junit4:junit4]   2> 251 T826 oascsi.HttpClientUtil.createClient Creating new http client, config:maxConnections=128&maxConnectionsPerHost=32&followRedirects=false
[junit4:junit4]   2> 253 T826 oejs.Server.doStart jetty-8.1.2.v20120308
[junit4:junit4]   2> 254 T826 oejs.AbstractConnector.doStart Started SocketConnector@0.0.0.0:37769
[junit4:junit4]   2> 255 T826 oasc.SolrResourceLoader.locateSolrHome JNDI not configured for solr (NoInitialContextEx)
[junit4:junit4]   2> 255 T826 oasc.SolrResourceLoader.locateSolrHome using system property solr.solr.home: /mnt/ssd/jenkins/workspace/Lucene-Solr-4.x-Linux/checkout/solr/build/solr-core/test-files/solr
[junit4:junit4]   2> 255 T826 oasc.SolrResourceLoader.<init> new SolrResourceLoader for deduced Solr Home: '/mnt/ssd/jenkins/workspace/Lucene-Solr-4.x-Linux/checkout/solr/build/solr-core/test-files/solr/'
[junit4:junit4]   2> 261 T826 oass.SolrDispatchFilter.init SolrDispatchFilter.init()
[junit4:junit4]   2> 261 T826 oasc.SolrResourceLoader.locateSolrHome JNDI not configured for solr (NoInitialContextEx)
[junit4:junit4]   2> 261 T826 oasc.SolrResourceLoader.locateSolrHome using system property solr.solr.home: /mnt/ssd/jenkins/workspace/Lucene-Solr-4.x-Linux/checkout/solr/build/solr-core/test-files/solr
[junit4:junit4]   2> 261 T826 oasc.CoreContainer$Initializer.initialize looking for solr.xml: /mnt/ssd/jenkins/workspace/Lucene-Solr-4.x-Linux/checkout/solr/build/solr-core/test-files/solr/solr.xml
[junit4:junit4]   2> 262 T826 oasc.CoreContainer.<init> New CoreContainer 1278212735
[junit4:junit4]   2> 262 T826 oasc.CoreContainer.load Loading CoreContainer using Solr Home: '/mnt/ssd/jenkins/workspace/Lucene-Solr-4.x-Linux/checkout/solr/build/solr-core/test-files/solr/'
[junit4:junit4]   2> 262 T826 oasc.SolrResourceLoader.<init> new SolrResourceLoader for directory: '/mnt/ssd/jenkins/workspace/Lucene-Solr-4.x-Linux/checkout/solr/build/solr-core/test-files/solr/'
[junit4:junit4]   2> 270 T826 oasc.CoreContainer.load Registering Log Listener
[junit4:junit4]   2> 284 T826 oasc.CoreContainer.create Creating SolrCore 'collection1' using instanceDir: /mnt/ssd/jenkins/workspace/Lucene-Solr-4.x-Linux/checkout/solr/build/solr-core/test-files/solr/collection1
[junit4:junit4]   2> 285 T826 oasc.SolrResourceLoader.<init> new SolrResourceLoader for directory: '/mnt/ssd/jenkins/workspace/Lucene-Solr-4.x-Linux/checkout/solr/build/solr-core/test-files/solr/collection1/'
[junit4:junit4]   2> 285 T826 oasc.SolrResourceLoader.replaceClassLoader Adding 'file:/mnt/ssd/jenkins/workspace/Lucene-Solr-4.x-Linux/checkout/solr/build/solr-core/test-files/solr/collection1/lib/README' to classloader
[junit4:junit4]   2> 285 T826 oasc.SolrResourceLoader.replaceClassLoader Adding 'file:/mnt/ssd/jenkins/workspace/Lucene-Solr-4.x-Linux/checkout/solr/build/solr-core/test-files/solr/collection1/lib/classes/' to classloader
[junit4:junit4]   2> 301 T826 oasc.SolrConfig.<init> Using Lucene MatchVersion: LUCENE_40
[junit4:junit4]   2> 325 T826 oasc.SolrConfig.<init> Loaded SolrConfig: solrconfig-elevate.xml
[junit4:junit4]   2> 326 T826 oass.IndexSchema.readSchema Reading Solr Schema
[junit4:junit4]   2> 328 T826 oass.IndexSchema.readSchema Schema name=example
[junit4:junit4]   2> 444 T826 oass.IndexSchema.readSchema default search field in schema is text
[junit4:junit4]   2> 446 T826 oass.IndexSchema.readSchema unique key field: id
[junit4:junit4]   2> 448 T826 oasc.SolrCore.<init> [collection1] Opening new SolrCore at /mnt/ssd/jenkins/workspace/Lucene-Solr-4.x-Linux/checkout/solr/build/solr-core/test-files/solr/collection1/, dataDir=./org.apache.solr.handler.component.DistributedQueryElevationComponentTest-1344267201327/shard0/data/
[junit4:junit4]   2> 448 T826 oasc.JmxMonitoredMap.<init> JMX monitoring is enabled. Adding Solr mbeans to JMX Server: com.sun.jmx.mbeanserver.JmxMBeanServer@13d33ff5
[junit4:junit4]   2> 449 T826 oasc.SolrCore.getNewIndexDir WARNING New index directory detected: old=null new=./org.apache.solr.handler.component.DistributedQueryElevationComponentTest-1344267201327/shard0/data/index/
[junit4:junit4]   2> 449 T826 oasc.SolrCore.initIndex WARNING [collection1] Solr index directory './org.apache.solr.handler.component.DistributedQueryElevationComponentTest-1344267201327/shard0/data/index' doesn't exist. Creating new index...
[junit4:junit4]   2> 450 T826 oasc.SolrDeletionPolicy.onCommit SolrDeletionPolicy.onCommit: commits:num=1
[junit4:junit4]   2> commit{dir=MockDirWrapper(org.apache.lucene.store.RAMDirectory@3ec2cff lockFactory=org.apache.lucene.store.SingleInstanceLockFactory@41363858),segFN=segments_1,generation=1,filenames=[segments_1]
[junit4:junit4]   2> 450 T826 oasc.SolrDeletionPolicy.updateCommits newest commit = 1
[junit4:junit4]   2> 451 T826 oasc.RequestHandlers.initHandlersFromConfig created /update: solr.UpdateRequestHandler
[junit4:junit4]   2> 451 T826 oasc.RequestHandlers.initHandlersFromConfig created /elevate: org.apache.solr.handler.component.SearchHandler
[junit4:junit4]   2> 452 T826 oasc.RequestHandlers.initHandlersFromConfig created /dataElevate: org.apache.solr.handler.component.SearchHandler
[junit4:junit4]   2> 452 T826 oashl.XMLLoader.init xsltCacheLifetimeSeconds=60
[junit4:junit4]   2> 452 T826 oasc.RequestHandlers.initHandlersFromConfig WARNING no default request handler is registered (either '/select' or 'standard')
[junit4:junit4]   2> 453 T826 oasc.SolrCore.initDeprecatedSupport WARNING solrconfig.xml uses deprecated <admin/gettableFiles>, Please update your config to use the ShowFileRequestHandler.
[junit4:junit4]   2> 454 T826 oasc.SolrCore.initDeprecatedSupport WARNING adding ShowFileRequestHandler with hidden files: [BAD-SCHEMA-EXTERNAL-FILEFIELD.XML, SCHEMA-DFR.XML, BAD-SCHEMA-UNIQUEKEY-USES-DEFAULT.XML, HYPHENATION.DTD, SOLRCONFIG-LAZYWRITER.XML, SOLRCONFIG-SCRIPT-UPDATEPROCESSOR.XML, STOPWORDS.TXT, PROTWORDS.TXT, SCHEMA.XML, SOLRCONFIG-ELEVATE.XML, SCHEMA12.XML, STOP-1.TXT, BAD-SOLRCONFIG-INVALID-SCRIPTFILE.XML, STOPTYPES-2.TXT, BAD-SCHEMA-NOT-INDEXED-BUT-TF.XML, SCHEMA_CODEC.XML, SCHEMA-STOP-KEEP.XML, SCHEMA-PHRASESUGGEST.XML, SOLRCONFIG-PROPINJECT.XML, SCHEMA-FOLDING.XML, COMPOUNDDICTIONARY.TXT, ADDFIELDS.UPDATEPROCESSOR.JS, SCHEMA-BM25.XML, TRIVIAL.UPDATEPROCESSOR1.JS, STOPWITHBOM.TXT, PHRASESUGGEST.TXT, SOLRCONFIG-REQHANDLER.INCL, SCHEMA-REPLICATION2.XML, DA_COMPOUNDDICTIONARY.TXT, MAPPING-ISOLATIN1ACCENT.TXT, SCHEMA-SPELLCHECKER.XML, BAD-SCHEMA-CODEC-GLOBAL-VS-FT-MISMATCH.XML, BAD-SOLRCONFIG-BOGUS-SCRIPTENGINE-NAME.XML, SOLRCONFIG-SPELLCHECKCOMPONENT.XML, SOLRCONFIG-SIMPLELOCK.XML, SOLRCONFIG-NOCACHE.XML, SCHEMA-NUMERIC.XML, KEEP-1.TXT, SCHEMA-COLLATE.XML, CONDITIONAL.UPDATEPROCESSOR.JS, THROW.ERROR.ON.ADD.UPDATEPROCESSOR.JS, SOLRCONFIG-SPELLCHECKER.XML, SOLRCONFIG-NATIVELOCK.XML, BAD_SOLRCONFIG.XML, TRIVIAL.UPDATEPROCESSOR0.JS, SOLRCONFIG-DELPOLICY2.XML, OLD_SYNONYMS.TXT, SOLRCONFIG-TRANSFORMERS.XML, KEEP-2.TXT, SOLRCONFIG-MASTER1.XML, SOLRCONFIG-TLOG.XML, BAD-SCHEMA-DUP-FIELD.XML, SCHEMA-LUCENEMATCHVERSION.XML, BAD-SOLRCONFIG-MISSING-SCRIPTFILE.XML, SOLRCONFIG-REPEATER.XML, BAD-SCHEMA-DUP-FIELDTYPE.XML, SCHEMA-REQUIRED-FIELDS.XML, STOPTYPES-1.TXT, BAD-SCHEMA-UNIQUEKEY-IS-COPYFIELD-DEST.XML, BAD-SCHEMA-NONTEXT-ANALYZER.XML, SOLRCONFIG-HIGHLIGHT.XML, SCHEMA11.XML, SCHEMA15.XML, SOLRCONFIG-SLAVE.XML, SOLRCONFIG-ALTDIRECTORY.XML, SOLRCONFIG-XINCLUDE.XML, SOLRCONFIG_CODEC.XML, SCHEMA-BINARYFIELD.XML, SCHEMA-TFIDF.XML, SOLRCONFIG-MASTER1-KEEPONEBACKUP.XML, STEMDICT.TXT, BAD-MP-SOLRCONFIG.XML, SOLRCONFIG-PROPINJECT-INDEXDEFAULT.XML, STOP-SNOWBALL.TXT, SOLRCONFIG-FUNCTIONQUERY.XML, STOP-2.TXT, BAD-SCHEMA-OMIT-TF-BUT-NOT-POS.XML, MISSING.FUNCTIONS.UPDATEPROCESSOR.JS, SOLRCONFIG-QUERYSENDER-NOQUERY.XML, SOLRCONFIG-PHRASESUGGEST.XML, HUNSPELL-TEST.AFF, SOLRCONFIG_PERF.XML, SOLRCONFIG-ENABLEPLUGIN.XML, SCHEMA-MINIMAL.XML, DA_UTF8.XML, SOLRCONFIG-MASTER.XML, FRENCHARTICLES.TXT, SOLRCONFIG-MASTER2.XML, SOLRCONFIG-BASIC.XML, BAD-SCHEMA-UNIQUEKEY-MULTIVALUED.XML, SOLRCONFIG-CACHING.XML, BAD-SCHEMA-NOT-INDEXED-BUT-NORMS.XML, SCHEMA-COPYFIELD-TEST.XML, SYNONYMS.TXT, SCHEMA-LMJELINEKMERCER.XML, SOLRCONFIG-SLAVE1.XML, SOLRCONFIG-MASTER3.XML, MISSLEADING.EXTENSION.UPDATEPROCESSOR.JS.TXT, BAD-SCHEMA-DUP-DYNAMICFIELD.XML, WDFTYPES.TXT, BAD-SCHEMA-ANALYZER-CLASS-AND-NESTED.XML, SOLRCONFIG-MERGEPOLICY.XML, SCHEMA-CHARFILTERS.XML, SOLRCONFIG-SOLCOREPROPERTIES.XML, SCHEMA-IB.XML, SCHEMA-REPLICATION1.XML, SOLRCONFIG-SOLR-749.XML, SCHEMA-LMDIRICHLET.XML, BAD-SCHEMA-SIM-GLOBAL-VS-FT-MISMATCH.XML, SOLRCONFIG-TERMINDEX.XML, ELEVATE.XML, SCHEMA-REVERSED.XML, CURRENCY.XML, XSLT, BAD-SCHEMA-NOT-INDEXED-BUT-POS.XML, SOLRCONFIG-BASIC-LUCENEVERSION31.XML, SCHEMASURROUND.XML, SOLRCONFIG-UPDATE-PROCESSOR-CHAINS.XML, SCHEMA-COLLATEFILTER.XML, OPEN-EXCHANGE-RATES.JSON, SCHEMA-TRIE.XML, STOPWORDSWRONGENCODING.TXT, SOLRCONFIG-QUERYSENDER.XML, SOLRCONFIG-DELPOLICY1.XML, HUNSPELL-TEST.DIC, SCHEMA-NOT-REQUIRED-UNIQUE-KEY.XML, SCHEMA-SIM.XML]
[junit4:junit4]   2> 455 T826 oass.SolrIndexSearcher.<init> Opening Searcher@64f6c59b main
[junit4:junit4]   2> 456 T826 oass.SolrIndexSearcher.getIndexDir WARNING WARNING: Directory impl does not support setting indexDir: org.apache.lucene.store.MockDirectoryWrapper
[junit4:junit4]   2> 456 T826 oasu.CommitTracker.<init> Hard AutoCommit: disabled
[junit4:junit4]   2> 456 T826 oasu.CommitTracker.<init> Soft AutoCommit: disabled
[junit4:junit4]   2> 456 T826 oashc.QueryElevationComponent.inform Loading QueryElevation from: /mnt/ssd/jenkins/workspace/Lucene-Solr-4.x-Linux/checkout/solr/build/solr-core/test-files/solr/collection1/conf/elevate.xml
[junit4:junit4]   2> 463 T826 oashc.QueryElevationComponent.inform Loading QueryElevation from: /mnt/ssd/jenkins/workspace/Lucene-Solr-4.x-Linux/checkout/solr/build/solr-core/test-files/solr/collection1/conf/elevate.xml
[junit4:junit4]   2> 469 T826 oashc.HttpShardHandlerFactory.getParameter Setting socketTimeout to: 0
[junit4:junit4]   2> 469 T826 oashc.HttpShardHandlerFactory.getParameter Setting urlScheme to: http://
[junit4:junit4]   2> 470 T826 oashc.HttpShardHandlerFactory.getParameter Setting connTimeout to: 0
[junit4:junit4]   2> 470 T826 oashc.HttpShardHandlerFactory.getParameter Setting maxConnectionsPerHost to: 20
[junit4:junit4]   2> 470 T826 oashc.HttpShardHandlerFactory.getParameter Setting corePoolSize to: 0
[junit4:junit4]   2> 470 T826 oashc.HttpShardHandlerFactory.getParameter Setting maximumPoolSize to: 2147483647
[junit4:junit4]   2> 471 T826 oashc.HttpShardHandlerFactory.getParameter Setting maxThreadIdleTime to: 5
[junit4:junit4]   2> 471 T826 oashc.HttpShardHandlerFactory.getParameter Setting sizeOfQueue to: -1
[junit4:junit4]   2> 471 T826 oashc.HttpShardHandlerFactory.getParameter Setting fairnessPolicy to: false
[junit4:junit4]   2> 471 T826 oascsi.HttpClientUtil.createClient Creating new http client, config:maxConnectionsPerHost=20&maxConnections=10000&socketTimeout=0&connTimeout=0&retry=false
[junit4:junit4]   2> 474 T846 oasc.SolrCore.registerSearcher [collection1] Registered new searcher Searcher@64f6c59b main{StandardDirectoryReader(segments_1:1)}
[junit4:junit4]   2> 474 T826 oasc.CoreContainer.register registering core: collection1
[junit4:junit4]   2> 478 T826 oass.SolrDispatchFilter.init user.dir=/mnt/ssd/jenkins/workspace/Lucene-Solr-4.x-Linux/checkout/solr/build/solr-core/test/J0
[junit4:junit4]   2> 478 T826 oass.SolrDispatchFilter.init SolrDispatchFilter.init() done
[junit4:junit4]   2> 478 T826 oascsi.HttpClientUtil.createClient Creating new http client, config:maxConnections=128&maxConnectionsPerHost=32&followRedirects=false
[junit4:junit4]   2> 480 T826 oejs.Server.doStart jetty-8.1.2.v20120308
[junit4:junit4]   2> 486 T826 oejs.AbstractConnector.doStart Started SocketConnector@0.0.0.0:38361
[junit4:junit4]   2> 487 T826 oasc.SolrResourceLoader.locateSolrHome JNDI not configured for solr (NoInitialContextEx)
[junit4:junit4]   2> 487 T826 oasc.SolrResourceLoader.locateSolrHome using system property solr.solr.home: /mnt/ssd/jenkins/workspace/Lucene-Solr-4.x-Linux/checkout/solr/build/solr-core/test-files/solr
[junit4:junit4]   2> 487 T826 oasc.SolrResourceLoader.<init> new SolrResourceLoader for deduced Solr Home: '/mnt/ssd/jenkins/workspace/Lucene-Solr-4.x-Linux/checkout/solr/build/solr-core/test-files/solr/'
[junit4:junit4]   2> 495 T826 oass.SolrDispatchFilter.init SolrDispatchFilter.init()
[junit4:junit4]   2> 496 T826 oasc.SolrResourceLoader.locateSolrHome JNDI not configured for solr (NoInitialContextEx)
[junit4:junit4]   2> 496 T826 oasc.SolrResourceLoader.locateSolrHome using system property solr.solr.home: /mnt/ssd/jenkins/workspace/Lucene-Solr-4.x-Linux/checkout/solr/build/solr-core/test-files/solr
[junit4:junit4]   2> 496 T826 oasc.CoreContainer$Initializer.initialize looking for solr.xml: /mnt/ssd/jenkins/workspace/Lucene-Solr-4.x-Linux/checkout/solr/build/solr-core/test-files/solr/solr.xml
[junit4:junit4]   2> 496 T826 oasc.CoreContainer.<init> New CoreContainer 1457909351
[junit4:junit4]   2> 497 T826 oasc.CoreContainer.load Loading CoreContainer using Solr Home: '/mnt/ssd/jenkins/workspace/Lucene-Solr-4.x-Linux/checkout/solr/build/solr-core/test-files/solr/'
[junit4:junit4]   2> 497 T826 oasc.SolrResourceLoader.<init> new SolrResourceLoader for directory: '/mnt/ssd/jenkins/workspace/Lucene-Solr-4.x-Linux/checkout/solr/build/solr-core/test-files/solr/'
[junit4:junit4]   2> 508 T826 oasc.CoreContainer.load Registering Log Listener
[junit4:junit4]   2> 517 T826 oasc.CoreContainer.create Creating SolrCore 'collection1' using instanceDir: /mnt/ssd/jenkins/workspace/Lucene-Solr-4.x-Linux/checkout/solr/build/solr-core/test-files/solr/collection1
[junit4:junit4]   2> 518 T826 oasc.SolrResourceLoader.<init> new SolrResourceLoader for directory: '/mnt/ssd/jenkins/workspace/Lucene-Solr-4.x-Linux/checkout/solr/build/solr-core/test-files/solr/collection1/'
[junit4:junit4]   2> 518 T826 oasc.SolrResourceLoader.replaceClassLoader Adding 'file:/mnt/ssd/jenkins/workspace/Lucene-Solr-4.x-Linux/checkout/solr/build/solr-core/test-files/solr/collection1/lib/README' to classloader
[junit4:junit4]   2> 518 T826 oasc.SolrResourceLoader.replaceClassLoader Adding 'file:/mnt/ssd/jenkins/workspace/Lucene-Solr-4.x-Linux/checkout/solr/build/solr-core/test-files/solr/collection1/lib/classes/' to classloader
[junit4:junit4]   2> 552 T826 oasc.SolrConfig.<init> Using Lucene MatchVersion: LUCENE_40
[junit4:junit4]   2> 593 T826 oasc.SolrConfig.<init> Loaded SolrConfig: solrconfig-elevate.xml
[junit4:junit4]   2> 594 T826 oass.IndexSchema.readSchema Reading Solr Schema
[junit4:junit4]   2> 596 T826 oass.IndexSchema.readSchema Schema name=example
[junit4:junit4]   2> 714 T826 oass.IndexSchema.readSchema default search field in schema is text
[junit4:junit4]   2> 716 T826 oass.IndexSchema.readSchema unique key field: id
[junit4:junit4]   2> 718 T826 oasc.SolrCore.<init> [collection1] Opening new SolrCore at /mnt/ssd/jenkins/workspace/Lucene-Solr-4.x-Linux/checkout/solr/build/solr-core/test-files/solr/collection1/, dataDir=./org.apache.solr.handler.component.DistributedQueryElevationComponentTest-1344267201327/shard1/data/
[junit4:junit4]   2> 718 T826 oasc.JmxMonitoredMap.<init> JMX monitoring is enabled. Adding Solr mbeans to JMX Server: com.sun.jmx.mbeanserver.JmxMBeanServer@13d33ff5
[junit4:junit4]   2> 719 T826 oasc.SolrCore.getNewIndexDir WARNING New index directory detected: old=null new=./org.apache.solr.handler.component.DistributedQueryElevationComponentTest-1344267201327/shard1/data/index/
[junit4:junit4]   2> 719 T826 oasc.SolrCore.initIndex WARNING [collection1] Solr index directory './org.apache.solr.handler.component.DistributedQueryElevationComponentTest-1344267201327/shard1/data/index' doesn't exist. Creating new index...
[junit4:junit4]   2> 720 T826 oasc.SolrDeletionPolicy.onCommit SolrDeletionPolicy.onCommit: commits:num=1
[junit4:junit4]   2> commit{dir=MockDirWrapper(NRTCachingDirectory(org.apache.lucene.store.RAMDirectory@4beff46a lockFactory=org.apache.lucene.store.SingleInstanceLockFactory@2a9934ab; maxCacheMB=0.3876953125 maxMergeSizeMB=0.55859375)),segFN=segments_1,generation=1,filenames=[segments_1]
[junit4:junit4]   2> 720 T826 oasc.SolrDeletionPolicy.updateCommits newest commit = 1
[junit4:junit4]   2> 721 T826 oasc.RequestHandlers.initHandlersFromConfig created /update: solr.UpdateRequestHandler
[junit4:junit4]   2> 721 T826 oasc.RequestHandlers.initHandlersFromConfig created /elevate: org.apache.solr.handler.component.SearchHandler
[junit4:junit4]   2> 722 T826 oasc.RequestHandlers.initHandlersFromConfig created /dataElevate: org.apache.solr.handler.component.SearchHandler
[junit4:junit4]   2> 722 T826 oashl.XMLLoader.init xsltCacheLifetimeSeconds=60
[junit4:junit4]   2> 722 T826 oasc.RequestHandlers.initHandlersFromConfig WARNING no default request handler is registered (either '/select' or 'standard')
[junit4:junit4]   2> 723 T826 oasc.SolrCore.initDeprecatedSupport WARNING solrconfig.xml uses deprecated <admin/gettableFiles>, Please update your config to use the ShowFileRequestHandler.
[junit4:junit4]   2> 724 T826 oasc.SolrCore.initDeprecatedSupport WARNING adding ShowFileRequestHandler with hidden files: [BAD-SCHEMA-EXTERNAL-FILEFIELD.XML, SCHEMA-DFR.XML, BAD-SCHEMA-UNIQUEKEY-USES-DEFAULT.XML, HYPHENATION.DTD, SOLRCONFIG-LAZYWRITER.XML, SOLRCONFIG-SCRIPT-UPDATEPROCESSOR.XML, STOPWORDS.TXT, PROTWORDS.TXT, SCHEMA.XML, SOLRCONFIG-ELEVATE.XML, SCHEMA12.XML, STOP-1.TXT, BAD-SOLRCONFIG-INVALID-SCRIPTFILE.XML, STOPTYPES-2.TXT, BAD-SCHEMA-NOT-INDEXED-BUT-TF.XML, SCHEMA_CODEC.XML, SCHEMA-STOP-KEEP.XML, SCHEMA-PHRASESUGGEST.XML, SOLRCONFIG-PROPINJECT.XML, SCHEMA-FOLDING.XML, COMPOUNDDICTIONARY.TXT, ADDFIELDS.UPDATEPROCESSOR.JS, SCHEMA-BM25.XML, TRIVIAL.UPDATEPROCESSOR1.JS, STOPWITHBOM.TXT, PHRASESUGGEST.TXT, SOLRCONFIG-REQHANDLER.INCL, SCHEMA-REPLICATION2.XML, DA_COMPOUNDDICTIONARY.TXT, MAPPING-ISOLATIN1ACCENT.TXT, SCHEMA-SPELLCHECKER.XML, BAD-SCHEMA-CODEC-GLOBAL-VS-FT-MISMATCH.XML, BAD-SOLRCONFIG-BOGUS-SCRIPTENGINE-NAME.XML, SOLRCONFIG-SPELLCHECKCOMPONENT.XML, SOLRCONFIG-SIMPLELOCK.XML, SOLRCONFIG-NOCACHE.XML, SCHEMA-NUMERIC.XML, KEEP-1.TXT, SCHEMA-COLLATE.XML, CONDITIONAL.UPDATEPROCESSOR.JS, THROW.ERROR.ON.ADD.UPDATEPROCESSOR.JS, SOLRCONFIG-SPELLCHECKER.XML, SOLRCONFIG-NATIVELOCK.XML, BAD_SOLRCONFIG.XML, TRIVIAL.UPDATEPROCESSOR0.JS, SOLRCONFIG-DELPOLICY2.XML, OLD_SYNONYMS.TXT, SOLRCONFIG-TRANSFORMERS.XML, KEEP-2.TXT, SOLRCONFIG-MASTER1.XML, SOLRCONFIG-TLOG.XML, BAD-SCHEMA-DUP-FIELD.XML, SCHEMA-LUCENEMATCHVERSION.XML, BAD-SOLRCONFIG-MISSING-SCRIPTFILE.XML, SOLRCONFIG-REPEATER.XML, BAD-SCHEMA-DUP-FIELDTYPE.XML, SCHEMA-REQUIRED-FIELDS.XML, STOPTYPES-1.TXT, BAD-SCHEMA-UNIQUEKEY-IS-COPYFIELD-DEST.XML, BAD-SCHEMA-NONTEXT-ANALYZER.XML, SOLRCONFIG-HIGHLIGHT.XML, SCHEMA11.XML, SCHEMA15.XML, SOLRCONFIG-SLAVE.XML, SOLRCONFIG-ALTDIRECTORY.XML, SOLRCONFIG-XINCLUDE.XML, SOLRCONFIG_CODEC.XML, SCHEMA-BINARYFIELD.XML, SCHEMA-TFIDF.XML, SOLRCONFIG-MASTER1-KEEPONEBACKUP.XML, STEMDICT.TXT, BAD-MP-SOLRCONFIG.XML, SOLRCONFIG-PROPINJECT-INDEXDEFAULT.XML, STOP-SNOWBALL.TXT, SOLRCONFIG-FUNCTIONQUERY.XML, STOP-2.TXT, BAD-SCHEMA-OMIT-TF-BUT-NOT-POS.XML, MISSING.FUNCTIONS.UPDATEPROCESSOR.JS, SOLRCONFIG-QUERYSENDER-NOQUERY.XML, SOLRCONFIG-PHRASESUGGEST.XML, HUNSPELL-TEST.AFF, SOLRCONFIG_PERF.XML, SOLRCONFIG-ENABLEPLUGIN.XML, SCHEMA-MINIMAL.XML, DA_UTF8.XML, SOLRCONFIG-MASTER.XML, FRENCHARTICLES.TXT, SOLRCONFIG-MASTER2.XML, SOLRCONFIG-BASIC.XML, BAD-SCHEMA-UNIQUEKEY-MULTIVALUED.XML, SOLRCONFIG-CACHING.XML, BAD-SCHEMA-NOT-INDEXED-BUT-NORMS.XML, SCHEMA-COPYFIELD-TEST.XML, SYNONYMS.TXT, SCHEMA-LMJELINEKMERCER.XML, SOLRCONFIG-SLAVE1.XML, SOLRCONFIG-MASTER3.XML, MISSLEADING.EXTENSION.UPDATEPROCESSOR.JS.TXT, BAD-SCHEMA-DUP-DYNAMICFIELD.XML, WDFTYPES.TXT, BAD-SCHEMA-ANALYZER-CLASS-AND-NESTED.XML, SOLRCONFIG-MERGEPOLICY.XML, SCHEMA-CHARFILTERS.XML, SOLRCONFIG-SOLCOREPROPERTIES.XML, SCHEMA-IB.XML, SCHEMA-REPLICATION1.XML, SOLRCONFIG-SOLR-749.XML, SCHEMA-LMDIRICHLET.XML, BAD-SCHEMA-SIM-GLOBAL-VS-FT-MISMATCH.XML, SOLRCONFIG-TERMINDEX.XML, ELEVATE.XML, SCHEMA-REVERSED.XML, CURRENCY.XML, XSLT, BAD-SCHEMA-NOT-INDEXED-BUT-POS.XML, SOLRCONFIG-BASIC-LUCENEVERSION31.XML, SCHEMASURROUND.XML, SOLRCONFIG-UPDATE-PROCESSOR-CHAINS.XML, SCHEMA-COLLATEFILTER.XML, OPEN-EXCHANGE-RATES.JSON, SCHEMA-TRIE.XML, STOPWORDSWRONGENCODING.TXT, SOLRCONFIG-QUERYSENDER.XML, SOLRCONFIG-DELPOLICY1.XML, HUNSPELL-TEST.DIC, SCHEMA-NOT-REQUIRED-UNIQUE-KEY.XML, SCHEMA-SIM.XML]
[junit4:junit4]   2> 725 T826 oass.SolrIndexSearcher.<init> Opening Searcher@68a17228 main
[junit4:junit4]   2> 726 T826 oass.SolrIndexSearcher.getIndexDir WARNING WARNING: Directory impl does not support setting indexDir: org.apache.lucene.store.MockDirectoryWrapper
[junit4:junit4]   2> 726 T826 oasu.CommitTracker.<init> Hard AutoCommit: disabled
[junit4:junit4]   2> 726 T826 oasu.CommitTracker.<init> Soft AutoCommit: disabled
[junit4:junit4]   2> 726 T826 oashc.QueryElevationComponent.inform Loading QueryElevation from: /mnt/ssd/jenkins/workspace/Lucene-Solr-4.x-Linux/checkout/solr/build/solr-core/test-files/solr/collection1/conf/elevate.xml
[junit4:junit4]   2> 732 T826 oashc.QueryElevationComponent.inform Loading QueryElevation from: /mnt/ssd/jenkins/workspace/Lucene-Solr-4.x-Linux/checkout/solr/build/solr-core/test-files/solr/collection1/conf/elevate.xml
[junit4:junit4]   2> 737 T826 oashc.HttpShardHandlerFactory.getParameter Setting socketTimeout to: 0
[junit4:junit4]   2> 737 T826 oashc.HttpShardHandlerFactory.getParameter Setting urlScheme to: http://
[junit4:junit4]   2> 737 T826 oashc.HttpShardHandlerFactory.getParameter Setting connTimeout to: 0
[junit4:junit4]   2> 738 T826 oashc.HttpShardHandlerFactory.getParameter Setting maxConnectionsPerHost to: 20
[junit4:junit4]   2> 738 T826 oashc.HttpShardHandlerFactory.getParameter Setting corePoolSize to: 0
[junit4:junit4]   2> 738 T826 oashc.HttpShardHandlerFactory.getParameter Setting maximumPoolSize to: 2147483647
[junit4:junit4]   2> 738 T826 oashc.HttpShardHandlerFactory.getParameter Setting maxThreadIdleTime to: 5
[junit4:junit4]   2> 738 T826 oashc.HttpShardHandlerFactory.getParameter Setting sizeOfQueue to: -1
[junit4:junit4]   2> 738 T826 oashc.HttpShardHandlerFactory.getParameter Setting fairnessPolicy to: false
[junit4:junit4]   2> 739 T826 oascsi.HttpClientUtil.createClient Creating new http client, config:maxConnectionsPerHost=20&maxConnections=10000&socketTimeout=0&connTimeout=0&retry=false
[junit4:junit4]   2> 741 T856 oasc.SolrCore.registerSearcher [collection1] Registered new searcher Searcher@68a17228 main{StandardDirectoryReader(segments_1:1)}
[junit4:junit4]   2> 741 T826 oasc.CoreContainer.register registering core: collection1
[junit4:junit4]   2> 741 T826 oass.SolrDispatchFilter.init user.dir=/mnt/ssd/jenkins/workspace/Lucene-Solr-4.x-Linux/checkout/solr/build/solr-core/test/J0
[junit4:junit4]   2> 741 T826 oass.SolrDispatchFilter.init SolrDispatchFilter.init() done
[junit4:junit4]   2> 742 T826 oascsi.HttpClientUtil.createClient Creating new http client, config:maxConnections=128&maxConnectionsPerHost=32&followRedirects=false
[junit4:junit4]   2> 744 T826 oejs.Server.doStart jetty-8.1.2.v20120308
[junit4:junit4]   2> 745 T826 oejs.AbstractConnector.doStart Started SocketConnector@0.0.0.0:58299
[junit4:junit4]   2> 746 T826 oasc.SolrResourceLoader.locateSolrHome JNDI not configured for solr (NoInitialContextEx)
[junit4:junit4]   2> 746 T826 oasc.SolrResourceLoader.locateSolrHome using system property solr.solr.home: /mnt/ssd/jenkins/workspace/Lucene-Solr-4.x-Linux/checkout/solr/build/solr-core/test-files/solr
[junit4:junit4]   2> 747 T826 oasc.SolrResourceLoader.<init> new SolrResourceLoader for deduced Solr Home: '/mnt/ssd/jenkins/workspace/Lucene-Solr-4.x-Linux/checkout/solr/build/solr-core/test-files/solr/'
[junit4:junit4]   2> 753 T826 oass.SolrDispatchFilter.init SolrDispatchFilter.init()
[junit4:junit4]   2> 754 T826 oasc.SolrResourceLoader.locateSolrHome JNDI not configured for solr (NoInitialContextEx)
[junit4:junit4]   2> 754 T826 oasc.SolrResourceLoader.locateSolrHome using system property solr.solr.home: /mnt/ssd/jenkins/workspace/Lucene-Solr-4.x-Linux/checkout/solr/build/solr-core/test-files/solr
[junit4:junit4]   2> 754 T826 oasc.CoreContainer$Initializer.initialize looking for solr.xml: /mnt/ssd/jenkins/workspace/Lucene-Solr-4.x-Linux/checkout/solr/build/solr-core/test-files/solr/solr.xml
[junit4:junit4]   2> 754 T826 oasc.CoreContainer.<init> New CoreContainer 1269733395
[junit4:junit4]   2> 755 T826 oasc.CoreContainer.load Loading CoreContainer using Solr Home: '/mnt/ssd/jenkins/workspace/Lucene-Solr-4.x-Linux/checkout/solr/build/solr-core/test-files/solr/'
[junit4:junit4]   2> 755 T826 oasc.SolrResourceLoader.<init> new SolrResourceLoader for directory: '/mnt/ssd/jenkins/workspace/Lucene-Solr-4.x-Linux/checkout/solr/build/solr-core/test-files/solr/'
[junit4:junit4]   2> 764 T826 oasc.CoreContainer.load Registering Log Listener
[junit4:junit4]   2> 776 T826 oasc.CoreContainer.create Creating SolrCore 'collection1' using instanceDir: /mnt/ssd/jenkins/workspace/Lucene-Solr-4.x-Linux/checkout/solr/build/solr-core/test-files/solr/collection1
[junit4:junit4]   2> 776 T826 oasc.SolrResourceLoader.<init> new SolrResourceLoader for directory: '/mnt/ssd/jenkins/workspace/Lucene-Solr-4.x-Linux/checkout/solr/build/solr-core/test-files/solr/collection1/'
[junit4:junit4]   2> 777 T826 oasc.SolrResourceLoader.replaceClassLoader Adding 'file:/mnt/ssd/jenkins/workspace/Lucene-Solr-4.x-Linux/checkout/solr/build/solr-core/test-files/solr/collection1/lib/README' to classloader
[junit4:junit4]   2> 777 T826 oasc.SolrResourceLoader.replaceClassLoader Adding 'file:/mnt/ssd/jenkins/workspace/Lucene-Solr-4.x-Linux/checkout/solr/build/solr-core/test-files/solr/collection1/lib/classes/' to classloader
[junit4:junit4]   2> 807 T826 oasc.SolrConfig.<init> Using Lucene MatchVersion: LUCENE_40
[junit4:junit4]   2> 849 T826 oasc.SolrConfig.<init> Loaded SolrConfig: solrconfig-elevate.xml
[junit4:junit4]   2> 849 T826 oass.IndexSchema.readSchema Reading Solr Schema
[junit4:junit4]   2> 852 T826 oass.IndexSchema.readSchema Schema name=example
[junit4:junit4]   2> 997 T826 oass.IndexSchema.readSchema default search field in schema is text
[junit4:junit4]   2> 998 T826 oass.IndexSchema.readSchema unique key field: id
[junit4:junit4]   2> 1000 T826 oasc.SolrCore.<init> [collection1] Opening new SolrCore at /mnt/ssd/jenkins/workspace/Lucene-Solr-4.x-Linux/checkout/solr/build/solr-core/test-files/solr/collection1/, dataDir=./org.apache.solr.handler.component.DistributedQueryElevationComponentTest-1344267201327/shard2/data/
[junit4:junit4]   2> 1000 T826 oasc.JmxMonitoredMap.<init> JMX monitoring is enabled. Adding Solr mbeans to JMX Server: com.sun.jmx.mbeanserver.JmxMBeanServer@13d33ff5
[junit4:junit4]   2> 1000 T826 oasc.SolrCore.getNewIndexDir WARNING New index directory detected: old=null new=./org.apache.solr.handler.component.DistributedQueryElevationComponentTest-1344267201327/shard2/data/index/
[junit4:junit4]   2> 1001 T826 oasc.SolrCore.initIndex WARNING [collection1] Solr index directory './org.apache.solr.handler.component.DistributedQueryElevationComponentTest-1344267201327/shard2/data/index' doesn't exist. Creating new index...
[junit4:junit4]   2> 1002 T826 oasc.SolrDeletionPolicy.onCommit SolrDeletionPolicy.onCommit: commits:num=1
[junit4:junit4]   2> commit{dir=MockDirWrapper(org.apache.lucene.store.SimpleFSDirectory@/mnt/ssd/jenkins/workspace/Lucene-Solr-4.x-Linux/checkout/solr/build/solr-core/test/J0/index5065650661tmp lockFactory=org.apache.lucene.store.SingleInstanceLockFactory@4e4f1b95),segFN=segments_1,generation=1,filenames=[segments_1]
[junit4:junit4]   2> 1003 T826 oasc.SolrDeletionPolicy.updateCommits newest commit = 1
[junit4:junit4]   2> 1003 T826 oasc.RequestHandlers.initHandlersFromConfig created /update: solr.UpdateRequestHandler
[junit4:junit4]   2> 1004 T826 oasc.RequestHandlers.initHandlersFromConfig created /elevate: org.apache.solr.handler.component.SearchHandler
[junit4:junit4]   2> 1004 T826 oasc.RequestHandlers.initHandlersFromConfig created /dataElevate: org.apache.solr.handler.component.SearchHandler
[junit4:junit4]   2> 1004 T826 oashl.XMLLoader.init xsltCacheLifetimeSeconds=60
[junit4:junit4]   2> 1004 T826 oasc.RequestHandlers.initHandlersFromConfig WARNING no default request handler is registered (either '/select' or 'standard')
[junit4:junit4]   2> 1005 T826 oasc.SolrCore.initDeprecatedSupport WARNING solrconfig.xml uses deprecated <admin/gettableFiles>, Please update your config to use the ShowFileRequestHandler.
[junit4:junit4]   2> 1006 T826 oasc.SolrCore.initDeprecatedSupport WARNING adding ShowFileRequestHandler with hidden files: [BAD-SCHEMA-EXTERNAL-FILEFIELD.XML, SCHEMA-DFR.XML, BAD-SCHEMA-UNIQUEKEY-USES-DEFAULT.XML, HYPHENATION.DTD, SOLRCONFIG-LAZYWRITER.XML, SOLRCONFIG-SCRIPT-UPDATEPROCESSOR.XML, STOPWORDS.TXT, PROTWORDS.TXT, SCHEMA.XML, SOLRCONFIG-ELEVATE.XML, SCHEMA12.XML, STOP-1.TXT, BAD-SOLRCONFIG-INVALID-SCRIPTFILE.XML, STOPTYPES-2.TXT, BAD-SCHEMA-NOT-INDEXED-BUT-TF.XML, SCHEMA_CODEC.XML, SCHEMA-STOP-KEEP.XML, SCHEMA-PHRASESUGGEST.XML, SOLRCONFIG-PROPINJECT.XML, SCHEMA-FOLDING.XML, COMPOUNDDICTIONARY.TXT, ADDFIELDS.UPDATEPROCESSOR.JS, SCHEMA-BM25.XML, TRIVIAL.UPDATEPROCESSOR1.JS, STOPWITHBOM.TXT, PHRASESUGGEST.TXT, SOLRCONFIG-REQHANDLER.INCL, SCHEMA-REPLICATION2.XML, DA_COMPOUNDDICTIONARY.TXT, MAPPING-ISOLATIN1ACCENT.TXT, SCHEMA-SPELLCHECKER.XML, BAD-SCHEMA-CODEC-GLOBAL-VS-FT-MISMATCH.XML, BAD-SOLRCONFIG-BOGUS-SCRIPTENGINE-NAME.XML, SOLRCONFIG-SPELLCHECKCOMPONENT.XML, SOLRCONFIG-SIMPLELOCK.XML, SOLRCONFIG-NOCACHE.XML, SCHEMA-NUMERIC.XML, KEEP-1.TXT, SCHEMA-COLLATE.XML, CONDITIONAL.UPDATEPROCESSOR.JS, THROW.ERROR.ON.ADD.UPDATEPROCESSOR.JS, SOLRCONFIG-SPELLCHECKER.XML, SOLRCONFIG-NATIVELOCK.XML, BAD_SOLRCONFIG.XML, TRIVIAL.UPDATEPROCESSOR0.JS, SOLRCONFIG-DELPOLICY2.XML, OLD_SYNONYMS.TXT, SOLRCONFIG-TRANSFORMERS.XML, KEEP-2.TXT, SOLRCONFIG-MASTER1.XML, SOLRCONFIG-TLOG.XML, BAD-SCHEMA-DUP-FIELD.XML, SCHEMA-LUCENEMATCHVERSION.XML, BAD-SOLRCONFIG-MISSING-SCRIPTFILE.XML, SOLRCONFIG-REPEATER.XML, BAD-SCHEMA-DUP-FIELDTYPE.XML, SCHEMA-REQUIRED-FIELDS.XML, STOPTYPES-1.TXT, BAD-SCHEMA-UNIQUEKEY-IS-COPYFIELD-DEST.XML, BAD-SCHEMA-NONTEXT-ANALYZER.XML, SOLRCONFIG-HIGHLIGHT.XML, SCHEMA11.XML, SCHEMA15.XML, SOLRCONFIG-SLAVE.XML, SOLRCONFIG-ALTDIRECTORY.XML, SOLRCONFIG-XINCLUDE.XML, SOLRCONFIG_CODEC.XML, SCHEMA-BINARYFIELD.XML, SCHEMA-TFIDF.XML, SOLRCONFIG-MASTER1-KEEPONEBACKUP.XML, STEMDICT.TXT, BAD-MP-SOLRCONFIG.XML, SOLRCONFIG-PROPINJECT-INDEXDEFAULT.XML, STOP-SNOWBALL.TXT, SOLRCONFIG-FUNCTIONQUERY.XML, STOP-2.TXT, BAD-SCHEMA-OMIT-TF-BUT-NOT-POS.XML, MISSING.FUNCTIONS.UPDATEPROCESSOR.JS, SOLRCONFIG-QUERYSENDER-NOQUERY.XML, SOLRCONFIG-PHRASESUGGEST.XML, HUNSPELL-TEST.AFF, SOLRCONFIG_PERF.XML, SOLRCONFIG-ENABLEPLUGIN.XML, SCHEMA-MINIMAL.XML, DA_UTF8.XML, SOLRCONFIG-MASTER.XML, FRENCHARTICLES.TXT, SOLRCONFIG-MASTER2.XML, SOLRCONFIG-BASIC.XML, BAD-SCHEMA-UNIQUEKEY-MULTIVALUED.XML, SOLRCONFIG-CACHING.XML, BAD-SCHEMA-NOT-INDEXED-BUT-NORMS.XML, SCHEMA-COPYFIELD-TEST.XML, SYNONYMS.TXT, SCHEMA-LMJELINEKMERCER.XML, SOLRCONFIG-SLAVE1.XML, SOLRCONFIG-MASTER3.XML, MISSLEADING.EXTENSION.UPDATEPROCESSOR.JS.TXT, BAD-SCHEMA-DUP-DYNAMICFIELD.XML, WDFTYPES.TXT, BAD-SCHEMA-ANALYZER-CLASS-AND-NESTED.XML, SOLRCONFIG-MERGEPOLICY.XML, SCHEMA-CHARFILTERS.XML, SOLRCONFIG-SOLCOREPROPERTIES.XML, SCHEMA-IB.XML, SCHEMA-REPLICATION1.XML, SOLRCONFIG-SOLR-749.XML, SCHEMA-LMDIRICHLET.XML, BAD-SCHEMA-SIM-GLOBAL-VS-FT-MISMATCH.XML, SOLRCONFIG-TERMINDEX.XML, ELEVATE.XML, SCHEMA-REVERSED.XML, CURRENCY.XML, XSLT, BAD-SCHEMA-NOT-INDEXED-BUT-POS.XML, SOLRCONFIG-BASIC-LUCENEVERSION31.XML, SCHEMASURROUND.XML, SOLRCONFIG-UPDATE-PROCESSOR-CHAINS.XML, SCHEMA-COLLATEFILTER.XML, OPEN-EXCHANGE-RATES.JSON, SCHEMA-TRIE.XML, STOPWORDSWRONGENCODING.TXT, SOLRCONFIG-QUERYSENDER.XML, SOLRCONFIG-DELPOLICY1.XML, HUNSPELL-TEST.DIC, SCHEMA-NOT-REQUIRED-UNIQUE-KEY.XML, SCHEMA-SIM.XML]
[junit4:junit4]   2> 1008 T826 oass.SolrIndexSearcher.<init> Opening Searcher@47ffe2ab main
[junit4:junit4]   2> 1008 T826 oass.SolrIndexSearcher.getIndexDir WARNING WARNING: Directory impl does not support setting indexDir: org.apache.lucene.store.MockDirectoryWrapper
[junit4:junit4]   2> 1008 T826 oasu.CommitTracker.<init> Hard AutoCommit: disabled
[junit4:junit4]   2> 1008 T826 oasu.CommitTracker.<init> Soft AutoCommit: disabled
[junit4:junit4]   2> 1009 T826 oashc.QueryElevationComponent.inform Loading QueryElevation from: /mnt/ssd/jenkins/workspace/Lucene-Solr-4.x-Linux/checkout/solr/build/solr-core/test-files/solr/collection1/conf/elevate.xml
[junit4:junit4]   2> 1015 T826 oashc.QueryElevationComponent.inform Loading QueryElevation from: /mnt/ssd/jenkins/workspace/Lucene-Solr-4.x-Linux/checkout/solr/build/solr-core/test-files/solr/collection1/conf/elevate.xml
[junit4:junit4]   2> 1023 T826 oashc.HttpShardHandlerFactory.getParameter Setting socketTimeout to: 0
[junit4:junit4]   2> 1023 T826 oashc.HttpShardHandlerFactory.getParameter Setting urlScheme to: http://
[junit4:junit4]   2> 1023 T826 oashc.HttpShardHandlerFactory.getParameter Setting connTimeout to: 0
[junit4:junit4]   2> 1024 T826 oashc.HttpShardHandlerFactory.getParameter Setting maxConnectionsPerHost to: 20
[junit4:junit4]   2> 1024 T826 oashc.HttpShardHandlerFactory.getParameter Setting corePoolSize to: 0
[junit4:junit4]   2> 1024 T826 oashc.HttpShardHandlerFactory.getParameter Setting maximumPoolSize to: 2147483647
[junit4:junit4]   2> 1024 T826 oashc.HttpShardHandlerFactory.getParameter Setting maxThreadIdleTime to: 5
[junit4:junit4]   2> 1025 T826 oashc.HttpShardHandlerFactory.getParameter Setting sizeOfQueue to: -1
[junit4:junit4]   2> 1025 T826 oashc.HttpShardHandlerFactory.getParameter Setting fairnessPolicy to: false
[junit4:junit4]   2> 1025 T826 oascsi.HttpClientUtil.createClient Creating new http client, config:maxConnectionsPerHost=20&maxConnections=10000&socketTimeout=0&connTimeout=0&retry=false
[junit4:junit4]   2> 1027 T866 oasc.SolrCore.registerSearcher [collection1] Registered new searcher Searcher@47ffe2ab main{StandardDirectoryReader(segments_1:1)}
[junit4:junit4]   2> 1027 T826 oasc.CoreContainer.register registering core: collection1
[junit4:junit4]   2> 1028 T826 oass.SolrDispatchFilter.init user.dir=/mnt/ssd/jenkins/workspace/Lucene-Solr-4.x-Linux/checkout/solr/build/solr-core/test/J0
[junit4:junit4]   2> 1028 T826 oass.SolrDispatchFilter.init SolrDispatchFilter.init() done
[junit4:junit4]   2> 1028 T826 oascsi.HttpClientUtil.createClient Creating new http client, config:maxConnections=128&maxConnectionsPerHost=32&followRedirects=false
[junit4:junit4]   2> ASYNC  NEW_CORE C31 name=collection1 org.apache.solr.core.SolrCore@3063d59b
[junit4:junit4]   2> 1032 T829 C31 oasu.DirectUpdateHandler2.deleteAll [collection1] REMOVING ALL DOCUMENTS FROM INDEX
[junit4:junit4]   2> 1033 T829 C31 oasc.SolrDeletionPolicy.onInit SolrDeletionPolicy.onInit: commits:num=1
[junit4:junit4]   2> commit{dir=MockDirWrapper(org.apache.lucene.store.RAMDirectory@6a5ccbee lockFactory=org.apache.lucene.store.SingleInstanceLockFactory@e8184ab),segFN=segments_1,generation=1,filenames=[segments_1]
[junit4:junit4]   2> 1034 T829 C31 oasc.SolrDeletionPolicy.updateCommits newest commit = 1
[junit4:junit4]   2> 1034 T829 C31 UPDATE [collection1] webapp=/solr path=/update params={version=2&wt=javabin} {deleteByQuery=*:*} 0 2
[junit4:junit4]   2> ASYNC  NEW_CORE C32 name=collection1 org.apache.solr.core.SolrCore@1021729f
[junit4:junit4]   2> 1037 T839 C32 oasu.DirectUpdateHandler2.deleteAll [collection1] REMOVING ALL DOCUMENTS FROM INDEX
[junit4:junit4]   2> 1038 T839 C32 oasc.SolrDeletionPolicy.onInit SolrDeletionPolicy.onInit: commits:num=1
[junit4:junit4]   2> commit{dir=MockDirWrapper(org.apache.lucene.store.RAMDirectory@3ec2cff lockFactory=org.apache.lucene.store.SingleInstanceLockFactory@41363858),segFN=segments_1,generation=1,filenames=[segments_1]
[junit4:junit4]   2> 1039 T839 C32 oasc.SolrDeletionPolicy.updateCommits newest commit = 1
[junit4:junit4]   2> 1039 T839 C32 UPDATE [collection1] webapp=/solr path=/update params={version=2&wt=javabin} {deleteByQuery=*:*} 0 2
[junit4:junit4]   2> ASYNC  NEW_CORE C33 name=collection1 org.apache.solr.core.SolrCore@51c0d924
[junit4:junit4]   2> 1043 T849 C33 oasu.DirectUpdateHandler2.deleteAll [collection1] REMOVING ALL DOCUMENTS FROM INDEX
[junit4:junit4]   2> 1044 T849 C33 oasc.SolrDeletionPolicy.onInit SolrDeletionPolicy.onInit: commits:num=1
[junit4:junit4]   2> commit{dir=MockDirWrapper(NRTCachingDirectory(org.apache.lucene.store.RAMDirectory@4beff46a lockFactory=org.apache.lucene.store.SingleInstanceLockFactory@2a9934ab; maxCacheMB=0.3876953125 maxMergeSizeMB=0.55859375)),segFN=segments_1,generation=1,filenames=[segments_1]
[junit4:junit4]   2> 1045 T849 C33 oasc.SolrDeletionPolicy.updateCommits newest commit = 1
[junit4:junit4]   2> 1045 T849 C33 UPDATE [collection1] webapp=/solr path=/update params={version=2&wt=javabin} {deleteByQuery=*:*} 0 2
[junit4:junit4]   2> ASYNC  NEW_CORE C34 name=collection1 org.apache.solr.core.SolrCore@28022aec
[junit4:junit4]   2> 1051 T859 C34 oasu.DirectUpdateHandler2.deleteAll [collection1] REMOVING ALL DOCUMENTS FROM INDEX
[junit4:junit4]   2> 1053 T859 C34 oasc.SolrDeletionPolicy.onInit SolrDeletionPolicy.onInit: commits:num=1
[junit4:junit4]   2> commit{dir=MockDirWrapper(org.apache.lucene.store.SimpleFSDirectory@/mnt/ssd/jenkins/workspace/Lucene-Solr-4.x-Linux/checkout/solr/build/solr-core/test/J0/index5065650661tmp lockFactory=org.apache.lucene.store.SingleInstanceLockFactory@4e4f1b95),segFN=segments_1,generation=1,filenames=[segments_1]
[junit4:junit4]   2> 1053 T859 C34 oasc.SolrDeletionPolicy.updateCommits newest commit = 1
[junit4:junit4]   2> 1054 T859 C34 UPDATE [collection1] webapp=/solr path=/update params={version=2&wt=javabin} {deleteByQuery=*:*} 0 3
[junit4:junit4]   2> 1056 T829 C31 UPDATE [collection1] webapp=/solr path=/update params={version=2&wt=javabin} {add=[1]} 0 0
[junit4:junit4]   2> 1078 T839 C32 UPDATE [collection1] webapp=/solr path=/update params={version=2&wt=javabin} {add=[1]} 0 0
[junit4:junit4]   2> 1081 T829 C31 UPDATE [collection1] webapp=/solr path=/update params={version=2&wt=javabin} {add=[2]} 0 1
[junit4:junit4]   2> 1083 T849 C33 UPDATE [collection1] webapp=/solr path=/update params={version=2&wt=javabin} {add=[2]} 0 1
[junit4:junit4]   2> 1085 T829 C31 UPDATE [collection1] webapp=/solr path=/update params={version=2&wt=javabin} {add=[3]} 0 0
[junit4:junit4]   2> 1087 T859 C34 UPDATE [collection1] webapp=/solr path=/update params={version=2&wt=javabin} {add=[3]} 0 0
[junit4:junit4]   2> 1089 T829 C31 UPDATE [collection1] webapp=/solr path=/update params={version=2&wt=javabin} {add=[4]} 0 0
[junit4:junit4]   2> 1091 T839 C32 UPDATE [collection1] webapp=/solr path=/update params={version=2&wt=javabin} {add=[4]} 0 0
[junit4:junit4]   2> 1096 T829 C31 UPDATE [collection1] webapp=/solr path=/update params={version=2&wt=javabin} {add=[5]} 0 3
[junit4:junit4]   2> 1098 T849 C33 UPDATE [collection1] webapp=/solr path=/update params={version=2&wt=javabin} {add=[5]} 0 0
[junit4:junit4]   2> 1102 T829 C31 UPDATE [collection1] webapp=/solr path=/update params={version=2&wt=javabin} {add=[6]} 0 0
[junit4:junit4]   2> 1110 T859 C34 UPDATE [collection1] webapp=/solr path=/update params={version=2&wt=javabin} {add=[6]} 0 0
[junit4:junit4]   2> 1112 T829 C31 UPDATE [collection1] webapp=/solr path=/update params={version=2&wt=javabin} {add=[7]} 0 0
[junit4:junit4]   2> 1114 T859 C34 UPDATE [collection1] webapp=/solr path=/update params={version=2&wt=javabin} {add=[7]} 0 0
[junit4:junit4]   2> 1116 T829 C31 oasu.DirectUpdateHandler2.commit start commit{flags=0,_version_=0,optimize=false,openSearcher=true,waitSearcher=true,expungeDeletes=false,softCommit=false}
[junit4:junit4]   2> 1117 T829 C31 oasc.SolrDeletionPolicy.onCommit SolrDeletionPolicy.onCommit: commits:num=2
[junit4:junit4]   2> commit{dir=MockDirWrapper(org.apache.lucene.store.RAMDirectory@6a5ccbee lockFactory=org.apache.lucene.store.SingleInstanceLockFactory@e8184ab),segFN=segments_1,generation=1,filenames=[segments_1]
[junit4:junit4]   2> commit{dir=MockDirWrapper(org.apache.lucene.store.RAMDirectory@6a5ccbee lockFactory=org.apache.lucene.store.SingleInstanceLockFactory@e8184ab),segFN=segments_2,generation=2,filenames=[_0_Asserting_0.frq, _0_Memory_0.ram, _0_Asserting_0.tim, _0_nrm.cfe, segments_2, _0.fnm, _0.fdx, _0.fdt, _0_Asserting_0.tip, _0_Asserting_0.prx, _0_nrm.cfs, _0.si]
[junit4:junit4]   2> 1118 T829 C31 oasc.SolrDeletionPolicy.updateCommits newest commit = 2
[junit4:junit4]   2> 1119 T829 C31 oass.SolrIndexSearcher.<init> Opening Searcher@1c91b76c main
[junit4:junit4]   2> 1119 T829 C31 oass.SolrIndexSearcher.getIndexDir WARNING WARNING: Directory impl does not support setting indexDir: org.apache.lucene.store.MockDirectoryWrapper
[junit4:junit4]   2> 1120 T829 C31 oasu.DirectUpdateHandler2.commit end_commit_flush
[junit4:junit4]   2> 1120 T836 oasc.SolrCore.registerSearcher [collection1] Registered new searcher Searcher@1c91b76c main{StandardDirectoryReader(segments_2:4 _0(4.0.0.1):C7)}
[junit4:junit4]   2> 1121 T829 C31 UPDATE [collection1] webapp=/solr path=/update params={wt=javabin&commit=true&version=2&softCommit=false&waitSearcher=true} {commit=} 0 5
[junit4:junit4]   2> 1123 T839 C32 oasu.DirectUpdateHandler2.commit start commit{flags=0,_version_=0,optimize=false,openSearcher=true,waitSearcher=true,expungeDeletes=false,softCommit=false}
[junit4:junit4]   2> 1124 T839 C32 oasc.SolrDeletionPolicy.onCommit SolrDeletionPolicy.onCommit: commits:num=2
[junit4:junit4]   2> commit{dir=MockDirWrapper(org.apache.lucene.store.RAMDirectory@3ec2cff lockFactory=org.apache.lucene.store.SingleInstanceLockFactory@41363858),segFN=segments_1,generation=1,filenames=[segments_1]
[junit4:junit4]   2> commit{dir=MockDirWrapper(org.apache.lucene.store.RAMDirectory@3ec2cff lockFactory=org.apache.lucene.store.SingleInstanceLockFactory@41363858),segFN=segments_2,generation=2,filenames=[_0_Asserting_0.frq, _0_Memory_0.ram, _0_Asserting_0.tim, _0_nrm.cfe, segments_2, _0.fnm, _0.fdx, _0.fdt, _0_Asserting_0.tip, _0_Asserting_0.prx, _0_nrm.cfs, _0.si]
[junit4:junit4]   2> 1124 T839 C32 oasc.SolrDeletionPolicy.updateCommits newest commit = 2
[junit4:junit4]   2> 1125 T839 C32 oass.SolrIndexSearcher.<init> Opening Searcher@6eec3687 main
[junit4:junit4]   2> 1126 T839 C32 oass.SolrIndexSearcher.getIndexDir WARNING WARNING: Directory impl does not support setting indexDir: org.apache.lucene.store.MockDirectoryWrapper
[junit4:junit4]   2> 1126 T839 C32 oasu.DirectUpdateHandler2.commit end_commit_flush
[junit4:junit4]   2> 1126 T846 oasc.SolrCore.registerSearcher [collection1] Registered new searcher Searcher@6eec3687 main{StandardDirectoryReader(segments_2:4 _0(4.0.0.1):C2)}
[junit4:junit4]   2> 1127 T839 C32 UPDATE [collection1] webapp=/solr path=/update params={wt=javabin&commit=true&version=2&softCommit=false&waitSearcher=true} {commit=} 0 4
[junit4:junit4]   2> 1129 T849 C33 oasu.DirectUpdateHandler2.commit start commit{flags=0,_version_=0,optimize=false,openSearcher=true,waitSearcher=true,expungeDeletes=false,softCommit=false}
[junit4:junit4]   2> 1131 T849 C33 oasc.SolrDeletionPolicy.onCommit SolrDeletionPolicy.onCommit: commits:num=2
[junit4:junit4]   2> commit{dir=MockDirWrapper(NRTCachingDirectory(org.apache.lucene.store.RAMDirectory@4beff46a lockFactory=org.apache.lucene.store.SingleInstanceLockFactory@2a9934ab; maxCacheMB=0.3876953125 maxMergeSizeMB=0.55859375)),segFN=segments_1,generation=1,filenames=[segments_1]
[junit4:junit4]   2> commit{dir=MockDirWrapper(NRTCachingDirectory(org.apache.lucene.store.RAMDirectory@4beff46a lockFactory=org.apache.lucene.store.SingleInstanceLockFactory@2a9934ab; maxCacheMB=0.3876953125 maxMergeSizeMB=0.55859375)),segFN=segments_2,generation=2,filenames=[_0_Asserting_0.frq, _0_Memory_0.ram, _0_Asserting_0.tim, _0_nrm.cfe, segments_2, _0.fnm, _0.fdx, _0.fdt, _0_Asserting_0.tip, _0_Asserting_0.prx, _0_nrm.cfs, _0.si]
[junit4:junit4]   2> 1131 T849 C33 oasc.SolrDeletionPolicy.updateCommits newest commit = 2
[junit4:junit4]   2> 1132 T849 C33 oass.SolrIndexSearcher.<init> Opening Searcher@1a33fc1d main
[junit4:junit4]   2> 1133 T849 C33 oass.SolrIndexSearcher.getIndexDir WARNING WARNING: Directory impl does not support setting indexDir: org.apache.lucene.store.MockDirectoryWrapper
[junit4:junit4]   2> 1133 T849 C33 oasu.DirectUpdateHandler2.commit end_commit_flush
[junit4:junit4]   2> 1133 T856 oasc.SolrCore.registerSearcher [collection1] Registered new searcher Searcher@1a33fc1d main{StandardDirectoryReader(segments_2:4 _0(4.0.0.1):C2)}
[junit4:junit4]   2> 1134 T849 C33 UPDATE [collection1] webapp=/solr path=/update params={wt=javabin&commit=true&version=2&softCommit=false&waitSearcher=true} {commit=} 0 5
[junit4:junit4]   2> 1136 T859 C34 oasu.DirectUpdateHandler2.commit start commit{flags=0,_version_=0,optimize=false,openSearcher=true,waitSearcher=true,expungeDeletes=false,softCommit=false}
[junit4:junit4]   2> 1139 T859 C34 oasc.SolrDeletionPolicy.onCommit SolrDeletionPolicy.onCommit: commits:num=2
[junit4:junit4]   2> commit{dir=MockDirWrapper(org.apache.lucene.store.SimpleFSDirectory@/mnt/ssd/jenkins/workspace/Lucene-Solr-4.x-Linux/checkout/solr/build/solr-core/test/J0/index5065650661tmp lockFactory=org.apache.lucene.store.SingleInstanceLockFactory@4e4f1b95),segFN=segments_1,generation=1,filenames=[segments_1]
[junit4:junit4]   2> commit{dir=MockDirWrapper(org.apache.lucene.store.SimpleFSDirectory@/mnt/ssd/jenkins/workspace/Lucene-Solr-4.x-Linux/checkout/solr/build/solr-core/test/J0/index5065650661tmp lockFactory=org.apache.lucene.store.SingleInstanceLockFactory@4e4f1b95),segFN=segments_2,generation=2,filenames=[_0_Asserting_0.frq, _0_Memory_0.ram, _0_Asserting_0.tim, _0_nrm.cfe, segments_2, _0.fnm, _0.fdx, _0.fdt, _0_Asserting_0.tip, _0_Asserting_0.prx, _0_nrm.cfs, _0.si]
[junit4:junit4]   2> 1139 T859 C34 oasc.SolrDeletionPolicy.updateCommits newest commit = 2
[junit4:junit4]   2> 1141 T859 C34 oass.SolrIndexSearcher.<init> Opening Searcher@24057ded main
[junit4:junit4]   2> 1141 T859 C34 oass.SolrIndexSearcher.getIndexDir WARNING WARNING: Directory impl does not support setting indexDir: org.apache.lucene.store.MockDirectoryWrapper
[junit4:junit4]   2> 1141 T859 C34 oasu.DirectUpdateHandler2.commit end_commit_flush
[junit4:junit4]   2> 1141 T866 oasc.SolrCore.registerSearcher [collection1] Registered new searcher Searcher@24057ded main{StandardDirectoryReader(segments_2:4 _0(4.0.0.1):C3)}
[junit4:junit4]   2> 1142 T859 C34 UPDATE [collection1] webapp=/solr path=/update params={wt=javabin&commit=true&version=2&softCommit=false&waitSearcher=true} {commit=} 0 6
[junit4:junit4]   2> 1149 T829 C31 REQ [collection1] webapp=/solr path=/elevate params={sort=id+desc&shards.qt=/elevate&distrib=false&version=2&rows=500&q=*:*&qt=/elevate&wt=javabin&fl=id,+score,+[elevated]} hits=7 status=0 QTime=5
[junit4:junit4]   2> 1156 T860 C34 REQ [collection1] webapp=/solr path=/elevate params={fsv=true&shards.qt=/elevate&start=0&q=*:*&isShard=true&qt=/elevate&wt=javabin&NOW=1344267202476&fl=id,score&sort=id+desc&distrib=false&version=2&rows=500&shard.url=localhost:58299/solr|[::1]:33332/solr} hits=3 status=0 QTime=1
[junit4:junit4]   2> 1156 T840 C32 REQ [collection1] webapp=/solr path=/elevate params={fsv=true&shards.qt=/elevate&start=0&q=*:*&isShard=true&qt=/elevate&wt=javabin&NOW=1344267202476&fl=id,score&sort=id+desc&distrib=false&version=2&rows=500&shard.url=[::1]:33332/solr|localhost:37769/solr} hits=2 status=0 QTime=1
[junit4:junit4]   2> 1156 T850 C33 REQ [collection1] webapp=/solr path=/elevate params={fsv=true&shards.qt=/elevate&start=0&q=*:*&isShard=true&qt=/elevate&wt=javabin&NOW=1344267202476&fl=id,score&sort=id+desc&distrib=false&version=2&rows=500&shard.url=localhost:38361/solr|[::1]:33332/solr} hits=2 status=0 QTime=1
[junit4:junit4]   2> 1159 T860 C34 REQ [collection1] webapp=/solr path=/elevate params={shards.qt=/elevate&q=*:*&qt=/elevate&isShard=true&wt=javabin&NOW=1344267202476&fl=id,+score,+[elevated]&distrib=false&version=2&rows=500&ids=7.0,6.0,3.0&shard.url=localhost:58299/solr|[::1]:33332/solr} status=0 QTime=0
[junit4:junit4]   2> 1159 T850 C33 REQ [collection1] webapp=/solr path=/elevate params={shards.qt=/elevate&q=*:*&qt=/elevate&isShard=true&wt=javabin&NOW=1344267202476&fl=id,+score,+[elevated]&distrib=false&version=2&rows=500&ids=2.0,5.0&shard.url=localhost:38361/solr|[::1]:33332/solr} status=0 QTime=0
[junit4:junit4]   2> 1159 T840 C32 REQ [collection1] webapp=/solr path=/elevate params={shards.qt=/elevate&q=*:*&qt=/elevate&isShard=true&wt=javabin&NOW=1344267202476&fl=id,+score,+[elevated]&distrib=false&version=2&rows=500&ids=4.0,1.0&shard.url=[::1]:33332/solr|localhost:37769/solr} status=0 QTime=0
[junit4:junit4]   2> 1160 T859 C34 REQ [collection1] webapp=/solr path=/elevate params={sort=id+desc&shards.qt=/elevate&version=2&rows=500&q=*:*&qt=/elevate&wt=javabin&fl=id,+score,+[elevated]&shards=[::1]:33332/solr|localhost:37769/solr,localhost:38361/solr|[::1]:33332/solr,localhost:58299/solr|[::1]:33332/solr} status=0 QTime=9
[junit4:junit4]   2> 1161 T826 oas.BaseDistributedSearchTestCase.compareResponses SEVERE Mismatched responses:
[junit4:junit4]   2> {responseHeader={status=0,QTime=9,params={sort=id desc,shards.qt=/elevate,version=2,rows=500,q=*:*,qt=/elevate,wt=javabin,fl=id, score, [elevated],shards=[::1]:33332/solr|localhost:37769/solr,localhost:38361/solr|[::1]:33332/solr,localhost:58299/solr|[::1]:33332/solr}},response={numFound=7,start=0,maxScore=1.0,docs=[SolrDocument{id=7.0, [elevated]=false, score=1.0}, SolrDocument{id=6.0, [elevated]=false, score=1.0}, SolrDocument{id=5.0, [elevated]=false, score=1.0}, SolrDocument{id=4.0, [elevated]=false, score=1.0}, SolrDocument{id=3.0, [elevated]=false, score=1.0}, SolrDocument{id=2.0, [elevated]=false, score=1.0}, SolrDocument{id=1.0, [elevated]=false, score=1.0}]}}
[junit4:junit4]   2> {responseHeader={status=0,QTime=5,params={sort=id desc,shards.qt=/elevate,distrib=false,version=2,rows=500,q=*:*,qt=/elevate,wt=javabin,fl=id, score, [elevated]}},response={numFound=7,start=0,maxScore=1.0,docs=[SolrDocument{id=7.0, score=1.0, [elevated]=false}, SolrDocument{id=6.0, score=1.0, [elevated]=false}, SolrDocument{id=5.0, score=1.0, [elevated]=false}, SolrDocument{id=4.0, score=1.0, [elevated]=false}, SolrDocument{id=3.0, score=1.0, [elevated]=false}, SolrDocument{id=2.0, score=1.0, [elevated]=false}, SolrDocument{id=1.0, score=1.0, [elevated]=false}]}}
[junit4:junit4]   2> 1162 T826 oasc.CoreContainer.shutdown Shutting down CoreContainer instance=1976062495
[junit4:junit4]   2> 1162 T826 oasc.SolrCore.close [collection1]  CLOSING SolrCore org.apache.solr.core.SolrCore@3063d59b
[junit4:junit4]   2> 1162 T826 oasc.SolrCore.closeSearcher [collection1] Closing main searcher on request.
[junit4:junit4]   2> 1163 T826 oasu.DirectUpdateHandler2.close closing DirectUpdateHandler2{commits=1,autocommits=0,soft autocommits=0,optimizes=0,rollbacks=0,expungeDeletes=0,docsPending=0,adds=0,deletesById=0,deletesByQuery=0,errors=0,cumulative_adds=7,cumulative_deletesById=0,cumulative_deletesByQuery=1,cumulative_errors=0}
[junit4:junit4]   2> 1166 T826 oejsh.ContextHandler.doStop stopped o.e.j.s.ServletContextHandler{/solr,null}
[junit4:junit4]   2> 1218 T826 oasc.CoreContainer.shutdown Shutting down CoreContainer instance=1278212735
[junit4:junit4]   2> 1219 T826 oasc.SolrCore.close [collection1]  CLOSING SolrCore org.apache.solr.core.SolrCore@1021729f
[junit4:junit4]   2> 1219 T826 oasc.SolrCore.closeSearcher [collection1] Closing main searcher on request.
[junit4:junit4]   2> 1219 T826 oasu.DirectUpdateHandler2.close closing DirectUpdateHandler2{commits=1,autocommits=0,soft autocommits=0,optimizes=0,rollbacks=0,expungeDeletes=0,docsPending=0,adds=0,deletesById=0,deletesByQuery=0,errors=0,cumulative_adds=2,cumulative_deletesById=0,cumulative_deletesByQuery=1,cumulative_errors=0}
[junit4:junit4]   2> 1221 T826 oejsh.ContextHandler.doStop stopped o.e.j.s.ServletContextHandler{/solr,null}
[junit4:junit4]   2> 1276 T826 oasc.CoreContainer.shutdown Shutting down CoreContainer instance=1457909351
[junit4:junit4]   2> 1276 T826 oasc.SolrCore.close [collection1]  CLOSING SolrCore org.apache.solr.core.SolrCore@51c0d924
[junit4:junit4]   2> 1277 T826 oasc.SolrCore.closeSearcher [collection1] Closing main searcher on request.
[junit4:junit4]   2> 1277 T826 oasu.DirectUpdateHandler2.close closing DirectUpdateHandler2{commits=1,autocommits=0,soft autocommits=0,optimizes=0,rollbacks=0,expungeDeletes=0,docsPending=0,adds=0,deletesById=0,deletesByQuery=0,errors=0,cumulative_adds=2,cumulative_deletesById=0,cumulative_deletesByQuery=1,cumulative_errors=0}
[junit4:junit4]   2> 1279 T826 oejsh.ContextHandler.doStop stopped o.e.j.s.ServletContextHandler{/solr,null}
[junit4:junit4]   2> 1331 T826 oasc.CoreContainer.shutdown Shutting down CoreContainer instance=1269733395
[junit4:junit4]   2> 1332 T826 oasc.SolrCore.close [collection1]  CLOSING SolrCore org.apache.solr.core.SolrCore@28022aec
[junit4:junit4]   2> 1333 T826 oasc.SolrCore.closeSearcher [collection1] Closing main searcher on request.
[junit4:junit4]   2> 1333 T826 oasu.DirectUpdateHandler2.close closing DirectUpdateHandler2{commits=1,autocommits=0,soft autocommits=0,optimizes=0,rollbacks=0,expungeDeletes=0,docsPending=0,adds=0,deletesById=0,deletesByQuery=0,errors=0,cumulative_adds=3,cumulative_deletesById=0,cumulative_deletesByQuery=1,cumulative_errors=0}
[junit4:junit4]   2> 1337 T826 oejsh.ContextHandler.doStop stopped o.e.j.s.ServletContextHandler{/solr,null}
[junit4:junit4]   2> 1388 T826 oas.SolrTestCaseJ4.tearDown ###Ending testDistribSearch
[junit4:junit4]   2> NOTE: reproduce with: ant test  -Dtestcase=DistributedQueryElevationComponentTest -Dtests.method=testDistribSearch -Dtests.seed=F50759B86D99CD42 -Dtests.multiplier=3 -Dtests.slow=true -Dtests.locale=in -Dtests.timezone=Europe/Amsterdam -Dtests.file.encoding=US-ASCII
[junit4:junit4]   2>
[junit4:junit4]    > (@AfterClass output)
[junit4:junit4]   2> 1432 T826 oas.SolrTestCaseJ4.deleteCore ###deleteCore
[junit4:junit4]   2> NOTE: test params are: codec=Lucene40: {text=PostingsFormat(name=Asserting), id=PostingsFormat(name=Memory doPackFST= false), field_t=PostingsFormat(name=Memory doPackFST= false), plow_t=PostingsFormat(name=Asserting), int_i=PostingsFormat(name=Asserting)}, sim=RandomSimilarityProvider(queryNorm=true,coord=true): {}, locale=in, timezone=Europe/Amsterdam
[junit4:junit4]   2> NOTE: Linux 3.2.0-27-generic amd64/Oracle Corporation 1.8.0-ea (64-bit)/cpus=8,threads=1,free=34445632,total=156581888
[junit4:junit4]   2> NOTE: All tests run in this JVM: [DirectUpdateHandlerOptimizeTest, TestOmitPositions, SearchHandlerTest, XmlUpdateRequestHandlerTest, TestUtils, OutputWriterTest, DateMathParserTest, QueryParsingTest, TestBinaryResponseWriter, BasicZkTest, LegacyHTMLStripCharFilterTest, SolrRequestParserTest, TestIndexingPerformance, TestBinaryField, LeaderElectionIntegrationTest, RecoveryZkTest, SampleTest, SolrCoreCheckLockOnStartupTest, TestUpdate, ReturnFieldsTest, FullSolrCloudDistribCmdsTest, SuggesterTest, SpellCheckCollatorTest, ZkCLITest, TestFaceting, BadComponentTest, TestCollationKeyRangeQueries, TestSolrXMLSerializer, MoreLikeThisHandlerTest, SpellPossibilityIteratorTest, BasicFunctionalityTest, ShowFileRequestHandlerTest, XsltUpdateRequestHandlerTest, SimpleFacetsTest, TestCSVLoader, SolrPluginUtilsTest, TestRandomFaceting, CurrencyFieldTest, TestCodecSupport, DistributedQueryElevationComponentTest]
[junit4:junit4]   2>
[junit4:junit4] Completed on J0 in 1.46s, 1 test, 1 failure <<< FAILURES!

[...truncated 387 lines...]
BUILD FAILED
/mnt/ssd/jenkins/workspace/Lucene-Solr-4.x-Linux/checkout/build.xml:29: The following error occurred while executing this line:
/mnt/ssd/jenkins/workspace/Lucene-Solr-4.x-Linux/checkout/solr/build.xml:144: The following error occurred while executing this line:
/mnt/ssd/jenkins/workspace/Lucene-Solr-4.x-Linux/checkout/lucene/module-build.xml:62: The following error occurred while executing this line:
/mnt/ssd/jenkins/workspace/Lucene-Solr-4.x-Linux/checkout/lucene/common-build.xml:1095: The following error occurred while executing this line:
/mnt/ssd/jenkins/workspace/Lucene-Solr-4.x-Linux/checkout/lucene/common-build.xml:790: There were test failures: 224 suites, 902 tests, 1 failure, 5 ignored

Total time: 19 minutes 10 seconds
Build step 'Execute shell' marked build as failure
Archiving artifacts
Recording test results
Email was triggered for: Failure
Sending email for trigger: Failure




---------------------------------------------------------------------
To unsubscribe, e-mail: [hidden email]
For additional commands, e-mail: [hidden email]
Reply | Threaded
Open this post in threaded view
|

Re: [JENKINS] Lucene-Solr-4.x-Linux (64bit/jdk1.8.0-ea-b49) - Build # 219 - Failure!

Yonik Seeley-2-2
Just checked in a change to the comparisons that will hopefully fix this.

-Yonik
http://lucidimagination.com


On Mon, Aug 6, 2012 at 11:37 AM, Policeman Jenkins Server
<[hidden email]> wrote:

> Build: http://jenkins.sd-datasolutions.de/job/Lucene-Solr-4.x-Linux/219/
> Java: 64bit/jdk1.8.0-ea-b49 -XX:+UseSerialGC
>
> 1 tests failed.
> REGRESSION:  org.apache.solr.handler.component.DistributedQueryElevationComponentTest.testDistribSearch
>
> Error Message:
> .responseHeader.params.size()==9,9skipped=4,5
>
> Stack Trace:
> junit.framework.AssertionFailedError: .responseHeader.params.size()==9,9skipped=4,5
>         at __randomizedtesting.SeedInfo.seed([F50759B86D99CD42:74E1D7A01AC6AD7E]:0)
>         at junit.framework.Assert.fail(Assert.java:50)
>         at org.apache.solr.BaseDistributedSearchTestCase.compareResponses(BaseDistributedSearchTestCase.java:670)
>         at org.apache.solr.BaseDistributedSearchTestCase.query(BaseDistributedSearchTestCase.java:392)
>         at org.apache.solr.handler.component.DistributedQueryElevationComponentTest.doTest(DistributedQueryElevationComponentTest.java:81)
>         at org.apache.solr.BaseDistributedSearchTestCase.testDistribSearch(BaseDistributedSearchTestCase.java:679)
>         at sun.reflect.NativeMethodAccessorImpl.invoke0(Native Method)
>         at sun.reflect.NativeMethodAccessorImpl.invoke(NativeMethodAccessorImpl.java:57)
>         at sun.reflect.DelegatingMethodAccessorImpl.invoke(DelegatingMethodAccessorImpl.java:43)
>         at java.lang.reflect.Method.invoke(Method.java:474)
>         at com.carrotsearch.randomizedtesting.RandomizedRunner.invoke(RandomizedRunner.java:1995)
>         at com.carrotsearch.randomizedtesting.RandomizedRunner.access$1100(RandomizedRunner.java:132)
>         at com.carrotsearch.randomizedtesting.RandomizedRunner$6.evaluate(RandomizedRunner.java:818)
>         at com.carrotsearch.randomizedtesting.RandomizedRunner$7.evaluate(RandomizedRunner.java:877)
>         at com.carrotsearch.randomizedtesting.RandomizedRunner$8.evaluate(RandomizedRunner.java:891)
>         at com.carrotsearch.randomizedtesting.rules.SystemPropertiesRestoreRule$1.evaluate(SystemPropertiesRestoreRule.java:53)
>         at org.apache.lucene.util.TestRuleSetupTeardownChained$1.evaluate(TestRuleSetupTeardownChained.java:50)
>         at org.apache.lucene.util.TestRuleFieldCacheSanity$1.evaluate(TestRuleFieldCacheSanity.java:32)
>         at org.apache.lucene.util.AbstractBeforeAfterRule$1.evaluate(AbstractBeforeAfterRule.java:45)
>         at com.carrotsearch.randomizedtesting.rules.SystemPropertiesInvariantRule$1.evaluate(SystemPropertiesInvariantRule.java:55)
>         at org.apache.lucene.util.TestRuleReportUncaughtExceptions$1.evaluate(TestRuleReportUncaughtExceptions.java:68)
>         at org.apache.lucene.util.TestRuleThreadAndTestName$1.evaluate(TestRuleThreadAndTestName.java:48)
>         at org.apache.lucene.util.TestRuleIgnoreAfterMaxFailures$1.evaluate(TestRuleIgnoreAfterMaxFailures.java:70)
>         at org.apache.lucene.util.TestRuleMarkFailure$1.evaluate(TestRuleMarkFailure.java:48)
>         at com.carrotsearch.randomizedtesting.RandomizedRunner.runSingleTest(RandomizedRunner.java:825)
>         at com.carrotsearch.randomizedtesting.RandomizedRunner.access$700(RandomizedRunner.java:132)
>         at com.carrotsearch.randomizedtesting.RandomizedRunner$3$1.run(RandomizedRunner.java:671)
>         at com.carrotsearch.randomizedtesting.RandomizedRunner$3.evaluate(RandomizedRunner.java:697)
>         at com.carrotsearch.randomizedtesting.RandomizedRunner$4.evaluate(RandomizedRunner.java:736)
>         at com.carrotsearch.randomizedtesting.RandomizedRunner$5.evaluate(RandomizedRunner.java:747)
>         at com.carrotsearch.randomizedtesting.rules.SystemPropertiesRestoreRule$1.evaluate(SystemPropertiesRestoreRule.java:53)
>         at org.apache.lucene.util.AbstractBeforeAfterRule$1.evaluate(AbstractBeforeAfterRule.java:45)
>         at org.apache.lucene.util.TestRuleReportUncaughtExceptions$1.evaluate(TestRuleReportUncaughtExceptions.java:68)
>         at org.apache.lucene.util.TestRuleStoreClassName$1.evaluate(TestRuleStoreClassName.java:38)
>         at com.carrotsearch.randomizedtesting.rules.SystemPropertiesInvariantRule$1.evaluate(SystemPropertiesInvariantRule.java:55)
>         at org.apache.lucene.util.TestRuleNoInstanceHooksOverrides$1.evaluate(TestRuleNoInstanceHooksOverrides.java:53)
>         at org.apache.lucene.util.TestRuleNoStaticHooksShadowing$1.evaluate(TestRuleNoStaticHooksShadowing.java:52)
>         at org.apache.lucene.util.TestRuleAssertionsRequired$1.evaluate(TestRuleAssertionsRequired.java:36)
>         at org.apache.lucene.util.TestRuleMarkFailure$1.evaluate(TestRuleMarkFailure.java:48)
>         at org.apache.lucene.util.TestRuleIgnoreAfterMaxFailures$1.evaluate(TestRuleIgnoreAfterMaxFailures.java:70)
>         at org.apache.lucene.util.TestRuleIgnoreTestSuites$1.evaluate(TestRuleIgnoreTestSuites.java:55)
>         at com.carrotsearch.randomizedtesting.RandomizedRunner.runSuite(RandomizedRunner.java:605)
>         at com.carrotsearch.randomizedtesting.RandomizedRunner.access$400(RandomizedRunner.java:132)
>         at com.carrotsearch.randomizedtesting.RandomizedRunner$2.run(RandomizedRunner.java:551)
>
>
>
>
> Build Log:
> [...truncated 7432 lines...]
> [junit4:junit4] Suite: org.apache.solr.handler.component.DistributedQueryElevationComponentTest
> [junit4:junit4] FAILURE 1.43s J0 | DistributedQueryElevationComponentTest.testDistribSearch
> [junit4:junit4]    > Throwable #1: junit.framework.AssertionFailedError: .responseHeader.params.size()==9,9skipped=4,5
> [junit4:junit4]    >    at __randomizedtesting.SeedInfo.seed([F50759B86D99CD42:74E1D7A01AC6AD7E]:0)
> [junit4:junit4]    >    at junit.framework.Assert.fail(Assert.java:50)
> [junit4:junit4]    >    at org.apache.solr.BaseDistributedSearchTestCase.compareResponses(BaseDistributedSearchTestCase.java:670)
> [junit4:junit4]    >    at org.apache.solr.BaseDistributedSearchTestCase.query(BaseDistributedSearchTestCase.java:392)
> [junit4:junit4]    >    at org.apache.solr.handler.component.DistributedQueryElevationComponentTest.doTest(DistributedQueryElevationComponentTest.java:81)
> [junit4:junit4]    >    at org.apache.solr.BaseDistributedSearchTestCase.testDistribSearch(BaseDistributedSearchTestCase.java:679)
> [junit4:junit4]    >    at sun.reflect.NativeMethodAccessorImpl.invoke0(Native Method)
> [junit4:junit4]    >    at sun.reflect.NativeMethodAccessorImpl.invoke(NativeMethodAccessorImpl.java:57)
> [junit4:junit4]    >    at sun.reflect.DelegatingMethodAccessorImpl.invoke(DelegatingMethodAccessorImpl.java:43)
> [junit4:junit4]    >    at java.lang.reflect.Method.invoke(Method.java:474)
> [junit4:junit4]    >    at com.carrotsearch.randomizedtesting.RandomizedRunner.invoke(RandomizedRunner.java:1995)
> [junit4:junit4]    >    at com.carrotsearch.randomizedtesting.RandomizedRunner.access$1100(RandomizedRunner.java:132)
> [junit4:junit4]    >    at com.carrotsearch.randomizedtesting.RandomizedRunner$6.evaluate(RandomizedRunner.java:818)
> [junit4:junit4]    >    at com.carrotsearch.randomizedtesting.RandomizedRunner$7.evaluate(RandomizedRunner.java:877)
> [junit4:junit4]    >    at com.carrotsearch.randomizedtesting.RandomizedRunner$8.evaluate(RandomizedRunner.java:891)
> [junit4:junit4]    >    at com.carrotsearch.randomizedtesting.rules.SystemPropertiesRestoreRule$1.evaluate(SystemPropertiesRestoreRule.java:53)
> [junit4:junit4]    >    at org.apache.lucene.util.TestRuleSetupTeardownChained$1.evaluate(TestRuleSetupTeardownChained.java:50)
> [junit4:junit4]    >    at org.apache.lucene.util.TestRuleFieldCacheSanity$1.evaluate(TestRuleFieldCacheSanity.java:32)
> [junit4:junit4]    >    at org.apache.lucene.util.AbstractBeforeAfterRule$1.evaluate(AbstractBeforeAfterRule.java:45)
> [junit4:junit4]    >    at com.carrotsearch.randomizedtesting.rules.SystemPropertiesInvariantRule$1.evaluate(SystemPropertiesInvariantRule.java:55)
> [junit4:junit4]    >    at org.apache.lucene.util.TestRuleReportUncaughtExceptions$1.evaluate(TestRuleReportUncaughtExceptions.java:68)
> [junit4:junit4]    >    at org.apache.lucene.util.TestRuleThreadAndTestName$1.evaluate(TestRuleThreadAndTestName.java:48)
> [junit4:junit4]    >    at org.apache.lucene.util.TestRuleIgnoreAfterMaxFailures$1.evaluate(TestRuleIgnoreAfterMaxFailures.java:70)
> [junit4:junit4]    >    at org.apache.lucene.util.TestRuleMarkFailure$1.evaluate(TestRuleMarkFailure.java:48)
> [junit4:junit4]    >    at com.carrotsearch.randomizedtesting.RandomizedRunner.runSingleTest(RandomizedRunner.java:825)
> [junit4:junit4]    >    at com.carrotsearch.randomizedtesting.RandomizedRunner.access$700(RandomizedRunner.java:132)
> [junit4:junit4]    >    at com.carrotsearch.randomizedtesting.RandomizedRunner$3$1.run(RandomizedRunner.java:671)
> [junit4:junit4]    >    at com.carrotsearch.randomizedtesting.RandomizedRunner$3.evaluate(RandomizedRunner.java:697)
> [junit4:junit4]    >    at com.carrotsearch.randomizedtesting.RandomizedRunner$4.evaluate(RandomizedRunner.java:736)
> [junit4:junit4]    >    at com.carrotsearch.randomizedtesting.RandomizedRunner$5.evaluate(RandomizedRunner.java:747)
> [junit4:junit4]    >    at com.carrotsearch.randomizedtesting.rules.SystemPropertiesRestoreRule$1.evaluate(SystemPropertiesRestoreRule.java:53)
> [junit4:junit4]    >    at org.apache.lucene.util.AbstractBeforeAfterRule$1.evaluate(AbstractBeforeAfterRule.java:45)
> [junit4:junit4]    >    at org.apache.lucene.util.TestRuleReportUncaughtExceptions$1.evaluate(TestRuleReportUncaughtExceptions.java:68)
> [junit4:junit4]    >    at org.apache.lucene.util.TestRuleStoreClassName$1.evaluate(TestRuleStoreClassName.java:38)
> [junit4:junit4]    >    at com.carrotsearch.randomizedtesting.rules.SystemPropertiesInvariantRule$1.evaluate(SystemPropertiesInvariantRule.java:55)
> [junit4:junit4]    >    at org.apache.lucene.util.TestRuleNoInstanceHooksOverrides$1.evaluate(TestRuleNoInstanceHooksOverrides.java:53)
> [junit4:junit4]    >    at org.apache.lucene.util.TestRuleNoStaticHooksShadowing$1.evaluate(TestRuleNoStaticHooksShadowing.java:52)
> [junit4:junit4]    >    at org.apache.lucene.util.TestRuleAssertionsRequired$1.evaluate(TestRuleAssertionsRequired.java:36)
> [junit4:junit4]    >    at org.apache.lucene.util.TestRuleMarkFailure$1.evaluate(TestRuleMarkFailure.java:48)
> [junit4:junit4]    >    at org.apache.lucene.util.TestRuleIgnoreAfterMaxFailures$1.evaluate(TestRuleIgnoreAfterMaxFailures.java:70)
> [junit4:junit4]    >    at org.apache.lucene.util.TestRuleIgnoreTestSuites$1.evaluate(TestRuleIgnoreTestSuites.java:55)
> [junit4:junit4]    >    at com.carrotsearch.randomizedtesting.RandomizedRunner.runSuite(RandomizedRunner.java:605)
> [junit4:junit4]    >    at com.carrotsearch.randomizedtesting.RandomizedRunner.access$400(RandomizedRunner.java:132)
> [junit4:junit4]    >    at com.carrotsearch.randomizedtesting.RandomizedRunner$2.run(RandomizedRunner.java:551)
> [junit4:junit4]    >
> [junit4:junit4]   2> 1 T826 oas.SolrTestCaseJ4.setUp ###Starting testDistribSearch
> [junit4:junit4]   2> 2 T826 oejs.Server.doStart jetty-8.1.2.v20120308
> [junit4:junit4]   2> 5 T826 oejs.AbstractConnector.doStart Started SocketConnector@0.0.0.0:43090
> [junit4:junit4]   2> 5 T826 oasc.SolrResourceLoader.locateSolrHome JNDI not configured for solr (NoInitialContextEx)
> [junit4:junit4]   2> 5 T826 oasc.SolrResourceLoader.locateSolrHome using system property solr.solr.home: /mnt/ssd/jenkins/workspace/Lucene-Solr-4.x-Linux/checkout/solr/build/solr-core/test-files/solr
> [junit4:junit4]   2> 6 T826 oasc.SolrResourceLoader.<init> new SolrResourceLoader for deduced Solr Home: '/mnt/ssd/jenkins/workspace/Lucene-Solr-4.x-Linux/checkout/solr/build/solr-core/test-files/solr/'
> [junit4:junit4]   2> 15 T826 oass.SolrDispatchFilter.init SolrDispatchFilter.init()
> [junit4:junit4]   2> 15 T826 oasc.SolrResourceLoader.locateSolrHome JNDI not configured for solr (NoInitialContextEx)
> [junit4:junit4]   2> 15 T826 oasc.SolrResourceLoader.locateSolrHome using system property solr.solr.home: /mnt/ssd/jenkins/workspace/Lucene-Solr-4.x-Linux/checkout/solr/build/solr-core/test-files/solr
> [junit4:junit4]   2> 16 T826 oasc.CoreContainer$Initializer.initialize looking for solr.xml: /mnt/ssd/jenkins/workspace/Lucene-Solr-4.x-Linux/checkout/solr/build/solr-core/test-files/solr/solr.xml
> [junit4:junit4]   2> 16 T826 oasc.CoreContainer.<init> New CoreContainer 1976062495
> [junit4:junit4]   2> 16 T826 oasc.CoreContainer.load Loading CoreContainer using Solr Home: '/mnt/ssd/jenkins/workspace/Lucene-Solr-4.x-Linux/checkout/solr/build/solr-core/test-files/solr/'
> [junit4:junit4]   2> 16 T826 oasc.SolrResourceLoader.<init> new SolrResourceLoader for directory: '/mnt/ssd/jenkins/workspace/Lucene-Solr-4.x-Linux/checkout/solr/build/solr-core/test-files/solr/'
> [junit4:junit4]   2> 28 T826 oasc.CoreContainer.load Registering Log Listener
> [junit4:junit4]   2> 46 T826 oasc.CoreContainer.create Creating SolrCore 'collection1' using instanceDir: /mnt/ssd/jenkins/workspace/Lucene-Solr-4.x-Linux/checkout/solr/build/solr-core/test-files/solr/collection1
> [junit4:junit4]   2> 46 T826 oasc.SolrResourceLoader.<init> new SolrResourceLoader for directory: '/mnt/ssd/jenkins/workspace/Lucene-Solr-4.x-Linux/checkout/solr/build/solr-core/test-files/solr/collection1/'
> [junit4:junit4]   2> 47 T826 oasc.SolrResourceLoader.replaceClassLoader Adding 'file:/mnt/ssd/jenkins/workspace/Lucene-Solr-4.x-Linux/checkout/solr/build/solr-core/test-files/solr/collection1/lib/README' to classloader
> [junit4:junit4]   2> 47 T826 oasc.SolrResourceLoader.replaceClassLoader Adding 'file:/mnt/ssd/jenkins/workspace/Lucene-Solr-4.x-Linux/checkout/solr/build/solr-core/test-files/solr/collection1/lib/classes/' to classloader
> [junit4:junit4]   2> 72 T826 oasc.SolrConfig.<init> Using Lucene MatchVersion: LUCENE_40
> [junit4:junit4]   2> 104 T826 oasc.SolrConfig.<init> Loaded SolrConfig: solrconfig-elevate.xml
> [junit4:junit4]   2> 105 T826 oass.IndexSchema.readSchema Reading Solr Schema
> [junit4:junit4]   2> 107 T826 oass.IndexSchema.readSchema Schema name=example
> [junit4:junit4]   2> 223 T826 oass.IndexSchema.readSchema default search field in schema is text
> [junit4:junit4]   2> 225 T826 oass.IndexSchema.readSchema unique key field: id
> [junit4:junit4]   2> 227 T826 oasc.SolrCore.<init> [collection1] Opening new SolrCore at /mnt/ssd/jenkins/workspace/Lucene-Solr-4.x-Linux/checkout/solr/build/solr-core/test-files/solr/collection1/, dataDir=./org.apache.solr.handler.component.DistributedQueryElevationComponentTest-1344267201327/control/data/
> [junit4:junit4]   2> 227 T826 oasc.JmxMonitoredMap.<init> JMX monitoring is enabled. Adding Solr mbeans to JMX Server: com.sun.jmx.mbeanserver.JmxMBeanServer@13d33ff5
> [junit4:junit4]   2> 228 T826 oasc.SolrCore.getNewIndexDir WARNING New index directory detected: old=null new=./org.apache.solr.handler.component.DistributedQueryElevationComponentTest-1344267201327/control/data/index/
> [junit4:junit4]   2> 228 T826 oasc.SolrCore.initIndex WARNING [collection1] Solr index directory './org.apache.solr.handler.component.DistributedQueryElevationComponentTest-1344267201327/control/data/index' doesn't exist. Creating new index...
> [junit4:junit4]   2> 229 T826 oasc.SolrDeletionPolicy.onCommit SolrDeletionPolicy.onCommit: commits:num=1
> [junit4:junit4]   2>            commit{dir=MockDirWrapper(org.apache.lucene.store.RAMDirectory@6a5ccbee lockFactory=org.apache.lucene.store.SingleInstanceLockFactory@e8184ab),segFN=segments_1,generation=1,filenames=[segments_1]
> [junit4:junit4]   2> 229 T826 oasc.SolrDeletionPolicy.updateCommits newest commit = 1
> [junit4:junit4]   2> 230 T826 oasc.RequestHandlers.initHandlersFromConfig created /update: solr.UpdateRequestHandler
> [junit4:junit4]   2> 230 T826 oasc.RequestHandlers.initHandlersFromConfig created /elevate: org.apache.solr.handler.component.SearchHandler
> [junit4:junit4]   2> 230 T826 oasc.RequestHandlers.initHandlersFromConfig created /dataElevate: org.apache.solr.handler.component.SearchHandler
> [junit4:junit4]   2> 231 T826 oashl.XMLLoader.init xsltCacheLifetimeSeconds=60
> [junit4:junit4]   2> 231 T826 oasc.RequestHandlers.initHandlersFromConfig WARNING no default request handler is registered (either '/select' or 'standard')
> [junit4:junit4]   2> 232 T826 oasc.SolrCore.initDeprecatedSupport WARNING solrconfig.xml uses deprecated <admin/gettableFiles>, Please update your config to use the ShowFileRequestHandler.
> [junit4:junit4]   2> 233 T826 oasc.SolrCore.initDeprecatedSupport WARNING adding ShowFileRequestHandler with hidden files: [BAD-SCHEMA-EXTERNAL-FILEFIELD.XML, SCHEMA-DFR.XML, BAD-SCHEMA-UNIQUEKEY-USES-DEFAULT.XML, HYPHENATION.DTD, SOLRCONFIG-LAZYWRITER.XML, SOLRCONFIG-SCRIPT-UPDATEPROCESSOR.XML, STOPWORDS.TXT, PROTWORDS.TXT, SCHEMA.XML, SOLRCONFIG-ELEVATE.XML, SCHEMA12.XML, STOP-1.TXT, BAD-SOLRCONFIG-INVALID-SCRIPTFILE.XML, STOPTYPES-2.TXT, BAD-SCHEMA-NOT-INDEXED-BUT-TF.XML, SCHEMA_CODEC.XML, SCHEMA-STOP-KEEP.XML, SCHEMA-PHRASESUGGEST.XML, SOLRCONFIG-PROPINJECT.XML, SCHEMA-FOLDING.XML, COMPOUNDDICTIONARY.TXT, ADDFIELDS.UPDATEPROCESSOR.JS, SCHEMA-BM25.XML, TRIVIAL.UPDATEPROCESSOR1.JS, STOPWITHBOM.TXT, PHRASESUGGEST.TXT, SOLRCONFIG-REQHANDLER.INCL, SCHEMA-REPLICATION2.XML, DA_COMPOUNDDICTIONARY.TXT, MAPPING-ISOLATIN1ACCENT.TXT, SCHEMA-SPELLCHECKER.XML, BAD-SCHEMA-CODEC-GLOBAL-VS-FT-MISMATCH.XML, BAD-SOLRCONFIG-BOGUS-SCRIPTENGINE-NAME.XML, SOLRCONFIG-SPELLCHECKCOMPONENT.XML, SOLRCONFIG-SIMPLELOCK.XML, SOLRCONFIG-NOCACHE.XML, SCHEMA-NUMERIC.XML, KEEP-1.TXT, SCHEMA-COLLATE.XML, CONDITIONAL.UPDATEPROCESSOR.JS, THROW.ERROR.ON.ADD.UPDATEPROCESSOR.JS, SOLRCONFIG-SPELLCHECKER.XML, SOLRCONFIG-NATIVELOCK.XML, BAD_SOLRCONFIG.XML, TRIVIAL.UPDATEPROCESSOR0.JS, SOLRCONFIG-DELPOLICY2.XML, OLD_SYNONYMS.TXT, SOLRCONFIG-TRANSFORMERS.XML, KEEP-2.TXT, SOLRCONFIG-MASTER1.XML, SOLRCONFIG-TLOG.XML, BAD-SCHEMA-DUP-FIELD.XML, SCHEMA-LUCENEMATCHVERSION.XML, BAD-SOLRCONFIG-MISSING-SCRIPTFILE.XML, SOLRCONFIG-REPEATER.XML, BAD-SCHEMA-DUP-FIELDTYPE.XML, SCHEMA-REQUIRED-FIELDS.XML, STOPTYPES-1.TXT, BAD-SCHEMA-UNIQUEKEY-IS-COPYFIELD-DEST.XML, BAD-SCHEMA-NONTEXT-ANALYZER.XML, SOLRCONFIG-HIGHLIGHT.XML, SCHEMA11.XML, SCHEMA15.XML, SOLRCONFIG-SLAVE.XML, SOLRCONFIG-ALTDIRECTORY.XML, SOLRCONFIG-XINCLUDE.XML, SOLRCONFIG_CODEC.XML, SCHEMA-BINARYFIELD.XML, SCHEMA-TFIDF.XML, SOLRCONFIG-MASTER1-KEEPONEBACKUP.XML, STEMDICT.TXT, BAD-MP-SOLRCONFIG.XML, SOLRCONFIG-PROPINJECT-INDEXDEFAULT.XML, STOP-SNOWBALL.TXT, SOLRCONFIG-FUNCTIONQUERY.XML, STOP-2.TXT, BAD-SCHEMA-OMIT-TF-BUT-NOT-POS.XML, MISSING.FUNCTIONS.UPDATEPROCESSOR.JS, SOLRCONFIG-QUERYSENDER-NOQUERY.XML, SOLRCONFIG-PHRASESUGGEST.XML, HUNSPELL-TEST.AFF, SOLRCONFIG_PERF.XML, SOLRCONFIG-ENABLEPLUGIN.XML, SCHEMA-MINIMAL.XML, DA_UTF8.XML, SOLRCONFIG-MASTER.XML, FRENCHARTICLES.TXT, SOLRCONFIG-MASTER2.XML, SOLRCONFIG-BASIC.XML, BAD-SCHEMA-UNIQUEKEY-MULTIVALUED.XML, SOLRCONFIG-CACHING.XML, BAD-SCHEMA-NOT-INDEXED-BUT-NORMS.XML, SCHEMA-COPYFIELD-TEST.XML, SYNONYMS.TXT, SCHEMA-LMJELINEKMERCER.XML, SOLRCONFIG-SLAVE1.XML, SOLRCONFIG-MASTER3.XML, MISSLEADING.EXTENSION.UPDATEPROCESSOR.JS.TXT, BAD-SCHEMA-DUP-DYNAMICFIELD.XML, WDFTYPES.TXT, BAD-SCHEMA-ANALYZER-CLASS-AND-NESTED.XML, SOLRCONFIG-MERGEPOLICY.XML, SCHEMA-CHARFILTERS.XML, SOLRCONFIG-SOLCOREPROPERTIES.XML, SCHEMA-IB.XML, SCHEMA-REPLICATION1.XML, SOLRCONFIG-SOLR-749.XML, SCHEMA-LMDIRICHLET.XML, BAD-SCHEMA-SIM-GLOBAL-VS-FT-MISMATCH.XML, SOLRCONFIG-TERMINDEX.XML, ELEVATE.XML, SCHEMA-REVERSED.XML, CURRENCY.XML, XSLT, BAD-SCHEMA-NOT-INDEXED-BUT-POS.XML, SOLRCONFIG-BASIC-LUCENEVERSION31.XML, SCHEMASURROUND.XML, SOLRCONFIG-UPDATE-PROCESSOR-CHAINS.XML, SCHEMA-COLLATEFILTER.XML, OPEN-EXCHANGE-RATES.JSON, SCHEMA-TRIE.XML, STOPWORDSWRONGENCODING.TXT, SOLRCONFIG-QUERYSENDER.XML, SOLRCONFIG-DELPOLICY1.XML, HUNSPELL-TEST.DIC, SCHEMA-NOT-REQUIRED-UNIQUE-KEY.XML, SCHEMA-SIM.XML]
> [junit4:junit4]   2> 234 T826 oass.SolrIndexSearcher.<init> Opening Searcher@54d0e770 main
> [junit4:junit4]   2> 235 T826 oass.SolrIndexSearcher.getIndexDir WARNING WARNING: Directory impl does not support setting indexDir: org.apache.lucene.store.MockDirectoryWrapper
> [junit4:junit4]   2> 235 T826 oasu.CommitTracker.<init> Hard AutoCommit: disabled
> [junit4:junit4]   2> 235 T826 oasu.CommitTracker.<init> Soft AutoCommit: disabled
> [junit4:junit4]   2> 235 T826 oashc.QueryElevationComponent.inform Loading QueryElevation from: /mnt/ssd/jenkins/workspace/Lucene-Solr-4.x-Linux/checkout/solr/build/solr-core/test-files/solr/collection1/conf/elevate.xml
> [junit4:junit4]   2> 241 T826 oashc.QueryElevationComponent.inform Loading QueryElevation from: /mnt/ssd/jenkins/workspace/Lucene-Solr-4.x-Linux/checkout/solr/build/solr-core/test-files/solr/collection1/conf/elevate.xml
> [junit4:junit4]   2> 246 T826 oashc.HttpShardHandlerFactory.getParameter Setting socketTimeout to: 0
> [junit4:junit4]   2> 246 T826 oashc.HttpShardHandlerFactory.getParameter Setting urlScheme to: http://
> [junit4:junit4]   2> 246 T826 oashc.HttpShardHandlerFactory.getParameter Setting connTimeout to: 0
> [junit4:junit4]   2> 247 T826 oashc.HttpShardHandlerFactory.getParameter Setting maxConnectionsPerHost to: 20
> [junit4:junit4]   2> 247 T826 oashc.HttpShardHandlerFactory.getParameter Setting corePoolSize to: 0
> [junit4:junit4]   2> 247 T826 oashc.HttpShardHandlerFactory.getParameter Setting maximumPoolSize to: 2147483647
> [junit4:junit4]   2> 247 T826 oashc.HttpShardHandlerFactory.getParameter Setting maxThreadIdleTime to: 5
> [junit4:junit4]   2> 247 T826 oashc.HttpShardHandlerFactory.getParameter Setting sizeOfQueue to: -1
> [junit4:junit4]   2> 247 T826 oashc.HttpShardHandlerFactory.getParameter Setting fairnessPolicy to: false
> [junit4:junit4]   2> 248 T826 oascsi.HttpClientUtil.createClient Creating new http client, config:maxConnectionsPerHost=20&maxConnections=10000&socketTimeout=0&connTimeout=0&retry=false
> [junit4:junit4]   2> 250 T836 oasc.SolrCore.registerSearcher [collection1] Registered new searcher Searcher@54d0e770 main{StandardDirectoryReader(segments_1:1)}
> [junit4:junit4]   2> 250 T826 oasc.CoreContainer.register registering core: collection1
> [junit4:junit4]   2> 251 T826 oass.SolrDispatchFilter.init user.dir=/mnt/ssd/jenkins/workspace/Lucene-Solr-4.x-Linux/checkout/solr/build/solr-core/test/J0
> [junit4:junit4]   2> 251 T826 oass.SolrDispatchFilter.init SolrDispatchFilter.init() done
> [junit4:junit4]   2> 251 T826 oascsi.HttpClientUtil.createClient Creating new http client, config:maxConnections=128&maxConnectionsPerHost=32&followRedirects=false
> [junit4:junit4]   2> 253 T826 oejs.Server.doStart jetty-8.1.2.v20120308
> [junit4:junit4]   2> 254 T826 oejs.AbstractConnector.doStart Started SocketConnector@0.0.0.0:37769
> [junit4:junit4]   2> 255 T826 oasc.SolrResourceLoader.locateSolrHome JNDI not configured for solr (NoInitialContextEx)
> [junit4:junit4]   2> 255 T826 oasc.SolrResourceLoader.locateSolrHome using system property solr.solr.home: /mnt/ssd/jenkins/workspace/Lucene-Solr-4.x-Linux/checkout/solr/build/solr-core/test-files/solr
> [junit4:junit4]   2> 255 T826 oasc.SolrResourceLoader.<init> new SolrResourceLoader for deduced Solr Home: '/mnt/ssd/jenkins/workspace/Lucene-Solr-4.x-Linux/checkout/solr/build/solr-core/test-files/solr/'
> [junit4:junit4]   2> 261 T826 oass.SolrDispatchFilter.init SolrDispatchFilter.init()
> [junit4:junit4]   2> 261 T826 oasc.SolrResourceLoader.locateSolrHome JNDI not configured for solr (NoInitialContextEx)
> [junit4:junit4]   2> 261 T826 oasc.SolrResourceLoader.locateSolrHome using system property solr.solr.home: /mnt/ssd/jenkins/workspace/Lucene-Solr-4.x-Linux/checkout/solr/build/solr-core/test-files/solr
> [junit4:junit4]   2> 261 T826 oasc.CoreContainer$Initializer.initialize looking for solr.xml: /mnt/ssd/jenkins/workspace/Lucene-Solr-4.x-Linux/checkout/solr/build/solr-core/test-files/solr/solr.xml
> [junit4:junit4]   2> 262 T826 oasc.CoreContainer.<init> New CoreContainer 1278212735
> [junit4:junit4]   2> 262 T826 oasc.CoreContainer.load Loading CoreContainer using Solr Home: '/mnt/ssd/jenkins/workspace/Lucene-Solr-4.x-Linux/checkout/solr/build/solr-core/test-files/solr/'
> [junit4:junit4]   2> 262 T826 oasc.SolrResourceLoader.<init> new SolrResourceLoader for directory: '/mnt/ssd/jenkins/workspace/Lucene-Solr-4.x-Linux/checkout/solr/build/solr-core/test-files/solr/'
> [junit4:junit4]   2> 270 T826 oasc.CoreContainer.load Registering Log Listener
> [junit4:junit4]   2> 284 T826 oasc.CoreContainer.create Creating SolrCore 'collection1' using instanceDir: /mnt/ssd/jenkins/workspace/Lucene-Solr-4.x-Linux/checkout/solr/build/solr-core/test-files/solr/collection1
> [junit4:junit4]   2> 285 T826 oasc.SolrResourceLoader.<init> new SolrResourceLoader for directory: '/mnt/ssd/jenkins/workspace/Lucene-Solr-4.x-Linux/checkout/solr/build/solr-core/test-files/solr/collection1/'
> [junit4:junit4]   2> 285 T826 oasc.SolrResourceLoader.replaceClassLoader Adding 'file:/mnt/ssd/jenkins/workspace/Lucene-Solr-4.x-Linux/checkout/solr/build/solr-core/test-files/solr/collection1/lib/README' to classloader
> [junit4:junit4]   2> 285 T826 oasc.SolrResourceLoader.replaceClassLoader Adding 'file:/mnt/ssd/jenkins/workspace/Lucene-Solr-4.x-Linux/checkout/solr/build/solr-core/test-files/solr/collection1/lib/classes/' to classloader
> [junit4:junit4]   2> 301 T826 oasc.SolrConfig.<init> Using Lucene MatchVersion: LUCENE_40
> [junit4:junit4]   2> 325 T826 oasc.SolrConfig.<init> Loaded SolrConfig: solrconfig-elevate.xml
> [junit4:junit4]   2> 326 T826 oass.IndexSchema.readSchema Reading Solr Schema
> [junit4:junit4]   2> 328 T826 oass.IndexSchema.readSchema Schema name=example
> [junit4:junit4]   2> 444 T826 oass.IndexSchema.readSchema default search field in schema is text
> [junit4:junit4]   2> 446 T826 oass.IndexSchema.readSchema unique key field: id
> [junit4:junit4]   2> 448 T826 oasc.SolrCore.<init> [collection1] Opening new SolrCore at /mnt/ssd/jenkins/workspace/Lucene-Solr-4.x-Linux/checkout/solr/build/solr-core/test-files/solr/collection1/, dataDir=./org.apache.solr.handler.component.DistributedQueryElevationComponentTest-1344267201327/shard0/data/
> [junit4:junit4]   2> 448 T826 oasc.JmxMonitoredMap.<init> JMX monitoring is enabled. Adding Solr mbeans to JMX Server: com.sun.jmx.mbeanserver.JmxMBeanServer@13d33ff5
> [junit4:junit4]   2> 449 T826 oasc.SolrCore.getNewIndexDir WARNING New index directory detected: old=null new=./org.apache.solr.handler.component.DistributedQueryElevationComponentTest-1344267201327/shard0/data/index/
> [junit4:junit4]   2> 449 T826 oasc.SolrCore.initIndex WARNING [collection1] Solr index directory './org.apache.solr.handler.component.DistributedQueryElevationComponentTest-1344267201327/shard0/data/index' doesn't exist. Creating new index...
> [junit4:junit4]   2> 450 T826 oasc.SolrDeletionPolicy.onCommit SolrDeletionPolicy.onCommit: commits:num=1
> [junit4:junit4]   2>            commit{dir=MockDirWrapper(org.apache.lucene.store.RAMDirectory@3ec2cff lockFactory=org.apache.lucene.store.SingleInstanceLockFactory@41363858),segFN=segments_1,generation=1,filenames=[segments_1]
> [junit4:junit4]   2> 450 T826 oasc.SolrDeletionPolicy.updateCommits newest commit = 1
> [junit4:junit4]   2> 451 T826 oasc.RequestHandlers.initHandlersFromConfig created /update: solr.UpdateRequestHandler
> [junit4:junit4]   2> 451 T826 oasc.RequestHandlers.initHandlersFromConfig created /elevate: org.apache.solr.handler.component.SearchHandler
> [junit4:junit4]   2> 452 T826 oasc.RequestHandlers.initHandlersFromConfig created /dataElevate: org.apache.solr.handler.component.SearchHandler
> [junit4:junit4]   2> 452 T826 oashl.XMLLoader.init xsltCacheLifetimeSeconds=60
> [junit4:junit4]   2> 452 T826 oasc.RequestHandlers.initHandlersFromConfig WARNING no default request handler is registered (either '/select' or 'standard')
> [junit4:junit4]   2> 453 T826 oasc.SolrCore.initDeprecatedSupport WARNING solrconfig.xml uses deprecated <admin/gettableFiles>, Please update your config to use the ShowFileRequestHandler.
> [junit4:junit4]   2> 454 T826 oasc.SolrCore.initDeprecatedSupport WARNING adding ShowFileRequestHandler with hidden files: [BAD-SCHEMA-EXTERNAL-FILEFIELD.XML, SCHEMA-DFR.XML, BAD-SCHEMA-UNIQUEKEY-USES-DEFAULT.XML, HYPHENATION.DTD, SOLRCONFIG-LAZYWRITER.XML, SOLRCONFIG-SCRIPT-UPDATEPROCESSOR.XML, STOPWORDS.TXT, PROTWORDS.TXT, SCHEMA.XML, SOLRCONFIG-ELEVATE.XML, SCHEMA12.XML, STOP-1.TXT, BAD-SOLRCONFIG-INVALID-SCRIPTFILE.XML, STOPTYPES-2.TXT, BAD-SCHEMA-NOT-INDEXED-BUT-TF.XML, SCHEMA_CODEC.XML, SCHEMA-STOP-KEEP.XML, SCHEMA-PHRASESUGGEST.XML, SOLRCONFIG-PROPINJECT.XML, SCHEMA-FOLDING.XML, COMPOUNDDICTIONARY.TXT, ADDFIELDS.UPDATEPROCESSOR.JS, SCHEMA-BM25.XML, TRIVIAL.UPDATEPROCESSOR1.JS, STOPWITHBOM.TXT, PHRASESUGGEST.TXT, SOLRCONFIG-REQHANDLER.INCL, SCHEMA-REPLICATION2.XML, DA_COMPOUNDDICTIONARY.TXT, MAPPING-ISOLATIN1ACCENT.TXT, SCHEMA-SPELLCHECKER.XML, BAD-SCHEMA-CODEC-GLOBAL-VS-FT-MISMATCH.XML, BAD-SOLRCONFIG-BOGUS-SCRIPTENGINE-NAME.XML, SOLRCONFIG-SPELLCHECKCOMPONENT.XML, SOLRCONFIG-SIMPLELOCK.XML, SOLRCONFIG-NOCACHE.XML, SCHEMA-NUMERIC.XML, KEEP-1.TXT, SCHEMA-COLLATE.XML, CONDITIONAL.UPDATEPROCESSOR.JS, THROW.ERROR.ON.ADD.UPDATEPROCESSOR.JS, SOLRCONFIG-SPELLCHECKER.XML, SOLRCONFIG-NATIVELOCK.XML, BAD_SOLRCONFIG.XML, TRIVIAL.UPDATEPROCESSOR0.JS, SOLRCONFIG-DELPOLICY2.XML, OLD_SYNONYMS.TXT, SOLRCONFIG-TRANSFORMERS.XML, KEEP-2.TXT, SOLRCONFIG-MASTER1.XML, SOLRCONFIG-TLOG.XML, BAD-SCHEMA-DUP-FIELD.XML, SCHEMA-LUCENEMATCHVERSION.XML, BAD-SOLRCONFIG-MISSING-SCRIPTFILE.XML, SOLRCONFIG-REPEATER.XML, BAD-SCHEMA-DUP-FIELDTYPE.XML, SCHEMA-REQUIRED-FIELDS.XML, STOPTYPES-1.TXT, BAD-SCHEMA-UNIQUEKEY-IS-COPYFIELD-DEST.XML, BAD-SCHEMA-NONTEXT-ANALYZER.XML, SOLRCONFIG-HIGHLIGHT.XML, SCHEMA11.XML, SCHEMA15.XML, SOLRCONFIG-SLAVE.XML, SOLRCONFIG-ALTDIRECTORY.XML, SOLRCONFIG-XINCLUDE.XML, SOLRCONFIG_CODEC.XML, SCHEMA-BINARYFIELD.XML, SCHEMA-TFIDF.XML, SOLRCONFIG-MASTER1-KEEPONEBACKUP.XML, STEMDICT.TXT, BAD-MP-SOLRCONFIG.XML, SOLRCONFIG-PROPINJECT-INDEXDEFAULT.XML, STOP-SNOWBALL.TXT, SOLRCONFIG-FUNCTIONQUERY.XML, STOP-2.TXT, BAD-SCHEMA-OMIT-TF-BUT-NOT-POS.XML, MISSING.FUNCTIONS.UPDATEPROCESSOR.JS, SOLRCONFIG-QUERYSENDER-NOQUERY.XML, SOLRCONFIG-PHRASESUGGEST.XML, HUNSPELL-TEST.AFF, SOLRCONFIG_PERF.XML, SOLRCONFIG-ENABLEPLUGIN.XML, SCHEMA-MINIMAL.XML, DA_UTF8.XML, SOLRCONFIG-MASTER.XML, FRENCHARTICLES.TXT, SOLRCONFIG-MASTER2.XML, SOLRCONFIG-BASIC.XML, BAD-SCHEMA-UNIQUEKEY-MULTIVALUED.XML, SOLRCONFIG-CACHING.XML, BAD-SCHEMA-NOT-INDEXED-BUT-NORMS.XML, SCHEMA-COPYFIELD-TEST.XML, SYNONYMS.TXT, SCHEMA-LMJELINEKMERCER.XML, SOLRCONFIG-SLAVE1.XML, SOLRCONFIG-MASTER3.XML, MISSLEADING.EXTENSION.UPDATEPROCESSOR.JS.TXT, BAD-SCHEMA-DUP-DYNAMICFIELD.XML, WDFTYPES.TXT, BAD-SCHEMA-ANALYZER-CLASS-AND-NESTED.XML, SOLRCONFIG-MERGEPOLICY.XML, SCHEMA-CHARFILTERS.XML, SOLRCONFIG-SOLCOREPROPERTIES.XML, SCHEMA-IB.XML, SCHEMA-REPLICATION1.XML, SOLRCONFIG-SOLR-749.XML, SCHEMA-LMDIRICHLET.XML, BAD-SCHEMA-SIM-GLOBAL-VS-FT-MISMATCH.XML, SOLRCONFIG-TERMINDEX.XML, ELEVATE.XML, SCHEMA-REVERSED.XML, CURRENCY.XML, XSLT, BAD-SCHEMA-NOT-INDEXED-BUT-POS.XML, SOLRCONFIG-BASIC-LUCENEVERSION31.XML, SCHEMASURROUND.XML, SOLRCONFIG-UPDATE-PROCESSOR-CHAINS.XML, SCHEMA-COLLATEFILTER.XML, OPEN-EXCHANGE-RATES.JSON, SCHEMA-TRIE.XML, STOPWORDSWRONGENCODING.TXT, SOLRCONFIG-QUERYSENDER.XML, SOLRCONFIG-DELPOLICY1.XML, HUNSPELL-TEST.DIC, SCHEMA-NOT-REQUIRED-UNIQUE-KEY.XML, SCHEMA-SIM.XML]
> [junit4:junit4]   2> 455 T826 oass.SolrIndexSearcher.<init> Opening Searcher@64f6c59b main
> [junit4:junit4]   2> 456 T826 oass.SolrIndexSearcher.getIndexDir WARNING WARNING: Directory impl does not support setting indexDir: org.apache.lucene.store.MockDirectoryWrapper
> [junit4:junit4]   2> 456 T826 oasu.CommitTracker.<init> Hard AutoCommit: disabled
> [junit4:junit4]   2> 456 T826 oasu.CommitTracker.<init> Soft AutoCommit: disabled
> [junit4:junit4]   2> 456 T826 oashc.QueryElevationComponent.inform Loading QueryElevation from: /mnt/ssd/jenkins/workspace/Lucene-Solr-4.x-Linux/checkout/solr/build/solr-core/test-files/solr/collection1/conf/elevate.xml
> [junit4:junit4]   2> 463 T826 oashc.QueryElevationComponent.inform Loading QueryElevation from: /mnt/ssd/jenkins/workspace/Lucene-Solr-4.x-Linux/checkout/solr/build/solr-core/test-files/solr/collection1/conf/elevate.xml
> [junit4:junit4]   2> 469 T826 oashc.HttpShardHandlerFactory.getParameter Setting socketTimeout to: 0
> [junit4:junit4]   2> 469 T826 oashc.HttpShardHandlerFactory.getParameter Setting urlScheme to: http://
> [junit4:junit4]   2> 470 T826 oashc.HttpShardHandlerFactory.getParameter Setting connTimeout to: 0
> [junit4:junit4]   2> 470 T826 oashc.HttpShardHandlerFactory.getParameter Setting maxConnectionsPerHost to: 20
> [junit4:junit4]   2> 470 T826 oashc.HttpShardHandlerFactory.getParameter Setting corePoolSize to: 0
> [junit4:junit4]   2> 470 T826 oashc.HttpShardHandlerFactory.getParameter Setting maximumPoolSize to: 2147483647
> [junit4:junit4]   2> 471 T826 oashc.HttpShardHandlerFactory.getParameter Setting maxThreadIdleTime to: 5
> [junit4:junit4]   2> 471 T826 oashc.HttpShardHandlerFactory.getParameter Setting sizeOfQueue to: -1
> [junit4:junit4]   2> 471 T826 oashc.HttpShardHandlerFactory.getParameter Setting fairnessPolicy to: false
> [junit4:junit4]   2> 471 T826 oascsi.HttpClientUtil.createClient Creating new http client, config:maxConnectionsPerHost=20&maxConnections=10000&socketTimeout=0&connTimeout=0&retry=false
> [junit4:junit4]   2> 474 T846 oasc.SolrCore.registerSearcher [collection1] Registered new searcher Searcher@64f6c59b main{StandardDirectoryReader(segments_1:1)}
> [junit4:junit4]   2> 474 T826 oasc.CoreContainer.register registering core: collection1
> [junit4:junit4]   2> 478 T826 oass.SolrDispatchFilter.init user.dir=/mnt/ssd/jenkins/workspace/Lucene-Solr-4.x-Linux/checkout/solr/build/solr-core/test/J0
> [junit4:junit4]   2> 478 T826 oass.SolrDispatchFilter.init SolrDispatchFilter.init() done
> [junit4:junit4]   2> 478 T826 oascsi.HttpClientUtil.createClient Creating new http client, config:maxConnections=128&maxConnectionsPerHost=32&followRedirects=false
> [junit4:junit4]   2> 480 T826 oejs.Server.doStart jetty-8.1.2.v20120308
> [junit4:junit4]   2> 486 T826 oejs.AbstractConnector.doStart Started SocketConnector@0.0.0.0:38361
> [junit4:junit4]   2> 487 T826 oasc.SolrResourceLoader.locateSolrHome JNDI not configured for solr (NoInitialContextEx)
> [junit4:junit4]   2> 487 T826 oasc.SolrResourceLoader.locateSolrHome using system property solr.solr.home: /mnt/ssd/jenkins/workspace/Lucene-Solr-4.x-Linux/checkout/solr/build/solr-core/test-files/solr
> [junit4:junit4]   2> 487 T826 oasc.SolrResourceLoader.<init> new SolrResourceLoader for deduced Solr Home: '/mnt/ssd/jenkins/workspace/Lucene-Solr-4.x-Linux/checkout/solr/build/solr-core/test-files/solr/'
> [junit4:junit4]   2> 495 T826 oass.SolrDispatchFilter.init SolrDispatchFilter.init()
> [junit4:junit4]   2> 496 T826 oasc.SolrResourceLoader.locateSolrHome JNDI not configured for solr (NoInitialContextEx)
> [junit4:junit4]   2> 496 T826 oasc.SolrResourceLoader.locateSolrHome using system property solr.solr.home: /mnt/ssd/jenkins/workspace/Lucene-Solr-4.x-Linux/checkout/solr/build/solr-core/test-files/solr
> [junit4:junit4]   2> 496 T826 oasc.CoreContainer$Initializer.initialize looking for solr.xml: /mnt/ssd/jenkins/workspace/Lucene-Solr-4.x-Linux/checkout/solr/build/solr-core/test-files/solr/solr.xml
> [junit4:junit4]   2> 496 T826 oasc.CoreContainer.<init> New CoreContainer 1457909351
> [junit4:junit4]   2> 497 T826 oasc.CoreContainer.load Loading CoreContainer using Solr Home: '/mnt/ssd/jenkins/workspace/Lucene-Solr-4.x-Linux/checkout/solr/build/solr-core/test-files/solr/'
> [junit4:junit4]   2> 497 T826 oasc.SolrResourceLoader.<init> new SolrResourceLoader for directory: '/mnt/ssd/jenkins/workspace/Lucene-Solr-4.x-Linux/checkout/solr/build/solr-core/test-files/solr/'
> [junit4:junit4]   2> 508 T826 oasc.CoreContainer.load Registering Log Listener
> [junit4:junit4]   2> 517 T826 oasc.CoreContainer.create Creating SolrCore 'collection1' using instanceDir: /mnt/ssd/jenkins/workspace/Lucene-Solr-4.x-Linux/checkout/solr/build/solr-core/test-files/solr/collection1
> [junit4:junit4]   2> 518 T826 oasc.SolrResourceLoader.<init> new SolrResourceLoader for directory: '/mnt/ssd/jenkins/workspace/Lucene-Solr-4.x-Linux/checkout/solr/build/solr-core/test-files/solr/collection1/'
> [junit4:junit4]   2> 518 T826 oasc.SolrResourceLoader.replaceClassLoader Adding 'file:/mnt/ssd/jenkins/workspace/Lucene-Solr-4.x-Linux/checkout/solr/build/solr-core/test-files/solr/collection1/lib/README' to classloader
> [junit4:junit4]   2> 518 T826 oasc.SolrResourceLoader.replaceClassLoader Adding 'file:/mnt/ssd/jenkins/workspace/Lucene-Solr-4.x-Linux/checkout/solr/build/solr-core/test-files/solr/collection1/lib/classes/' to classloader
> [junit4:junit4]   2> 552 T826 oasc.SolrConfig.<init> Using Lucene MatchVersion: LUCENE_40
> [junit4:junit4]   2> 593 T826 oasc.SolrConfig.<init> Loaded SolrConfig: solrconfig-elevate.xml
> [junit4:junit4]   2> 594 T826 oass.IndexSchema.readSchema Reading Solr Schema
> [junit4:junit4]   2> 596 T826 oass.IndexSchema.readSchema Schema name=example
> [junit4:junit4]   2> 714 T826 oass.IndexSchema.readSchema default search field in schema is text
> [junit4:junit4]   2> 716 T826 oass.IndexSchema.readSchema unique key field: id
> [junit4:junit4]   2> 718 T826 oasc.SolrCore.<init> [collection1] Opening new SolrCore at /mnt/ssd/jenkins/workspace/Lucene-Solr-4.x-Linux/checkout/solr/build/solr-core/test-files/solr/collection1/, dataDir=./org.apache.solr.handler.component.DistributedQueryElevationComponentTest-1344267201327/shard1/data/
> [junit4:junit4]   2> 718 T826 oasc.JmxMonitoredMap.<init> JMX monitoring is enabled. Adding Solr mbeans to JMX Server: com.sun.jmx.mbeanserver.JmxMBeanServer@13d33ff5
> [junit4:junit4]   2> 719 T826 oasc.SolrCore.getNewIndexDir WARNING New index directory detected: old=null new=./org.apache.solr.handler.component.DistributedQueryElevationComponentTest-1344267201327/shard1/data/index/
> [junit4:junit4]   2> 719 T826 oasc.SolrCore.initIndex WARNING [collection1] Solr index directory './org.apache.solr.handler.component.DistributedQueryElevationComponentTest-1344267201327/shard1/data/index' doesn't exist. Creating new index...
> [junit4:junit4]   2> 720 T826 oasc.SolrDeletionPolicy.onCommit SolrDeletionPolicy.onCommit: commits:num=1
> [junit4:junit4]   2>            commit{dir=MockDirWrapper(NRTCachingDirectory(org.apache.lucene.store.RAMDirectory@4beff46a lockFactory=org.apache.lucene.store.SingleInstanceLockFactory@2a9934ab; maxCacheMB=0.3876953125 maxMergeSizeMB=0.55859375)),segFN=segments_1,generation=1,filenames=[segments_1]
> [junit4:junit4]   2> 720 T826 oasc.SolrDeletionPolicy.updateCommits newest commit = 1
> [junit4:junit4]   2> 721 T826 oasc.RequestHandlers.initHandlersFromConfig created /update: solr.UpdateRequestHandler
> [junit4:junit4]   2> 721 T826 oasc.RequestHandlers.initHandlersFromConfig created /elevate: org.apache.solr.handler.component.SearchHandler
> [junit4:junit4]   2> 722 T826 oasc.RequestHandlers.initHandlersFromConfig created /dataElevate: org.apache.solr.handler.component.SearchHandler
> [junit4:junit4]   2> 722 T826 oashl.XMLLoader.init xsltCacheLifetimeSeconds=60
> [junit4:junit4]   2> 722 T826 oasc.RequestHandlers.initHandlersFromConfig WARNING no default request handler is registered (either '/select' or 'standard')
> [junit4:junit4]   2> 723 T826 oasc.SolrCore.initDeprecatedSupport WARNING solrconfig.xml uses deprecated <admin/gettableFiles>, Please update your config to use the ShowFileRequestHandler.
> [junit4:junit4]   2> 724 T826 oasc.SolrCore.initDeprecatedSupport WARNING adding ShowFileRequestHandler with hidden files: [BAD-SCHEMA-EXTERNAL-FILEFIELD.XML, SCHEMA-DFR.XML, BAD-SCHEMA-UNIQUEKEY-USES-DEFAULT.XML, HYPHENATION.DTD, SOLRCONFIG-LAZYWRITER.XML, SOLRCONFIG-SCRIPT-UPDATEPROCESSOR.XML, STOPWORDS.TXT, PROTWORDS.TXT, SCHEMA.XML, SOLRCONFIG-ELEVATE.XML, SCHEMA12.XML, STOP-1.TXT, BAD-SOLRCONFIG-INVALID-SCRIPTFILE.XML, STOPTYPES-2.TXT, BAD-SCHEMA-NOT-INDEXED-BUT-TF.XML, SCHEMA_CODEC.XML, SCHEMA-STOP-KEEP.XML, SCHEMA-PHRASESUGGEST.XML, SOLRCONFIG-PROPINJECT.XML, SCHEMA-FOLDING.XML, COMPOUNDDICTIONARY.TXT, ADDFIELDS.UPDATEPROCESSOR.JS, SCHEMA-BM25.XML, TRIVIAL.UPDATEPROCESSOR1.JS, STOPWITHBOM.TXT, PHRASESUGGEST.TXT, SOLRCONFIG-REQHANDLER.INCL, SCHEMA-REPLICATION2.XML, DA_COMPOUNDDICTIONARY.TXT, MAPPING-ISOLATIN1ACCENT.TXT, SCHEMA-SPELLCHECKER.XML, BAD-SCHEMA-CODEC-GLOBAL-VS-FT-MISMATCH.XML, BAD-SOLRCONFIG-BOGUS-SCRIPTENGINE-NAME.XML, SOLRCONFIG-SPELLCHECKCOMPONENT.XML, SOLRCONFIG-SIMPLELOCK.XML, SOLRCONFIG-NOCACHE.XML, SCHEMA-NUMERIC.XML, KEEP-1.TXT, SCHEMA-COLLATE.XML, CONDITIONAL.UPDATEPROCESSOR.JS, THROW.ERROR.ON.ADD.UPDATEPROCESSOR.JS, SOLRCONFIG-SPELLCHECKER.XML, SOLRCONFIG-NATIVELOCK.XML, BAD_SOLRCONFIG.XML, TRIVIAL.UPDATEPROCESSOR0.JS, SOLRCONFIG-DELPOLICY2.XML, OLD_SYNONYMS.TXT, SOLRCONFIG-TRANSFORMERS.XML, KEEP-2.TXT, SOLRCONFIG-MASTER1.XML, SOLRCONFIG-TLOG.XML, BAD-SCHEMA-DUP-FIELD.XML, SCHEMA-LUCENEMATCHVERSION.XML, BAD-SOLRCONFIG-MISSING-SCRIPTFILE.XML, SOLRCONFIG-REPEATER.XML, BAD-SCHEMA-DUP-FIELDTYPE.XML, SCHEMA-REQUIRED-FIELDS.XML, STOPTYPES-1.TXT, BAD-SCHEMA-UNIQUEKEY-IS-COPYFIELD-DEST.XML, BAD-SCHEMA-NONTEXT-ANALYZER.XML, SOLRCONFIG-HIGHLIGHT.XML, SCHEMA11.XML, SCHEMA15.XML, SOLRCONFIG-SLAVE.XML, SOLRCONFIG-ALTDIRECTORY.XML, SOLRCONFIG-XINCLUDE.XML, SOLRCONFIG_CODEC.XML, SCHEMA-BINARYFIELD.XML, SCHEMA-TFIDF.XML, SOLRCONFIG-MASTER1-KEEPONEBACKUP.XML, STEMDICT.TXT, BAD-MP-SOLRCONFIG.XML, SOLRCONFIG-PROPINJECT-INDEXDEFAULT.XML, STOP-SNOWBALL.TXT, SOLRCONFIG-FUNCTIONQUERY.XML, STOP-2.TXT, BAD-SCHEMA-OMIT-TF-BUT-NOT-POS.XML, MISSING.FUNCTIONS.UPDATEPROCESSOR.JS, SOLRCONFIG-QUERYSENDER-NOQUERY.XML, SOLRCONFIG-PHRASESUGGEST.XML, HUNSPELL-TEST.AFF, SOLRCONFIG_PERF.XML, SOLRCONFIG-ENABLEPLUGIN.XML, SCHEMA-MINIMAL.XML, DA_UTF8.XML, SOLRCONFIG-MASTER.XML, FRENCHARTICLES.TXT, SOLRCONFIG-MASTER2.XML, SOLRCONFIG-BASIC.XML, BAD-SCHEMA-UNIQUEKEY-MULTIVALUED.XML, SOLRCONFIG-CACHING.XML, BAD-SCHEMA-NOT-INDEXED-BUT-NORMS.XML, SCHEMA-COPYFIELD-TEST.XML, SYNONYMS.TXT, SCHEMA-LMJELINEKMERCER.XML, SOLRCONFIG-SLAVE1.XML, SOLRCONFIG-MASTER3.XML, MISSLEADING.EXTENSION.UPDATEPROCESSOR.JS.TXT, BAD-SCHEMA-DUP-DYNAMICFIELD.XML, WDFTYPES.TXT, BAD-SCHEMA-ANALYZER-CLASS-AND-NESTED.XML, SOLRCONFIG-MERGEPOLICY.XML, SCHEMA-CHARFILTERS.XML, SOLRCONFIG-SOLCOREPROPERTIES.XML, SCHEMA-IB.XML, SCHEMA-REPLICATION1.XML, SOLRCONFIG-SOLR-749.XML, SCHEMA-LMDIRICHLET.XML, BAD-SCHEMA-SIM-GLOBAL-VS-FT-MISMATCH.XML, SOLRCONFIG-TERMINDEX.XML, ELEVATE.XML, SCHEMA-REVERSED.XML, CURRENCY.XML, XSLT, BAD-SCHEMA-NOT-INDEXED-BUT-POS.XML, SOLRCONFIG-BASIC-LUCENEVERSION31.XML, SCHEMASURROUND.XML, SOLRCONFIG-UPDATE-PROCESSOR-CHAINS.XML, SCHEMA-COLLATEFILTER.XML, OPEN-EXCHANGE-RATES.JSON, SCHEMA-TRIE.XML, STOPWORDSWRONGENCODING.TXT, SOLRCONFIG-QUERYSENDER.XML, SOLRCONFIG-DELPOLICY1.XML, HUNSPELL-TEST.DIC, SCHEMA-NOT-REQUIRED-UNIQUE-KEY.XML, SCHEMA-SIM.XML]
> [junit4:junit4]   2> 725 T826 oass.SolrIndexSearcher.<init> Opening Searcher@68a17228 main
> [junit4:junit4]   2> 726 T826 oass.SolrIndexSearcher.getIndexDir WARNING WARNING: Directory impl does not support setting indexDir: org.apache.lucene.store.MockDirectoryWrapper
> [junit4:junit4]   2> 726 T826 oasu.CommitTracker.<init> Hard AutoCommit: disabled
> [junit4:junit4]   2> 726 T826 oasu.CommitTracker.<init> Soft AutoCommit: disabled
> [junit4:junit4]   2> 726 T826 oashc.QueryElevationComponent.inform Loading QueryElevation from: /mnt/ssd/jenkins/workspace/Lucene-Solr-4.x-Linux/checkout/solr/build/solr-core/test-files/solr/collection1/conf/elevate.xml
> [junit4:junit4]   2> 732 T826 oashc.QueryElevationComponent.inform Loading QueryElevation from: /mnt/ssd/jenkins/workspace/Lucene-Solr-4.x-Linux/checkout/solr/build/solr-core/test-files/solr/collection1/conf/elevate.xml
> [junit4:junit4]   2> 737 T826 oashc.HttpShardHandlerFactory.getParameter Setting socketTimeout to: 0
> [junit4:junit4]   2> 737 T826 oashc.HttpShardHandlerFactory.getParameter Setting urlScheme to: http://
> [junit4:junit4]   2> 737 T826 oashc.HttpShardHandlerFactory.getParameter Setting connTimeout to: 0
> [junit4:junit4]   2> 738 T826 oashc.HttpShardHandlerFactory.getParameter Setting maxConnectionsPerHost to: 20
> [junit4:junit4]   2> 738 T826 oashc.HttpShardHandlerFactory.getParameter Setting corePoolSize to: 0
> [junit4:junit4]   2> 738 T826 oashc.HttpShardHandlerFactory.getParameter Setting maximumPoolSize to: 2147483647
> [junit4:junit4]   2> 738 T826 oashc.HttpShardHandlerFactory.getParameter Setting maxThreadIdleTime to: 5
> [junit4:junit4]   2> 738 T826 oashc.HttpShardHandlerFactory.getParameter Setting sizeOfQueue to: -1
> [junit4:junit4]   2> 738 T826 oashc.HttpShardHandlerFactory.getParameter Setting fairnessPolicy to: false
> [junit4:junit4]   2> 739 T826 oascsi.HttpClientUtil.createClient Creating new http client, config:maxConnectionsPerHost=20&maxConnections=10000&socketTimeout=0&connTimeout=0&retry=false
> [junit4:junit4]   2> 741 T856 oasc.SolrCore.registerSearcher [collection1] Registered new searcher Searcher@68a17228 main{StandardDirectoryReader(segments_1:1)}
> [junit4:junit4]   2> 741 T826 oasc.CoreContainer.register registering core: collection1
> [junit4:junit4]   2> 741 T826 oass.SolrDispatchFilter.init user.dir=/mnt/ssd/jenkins/workspace/Lucene-Solr-4.x-Linux/checkout/solr/build/solr-core/test/J0
> [junit4:junit4]   2> 741 T826 oass.SolrDispatchFilter.init SolrDispatchFilter.init() done
> [junit4:junit4]   2> 742 T826 oascsi.HttpClientUtil.createClient Creating new http client, config:maxConnections=128&maxConnectionsPerHost=32&followRedirects=false
> [junit4:junit4]   2> 744 T826 oejs.Server.doStart jetty-8.1.2.v20120308
> [junit4:junit4]   2> 745 T826 oejs.AbstractConnector.doStart Started SocketConnector@0.0.0.0:58299
> [junit4:junit4]   2> 746 T826 oasc.SolrResourceLoader.locateSolrHome JNDI not configured for solr (NoInitialContextEx)
> [junit4:junit4]   2> 746 T826 oasc.SolrResourceLoader.locateSolrHome using system property solr.solr.home: /mnt/ssd/jenkins/workspace/Lucene-Solr-4.x-Linux/checkout/solr/build/solr-core/test-files/solr
> [junit4:junit4]   2> 747 T826 oasc.SolrResourceLoader.<init> new SolrResourceLoader for deduced Solr Home: '/mnt/ssd/jenkins/workspace/Lucene-Solr-4.x-Linux/checkout/solr/build/solr-core/test-files/solr/'
> [junit4:junit4]   2> 753 T826 oass.SolrDispatchFilter.init SolrDispatchFilter.init()
> [junit4:junit4]   2> 754 T826 oasc.SolrResourceLoader.locateSolrHome JNDI not configured for solr (NoInitialContextEx)
> [junit4:junit4]   2> 754 T826 oasc.SolrResourceLoader.locateSolrHome using system property solr.solr.home: /mnt/ssd/jenkins/workspace/Lucene-Solr-4.x-Linux/checkout/solr/build/solr-core/test-files/solr
> [junit4:junit4]   2> 754 T826 oasc.CoreContainer$Initializer.initialize looking for solr.xml: /mnt/ssd/jenkins/workspace/Lucene-Solr-4.x-Linux/checkout/solr/build/solr-core/test-files/solr/solr.xml
> [junit4:junit4]   2> 754 T826 oasc.CoreContainer.<init> New CoreContainer 1269733395
> [junit4:junit4]   2> 755 T826 oasc.CoreContainer.load Loading CoreContainer using Solr Home: '/mnt/ssd/jenkins/workspace/Lucene-Solr-4.x-Linux/checkout/solr/build/solr-core/test-files/solr/'
> [junit4:junit4]   2> 755 T826 oasc.SolrResourceLoader.<init> new SolrResourceLoader for directory: '/mnt/ssd/jenkins/workspace/Lucene-Solr-4.x-Linux/checkout/solr/build/solr-core/test-files/solr/'
> [junit4:junit4]   2> 764 T826 oasc.CoreContainer.load Registering Log Listener
> [junit4:junit4]   2> 776 T826 oasc.CoreContainer.create Creating SolrCore 'collection1' using instanceDir: /mnt/ssd/jenkins/workspace/Lucene-Solr-4.x-Linux/checkout/solr/build/solr-core/test-files/solr/collection1
> [junit4:junit4]   2> 776 T826 oasc.SolrResourceLoader.<init> new SolrResourceLoader for directory: '/mnt/ssd/jenkins/workspace/Lucene-Solr-4.x-Linux/checkout/solr/build/solr-core/test-files/solr/collection1/'
> [junit4:junit4]   2> 777 T826 oasc.SolrResourceLoader.replaceClassLoader Adding 'file:/mnt/ssd/jenkins/workspace/Lucene-Solr-4.x-Linux/checkout/solr/build/solr-core/test-files/solr/collection1/lib/README' to classloader
> [junit4:junit4]   2> 777 T826 oasc.SolrResourceLoader.replaceClassLoader Adding 'file:/mnt/ssd/jenkins/workspace/Lucene-Solr-4.x-Linux/checkout/solr/build/solr-core/test-files/solr/collection1/lib/classes/' to classloader
> [junit4:junit4]   2> 807 T826 oasc.SolrConfig.<init> Using Lucene MatchVersion: LUCENE_40
> [junit4:junit4]   2> 849 T826 oasc.SolrConfig.<init> Loaded SolrConfig: solrconfig-elevate.xml
> [junit4:junit4]   2> 849 T826 oass.IndexSchema.readSchema Reading Solr Schema
> [junit4:junit4]   2> 852 T826 oass.IndexSchema.readSchema Schema name=example
> [junit4:junit4]   2> 997 T826 oass.IndexSchema.readSchema default search field in schema is text
> [junit4:junit4]   2> 998 T826 oass.IndexSchema.readSchema unique key field: id
> [junit4:junit4]   2> 1000 T826 oasc.SolrCore.<init> [collection1] Opening new SolrCore at /mnt/ssd/jenkins/workspace/Lucene-Solr-4.x-Linux/checkout/solr/build/solr-core/test-files/solr/collection1/, dataDir=./org.apache.solr.handler.component.DistributedQueryElevationComponentTest-1344267201327/shard2/data/
> [junit4:junit4]   2> 1000 T826 oasc.JmxMonitoredMap.<init> JMX monitoring is enabled. Adding Solr mbeans to JMX Server: com.sun.jmx.mbeanserver.JmxMBeanServer@13d33ff5
> [junit4:junit4]   2> 1000 T826 oasc.SolrCore.getNewIndexDir WARNING New index directory detected: old=null new=./org.apache.solr.handler.component.DistributedQueryElevationComponentTest-1344267201327/shard2/data/index/
> [junit4:junit4]   2> 1001 T826 oasc.SolrCore.initIndex WARNING [collection1] Solr index directory './org.apache.solr.handler.component.DistributedQueryElevationComponentTest-1344267201327/shard2/data/index' doesn't exist. Creating new index...
> [junit4:junit4]   2> 1002 T826 oasc.SolrDeletionPolicy.onCommit SolrDeletionPolicy.onCommit: commits:num=1
> [junit4:junit4]   2>            commit{dir=MockDirWrapper(org.apache.lucene.store.SimpleFSDirectory@/mnt/ssd/jenkins/workspace/Lucene-Solr-4.x-Linux/checkout/solr/build/solr-core/test/J0/index5065650661tmp lockFactory=org.apache.lucene.store.SingleInstanceLockFactory@4e4f1b95),segFN=segments_1,generation=1,filenames=[segments_1]
> [junit4:junit4]   2> 1003 T826 oasc.SolrDeletionPolicy.updateCommits newest commit = 1
> [junit4:junit4]   2> 1003 T826 oasc.RequestHandlers.initHandlersFromConfig created /update: solr.UpdateRequestHandler
> [junit4:junit4]   2> 1004 T826 oasc.RequestHandlers.initHandlersFromConfig created /elevate: org.apache.solr.handler.component.SearchHandler
> [junit4:junit4]   2> 1004 T826 oasc.RequestHandlers.initHandlersFromConfig created /dataElevate: org.apache.solr.handler.component.SearchHandler
> [junit4:junit4]   2> 1004 T826 oashl.XMLLoader.init xsltCacheLifetimeSeconds=60
> [junit4:junit4]   2> 1004 T826 oasc.RequestHandlers.initHandlersFromConfig WARNING no default request handler is registered (either '/select' or 'standard')
> [junit4:junit4]   2> 1005 T826 oasc.SolrCore.initDeprecatedSupport WARNING solrconfig.xml uses deprecated <admin/gettableFiles>, Please update your config to use the ShowFileRequestHandler.
> [junit4:junit4]   2> 1006 T826 oasc.SolrCore.initDeprecatedSupport WARNING adding ShowFileRequestHandler with hidden files: [BAD-SCHEMA-EXTERNAL-FILEFIELD.XML, SCHEMA-DFR.XML, BAD-SCHEMA-UNIQUEKEY-USES-DEFAULT.XML, HYPHENATION.DTD, SOLRCONFIG-LAZYWRITER.XML, SOLRCONFIG-SCRIPT-UPDATEPROCESSOR.XML, STOPWORDS.TXT, PROTWORDS.TXT, SCHEMA.XML, SOLRCONFIG-ELEVATE.XML, SCHEMA12.XML, STOP-1.TXT, BAD-SOLRCONFIG-INVALID-SCRIPTFILE.XML, STOPTYPES-2.TXT, BAD-SCHEMA-NOT-INDEXED-BUT-TF.XML, SCHEMA_CODEC.XML, SCHEMA-STOP-KEEP.XML, SCHEMA-PHRASESUGGEST.XML, SOLRCONFIG-PROPINJECT.XML, SCHEMA-FOLDING.XML, COMPOUNDDICTIONARY.TXT, ADDFIELDS.UPDATEPROCESSOR.JS, SCHEMA-BM25.XML, TRIVIAL.UPDATEPROCESSOR1.JS, STOPWITHBOM.TXT, PHRASESUGGEST.TXT, SOLRCONFIG-REQHANDLER.INCL, SCHEMA-REPLICATION2.XML, DA_COMPOUNDDICTIONARY.TXT, MAPPING-ISOLATIN1ACCENT.TXT, SCHEMA-SPELLCHECKER.XML, BAD-SCHEMA-CODEC-GLOBAL-VS-FT-MISMATCH.XML, BAD-SOLRCONFIG-BOGUS-SCRIPTENGINE-NAME.XML, SOLRCONFIG-SPELLCHECKCOMPONENT.XML, SOLRCONFIG-SIMPLELOCK.XML, SOLRCONFIG-NOCACHE.XML, SCHEMA-NUMERIC.XML, KEEP-1.TXT, SCHEMA-COLLATE.XML, CONDITIONAL.UPDATEPROCESSOR.JS, THROW.ERROR.ON.ADD.UPDATEPROCESSOR.JS, SOLRCONFIG-SPELLCHECKER.XML, SOLRCONFIG-NATIVELOCK.XML, BAD_SOLRCONFIG.XML, TRIVIAL.UPDATEPROCESSOR0.JS, SOLRCONFIG-DELPOLICY2.XML, OLD_SYNONYMS.TXT, SOLRCONFIG-TRANSFORMERS.XML, KEEP-2.TXT, SOLRCONFIG-MASTER1.XML, SOLRCONFIG-TLOG.XML, BAD-SCHEMA-DUP-FIELD.XML, SCHEMA-LUCENEMATCHVERSION.XML, BAD-SOLRCONFIG-MISSING-SCRIPTFILE.XML, SOLRCONFIG-REPEATER.XML, BAD-SCHEMA-DUP-FIELDTYPE.XML, SCHEMA-REQUIRED-FIELDS.XML, STOPTYPES-1.TXT, BAD-SCHEMA-UNIQUEKEY-IS-COPYFIELD-DEST.XML, BAD-SCHEMA-NONTEXT-ANALYZER.XML, SOLRCONFIG-HIGHLIGHT.XML, SCHEMA11.XML, SCHEMA15.XML, SOLRCONFIG-SLAVE.XML, SOLRCONFIG-ALTDIRECTORY.XML, SOLRCONFIG-XINCLUDE.XML, SOLRCONFIG_CODEC.XML, SCHEMA-BINARYFIELD.XML, SCHEMA-TFIDF.XML, SOLRCONFIG-MASTER1-KEEPONEBACKUP.XML, STEMDICT.TXT, BAD-MP-SOLRCONFIG.XML, SOLRCONFIG-PROPINJECT-INDEXDEFAULT.XML, STOP-SNOWBALL.TXT, SOLRCONFIG-FUNCTIONQUERY.XML, STOP-2.TXT, BAD-SCHEMA-OMIT-TF-BUT-NOT-POS.XML, MISSING.FUNCTIONS.UPDATEPROCESSOR.JS, SOLRCONFIG-QUERYSENDER-NOQUERY.XML, SOLRCONFIG-PHRASESUGGEST.XML, HUNSPELL-TEST.AFF, SOLRCONFIG_PERF.XML, SOLRCONFIG-ENABLEPLUGIN.XML, SCHEMA-MINIMAL.XML, DA_UTF8.XML, SOLRCONFIG-MASTER.XML, FRENCHARTICLES.TXT, SOLRCONFIG-MASTER2.XML, SOLRCONFIG-BASIC.XML, BAD-SCHEMA-UNIQUEKEY-MULTIVALUED.XML, SOLRCONFIG-CACHING.XML, BAD-SCHEMA-NOT-INDEXED-BUT-NORMS.XML, SCHEMA-COPYFIELD-TEST.XML, SYNONYMS.TXT, SCHEMA-LMJELINEKMERCER.XML, SOLRCONFIG-SLAVE1.XML, SOLRCONFIG-MASTER3.XML, MISSLEADING.EXTENSION.UPDATEPROCESSOR.JS.TXT, BAD-SCHEMA-DUP-DYNAMICFIELD.XML, WDFTYPES.TXT, BAD-SCHEMA-ANALYZER-CLASS-AND-NESTED.XML, SOLRCONFIG-MERGEPOLICY.XML, SCHEMA-CHARFILTERS.XML, SOLRCONFIG-SOLCOREPROPERTIES.XML, SCHEMA-IB.XML, SCHEMA-REPLICATION1.XML, SOLRCONFIG-SOLR-749.XML, SCHEMA-LMDIRICHLET.XML, BAD-SCHEMA-SIM-GLOBAL-VS-FT-MISMATCH.XML, SOLRCONFIG-TERMINDEX.XML, ELEVATE.XML, SCHEMA-REVERSED.XML, CURRENCY.XML, XSLT, BAD-SCHEMA-NOT-INDEXED-BUT-POS.XML, SOLRCONFIG-BASIC-LUCENEVERSION31.XML, SCHEMASURROUND.XML, SOLRCONFIG-UPDATE-PROCESSOR-CHAINS.XML, SCHEMA-COLLATEFILTER.XML, OPEN-EXCHANGE-RATES.JSON, SCHEMA-TRIE.XML, STOPWORDSWRONGENCODING.TXT, SOLRCONFIG-QUERYSENDER.XML, SOLRCONFIG-DELPOLICY1.XML, HUNSPELL-TEST.DIC, SCHEMA-NOT-REQUIRED-UNIQUE-KEY.XML, SCHEMA-SIM.XML]
> [junit4:junit4]   2> 1008 T826 oass.SolrIndexSearcher.<init> Opening Searcher@47ffe2ab main
> [junit4:junit4]   2> 1008 T826 oass.SolrIndexSearcher.getIndexDir WARNING WARNING: Directory impl does not support setting indexDir: org.apache.lucene.store.MockDirectoryWrapper
> [junit4:junit4]   2> 1008 T826 oasu.CommitTracker.<init> Hard AutoCommit: disabled
> [junit4:junit4]   2> 1008 T826 oasu.CommitTracker.<init> Soft AutoCommit: disabled
> [junit4:junit4]   2> 1009 T826 oashc.QueryElevationComponent.inform Loading QueryElevation from: /mnt/ssd/jenkins/workspace/Lucene-Solr-4.x-Linux/checkout/solr/build/solr-core/test-files/solr/collection1/conf/elevate.xml
> [junit4:junit4]   2> 1015 T826 oashc.QueryElevationComponent.inform Loading QueryElevation from: /mnt/ssd/jenkins/workspace/Lucene-Solr-4.x-Linux/checkout/solr/build/solr-core/test-files/solr/collection1/conf/elevate.xml
> [junit4:junit4]   2> 1023 T826 oashc.HttpShardHandlerFactory.getParameter Setting socketTimeout to: 0
> [junit4:junit4]   2> 1023 T826 oashc.HttpShardHandlerFactory.getParameter Setting urlScheme to: http://
> [junit4:junit4]   2> 1023 T826 oashc.HttpShardHandlerFactory.getParameter Setting connTimeout to: 0
> [junit4:junit4]   2> 1024 T826 oashc.HttpShardHandlerFactory.getParameter Setting maxConnectionsPerHost to: 20
> [junit4:junit4]   2> 1024 T826 oashc.HttpShardHandlerFactory.getParameter Setting corePoolSize to: 0
> [junit4:junit4]   2> 1024 T826 oashc.HttpShardHandlerFactory.getParameter Setting maximumPoolSize to: 2147483647
> [junit4:junit4]   2> 1024 T826 oashc.HttpShardHandlerFactory.getParameter Setting maxThreadIdleTime to: 5
> [junit4:junit4]   2> 1025 T826 oashc.HttpShardHandlerFactory.getParameter Setting sizeOfQueue to: -1
> [junit4:junit4]   2> 1025 T826 oashc.HttpShardHandlerFactory.getParameter Setting fairnessPolicy to: false
> [junit4:junit4]   2> 1025 T826 oascsi.HttpClientUtil.createClient Creating new http client, config:maxConnectionsPerHost=20&maxConnections=10000&socketTimeout=0&connTimeout=0&retry=false
> [junit4:junit4]   2> 1027 T866 oasc.SolrCore.registerSearcher [collection1] Registered new searcher Searcher@47ffe2ab main{StandardDirectoryReader(segments_1:1)}
> [junit4:junit4]   2> 1027 T826 oasc.CoreContainer.register registering core: collection1
> [junit4:junit4]   2> 1028 T826 oass.SolrDispatchFilter.init user.dir=/mnt/ssd/jenkins/workspace/Lucene-Solr-4.x-Linux/checkout/solr/build/solr-core/test/J0
> [junit4:junit4]   2> 1028 T826 oass.SolrDispatchFilter.init SolrDispatchFilter.init() done
> [junit4:junit4]   2> 1028 T826 oascsi.HttpClientUtil.createClient Creating new http client, config:maxConnections=128&maxConnectionsPerHost=32&followRedirects=false
> [junit4:junit4]   2> ASYNC  NEW_CORE C31 name=collection1 org.apache.solr.core.SolrCore@3063d59b
> [junit4:junit4]   2> 1032 T829 C31 oasu.DirectUpdateHandler2.deleteAll [collection1] REMOVING ALL DOCUMENTS FROM INDEX
> [junit4:junit4]   2> 1033 T829 C31 oasc.SolrDeletionPolicy.onInit SolrDeletionPolicy.onInit: commits:num=1
> [junit4:junit4]   2>            commit{dir=MockDirWrapper(org.apache.lucene.store.RAMDirectory@6a5ccbee lockFactory=org.apache.lucene.store.SingleInstanceLockFactory@e8184ab),segFN=segments_1,generation=1,filenames=[segments_1]
> [junit4:junit4]   2> 1034 T829 C31 oasc.SolrDeletionPolicy.updateCommits newest commit = 1
> [junit4:junit4]   2> 1034 T829 C31 UPDATE [collection1] webapp=/solr path=/update params={version=2&wt=javabin} {deleteByQuery=*:*} 0 2
> [junit4:junit4]   2> ASYNC  NEW_CORE C32 name=collection1 org.apache.solr.core.SolrCore@1021729f
> [junit4:junit4]   2> 1037 T839 C32 oasu.DirectUpdateHandler2.deleteAll [collection1] REMOVING ALL DOCUMENTS FROM INDEX
> [junit4:junit4]   2> 1038 T839 C32 oasc.SolrDeletionPolicy.onInit SolrDeletionPolicy.onInit: commits:num=1
> [junit4:junit4]   2>            commit{dir=MockDirWrapper(org.apache.lucene.store.RAMDirectory@3ec2cff lockFactory=org.apache.lucene.store.SingleInstanceLockFactory@41363858),segFN=segments_1,generation=1,filenames=[segments_1]
> [junit4:junit4]   2> 1039 T839 C32 oasc.SolrDeletionPolicy.updateCommits newest commit = 1
> [junit4:junit4]   2> 1039 T839 C32 UPDATE [collection1] webapp=/solr path=/update params={version=2&wt=javabin} {deleteByQuery=*:*} 0 2
> [junit4:junit4]   2> ASYNC  NEW_CORE C33 name=collection1 org.apache.solr.core.SolrCore@51c0d924
> [junit4:junit4]   2> 1043 T849 C33 oasu.DirectUpdateHandler2.deleteAll [collection1] REMOVING ALL DOCUMENTS FROM INDEX
> [junit4:junit4]   2> 1044 T849 C33 oasc.SolrDeletionPolicy.onInit SolrDeletionPolicy.onInit: commits:num=1
> [junit4:junit4]   2>            commit{dir=MockDirWrapper(NRTCachingDirectory(org.apache.lucene.store.RAMDirectory@4beff46a lockFactory=org.apache.lucene.store.SingleInstanceLockFactory@2a9934ab; maxCacheMB=0.3876953125 maxMergeSizeMB=0.55859375)),segFN=segments_1,generation=1,filenames=[segments_1]
> [junit4:junit4]   2> 1045 T849 C33 oasc.SolrDeletionPolicy.updateCommits newest commit = 1
> [junit4:junit4]   2> 1045 T849 C33 UPDATE [collection1] webapp=/solr path=/update params={version=2&wt=javabin} {deleteByQuery=*:*} 0 2
> [junit4:junit4]   2> ASYNC  NEW_CORE C34 name=collection1 org.apache.solr.core.SolrCore@28022aec
> [junit4:junit4]   2> 1051 T859 C34 oasu.DirectUpdateHandler2.deleteAll [collection1] REMOVING ALL DOCUMENTS FROM INDEX
> [junit4:junit4]   2> 1053 T859 C34 oasc.SolrDeletionPolicy.onInit SolrDeletionPolicy.onInit: commits:num=1
> [junit4:junit4]   2>            commit{dir=MockDirWrapper(org.apache.lucene.store.SimpleFSDirectory@/mnt/ssd/jenkins/workspace/Lucene-Solr-4.x-Linux/checkout/solr/build/solr-core/test/J0/index5065650661tmp lockFactory=org.apache.lucene.store.SingleInstanceLockFactory@4e4f1b95),segFN=segments_1,generation=1,filenames=[segments_1]
> [junit4:junit4]   2> 1053 T859 C34 oasc.SolrDeletionPolicy.updateCommits newest commit = 1
> [junit4:junit4]   2> 1054 T859 C34 UPDATE [collection1] webapp=/solr path=/update params={version=2&wt=javabin} {deleteByQuery=*:*} 0 3
> [junit4:junit4]   2> 1056 T829 C31 UPDATE [collection1] webapp=/solr path=/update params={version=2&wt=javabin} {add=[1]} 0 0
> [junit4:junit4]   2> 1078 T839 C32 UPDATE [collection1] webapp=/solr path=/update params={version=2&wt=javabin} {add=[1]} 0 0
> [junit4:junit4]   2> 1081 T829 C31 UPDATE [collection1] webapp=/solr path=/update params={version=2&wt=javabin} {add=[2]} 0 1
> [junit4:junit4]   2> 1083 T849 C33 UPDATE [collection1] webapp=/solr path=/update params={version=2&wt=javabin} {add=[2]} 0 1
> [junit4:junit4]   2> 1085 T829 C31 UPDATE [collection1] webapp=/solr path=/update params={version=2&wt=javabin} {add=[3]} 0 0
> [junit4:junit4]   2> 1087 T859 C34 UPDATE [collection1] webapp=/solr path=/update params={version=2&wt=javabin} {add=[3]} 0 0
> [junit4:junit4]   2> 1089 T829 C31 UPDATE [collection1] webapp=/solr path=/update params={version=2&wt=javabin} {add=[4]} 0 0
> [junit4:junit4]   2> 1091 T839 C32 UPDATE [collection1] webapp=/solr path=/update params={version=2&wt=javabin} {add=[4]} 0 0
> [junit4:junit4]   2> 1096 T829 C31 UPDATE [collection1] webapp=/solr path=/update params={version=2&wt=javabin} {add=[5]} 0 3
> [junit4:junit4]   2> 1098 T849 C33 UPDATE [collection1] webapp=/solr path=/update params={version=2&wt=javabin} {add=[5]} 0 0
> [junit4:junit4]   2> 1102 T829 C31 UPDATE [collection1] webapp=/solr path=/update params={version=2&wt=javabin} {add=[6]} 0 0
> [junit4:junit4]   2> 1110 T859 C34 UPDATE [collection1] webapp=/solr path=/update params={version=2&wt=javabin} {add=[6]} 0 0
> [junit4:junit4]   2> 1112 T829 C31 UPDATE [collection1] webapp=/solr path=/update params={version=2&wt=javabin} {add=[7]} 0 0
> [junit4:junit4]   2> 1114 T859 C34 UPDATE [collection1] webapp=/solr path=/update params={version=2&wt=javabin} {add=[7]} 0 0
> [junit4:junit4]   2> 1116 T829 C31 oasu.DirectUpdateHandler2.commit start commit{flags=0,_version_=0,optimize=false,openSearcher=true,waitSearcher=true,expungeDeletes=false,softCommit=false}
> [junit4:junit4]   2> 1117 T829 C31 oasc.SolrDeletionPolicy.onCommit SolrDeletionPolicy.onCommit: commits:num=2
> [junit4:junit4]   2>            commit{dir=MockDirWrapper(org.apache.lucene.store.RAMDirectory@6a5ccbee lockFactory=org.apache.lucene.store.SingleInstanceLockFactory@e8184ab),segFN=segments_1,generation=1,filenames=[segments_1]
> [junit4:junit4]   2>            commit{dir=MockDirWrapper(org.apache.lucene.store.RAMDirectory@6a5ccbee lockFactory=org.apache.lucene.store.SingleInstanceLockFactory@e8184ab),segFN=segments_2,generation=2,filenames=[_0_Asserting_0.frq, _0_Memory_0.ram, _0_Asserting_0.tim, _0_nrm.cfe, segments_2, _0.fnm, _0.fdx, _0.fdt, _0_Asserting_0.tip, _0_Asserting_0.prx, _0_nrm.cfs, _0.si]
> [junit4:junit4]   2> 1118 T829 C31 oasc.SolrDeletionPolicy.updateCommits newest commit = 2
> [junit4:junit4]   2> 1119 T829 C31 oass.SolrIndexSearcher.<init> Opening Searcher@1c91b76c main
> [junit4:junit4]   2> 1119 T829 C31 oass.SolrIndexSearcher.getIndexDir WARNING WARNING: Directory impl does not support setting indexDir: org.apache.lucene.store.MockDirectoryWrapper
> [junit4:junit4]   2> 1120 T829 C31 oasu.DirectUpdateHandler2.commit end_commit_flush
> [junit4:junit4]   2> 1120 T836 oasc.SolrCore.registerSearcher [collection1] Registered new searcher Searcher@1c91b76c main{StandardDirectoryReader(segments_2:4 _0(4.0.0.1):C7)}
> [junit4:junit4]   2> 1121 T829 C31 UPDATE [collection1] webapp=/solr path=/update params={wt=javabin&commit=true&version=2&softCommit=false&waitSearcher=true} {commit=} 0 5
> [junit4:junit4]   2> 1123 T839 C32 oasu.DirectUpdateHandler2.commit start commit{flags=0,_version_=0,optimize=false,openSearcher=true,waitSearcher=true,expungeDeletes=false,softCommit=false}
> [junit4:junit4]   2> 1124 T839 C32 oasc.SolrDeletionPolicy.onCommit SolrDeletionPolicy.onCommit: commits:num=2
> [junit4:junit4]   2>            commit{dir=MockDirWrapper(org.apache.lucene.store.RAMDirectory@3ec2cff lockFactory=org.apache.lucene.store.SingleInstanceLockFactory@41363858),segFN=segments_1,generation=1,filenames=[segments_1]
> [junit4:junit4]   2>            commit{dir=MockDirWrapper(org.apache.lucene.store.RAMDirectory@3ec2cff lockFactory=org.apache.lucene.store.SingleInstanceLockFactory@41363858),segFN=segments_2,generation=2,filenames=[_0_Asserting_0.frq, _0_Memory_0.ram, _0_Asserting_0.tim, _0_nrm.cfe, segments_2, _0.fnm, _0.fdx, _0.fdt, _0_Asserting_0.tip, _0_Asserting_0.prx, _0_nrm.cfs, _0.si]
> [junit4:junit4]   2> 1124 T839 C32 oasc.SolrDeletionPolicy.updateCommits newest commit = 2
> [junit4:junit4]   2> 1125 T839 C32 oass.SolrIndexSearcher.<init> Opening Searcher@6eec3687 main
> [junit4:junit4]   2> 1126 T839 C32 oass.SolrIndexSearcher.getIndexDir WARNING WARNING: Directory impl does not support setting indexDir: org.apache.lucene.store.MockDirectoryWrapper
> [junit4:junit4]   2> 1126 T839 C32 oasu.DirectUpdateHandler2.commit end_commit_flush
> [junit4:junit4]   2> 1126 T846 oasc.SolrCore.registerSearcher [collection1] Registered new searcher Searcher@6eec3687 main{StandardDirectoryReader(segments_2:4 _0(4.0.0.1):C2)}
> [junit4:junit4]   2> 1127 T839 C32 UPDATE [collection1] webapp=/solr path=/update params={wt=javabin&commit=true&version=2&softCommit=false&waitSearcher=true} {commit=} 0 4
> [junit4:junit4]   2> 1129 T849 C33 oasu.DirectUpdateHandler2.commit start commit{flags=0,_version_=0,optimize=false,openSearcher=true,waitSearcher=true,expungeDeletes=false,softCommit=false}
> [junit4:junit4]   2> 1131 T849 C33 oasc.SolrDeletionPolicy.onCommit SolrDeletionPolicy.onCommit: commits:num=2
> [junit4:junit4]   2>            commit{dir=MockDirWrapper(NRTCachingDirectory(org.apache.lucene.store.RAMDirectory@4beff46a lockFactory=org.apache.lucene.store.SingleInstanceLockFactory@2a9934ab; maxCacheMB=0.3876953125 maxMergeSizeMB=0.55859375)),segFN=segments_1,generation=1,filenames=[segments_1]
> [junit4:junit4]   2>            commit{dir=MockDirWrapper(NRTCachingDirectory(org.apache.lucene.store.RAMDirectory@4beff46a lockFactory=org.apache.lucene.store.SingleInstanceLockFactory@2a9934ab; maxCacheMB=0.3876953125 maxMergeSizeMB=0.55859375)),segFN=segments_2,generation=2,filenames=[_0_Asserting_0.frq, _0_Memory_0.ram, _0_Asserting_0.tim, _0_nrm.cfe, segments_2, _0.fnm, _0.fdx, _0.fdt, _0_Asserting_0.tip, _0_Asserting_0.prx, _0_nrm.cfs, _0.si]
> [junit4:junit4]   2> 1131 T849 C33 oasc.SolrDeletionPolicy.updateCommits newest commit = 2
> [junit4:junit4]   2> 1132 T849 C33 oass.SolrIndexSearcher.<init> Opening Searcher@1a33fc1d main
> [junit4:junit4]   2> 1133 T849 C33 oass.SolrIndexSearcher.getIndexDir WARNING WARNING: Directory impl does not support setting indexDir: org.apache.lucene.store.MockDirectoryWrapper
> [junit4:junit4]   2> 1133 T849 C33 oasu.DirectUpdateHandler2.commit end_commit_flush
> [junit4:junit4]   2> 1133 T856 oasc.SolrCore.registerSearcher [collection1] Registered new searcher Searcher@1a33fc1d main{StandardDirectoryReader(segments_2:4 _0(4.0.0.1):C2)}
> [junit4:junit4]   2> 1134 T849 C33 UPDATE [collection1] webapp=/solr path=/update params={wt=javabin&commit=true&version=2&softCommit=false&waitSearcher=true} {commit=} 0 5
> [junit4:junit4]   2> 1136 T859 C34 oasu.DirectUpdateHandler2.commit start commit{flags=0,_version_=0,optimize=false,openSearcher=true,waitSearcher=true,expungeDeletes=false,softCommit=false}
> [junit4:junit4]   2> 1139 T859 C34 oasc.SolrDeletionPolicy.onCommit SolrDeletionPolicy.onCommit: commits:num=2
> [junit4:junit4]   2>            commit{dir=MockDirWrapper(org.apache.lucene.store.SimpleFSDirectory@/mnt/ssd/jenkins/workspace/Lucene-Solr-4.x-Linux/checkout/solr/build/solr-core/test/J0/index5065650661tmp lockFactory=org.apache.lucene.store.SingleInstanceLockFactory@4e4f1b95),segFN=segments_1,generation=1,filenames=[segments_1]
> [junit4:junit4]   2>            commit{dir=MockDirWrapper(org.apache.lucene.store.SimpleFSDirectory@/mnt/ssd/jenkins/workspace/Lucene-Solr-4.x-Linux/checkout/solr/build/solr-core/test/J0/index5065650661tmp lockFactory=org.apache.lucene.store.SingleInstanceLockFactory@4e4f1b95),segFN=segments_2,generation=2,filenames=[_0_Asserting_0.frq, _0_Memory_0.ram, _0_Asserting_0.tim, _0_nrm.cfe, segments_2, _0.fnm, _0.fdx, _0.fdt, _0_Asserting_0.tip, _0_Asserting_0.prx, _0_nrm.cfs, _0.si]
> [junit4:junit4]   2> 1139 T859 C34 oasc.SolrDeletionPolicy.updateCommits newest commit = 2
> [junit4:junit4]   2> 1141 T859 C34 oass.SolrIndexSearcher.<init> Opening Searcher@24057ded main
> [junit4:junit4]   2> 1141 T859 C34 oass.SolrIndexSearcher.getIndexDir WARNING WARNING: Directory impl does not support setting indexDir: org.apache.lucene.store.MockDirectoryWrapper
> [junit4:junit4]   2> 1141 T859 C34 oasu.DirectUpdateHandler2.commit end_commit_flush
> [junit4:junit4]   2> 1141 T866 oasc.SolrCore.registerSearcher [collection1] Registered new searcher Searcher@24057ded main{StandardDirectoryReader(segments_2:4 _0(4.0.0.1):C3)}
> [junit4:junit4]   2> 1142 T859 C34 UPDATE [collection1] webapp=/solr path=/update params={wt=javabin&commit=true&version=2&softCommit=false&waitSearcher=true} {commit=} 0 6
> [junit4:junit4]   2> 1149 T829 C31 REQ [collection1] webapp=/solr path=/elevate params={sort=id+desc&shards.qt=/elevate&distrib=false&version=2&rows=500&q=*:*&qt=/elevate&wt=javabin&fl=id,+score,+[elevated]} hits=7 status=0 QTime=5
> [junit4:junit4]   2> 1156 T860 C34 REQ [collection1] webapp=/solr path=/elevate params={fsv=true&shards.qt=/elevate&start=0&q=*:*&isShard=true&qt=/elevate&wt=javabin&NOW=1344267202476&fl=id,score&sort=id+desc&distrib=false&version=2&rows=500&shard.url=localhost:58299/solr|[::1]:33332/solr} hits=3 status=0 QTime=1
> [junit4:junit4]   2> 1156 T840 C32 REQ [collection1] webapp=/solr path=/elevate params={fsv=true&shards.qt=/elevate&start=0&q=*:*&isShard=true&qt=/elevate&wt=javabin&NOW=1344267202476&fl=id,score&sort=id+desc&distrib=false&version=2&rows=500&shard.url=[::1]:33332/solr|localhost:37769/solr} hits=2 status=0 QTime=1
> [junit4:junit4]   2> 1156 T850 C33 REQ [collection1] webapp=/solr path=/elevate params={fsv=true&shards.qt=/elevate&start=0&q=*:*&isShard=true&qt=/elevate&wt=javabin&NOW=1344267202476&fl=id,score&sort=id+desc&distrib=false&version=2&rows=500&shard.url=localhost:38361/solr|[::1]:33332/solr} hits=2 status=0 QTime=1
> [junit4:junit4]   2> 1159 T860 C34 REQ [collection1] webapp=/solr path=/elevate params={shards.qt=/elevate&q=*:*&qt=/elevate&isShard=true&wt=javabin&NOW=1344267202476&fl=id,+score,+[elevated]&distrib=false&version=2&rows=500&ids=7.0,6.0,3.0&shard.url=localhost:58299/solr|[::1]:33332/solr} status=0 QTime=0
> [junit4:junit4]   2> 1159 T850 C33 REQ [collection1] webapp=/solr path=/elevate params={shards.qt=/elevate&q=*:*&qt=/elevate&isShard=true&wt=javabin&NOW=1344267202476&fl=id,+score,+[elevated]&distrib=false&version=2&rows=500&ids=2.0,5.0&shard.url=localhost:38361/solr|[::1]:33332/solr} status=0 QTime=0
> [junit4:junit4]   2> 1159 T840 C32 REQ [collection1] webapp=/solr path=/elevate params={shards.qt=/elevate&q=*:*&qt=/elevate&isShard=true&wt=javabin&NOW=1344267202476&fl=id,+score,+[elevated]&distrib=false&version=2&rows=500&ids=4.0,1.0&shard.url=[::1]:33332/solr|localhost:37769/solr} status=0 QTime=0
> [junit4:junit4]   2> 1160 T859 C34 REQ [collection1] webapp=/solr path=/elevate params={sort=id+desc&shards.qt=/elevate&version=2&rows=500&q=*:*&qt=/elevate&wt=javabin&fl=id,+score,+[elevated]&shards=[::1]:33332/solr|localhost:37769/solr,localhost:38361/solr|[::1]:33332/solr,localhost:58299/solr|[::1]:33332/solr} status=0 QTime=9
> [junit4:junit4]   2> 1161 T826 oas.BaseDistributedSearchTestCase.compareResponses SEVERE Mismatched responses:
> [junit4:junit4]   2>    {responseHeader={status=0,QTime=9,params={sort=id desc,shards.qt=/elevate,version=2,rows=500,q=*:*,qt=/elevate,wt=javabin,fl=id, score, [elevated],shards=[::1]:33332/solr|localhost:37769/solr,localhost:38361/solr|[::1]:33332/solr,localhost:58299/solr|[::1]:33332/solr}},response={numFound=7,start=0,maxScore=1.0,docs=[SolrDocument{id=7.0, [elevated]=false, score=1.0}, SolrDocument{id=6.0, [elevated]=false, score=1.0}, SolrDocument{id=5.0, [elevated]=false, score=1.0}, SolrDocument{id=4.0, [elevated]=false, score=1.0}, SolrDocument{id=3.0, [elevated]=false, score=1.0}, SolrDocument{id=2.0, [elevated]=false, score=1.0}, SolrDocument{id=1.0, [elevated]=false, score=1.0}]}}
> [junit4:junit4]   2>    {responseHeader={status=0,QTime=5,params={sort=id desc,shards.qt=/elevate,distrib=false,version=2,rows=500,q=*:*,qt=/elevate,wt=javabin,fl=id, score, [elevated]}},response={numFound=7,start=0,maxScore=1.0,docs=[SolrDocument{id=7.0, score=1.0, [elevated]=false}, SolrDocument{id=6.0, score=1.0, [elevated]=false}, SolrDocument{id=5.0, score=1.0, [elevated]=false}, SolrDocument{id=4.0, score=1.0, [elevated]=false}, SolrDocument{id=3.0, score=1.0, [elevated]=false}, SolrDocument{id=2.0, score=1.0, [elevated]=false}, SolrDocument{id=1.0, score=1.0, [elevated]=false}]}}
> [junit4:junit4]   2> 1162 T826 oasc.CoreContainer.shutdown Shutting down CoreContainer instance=1976062495
> [junit4:junit4]   2> 1162 T826 oasc.SolrCore.close [collection1]  CLOSING SolrCore org.apache.solr.core.SolrCore@3063d59b
> [junit4:junit4]   2> 1162 T826 oasc.SolrCore.closeSearcher [collection1] Closing main searcher on request.
> [junit4:junit4]   2> 1163 T826 oasu.DirectUpdateHandler2.close closing DirectUpdateHandler2{commits=1,autocommits=0,soft autocommits=0,optimizes=0,rollbacks=0,expungeDeletes=0,docsPending=0,adds=0,deletesById=0,deletesByQuery=0,errors=0,cumulative_adds=7,cumulative_deletesById=0,cumulative_deletesByQuery=1,cumulative_errors=0}
> [junit4:junit4]   2> 1166 T826 oejsh.ContextHandler.doStop stopped o.e.j.s.ServletContextHandler{/solr,null}
> [junit4:junit4]   2> 1218 T826 oasc.CoreContainer.shutdown Shutting down CoreContainer instance=1278212735
> [junit4:junit4]   2> 1219 T826 oasc.SolrCore.close [collection1]  CLOSING SolrCore org.apache.solr.core.SolrCore@1021729f
> [junit4:junit4]   2> 1219 T826 oasc.SolrCore.closeSearcher [collection1] Closing main searcher on request.
> [junit4:junit4]   2> 1219 T826 oasu.DirectUpdateHandler2.close closing DirectUpdateHandler2{commits=1,autocommits=0,soft autocommits=0,optimizes=0,rollbacks=0,expungeDeletes=0,docsPending=0,adds=0,deletesById=0,deletesByQuery=0,errors=0,cumulative_adds=2,cumulative_deletesById=0,cumulative_deletesByQuery=1,cumulative_errors=0}
> [junit4:junit4]   2> 1221 T826 oejsh.ContextHandler.doStop stopped o.e.j.s.ServletContextHandler{/solr,null}
> [junit4:junit4]   2> 1276 T826 oasc.CoreContainer.shutdown Shutting down CoreContainer instance=1457909351
> [junit4:junit4]   2> 1276 T826 oasc.SolrCore.close [collection1]  CLOSING SolrCore org.apache.solr.core.SolrCore@51c0d924
> [junit4:junit4]   2> 1277 T826 oasc.SolrCore.closeSearcher [collection1] Closing main searcher on request.
> [junit4:junit4]   2> 1277 T826 oasu.DirectUpdateHandler2.close closing DirectUpdateHandler2{commits=1,autocommits=0,soft autocommits=0,optimizes=0,rollbacks=0,expungeDeletes=0,docsPending=0,adds=0,deletesById=0,deletesByQuery=0,errors=0,cumulative_adds=2,cumulative_deletesById=0,cumulative_deletesByQuery=1,cumulative_errors=0}
> [junit4:junit4]   2> 1279 T826 oejsh.ContextHandler.doStop stopped o.e.j.s.ServletContextHandler{/solr,null}
> [junit4:junit4]   2> 1331 T826 oasc.CoreContainer.shutdown Shutting down CoreContainer instance=1269733395
> [junit4:junit4]   2> 1332 T826 oasc.SolrCore.close [collection1]  CLOSING SolrCore org.apache.solr.core.SolrCore@28022aec
> [junit4:junit4]   2> 1333 T826 oasc.SolrCore.closeSearcher [collection1] Closing main searcher on request.
> [junit4:junit4]   2> 1333 T826 oasu.DirectUpdateHandler2.close closing DirectUpdateHandler2{commits=1,autocommits=0,soft autocommits=0,optimizes=0,rollbacks=0,expungeDeletes=0,docsPending=0,adds=0,deletesById=0,deletesByQuery=0,errors=0,cumulative_adds=3,cumulative_deletesById=0,cumulative_deletesByQuery=1,cumulative_errors=0}
> [junit4:junit4]   2> 1337 T826 oejsh.ContextHandler.doStop stopped o.e.j.s.ServletContextHandler{/solr,null}
> [junit4:junit4]   2> 1388 T826 oas.SolrTestCaseJ4.tearDown ###Ending testDistribSearch
> [junit4:junit4]   2> NOTE: reproduce with: ant test  -Dtestcase=DistributedQueryElevationComponentTest -Dtests.method=testDistribSearch -Dtests.seed=F50759B86D99CD42 -Dtests.multiplier=3 -Dtests.slow=true -Dtests.locale=in -Dtests.timezone=Europe/Amsterdam -Dtests.file.encoding=US-ASCII
> [junit4:junit4]   2>
> [junit4:junit4]    > (@AfterClass output)
> [junit4:junit4]   2> 1432 T826 oas.SolrTestCaseJ4.deleteCore ###deleteCore
> [junit4:junit4]   2> NOTE: test params are: codec=Lucene40: {text=PostingsFormat(name=Asserting), id=PostingsFormat(name=Memory doPackFST= false), field_t=PostingsFormat(name=Memory doPackFST= false), plow_t=PostingsFormat(name=Asserting), int_i=PostingsFormat(name=Asserting)}, sim=RandomSimilarityProvider(queryNorm=true,coord=true): {}, locale=in, timezone=Europe/Amsterdam
> [junit4:junit4]   2> NOTE: Linux 3.2.0-27-generic amd64/Oracle Corporation 1.8.0-ea (64-bit)/cpus=8,threads=1,free=34445632,total=156581888
> [junit4:junit4]   2> NOTE: All tests run in this JVM: [DirectUpdateHandlerOptimizeTest, TestOmitPositions, SearchHandlerTest, XmlUpdateRequestHandlerTest, TestUtils, OutputWriterTest, DateMathParserTest, QueryParsingTest, TestBinaryResponseWriter, BasicZkTest, LegacyHTMLStripCharFilterTest, SolrRequestParserTest, TestIndexingPerformance, TestBinaryField, LeaderElectionIntegrationTest, RecoveryZkTest, SampleTest, SolrCoreCheckLockOnStartupTest, TestUpdate, ReturnFieldsTest, FullSolrCloudDistribCmdsTest, SuggesterTest, SpellCheckCollatorTest, ZkCLITest, TestFaceting, BadComponentTest, TestCollationKeyRangeQueries, TestSolrXMLSerializer, MoreLikeThisHandlerTest, SpellPossibilityIteratorTest, BasicFunctionalityTest, ShowFileRequestHandlerTest, XsltUpdateRequestHandlerTest, SimpleFacetsTest, TestCSVLoader, SolrPluginUtilsTest, TestRandomFaceting, CurrencyFieldTest, TestCodecSupport, DistributedQueryElevationComponentTest]
> [junit4:junit4]   2>
> [junit4:junit4] Completed on J0 in 1.46s, 1 test, 1 failure <<< FAILURES!
>
> [...truncated 387 lines...]
> BUILD FAILED
> /mnt/ssd/jenkins/workspace/Lucene-Solr-4.x-Linux/checkout/build.xml:29: The following error occurred while executing this line:
> /mnt/ssd/jenkins/workspace/Lucene-Solr-4.x-Linux/checkout/solr/build.xml:144: The following error occurred while executing this line:
> /mnt/ssd/jenkins/workspace/Lucene-Solr-4.x-Linux/checkout/lucene/module-build.xml:62: The following error occurred while executing this line:
> /mnt/ssd/jenkins/workspace/Lucene-Solr-4.x-Linux/checkout/lucene/common-build.xml:1095: The following error occurred while executing this line:
> /mnt/ssd/jenkins/workspace/Lucene-Solr-4.x-Linux/checkout/lucene/common-build.xml:790: There were test failures: 224 suites, 902 tests, 1 failure, 5 ignored
>
> Total time: 19 minutes 10 seconds
> Build step 'Execute shell' marked build as failure
> Archiving artifacts
> Recording test results
> Email was triggered for: Failure
> Sending email for trigger: Failure
>
>
>
>
> ---------------------------------------------------------------------
> To unsubscribe, e-mail: [hidden email]
> For additional commands, e-mail: [hidden email]

---------------------------------------------------------------------
To unsubscribe, e-mail: [hidden email]
For additional commands, e-mail: [hidden email]