[JENKINS] Lucene-Solr-4.x-MacOSX (64bit/jdk1.6.0) - Build # 727 - Failure!

classic Classic list List threaded Threaded
2 messages Options
Reply | Threaded
Open this post in threaded view
|

[JENKINS] Lucene-Solr-4.x-MacOSX (64bit/jdk1.6.0) - Build # 727 - Failure!

Policeman Jenkins Server-2
Build: http://jenkins.thetaphi.de/job/Lucene-Solr-4.x-MacOSX/727/
Java: 64bit/jdk1.6.0 -XX:+UseCompressedOops -XX:+UseSerialGC

1 tests failed.
REGRESSION:  org.apache.solr.client.solrj.SolrExampleBinaryTest.testGetEmptyResults

Error Message:
IOException occured when talking to server at: https://127.0.0.1:55485/solr/collection1

Stack Trace:
org.apache.solr.client.solrj.SolrServerException: IOException occured when talking to server at: https://127.0.0.1:55485/solr/collection1
        at __randomizedtesting.SeedInfo.seed([28D83842A44A956B:7319295C90CDF161]:0)
        at org.apache.solr.client.solrj.impl.HttpSolrServer.request(HttpSolrServer.java:435)
        at org.apache.solr.client.solrj.impl.HttpSolrServer.request(HttpSolrServer.java:180)
        at org.apache.solr.client.solrj.request.AbstractUpdateRequest.process(AbstractUpdateRequest.java:117)
        at org.apache.solr.client.solrj.SolrServer.commit(SolrServer.java:168)
        at org.apache.solr.client.solrj.SolrServer.commit(SolrServer.java:146)
        at org.apache.solr.client.solrj.SolrExampleTests.testGetEmptyResults(SolrExampleTests.java:291)
        at sun.reflect.NativeMethodAccessorImpl.invoke0(Native Method)
        at sun.reflect.NativeMethodAccessorImpl.invoke(NativeMethodAccessorImpl.java:39)
        at sun.reflect.DelegatingMethodAccessorImpl.invoke(DelegatingMethodAccessorImpl.java:25)
        at java.lang.reflect.Method.invoke(Method.java:597)
        at com.carrotsearch.randomizedtesting.RandomizedRunner.invoke(RandomizedRunner.java:1559)
        at com.carrotsearch.randomizedtesting.RandomizedRunner.access$600(RandomizedRunner.java:79)
        at com.carrotsearch.randomizedtesting.RandomizedRunner$6.evaluate(RandomizedRunner.java:737)
        at com.carrotsearch.randomizedtesting.RandomizedRunner$7.evaluate(RandomizedRunner.java:773)
        at com.carrotsearch.randomizedtesting.RandomizedRunner$8.evaluate(RandomizedRunner.java:787)
        at com.carrotsearch.randomizedtesting.rules.SystemPropertiesRestoreRule$1.evaluate(SystemPropertiesRestoreRule.java:53)
        at org.apache.lucene.util.TestRuleSetupTeardownChained$1.evaluate(TestRuleSetupTeardownChained.java:50)
        at org.apache.lucene.util.TestRuleFieldCacheSanity$1.evaluate(TestRuleFieldCacheSanity.java:51)
        at org.apache.lucene.util.AbstractBeforeAfterRule$1.evaluate(AbstractBeforeAfterRule.java:46)
        at com.carrotsearch.randomizedtesting.rules.SystemPropertiesInvariantRule$1.evaluate(SystemPropertiesInvariantRule.java:55)
        at org.apache.lucene.util.TestRuleThreadAndTestName$1.evaluate(TestRuleThreadAndTestName.java:49)
        at org.apache.lucene.util.TestRuleIgnoreAfterMaxFailures$1.evaluate(TestRuleIgnoreAfterMaxFailures.java:70)
        at org.apache.lucene.util.TestRuleMarkFailure$1.evaluate(TestRuleMarkFailure.java:48)
        at com.carrotsearch.randomizedtesting.rules.StatementAdapter.evaluate(StatementAdapter.java:36)
        at com.carrotsearch.randomizedtesting.ThreadLeakControl$StatementRunner.run(ThreadLeakControl.java:358)
        at com.carrotsearch.randomizedtesting.ThreadLeakControl.forkTimeoutingTask(ThreadLeakControl.java:782)
        at com.carrotsearch.randomizedtesting.ThreadLeakControl$3.evaluate(ThreadLeakControl.java:442)
        at com.carrotsearch.randomizedtesting.RandomizedRunner.runSingleTest(RandomizedRunner.java:746)
        at com.carrotsearch.randomizedtesting.RandomizedRunner$3.evaluate(RandomizedRunner.java:648)
        at com.carrotsearch.randomizedtesting.RandomizedRunner$4.evaluate(RandomizedRunner.java:682)
        at com.carrotsearch.randomizedtesting.RandomizedRunner$5.evaluate(RandomizedRunner.java:693)
        at com.carrotsearch.randomizedtesting.rules.StatementAdapter.evaluate(StatementAdapter.java:36)
        at com.carrotsearch.randomizedtesting.rules.SystemPropertiesRestoreRule$1.evaluate(SystemPropertiesRestoreRule.java:53)
        at org.apache.lucene.util.AbstractBeforeAfterRule$1.evaluate(AbstractBeforeAfterRule.java:46)
        at org.apache.lucene.util.TestRuleStoreClassName$1.evaluate(TestRuleStoreClassName.java:42)
        at com.carrotsearch.randomizedtesting.rules.SystemPropertiesInvariantRule$1.evaluate(SystemPropertiesInvariantRule.java:55)
        at com.carrotsearch.randomizedtesting.rules.NoShadowingOrOverridesOnMethodsRule$1.evaluate(NoShadowingOrOverridesOnMethodsRule.java:39)
        at com.carrotsearch.randomizedtesting.rules.NoShadowingOrOverridesOnMethodsRule$1.evaluate(NoShadowingOrOverridesOnMethodsRule.java:39)
        at com.carrotsearch.randomizedtesting.rules.StatementAdapter.evaluate(StatementAdapter.java:36)
        at org.apache.lucene.util.TestRuleAssertionsRequired$1.evaluate(TestRuleAssertionsRequired.java:43)
        at org.apache.lucene.util.TestRuleMarkFailure$1.evaluate(TestRuleMarkFailure.java:48)
        at org.apache.lucene.util.TestRuleIgnoreAfterMaxFailures$1.evaluate(TestRuleIgnoreAfterMaxFailures.java:70)
        at org.apache.lucene.util.TestRuleIgnoreTestSuites$1.evaluate(TestRuleIgnoreTestSuites.java:55)
        at com.carrotsearch.randomizedtesting.rules.StatementAdapter.evaluate(StatementAdapter.java:36)
        at com.carrotsearch.randomizedtesting.ThreadLeakControl$StatementRunner.run(ThreadLeakControl.java:358)
        at java.lang.Thread.run(Thread.java:680)
Caused by: org.apache.http.NoHttpResponseException: The target server failed to respond
        at org.apache.http.impl.conn.DefaultHttpResponseParser.parseHead(DefaultHttpResponseParser.java:95)
        at org.apache.http.impl.conn.DefaultHttpResponseParser.parseHead(DefaultHttpResponseParser.java:62)
        at org.apache.http.impl.io.AbstractMessageParser.parse(AbstractMessageParser.java:254)
        at org.apache.http.impl.AbstractHttpClientConnection.receiveResponseHeader(AbstractHttpClientConnection.java:289)
        at org.apache.http.impl.conn.DefaultClientConnection.receiveResponseHeader(DefaultClientConnection.java:252)
        at org.apache.http.impl.conn.ManagedClientConnectionImpl.receiveResponseHeader(ManagedClientConnectionImpl.java:191)
        at org.apache.http.protocol.HttpRequestExecutor.doReceiveResponse(HttpRequestExecutor.java:300)
        at org.apache.http.protocol.HttpRequestExecutor.execute(HttpRequestExecutor.java:127)
        at org.apache.http.impl.client.DefaultRequestDirector.tryExecute(DefaultRequestDirector.java:717)
        at org.apache.http.impl.client.DefaultRequestDirector.execute(DefaultRequestDirector.java:522)
        at org.apache.http.impl.client.AbstractHttpClient.execute(AbstractHttpClient.java:906)
        at org.apache.http.impl.client.AbstractHttpClient.execute(AbstractHttpClient.java:805)
        at org.apache.http.impl.client.AbstractHttpClient.execute(AbstractHttpClient.java:784)
        at org.apache.solr.client.solrj.impl.HttpSolrServer.request(HttpSolrServer.java:365)
        ... 45 more




Build Log:
[...truncated 10324 lines...]
   [junit4] Suite: org.apache.solr.client.solrj.SolrExampleBinaryTest
   [junit4]   2> 82611 T169 oas.SolrJettyTestBase.beforeSolrJettyTestBase Randomized ssl (true) and clientAuth (false)
   [junit4]   2> 82612 T169 oas.SolrTestCaseJ4.initCore ####initCore
   [junit4]   2> Creating dataDir: /Users/jenkins/workspace/Lucene-Solr-4.x-MacOSX/solr/build/solr-solrj/test/J0/./solrtest-SolrExampleBinaryTest-1376971958930
   [junit4]   2> 82613 T169 oas.SolrTestCaseJ4.initCore ####initCore end
   [junit4]   2> 82614 T169 oejs.Server.doStart jetty-8.1.10.v20130312
   [junit4]   2> 82627 T169 oejus.SslContextFactory.doStart Enabled Protocols [SSLv2Hello, SSLv3, TLSv1] of [SSLv2Hello, SSLv3, TLSv1]
   [junit4]   2> 82634 T169 oejs.AbstractConnector.doStart Started SslSelectChannelConnector@127.0.0.1:55485
   [junit4]   2> 82637 T169 oass.SolrDispatchFilter.init SolrDispatchFilter.init()
   [junit4]   2> 82637 T169 oasc.SolrResourceLoader.locateSolrHome JNDI not configured for solr (NoInitialContextEx)
   [junit4]   2> 82638 T169 oasc.SolrResourceLoader.locateSolrHome using system property solr.solr.home: /Users/jenkins/workspace/Lucene-Solr-4.x-MacOSX/solr/example/solr
   [junit4]   2> 82638 T169 oasc.SolrResourceLoader.<init> new SolrResourceLoader for directory: '/Users/jenkins/workspace/Lucene-Solr-4.x-MacOSX/solr/example/solr/'
   [junit4]   2> 82691 T169 oasc.ConfigSolr.fromFile Loading container configuration from /Users/jenkins/workspace/Lucene-Solr-4.x-MacOSX/solr/example/solr/solr.xml
   [junit4]   2> 82806 T169 oasc.ConfigSolrXml.<init> Config-defined core root directory:
   [junit4]   2> 82807 T169 oasc.CoreContainer.<init> New CoreContainer 65949717
   [junit4]   2> 82808 T169 oasc.CoreContainer.load Loading cores into CoreContainer [instanceDir=/Users/jenkins/workspace/Lucene-Solr-4.x-MacOSX/solr/example/solr/]
   [junit4]   2> 82809 T169 oashc.HttpShardHandlerFactory.getParameter Setting socketTimeout to: 0
   [junit4]   2> 82809 T169 oashc.HttpShardHandlerFactory.getParameter Setting urlScheme to: http://
   [junit4]   2> 82809 T169 oashc.HttpShardHandlerFactory.getParameter Setting connTimeout to: 0
   [junit4]   2> 82810 T169 oashc.HttpShardHandlerFactory.getParameter Setting maxConnectionsPerHost to: 20
   [junit4]   2> 82810 T169 oashc.HttpShardHandlerFactory.getParameter Setting corePoolSize to: 0
   [junit4]   2> 82811 T169 oashc.HttpShardHandlerFactory.getParameter Setting maximumPoolSize to: 2147483647
   [junit4]   2> 82811 T169 oashc.HttpShardHandlerFactory.getParameter Setting maxThreadIdleTime to: 5
   [junit4]   2> 82811 T169 oashc.HttpShardHandlerFactory.getParameter Setting sizeOfQueue to: -1
   [junit4]   2> 82811 T169 oashc.HttpShardHandlerFactory.getParameter Setting fairnessPolicy to: false
   [junit4]   2> 82812 T169 oascsi.HttpClientUtil.createClient Creating new http client, config:maxConnectionsPerHost=20&maxConnections=10000&socketTimeout=0&connTimeout=0&retry=false
   [junit4]   2> 83306 T169 oasc.CorePropertiesLocator.discover Looking for core definitions underneath /Users/jenkins/workspace/Lucene-Solr-4.x-MacOSX/solr/example/solr
   [junit4]   2> 83320 T169 oasc.CorePropertiesLocator.discoverUnder Found core collection1 in /Users/jenkins/workspace/Lucene-Solr-4.x-MacOSX/solr/example/solr/collection1/
   [junit4]   2> 83321 T169 oasc.CorePropertiesLocator.discover Found 1 core definitions
   [junit4]   2> 83323 T179 oasc.CoreContainer.create Creating SolrCore 'collection1' using instanceDir: /Users/jenkins/workspace/Lucene-Solr-4.x-MacOSX/solr/example/solr/collection1
   [junit4]   2> 83323 T179 oasc.SolrResourceLoader.<init> new SolrResourceLoader for directory: '/Users/jenkins/workspace/Lucene-Solr-4.x-MacOSX/solr/example/solr/collection1/'
   [junit4]   2> 83372 T179 oasc.SolrConfig.initLibs Adding specified lib dirs to ClassLoader
   [junit4]   2> 83373 T179 oasc.SolrResourceLoader.addToClassLoader WARN No files added to classloader from lib: ../../../contrib/extraction/lib (resolved as: /Users/jenkins/workspace/Lucene-Solr-4.x-MacOSX/solr/example/solr/collection1/../../../contrib/extraction/lib).
   [junit4]   2> 83374 T179 oasc.SolrResourceLoader.addToClassLoader WARN Can't find (or read) directory to add to classloader: ../../../dist/ (resolved as: /Users/jenkins/workspace/Lucene-Solr-4.x-MacOSX/solr/example/solr/collection1/../../../dist).
   [junit4]   2> 83374 T179 oasc.SolrResourceLoader.addToClassLoader WARN No files added to classloader from lib: ../../../contrib/clustering/lib/ (resolved as: /Users/jenkins/workspace/Lucene-Solr-4.x-MacOSX/solr/example/solr/collection1/../../../contrib/clustering/lib).
   [junit4]   2> 83375 T179 oasc.SolrResourceLoader.addToClassLoader WARN Can't find (or read) directory to add to classloader: ../../../dist/ (resolved as: /Users/jenkins/workspace/Lucene-Solr-4.x-MacOSX/solr/example/solr/collection1/../../../dist).
   [junit4]   2> 83375 T179 oasc.SolrResourceLoader.addToClassLoader WARN No files added to classloader from lib: ../../../contrib/langid/lib/ (resolved as: /Users/jenkins/workspace/Lucene-Solr-4.x-MacOSX/solr/example/solr/collection1/../../../contrib/langid/lib).
   [junit4]   2> 83376 T179 oasc.SolrResourceLoader.addToClassLoader WARN Can't find (or read) directory to add to classloader: ../../../dist/ (resolved as: /Users/jenkins/workspace/Lucene-Solr-4.x-MacOSX/solr/example/solr/collection1/../../../dist).
   [junit4]   2> 83376 T179 oasc.SolrResourceLoader.addToClassLoader WARN No files added to classloader from lib: ../../../contrib/velocity/lib (resolved as: /Users/jenkins/workspace/Lucene-Solr-4.x-MacOSX/solr/example/solr/collection1/../../../contrib/velocity/lib).
   [junit4]   2> 83377 T179 oasc.SolrResourceLoader.addToClassLoader WARN Can't find (or read) directory to add to classloader: ../../../dist/ (resolved as: /Users/jenkins/workspace/Lucene-Solr-4.x-MacOSX/solr/example/solr/collection1/../../../dist).
   [junit4]   2> 83425 T179 oasu.SolrIndexConfig.<init> IndexWriter infoStream solr logging is enabled
   [junit4]   2> 83428 T179 oasc.SolrConfig.<init> Using Lucene MatchVersion: LUCENE_45
   [junit4]   2> 83559 T179 oasc.SolrConfig.<init> Loaded SolrConfig: solrconfig.xml
   [junit4]   2> 83561 T179 oass.IndexSchema.readSchema Reading Solr Schema from schema.xml
   [junit4]   2> 83606 T179 oass.IndexSchema.readSchema [null] Schema name=example
   [junit4]   2> 84515 T179 oass.IndexSchema.readSchema unique key field: id
   [junit4]   2> 84569 T179 oass.FileExchangeRateProvider.reload Reloading exchange rates from file currency.xml
   [junit4]   2> 84580 T179 oass.FileExchangeRateProvider.reload Reloading exchange rates from file currency.xml
   [junit4]   2> 84687 T179 oasc.SolrCore.initDirectoryFactory org.apache.solr.core.MockDirectoryFactory
   [junit4]   2> 84688 T179 oasc.SolrCore.<init> [collection1] Opening new SolrCore at /Users/jenkins/workspace/Lucene-Solr-4.x-MacOSX/solr/example/solr/collection1/, dataDir=/Users/jenkins/workspace/Lucene-Solr-4.x-MacOSX/solr/build/solr-solrj/test/J0/solrtest-SolrExampleBinaryTest-1376971958930/
   [junit4]   2> 84689 T179 oasc.JmxMonitoredMap.<init> JMX monitoring is enabled. Adding Solr mbeans to JMX Server: com.sun.jmx.mbeanserver.JmxMBeanServer@484845aa
   [junit4]   2> 84691 T179 oasc.SolrCore.initListeners [collection1] Added SolrEventListener for newSearcher: org.apache.solr.core.QuerySenderListener{queries=[]}
   [junit4]   2> 84691 T179 oasc.SolrCore.initListeners [collection1] Added SolrEventListener for firstSearcher: org.apache.solr.core.QuerySenderListener{queries=[{q=static firstSearcher warming in solrconfig.xml}]}
   [junit4]   2> 84693 T179 oasc.CachingDirectoryFactory.get return new directory for /Users/jenkins/workspace/Lucene-Solr-4.x-MacOSX/solr/build/solr-solrj/test/J0/solrtest-SolrExampleBinaryTest-1376971958930
   [junit4]   2> 84694 T179 oasc.SolrCore.getNewIndexDir New index directory detected: old=null new=/Users/jenkins/workspace/Lucene-Solr-4.x-MacOSX/solr/build/solr-solrj/test/J0/solrtest-SolrExampleBinaryTest-1376971958930/index/
   [junit4]   2> 84695 T179 oasc.SolrCore.initIndex WARN [collection1] Solr index directory '/Users/jenkins/workspace/Lucene-Solr-4.x-MacOSX/solr/build/solr-solrj/test/J0/solrtest-SolrExampleBinaryTest-1376971958930/index' doesn't exist. Creating new index...
   [junit4]   2> 84695 T179 oasc.CachingDirectoryFactory.get return new directory for /Users/jenkins/workspace/Lucene-Solr-4.x-MacOSX/solr/build/solr-solrj/test/J0/solrtest-SolrExampleBinaryTest-1376971958930/index
   [junit4]   2> 84699 T179 oasu.LoggingInfoStream.message [IFD][coreLoadExecutor-127-thread-1]: init: current segments file is "null"; deletionPolicy=org.apache.solr.core.IndexDeletionPolicyWrapper@5769aa0e
   [junit4]   2> 84700 T179 oasu.LoggingInfoStream.message [IFD][coreLoadExecutor-127-thread-1]: now checkpoint "" [0 segments ; isCommit = false]
   [junit4]   2> 84700 T179 oasu.LoggingInfoStream.message [IFD][coreLoadExecutor-127-thread-1]: 0 msec to checkpoint
   [junit4]   2> 84701 T179 oasu.LoggingInfoStream.message [IW][coreLoadExecutor-127-thread-1]: init: create=true
   [junit4]   2> 84701 T179 oasu.LoggingInfoStream.message [IW][coreLoadExecutor-127-thread-1]:
   [junit4]   2> dir=MockDirWrapper(org.apache.lucene.store.RAMDirectory@3486a602 lockFactory=org.apache.lucene.store.NativeFSLockFactory@10ca6ba3)
   [junit4]   2> index=
   [junit4]   2> version=4.5-SNAPSHOT
   [junit4]   2> matchVersion=LUCENE_45
   [junit4]   2> analyzer=null
   [junit4]   2> ramBufferSizeMB=100.0
   [junit4]   2> maxBufferedDocs=-1
   [junit4]   2> maxBufferedDeleteTerms=-1
   [junit4]   2> mergedSegmentWarmer=null
   [junit4]   2> readerTermsIndexDivisor=1
   [junit4]   2> termIndexInterval=32
   [junit4]   2> delPolicy=org.apache.solr.core.IndexDeletionPolicyWrapper
   [junit4]   2> commit=null
   [junit4]   2> openMode=CREATE
   [junit4]   2> similarity=org.apache.lucene.search.similarities.DefaultSimilarity
   [junit4]   2> mergeScheduler=ConcurrentMergeScheduler: maxThreadCount=1, maxMergeCount=2, mergeThreadPriority=-1
   [junit4]   2> default WRITE_LOCK_TIMEOUT=1000
   [junit4]   2> writeLockTimeout=1000
   [junit4]   2> codec=Lucene42
   [junit4]   2> infoStream=org.apache.solr.update.LoggingInfoStream
   [junit4]   2> mergePolicy=[TieredMergePolicy: maxMergeAtOnce=10, maxMergeAtOnceExplicit=30, maxMergedSegmentMB=5120.0, floorSegmentMB=2.0, forceMergeDeletesPctAllowed=10.0, segmentsPerTier=10.0, maxCFSSegmentSizeMB=8.796093022207999E12, noCFSRatio=0.0
   [junit4]   2> indexerThreadPool=org.apache.lucene.index.ThreadAffinityDocumentsWriterThreadPool@5a1ba9f7
   [junit4]   2> readerPooling=false
   [junit4]   2> perThreadHardLimitMB=1945
   [junit4]   2> useCompoundFile=false
   [junit4]   2>
   [junit4]   2> 84702 T179 oasu.LoggingInfoStream.message [IW][coreLoadExecutor-127-thread-1]: now flush at close waitForMerges=true
   [junit4]   2> 84703 T179 oasu.LoggingInfoStream.message [IW][coreLoadExecutor-127-thread-1]:   start flush: applyAllDeletes=true
   [junit4]   2> 84704 T179 oasu.LoggingInfoStream.message [IW][coreLoadExecutor-127-thread-1]:   index before flush
   [junit4]   2> 84705 T179 oasu.LoggingInfoStream.message [DW][coreLoadExecutor-127-thread-1]: coreLoadExecutor-127-thread-1 startFullFlush
   [junit4]   2> 84706 T179 oasu.LoggingInfoStream.message [DW][coreLoadExecutor-127-thread-1]: anyChanges? numDocsInRam=0 deletes=false hasTickets:false pendingChangesInFullFlush: false
   [junit4]   2> 84707 T179 oasu.LoggingInfoStream.message [DW][coreLoadExecutor-127-thread-1]: coreLoadExecutor-127-thread-1 finishFullFlush success=true
   [junit4]   2> 84707 T179 oasu.LoggingInfoStream.message [IW][coreLoadExecutor-127-thread-1]: apply all deletes during flush
   [junit4]   2> 84708 T179 oasu.LoggingInfoStream.message [BD][coreLoadExecutor-127-thread-1]: prune sis=org.apache.lucene.index.SegmentInfos@4e33c558 minGen=9223372036854775807 packetCount=0
   [junit4]   2> 84709 T179 oasu.LoggingInfoStream.message [CMS][coreLoadExecutor-127-thread-1]: now merge
   [junit4]   2> 84709 T179 oasu.LoggingInfoStream.message [CMS][coreLoadExecutor-127-thread-1]:   index:
   [junit4]   2> 84710 T179 oasu.LoggingInfoStream.message [CMS][coreLoadExecutor-127-thread-1]:   no more merges pending; now return
   [junit4]   2> 84711 T179 oasu.LoggingInfoStream.message [IW][coreLoadExecutor-127-thread-1]: waitForMerges
   [junit4]   2> 84711 T179 oasu.LoggingInfoStream.message [IW][coreLoadExecutor-127-thread-1]: waitForMerges done
   [junit4]   2> 84712 T179 oasu.LoggingInfoStream.message [IW][coreLoadExecutor-127-thread-1]: now call final commit()
   [junit4]   2> 84712 T179 oasu.LoggingInfoStream.message [IW][coreLoadExecutor-127-thread-1]: commit: start
   [junit4]   2> 84713 T179 oasu.LoggingInfoStream.message [IW][coreLoadExecutor-127-thread-1]: commit: enter lock
   [junit4]   2> 84713 T179 oasu.LoggingInfoStream.message [IW][coreLoadExecutor-127-thread-1]: commit: now prepare
   [junit4]   2> 84714 T179 oasu.LoggingInfoStream.message [IW][coreLoadExecutor-127-thread-1]: prepareCommit: flush
   [junit4]   2> 84715 T179 oasu.LoggingInfoStream.message [IW][coreLoadExecutor-127-thread-1]:   index before flush
   [junit4]   2> 84715 T179 oasu.LoggingInfoStream.message [DW][coreLoadExecutor-127-thread-1]: coreLoadExecutor-127-thread-1 startFullFlush
   [junit4]   2> 84716 T179 oasu.LoggingInfoStream.message [DW][coreLoadExecutor-127-thread-1]: anyChanges? numDocsInRam=0 deletes=false hasTickets:false pendingChangesInFullFlush: false
   [junit4]   2> 84716 T179 oasu.LoggingInfoStream.message [IW][coreLoadExecutor-127-thread-1]: apply all deletes during flush
   [junit4]   2> 84717 T179 oasu.LoggingInfoStream.message [BD][coreLoadExecutor-127-thread-1]: prune sis=org.apache.lucene.index.SegmentInfos@4e33c558 minGen=9223372036854775807 packetCount=0
   [junit4]   2> 84718 T179 oasu.LoggingInfoStream.message [DW][coreLoadExecutor-127-thread-1]: coreLoadExecutor-127-thread-1 finishFullFlush success=true
   [junit4]   2> 84718 T179 oasu.LoggingInfoStream.message [IW][coreLoadExecutor-127-thread-1]: startCommit(): start
   [junit4]   2> 84719 T179 oasu.LoggingInfoStream.message [IW][coreLoadExecutor-127-thread-1]: startCommit index= changeCount=1
   [junit4]   2> 84720 T179 oasu.LoggingInfoStream.message [IW][coreLoadExecutor-127-thread-1]: done all syncs: []
   [junit4]   2> 84720 T179 oasu.LoggingInfoStream.message [IW][coreLoadExecutor-127-thread-1]: commit: pendingCommit != null
   [junit4]   2> 84721 T179 oasu.LoggingInfoStream.message [IW][coreLoadExecutor-127-thread-1]: commit: wrote segments file "segments_1"
   [junit4]   2> 84722 T179 oasu.LoggingInfoStream.message [IFD][coreLoadExecutor-127-thread-1]: now checkpoint "" [0 segments ; isCommit = true]
   [junit4]   2> 84723 T179 oasc.SolrDeletionPolicy.onCommit SolrDeletionPolicy.onCommit: commits: num=1
   [junit4]   2> commit{dir=MockDirWrapper(org.apache.lucene.store.RAMDirectory@3486a602 lockFactory=org.apache.lucene.store.NativeFSLockFactory@10ca6ba3),segFN=segments_1,generation=1}
   [junit4]   2> 84723 T179 oasc.SolrDeletionPolicy.updateCommits newest commit generation = 1
   [junit4]   2> 84724 T179 oasu.LoggingInfoStream.message [IFD][coreLoadExecutor-127-thread-1]: 2 msec to checkpoint
   [junit4]   2> 84725 T179 oasu.LoggingInfoStream.message [IW][coreLoadExecutor-127-thread-1]: commit: done
   [junit4]   2> 84725 T179 oasu.LoggingInfoStream.message [IW][coreLoadExecutor-127-thread-1]: at close:
   [junit4]   2> 84727 T179 oasc.SolrCore.initWriters created json: solr.JSONResponseWriter
   [junit4]   2> 84728 T179 oasc.SolrCore.initWriters adding lazy queryResponseWriter: solr.VelocityResponseWriter
   [junit4]   2> 84728 T179 oasc.SolrCore.initWriters created velocity: solr.VelocityResponseWriter
   [junit4]   2> 84729 T179 oasc.SolrCore.initWriters created xslt: solr.XSLTResponseWriter
   [junit4]   2> 84729 T179 oasr.XSLTResponseWriter.init xsltCacheLifetimeSeconds=5
   [junit4]   2> 84745 T179 oasc.SolrCore.loadUpdateProcessorChains no updateRequestProcessorChain defined as default, creating implicit default
   [junit4]   2> 84747 T179 oasc.RequestHandlers.initHandlersFromConfig created /select: solr.SearchHandler
   [junit4]   2> 84749 T179 oasc.RequestHandlers.initHandlersFromConfig created /query: solr.SearchHandler
   [junit4]   2> 84752 T179 oasc.RequestHandlers.initHandlersFromConfig created /get: solr.RealTimeGetHandler
   [junit4]   2> 84754 T179 oasc.RequestHandlers.initHandlersFromConfig created /browse: solr.SearchHandler
   [junit4]   2> 84756 T179 oasc.RequestHandlers.initHandlersFromConfig created /update: solr.UpdateRequestHandler
   [junit4]   2> 84758 T179 oasc.RequestHandlers.initHandlersFromConfig created /update/json: solr.JsonUpdateRequestHandler
   [junit4]   2> 84760 T179 oasc.RequestHandlers.initHandlersFromConfig created /update/csv: solr.CSVRequestHandler
   [junit4]   2> 84761 T179 oasc.RequestHandlers.initHandlersFromConfig adding lazy requestHandler: solr.extraction.ExtractingRequestHandler
   [junit4]   2> 84762 T179 oasc.RequestHandlers.initHandlersFromConfig created /update/extract: solr.extraction.ExtractingRequestHandler
   [junit4]   2> 84763 T179 oasc.RequestHandlers.initHandlersFromConfig adding lazy requestHandler: solr.FieldAnalysisRequestHandler
   [junit4]   2> 84764 T179 oasc.RequestHandlers.initHandlersFromConfig created /analysis/field: solr.FieldAnalysisRequestHandler
   [junit4]   2> 84764 T179 oasc.RequestHandlers.initHandlersFromConfig adding lazy requestHandler: solr.DocumentAnalysisRequestHandler
   [junit4]   2> 84765 T179 oasc.RequestHandlers.initHandlersFromConfig created /analysis/document: solr.DocumentAnalysisRequestHandler
   [junit4]   2> 84767 T179 oasc.RequestHandlers.initHandlersFromConfig created /admin/: solr.admin.AdminHandlers
   [junit4]   2> 84769 T179 oasc.RequestHandlers.initHandlersFromConfig created /admin/ping: solr.PingRequestHandler
   [junit4]   2> 84771 T179 oasc.RequestHandlers.initHandlersFromConfig created /debug/dump: solr.DumpRequestHandler
   [junit4]   2> 84773 T179 oasc.RequestHandlers.initHandlersFromConfig created /replication: solr.ReplicationHandler
   [junit4]   2> 84773 T179 oasc.RequestHandlers.initHandlersFromConfig adding lazy requestHandler: solr.SearchHandler
   [junit4]   2> 84774 T179 oasc.RequestHandlers.initHandlersFromConfig created /spell: solr.SearchHandler
   [junit4]   2> 84774 T179 oasc.RequestHandlers.initHandlersFromConfig adding lazy requestHandler: solr.SearchHandler
   [junit4]   2> 84775 T179 oasc.RequestHandlers.initHandlersFromConfig created /tvrh: solr.SearchHandler
   [junit4]   2> 84775 T179 oasc.RequestHandlers.initHandlersFromConfig adding lazy requestHandler: org.apache.solr.handler.js.JavaScriptRequestHandler
   [junit4]   2> 84776 T179 oasc.RequestHandlers.initHandlersFromConfig created /js: org.apache.solr.handler.js.JavaScriptRequestHandler
   [junit4]   2> 84776 T179 oasc.RequestHandlers.initHandlersFromConfig adding lazy requestHandler: solr.SearchHandler
   [junit4]   2> 84777 T179 oasc.RequestHandlers.initHandlersFromConfig created /terms: solr.SearchHandler
   [junit4]   2> 84777 T179 oasc.RequestHandlers.initHandlersFromConfig adding lazy requestHandler: solr.SearchHandler
   [junit4]   2> 84778 T179 oasc.RequestHandlers.initHandlersFromConfig created /elevate: solr.SearchHandler
   [junit4]   2> 84786 T179 oashl.XMLLoader.init xsltCacheLifetimeSeconds=60
   [junit4]   2> 84789 T179 oashl.XMLLoader.init xsltCacheLifetimeSeconds=60
   [junit4]   2> 84792 T179 oashl.XMLLoader.init xsltCacheLifetimeSeconds=60
   [junit4]   2> 84801 T179 oasu.CommitTracker.<init> Hard AutoCommit: if uncommited for 15000ms;
   [junit4]   2> 84802 T179 oasu.CommitTracker.<init> Soft AutoCommit: disabled
   [junit4]   2> 84805 T179 oasu.LoggingInfoStream.message [IFD][coreLoadExecutor-127-thread-1]: init: current segments file is "segments_1"; deletionPolicy=org.apache.solr.core.IndexDeletionPolicyWrapper@5769aa0e
   [junit4]   2> 84805 T179 oasu.LoggingInfoStream.message [IFD][coreLoadExecutor-127-thread-1]: init: load commit "segments_1"
   [junit4]   2> 84806 T179 oasc.SolrDeletionPolicy.onInit SolrDeletionPolicy.onInit: commits: num=1
   [junit4]   2> commit{dir=MockDirWrapper(org.apache.lucene.store.RAMDirectory@3486a602 lockFactory=org.apache.lucene.store.NativeFSLockFactory@10ca6ba3),segFN=segments_1,generation=1}
   [junit4]   2> 84806 T179 oasc.SolrDeletionPolicy.updateCommits newest commit generation = 1
   [junit4]   2> 84807 T179 oasu.LoggingInfoStream.message [IFD][coreLoadExecutor-127-thread-1]: now checkpoint "" [0 segments ; isCommit = false]
   [junit4]   2> 84807 T179 oasu.LoggingInfoStream.message [IFD][coreLoadExecutor-127-thread-1]: 0 msec to checkpoint
   [junit4]   2> 84808 T179 oasu.LoggingInfoStream.message [IW][coreLoadExecutor-127-thread-1]: init: create=false
   [junit4]   2> 84808 T179 oasu.LoggingInfoStream.message [IW][coreLoadExecutor-127-thread-1]:
   [junit4]   2> dir=MockDirWrapper(org.apache.lucene.store.RAMDirectory@3486a602 lockFactory=org.apache.lucene.store.NativeFSLockFactory@10ca6ba3)
   [junit4]   2> index=
   [junit4]   2> version=4.5-SNAPSHOT
   [junit4]   2> matchVersion=LUCENE_45
   [junit4]   2> analyzer=null
   [junit4]   2> ramBufferSizeMB=100.0
   [junit4]   2> maxBufferedDocs=-1
   [junit4]   2> maxBufferedDeleteTerms=-1
   [junit4]   2> mergedSegmentWarmer=null
   [junit4]   2> readerTermsIndexDivisor=1
   [junit4]   2> termIndexInterval=32
   [junit4]   2> delPolicy=org.apache.solr.core.IndexDeletionPolicyWrapper
   [junit4]   2> commit=null
   [junit4]   2> openMode=APPEND
   [junit4]   2> similarity=org.apache.lucene.search.similarities.DefaultSimilarity
   [junit4]   2> mergeScheduler=ConcurrentMergeScheduler: maxThreadCount=1, maxMergeCount=2, mergeThreadPriority=-1
   [junit4]   2> default WRITE_LOCK_TIMEOUT=1000
   [junit4]   2> writeLockTimeout=1000
   [junit4]   2> codec=Lucene42
   [junit4]   2> infoStream=org.apache.solr.update.LoggingInfoStream
   [junit4]   2> mergePolicy=[TieredMergePolicy: maxMergeAtOnce=10, maxMergeAtOnceExplicit=30, maxMergedSegmentMB=5120.0, floorSegmentMB=2.0, forceMergeDeletesPctAllowed=10.0, segmentsPerTier=10.0, maxCFSSegmentSizeMB=8.796093022207999E12, noCFSRatio=0.0
   [junit4]   2> indexerThreadPool=org.apache.lucene.index.ThreadAffinityDocumentsWriterThreadPool@323ba00
   [junit4]   2> readerPooling=false
   [junit4]   2> perThreadHardLimitMB=1945
   [junit4]   2> useCompoundFile=false
   [junit4]   2>
   [junit4]   2> 84809 T179 oasu.LoggingInfoStream.message [IW][coreLoadExecutor-127-thread-1]: flush at getReader
   [junit4]   2> 84809 T179 oasu.LoggingInfoStream.message [DW][coreLoadExecutor-127-thread-1]: coreLoadExecutor-127-thread-1 startFullFlush
   [junit4]   2> 84809 T179 oasu.LoggingInfoStream.message [DW][coreLoadExecutor-127-thread-1]: anyChanges? numDocsInRam=0 deletes=false hasTickets:false pendingChangesInFullFlush: false
   [junit4]   2> 84810 T179 oasu.LoggingInfoStream.message [IW][coreLoadExecutor-127-thread-1]: apply all deletes during flush
   [junit4]   2> 84811 T179 oasu.LoggingInfoStream.message [BD][coreLoadExecutor-127-thread-1]: prune sis=org.apache.lucene.index.SegmentInfos@1e88579c minGen=9223372036854775807 packetCount=0
   [junit4]   2> 84811 T179 oasu.LoggingInfoStream.message [IW][coreLoadExecutor-127-thread-1]: return reader version=1 reader=StandardDirectoryReader(segments_1:1:nrt)
   [junit4]   2> 84811 T179 oasu.LoggingInfoStream.message [DW][coreLoadExecutor-127-thread-1]: coreLoadExecutor-127-thread-1 finishFullFlush success=true
   [junit4]   2> 84812 T179 oasu.LoggingInfoStream.message [IW][coreLoadExecutor-127-thread-1]: getReader took 3 msec
   [junit4]   2> 84813 T179 oass.SolrIndexSearcher.<init> Opening Searcher@229ff6d1 main
   [junit4]   2> 84814 T179 oashc.SpellCheckComponent.inform Initializing spell checkers
   [junit4]   2> 84814 T179 oass.DirectSolrSpellChecker.init init: {name=default,field=text,classname=solr.DirectSolrSpellChecker,distanceMeasure=internal,accuracy=0.5,maxEdits=2,minPrefix=1,maxInspections=5,minQueryLength=4,maxQueryFrequency=0.01}
   [junit4]   2> 84815 T179 oashc.SpellCheckComponent.inform No queryConverter defined, using default converter
   [junit4]   2> 84816 T179 oashc.QueryElevationComponent.inform Loading QueryElevation from: /Users/jenkins/workspace/Lucene-Solr-4.x-MacOSX/solr/example/solr/collection1/conf/elevate.xml
   [junit4]   2> 84870 T179 oash.ReplicationHandler.inform Commits will be reserved for  10000
   [junit4]   2> 84871 T180 oasc.QuerySenderListener.newSearcher QuerySenderListener sending requests to Searcher@229ff6d1 main{StandardDirectoryReader(segments_1:1:nrt)}
   [junit4]   2> ASYNC  NEW_CORE C74 name=collection1 org.apache.solr.core.SolrCore@78c4f9e6
   [junit4]   2> 84875 T180 C74 oasc.SolrCore.execute [collection1] webapp=null path=null params={event=firstSearcher&q=static+firstSearcher+warming+in+solrconfig.xml&distrib=false} hits=0 status=0 QTime=3
   [junit4]   2> 84875 T180 oasc.QuerySenderListener.newSearcher QuerySenderListener done.
   [junit4]   2> 84876 T180 oashc.SpellCheckComponent$SpellCheckerListener.newSearcher Loading spell index for spellchecker: default
   [junit4]   2> 84876 T180 oashc.SpellCheckComponent$SpellCheckerListener.newSearcher Loading spell index for spellchecker: wordbreak
   [junit4]   2> 84887 T180 oasc.SolrCore.registerSearcher [collection1] Registered new searcher Searcher@229ff6d1 main{StandardDirectoryReader(segments_1:1:nrt)}
   [junit4]   2> 84952 T179 oasc.CoreContainer.registerCore registering core: collection1
   [junit4]   2> 84956 T169 oass.SolrDispatchFilter.init user.dir=/Users/jenkins/workspace/Lucene-Solr-4.x-MacOSX/solr/build/solr-solrj/test/J0
   [junit4]   2> 85021 T169 oass.SolrDispatchFilter.init SolrDispatchFilter.init() done
   [junit4]   2> 85022 T169 oas.SolrJettyTestBase.createJetty Jetty Assigned Port#55485
   [junit4]   2> 85104 T169 oas.SolrTestCaseJ4.setUp ###Starting testErrorHandling
   [junit4]   2> 85105 T169 oascsi.HttpClientUtil.createClient Creating new http client, config:maxConnections=128&maxConnectionsPerHost=32&followRedirects=false
   [junit4]   2> 85232 T175 C74 oasc.SolrException.log Ignoring exception matching ignore_exception
   [junit4]   2> 85233 T175 C74 oasc.SolrCore.execute [collection1] webapp=/solr path=/analysis/field params={analysis.fieldtype=int&wt=javabin&qt=/analysis/field&analysis.fieldvalue=ignore_exception&version=2} status=400 QTime=2
   [junit4]   2> 85263 T176 C74 oasup.LogUpdateProcessor.finish [collection1] webapp=/solr path=/update params={wt=javabin&version=2} {} 0 6
   [junit4]   2> 85266 T176 C74 oasc.SolrException.log Ignoring exception matching ignore_exception
   [junit4]   2> 85278 T177 C74 oasup.LogUpdateProcessor.finish [collection1] webapp=/solr path=/update params={wt=javabin&version=2} {} 0 1
   [junit4]   2> 85280 T177 C74 oasc.SolrException.log ERROR org.apache.solr.common.SolrException: Document contains multiple values for uniqueKey field: id=[DOCID, DOCID2]
   [junit4]   2> at org.apache.solr.update.AddUpdateCommand.getIndexedId(AddUpdateCommand.java:96)
   [junit4]   2> at org.apache.solr.update.processor.DistributedUpdateProcessor.versionAdd(DistributedUpdateProcessor.java:569)
   [junit4]   2> at org.apache.solr.update.processor.DistributedUpdateProcessor.processAdd(DistributedUpdateProcessor.java:435)
   [junit4]   2> at org.apache.solr.update.processor.LogUpdateProcessor.processAdd(LogUpdateProcessorFactory.java:100)
   [junit4]   2> at org.apache.solr.handler.loader.JavabinLoader$1.update(JavabinLoader.java:86)
   [junit4]   2> at org.apache.solr.client.solrj.request.JavaBinUpdateRequestCodec$1.readOuterMostDocIterator(JavaBinUpdateRequestCodec.java:143)
   [junit4]   2> at org.apache.solr.client.solrj.request.JavaBinUpdateRequestCodec$1.readIterator(JavaBinUpdateRequestCodec.java:123)
   [junit4]   2> at org.apache.solr.common.util.JavaBinCodec.readVal(JavaBinCodec.java:222)
   [junit4]   2> at org.apache.solr.client.solrj.request.JavaBinUpdateRequestCodec$1.readNamedList(JavaBinUpdateRequestCodec.java:108)
   [junit4]   2> at org.apache.solr.common.util.JavaBinCodec.readVal(JavaBinCodec.java:187)
   [junit4]   2> at org.apache.solr.common.util.JavaBinCodec.unmarshal(JavaBinCodec.java:113)
   [junit4]   2> at org.apache.solr.client.solrj.request.JavaBinUpdateRequestCodec.unmarshal(JavaBinUpdateRequestCodec.java:150)
   [junit4]   2> at org.apache.solr.handler.loader.JavabinLoader.parseAndLoadDocs(JavabinLoader.java:96)
   [junit4]   2> at org.apache.solr.handler.loader.JavabinLoader.load(JavabinLoader.java:55)
   [junit4]   2> at org.apache.solr.handler.UpdateRequestHandler$1.load(UpdateRequestHandler.java:92)
   [junit4]   2> at org.apache.solr.handler.ContentStreamHandlerBase.handleRequestBody(ContentStreamHandlerBase.java:74)
   [junit4]   2> at org.apache.solr.handler.RequestHandlerBase.handleRequest(RequestHandlerBase.java:135)
   [junit4]   2> at org.apache.solr.core.SolrCore.execute(SolrCore.java:1850)
   [junit4]   2> at org.apache.solr.servlet.SolrDispatchFilter.execute(SolrDispatchFilter.java:703)
   [junit4]   2> at org.apache.solr.servlet.SolrDispatchFilter.doFilter(SolrDispatchFilter.java:406)
   [junit4]   2> at org.apache.solr.servlet.SolrDispatchFilter.doFilter(SolrDispatchFilter.java:195)
   [junit4]   2> at org.eclipse.jetty.servlet.ServletHandler$CachedChain.doFilter(ServletHandler.java:1419)
   [junit4]   2> at org.apache.solr.client.solrj.embedded.JettySolrRunner$DebugFilter.doFilter(JettySolrRunner.java:135)
   [junit4]   2> at org.eclipse.jetty.servlet.ServletHandler$CachedChain.doFilter(ServletHandler.java:1419)
   [junit4]   2> at org.eclipse.jetty.servlet.ServletHandler.doHandle(ServletHandler.java:455)
   [junit4]   2> at org.eclipse.jetty.server.session.SessionHandler.doHandle(SessionHandler.java:229)
   [junit4]   2> at org.eclipse.jetty.server.handler.ScopedHandler.handle(ScopedHandler.java:137)
   [junit4]   2> at org.eclipse.jetty.server.handler.GzipHandler.handle(GzipHandler.java:301)
   [junit4]   2> at org.eclipse.jetty.server.handler.ContextHandler.doHandle(ContextHandler.java:1077)
   [junit4]   2> at org.eclipse.jetty.servlet.ServletHandler.doScope(ServletHandler.java:384)
   [junit4]   2> at org.eclipse.jetty.server.session.SessionHandler.doScope(SessionHandler.java:193)
   [junit4]   2> at org.eclipse.jetty.server.handler.ContextHandler.doScope(ContextHandler.java:1009)
   [junit4]   2> at org.eclipse.jetty.server.handler.ScopedHandler.handle(ScopedHandler.java:135)
   [junit4]   2> at org.eclipse.jetty.server.handler.HandlerWrapper.handle(HandlerWrapper.java:116)
   [junit4]   2> at org.eclipse.jetty.server.Server.handle(Server.java:368)
   [junit4]   2> at org.eclipse.jetty.server.AbstractHttpConnection.handleRequest(AbstractHttpConnection.java:489)
   [junit4]   2> at org.eclipse.jetty.server.AbstractHttpConnection.content(AbstractHttpConnection.java:953)
   [junit4]   2> at org.eclipse.jetty.server.AbstractHttpConnection$RequestHandler.content(AbstractHttpConnection.java:1014)
   [junit4]   2> at org.eclipse.jetty.http.HttpParser.parseNext(HttpParser.java:953)
   [junit4]   2> at org.eclipse.jetty.http.HttpParser.parseAvailable(HttpParser.java:240)
   [junit4]   2> at org.eclipse.jetty.server.AsyncHttpConnection.handle(AsyncHttpConnection.java:82)
   [junit4]   2> at org.eclipse.jetty.io.nio.SslConnection.handle(SslConnection.java:196)
   [junit4]   2> at org.eclipse.jetty.io.nio.SelectChannelEndPoint.handle(SelectChannelEndPoint.java:628)
   [junit4]   2> at org.eclipse.jetty.io.nio.SelectChannelEndPoint$1.run(SelectChannelEndPoint.java:52)
   [junit4]   2> at org.eclipse.jetty.util.thread.QueuedThreadPool.runJob(QueuedThreadPool.java:608)
   [junit4]   2> at org.eclipse.jetty.util.thread.QueuedThreadPool$3.run(QueuedThreadPool.java:543)
   [junit4]   2> at java.lang.Thread.run(Thread.java:680)
   [junit4]   2>
   [junit4]   2> 85285 T169 oas.SolrTestCaseJ4.tearDown ###Ending testErrorHandling
   [junit4]   2> 85337 T169 oas.SolrTestCaseJ4.setUp ###Starting testRealtimeGet
   [junit4]   2> 85349 T178 C74 oasu.LoggingInfoStream.message [DW][qtp1495064932-178]: anyChanges? numDocsInRam=0 deletes=true hasTickets:false pendingChangesInFullFlush: false
   [junit4]   2> 85351 T178 C74 oasu.LoggingInfoStream.message [IW][qtp1495064932-178]: nrtIsCurrent: infoVersion matches: true; DW changes: true; BD changes: false
   [junit4]   2> 85352 T178 C74 oasu.LoggingInfoStream.message [DW][qtp1495064932-178]: anyChanges? numDocsInRam=0 deletes=true hasTickets:false pendingChangesInFullFlush: false
   [junit4]   2> 85353 T178 C74 oasu.LoggingInfoStream.message [IW][qtp1495064932-178]: flush at getReader
   [junit4]   2> 85355 T178 C74 oasu.LoggingInfoStream.message [DW][qtp1495064932-178]: qtp1495064932-178 startFullFlush
   [junit4]   2> 85356 T178 C74 oasu.LoggingInfoStream.message [DW][qtp1495064932-178]: anyChanges? numDocsInRam=0 deletes=true hasTickets:false pendingChangesInFullFlush: false
   [junit4]   2> 85357 T178 C74 oasu.LoggingInfoStream.message [DW][qtp1495064932-178]: qtp1495064932-178: flush naked frozen global deletes
   [junit4]   2> 85359 T178 C74 oasu.LoggingInfoStream.message [BD][qtp1495064932-178]: push deletes  1 deleted queries bytesUsed=32 delGen=2 packetCount=1 totBytesUsed=32
   [junit4]   2> 85359 T178 C74 oasu.LoggingInfoStream.message [DW][qtp1495064932-178]: flush: push buffered deletes:  1 deleted queries bytesUsed=32
   [junit4]   2> 85359 T178 C74 oasu.LoggingInfoStream.message [IW][qtp1495064932-178]: apply all deletes during flush
   [junit4]   2> 85359 T178 C74 oasu.LoggingInfoStream.message [BD][qtp1495064932-178]: prune sis=org.apache.lucene.index.SegmentInfos@1e88579c minGen=9223372036854775807 packetCount=1
   [junit4]   2> 85360 T178 C74 oasu.LoggingInfoStream.message [BD][qtp1495064932-178]: pruneDeletes: prune 1 packets; 0 packets remain
   [junit4]   2> 85360 T178 C74 oasu.LoggingInfoStream.message [IW][qtp1495064932-178]: return reader version=1 reader=StandardDirectoryReader(segments_1:1:nrt)
   [junit4]   2> 85361 T178 C74 oasu.LoggingInfoStream.message [DW][qtp1495064932-178]: qtp1495064932-178 finishFullFlush success=true
   [junit4]   2> 85361 T178 C74 oasu.LoggingInfoStream.message [IW][qtp1495064932-178]: getReader took 9 msec
   [junit4]   2> 85362 T178 C74 oasup.LogUpdateProcessor.finish [collection1] webapp=/solr path=/update params={wt=javabin&version=2} {deleteByQuery=*:* (-1443859751671693312)} 0 19
   [junit4]   2> 85369 T173 C74 oasup.LogUpdateProcessor.finish [collection1] webapp=/solr path=/update params={wt=javabin&version=2} {add=[DOCID (1443859751695810560)]} 0 2
   [junit4]   2> 85376 T174 C74 oasu.DirectUpdateHandler2.commit start commit{,optimize=false,openSearcher=true,waitSearcher=true,expungeDeletes=false,softCommit=false,prepareCommit=false}
   [junit4]   2> 85377 T174 C74 oasu.LoggingInfoStream.message [IW][qtp1495064932-174]: commit: start
   [junit4]   2> 85377 T174 C74 oasu.LoggingInfoStream.message [IW][qtp1495064932-174]: commit: enter lock
   [junit4]   2> 85378 T174 C74 oasu.LoggingInfoStream.message [IW][qtp1495064932-174]: commit: now prepare
   [junit4]   2> 85379 T174 C74 oasu.LoggingInfoStream.message [IW][qtp1495064932-174]: prepareCommit: flush
   [junit4]   2> 85379 T174 C74 oasu.LoggingInfoStream.message [IW][qtp1495064932-174]:   index before flush
   [junit4]   2> 85380 T174 C74 oasu.LoggingInfoStream.message [DW][qtp1495064932-174]: qtp1495064932-174 startFullFlush
   [junit4]   2> 85380 T174 C74 oasu.LoggingInfoStream.message [DW][qtp1495064932-174]: anyChanges? numDocsInRam=1 deletes=true hasTickets:false pendingChangesInFullFlush: false
   [junit4]   2> 85381 T174 C74 oasu.LoggingInfoStream.message [DWFC][qtp1495064932-174]: addFlushableState DocumentsWriterPerThread [pendingDeletes=gen=0, segment=_0, aborting=false, numDocsInRAM=1, deleteQueue=DWDQ: [ generation: 2 ]]
   [junit4]   2> 85382 T174 C74 oasu.LoggingInfoStream.message [DWPT][qtp1495064932-174]: flush postings as segment _0 numDocs=1
   [junit4]   2> 85385 T174 C74 oasu.LoggingInfoStream.message [DWPT][qtp1495064932-174]: new segment has 0 deleted docs
   [junit4]   2> 85386 T174 C74 oasu.LoggingInfoStream.message [DWPT][qtp1495064932-174]: new segment has no vectors; norms; no docValues; prox; freqs
   [junit4]   2> 85387 T174 C74 oasu.LoggingInfoStream.message [DWPT][qtp1495064932-174]: flushedFiles=[_0.fnm, _0_Lucene41_0.doc, _0_Lucene41_0.pos, _0.nvd, _0.fdx, _0.nvm, _0_Lucene41_0.tim, _0_Lucene41_0.tip, _0.fdt]
   [junit4]   2> 85387 T174 C74 oasu.LoggingInfoStream.message [DWPT][qtp1495064932-174]: flushed codec=Lucene42
   [junit4]   2> 85389 T174 C74 oasu.LoggingInfoStream.message [DWPT][qtp1495064932-174]: flushed: segment=_0 ramUsed=0.079 MB newFlushedSize(includes docstores)=0.001 MB docs/MB=1,084.36
   [junit4]   2> 85390 T174 C74 oasu.LoggingInfoStream.message [DW][qtp1495064932-174]: publishFlushedSegment seg-private deletes=null
   [junit4]   2> 85391 T174 C74 oasu.LoggingInfoStream.message [IW][qtp1495064932-174]: publishFlushedSegment
   [junit4]   2> 85392 T174 C74 oasu.LoggingInfoStream.message [BD][qtp1495064932-174]: push deletes  1 deleted terms (unique count=1) bytesUsed=1024 delGen=4 packetCount=1 totBytesUsed=1024
   [junit4]   2> 85392 T174 C74 oasu.LoggingInfoStream.message [IW][qtp1495064932-174]: publish sets newSegment delGen=5 seg=_0(4.5):C1
   [junit4]   2> 85393 T174 C74 oasu.LoggingInfoStream.message [IFD][qtp1495064932-174]: now checkpoint "_0(4.5):C1" [1 segments ; isCommit = false]
   [junit4]   2> 85393 T174 C74 oasu.LoggingInfoStream.message [IFD][qtp1495064932-174]: 0 msec to checkpoint
   [junit4]   2> 85394 T174 C74 oasu.LoggingInfoStream.message [IW][qtp1495064932-174]: apply all deletes during flush
   [junit4]   2> 85395 T174 C74 oasu.LoggingInfoStream.message [BD][qtp1495064932-174]: applyDeletes: infos=[_0(4.5):C1] packetCount=1
   [junit4]   2> 85395 T174 C74 oasu.LoggingInfoStream.message [BD][qtp1495064932-174]: applyDeletes took 0 msec
   [junit4]   2> 85396 T174 C74 oasu.LoggingInfoStream.message [BD][qtp1495064932-174]: prune sis=org.apache.lucene.index.SegmentInfos@1e88579c minGen=6 packetCount=1
   [junit4]   2> 85397 T174 C74 oasu.LoggingInfoStream.message [BD][qtp1495064932-174]: pruneDeletes: prune 1 packets; 0 packets remain
   [junit4]   2> 85398 T174 C74 oasu.LoggingInfoStream.message [DW][qtp1495064932-174]: qtp1495064932-174 finishFullFlush success=true
   [junit4]   2> 85399 T174 C74 oasu.LoggingInfoStream.message [TMP][qtp1495064932-174]: findMerges: 1 segments
   [junit4]   2> 85400 T174 C74 oasu.LoggingInfoStream.message [TMP][qtp1495064932-174]:   seg=_0(4.5):C1 size=0.001 MB [floored]
   [junit4]   2> 85401 T174 C74 oasu.LoggingInfoStream.message [TMP][qtp1495064932-174]:   allowedSegmentCount=1 vs count=1 (eligible count=1) tooBigCount=0
   [junit4]   2> 85401 T174 C74 oasu.LoggingInfoStream.message [CMS][qtp1495064932-174]: now merge
   [junit4]   2> 85402 T174 C74 oasu.LoggingInfoStream.message [CMS][qtp1495064932-174]:   index: _0(4.5):C1
   [junit4]   2> 85402 T174 C74 oasu.LoggingInfoStream.message [CMS][qtp1495064932-174]:   no more merges pending; now return
   [junit4]   2> 85403 T174 C74 oasu.LoggingInfoStream.message [IW][qtp1495064932-174]: startCommit(): start
   [junit4]   2> 85404 T174 C74 oasu.LoggingInfoStream.message [IW][qtp1495064932-174]: startCommit index=_0(4.5):C1 changeCount=3
   [junit4]   2> 85405 T174 C74 oasu.LoggingInfoStream.message [IW][qtp1495064932-174]: done all syncs: [_0.fnm, _0_Lucene41_0.doc, _0_Lucene41_0.pos, _0.nvd, _0.fdx, _0.si, _0.nvm, _0_Lucene41_0.tim, _0.fdt, _0_Lucene41_0.tip]
   [junit4]   2> 85405 T174 C74 oasu.LoggingInfoStream.message [IW][qtp1495064932-174]: commit: pendingCommit != null
   [junit4]   2> 85406 T174 C74 oasu.LoggingInfoStream.message [IW][qtp1495064932-174]: commit: wrote segments file "segments_2"
   [junit4]   2> 85407 T174 C74 oasu.LoggingInfoStream.message [IFD][qtp1495064932-174]: now checkpoint "_0(4.5):C1" [1 segments ; isCommit = true]
   [junit4]   2> 85409 T174 C74 oasc.SolrDeletionPolicy.onCommit SolrDeletionPolicy.onCommit: commits: num=2
   [junit4]   2> commit{dir=MockDirWrapper(org.apache.lucene.store.RAMDirectory@3486a602 lockFactory=org.apache.lucene.store.NativeFSLockFactory@10ca6ba3),segFN=segments_1,generation=1}
   [junit4]   2> commit{dir=MockDirWrapper(org.apache.lucene.store.RAMDirectory@3486a602 lockFactory=org.apache.lucene.store.NativeFSLockFactory@10ca6ba3),segFN=segments_2,generation=2}
   [junit4]   2> 85411 T174 C74 oasc.SolrDeletionPolicy.updateCommits newest commit generation = 2
   [junit4]   2> 85412 T174 C74 oasu.LoggingInfoStream.message [IFD][qtp1495064932-174]: deleteCommits: now decRef commit "segments_1"
   [junit4]   2> 85413 T174 C74 oasu.LoggingInfoStream.message [IFD][qtp1495064932-174]: delete "segments_1"
   [junit4]   2> 85414 T174 C74 oasu.LoggingInfoStream.message [IFD][qtp1495064932-174]: 7 msec to checkpoint
   [junit4]   2> 85415 T174 C74 oasu.LoggingInfoStream.message [IW][qtp1495064932-174]: commit: done
   [junit4]   2> 85416 T174 C74 oasu.LoggingInfoStream.message [DW][qtp1495064932-174]: anyChanges? numDocsInRam=0 deletes=false hasTickets:false pendingChangesInFullFlush: false
   [junit4]   2> 85417 T174 C74 oasu.LoggingInfoStream.message [IW][qtp1495064932-174]: nrtIsCurrent: infoVersion matches: false; DW changes: false; BD changes: false
   [junit4]   2> 85418 T174 C74 oasu.LoggingInfoStream.message [IW][qtp1495064932-174]: flush at getReader
   [junit4]   2> 85419 T174 C74 oasu.LoggingInfoStream.message [DW][qtp1495064932-174]: qtp1495064932-174 startFullFlush
   [junit4]   2> 85420 T174 C74 oasu.LoggingInfoStream.message [DW][qtp1495064932-174]: anyChanges? numDocsInRam=0 deletes=false hasTickets:false pendingChangesInFullFlush: false
   [junit4]   2> 85422 T174 C74 oasu.LoggingInfoStream.message [IW][qtp1495064932-174]: apply all deletes during flush
   [junit4]   2> 85423 T174 C74 oasu.LoggingInfoStream.message [BD][qtp1495064932-174]: applyDeletes: no deletes; skipping
   [junit4]   2> 85424 T174 C74 oasu.LoggingInfoStream.message [BD][qtp1495064932-174]: prune sis=org.apache.lucene.index.SegmentInfos@1e88579c minGen=6 packetCount=0
   [junit4]   2> 85427 T174 C74 oasu.LoggingInfoStream.message [IW][qtp1495064932-174]: return reader version=3 reader=StandardDirectoryReader(segments_2:3:nrt _0(4.5):C1)
   [junit4]   2> 85428 T174 C74 oasu.LoggingInfoStream.message [DW][qtp1495064932-174]: qtp1495064932-174 finishFullFlush success=true
   [junit4]   2> 85429 T174 C74 oasu.LoggingInfoStream.message [IW][qtp1495064932-174]: getReader took 11 msec
   [junit4]   2> 85430 T174 C74 oass.SolrIndexSearcher.<init> Opening Searcher@3c22d5b5 main
   [junit4]   2> 85431 T180 oasc.QuerySenderListener.newSearcher QuerySenderListener sending requests to Searcher@3c22d5b5 main{StandardDirectoryReader(segments_2:3:nrt _0(4.5):C1)}
   [junit4]   2> 85432 T180 oasc.QuerySenderListener.newSearcher QuerySenderListener done.
   [junit4]   2> 85461 T180 oasc.SolrCore.registerSearcher [collection1] Registered new searcher Searcher@3c22d5b5 main{StandardDirectoryReader(segments_2:3:nrt _0(4.5):C1)}
   [junit4]   2> ASYNC  NEW_CORE C75 name=collection1 org.apache.solr.core.SolrCore@78c4f9e6
   [junit4]   2> 85463 T174 C75 oasu.DirectUpdateHandler2.commit end_commit_flush
   [junit4]   2> 85464 T174 C75 oasup.LogUpdateProcessor.finish [collection1] webapp=/solr path=/update params={waitSearcher=true&commit=true&wt=javabin&version=2&softCommit=false} {commit=} 0 89
   [junit4]   2> 85475 T176 C75 oasc.SolrCore.execute [collection1] webapp=/solr path=/get params={id=DOCID&fl=id,name,aaa:[value+v%3Daaa]&wt=javabin&qt=/get&version=2} status=0 QTime=1
   [junit4]   2> 85482 T177 C75 oasc.SolrCore.execute [collection1] webapp=/solr path=/get params={id=DOCID&fl=id,name,aaa:[value+v%3Daaa]&wt=xml&qt=/get&version=2.2} status=0 QTime=1
   [junit4]   2> 85485 T169 oas.SolrTestCaseJ4.tearDown ###Ending testRealtimeGet
   [junit4]   2> 85519 T169 oas.SolrTestCaseJ4.setUp ###Starting testSetNullUpdates
   [junit4]   2> 85526 T178 C75 oasup.LogUpdateProcessor.finish [collection1] webapp=/solr path=/update params={wt=javabin&version=2} {add=[testSetNullUpdates (1443859751860436992)]} 0 2
   [junit4]   2> 85535 T173 C75 oasu.DirectUpdateHandler2.commit start commit{,optimize=false,openSearcher=true,waitSearcher=true,expungeDeletes=false,softCommit=false,prepareCommit=false}
   [junit4]   2> 85536 T173 C75 oasu.LoggingInfoStream.message [IW][qtp1495064932-173]: commit: start
   [junit4]   2> 85537 T173 C75 oasu.LoggingInfoStream.message [IW][qtp1495064932-173]: commit: enter lock
   [junit4]   2> 85537 T173 C75 oasu.LoggingInfoStream.message [IW][qtp1495064932-173]: commit: now prepare
   [junit4]   2> 85537 T173 C75 oasu.LoggingInfoStream.message [IW][qtp1495064932-173]: prepareCommit: flush
   [junit4]   2> 85538 T173 C75 oasu.LoggingInfoStream.message [IW][qtp1495064932-173]:   index before flush _0(4.5):C1
   [junit4]   2> 85538 T173 C75 oasu.LoggingInfoStream.message [DW][qtp1495064932-173]: qtp1495064932-173 startFullFlush
   [junit4]   2> 85539 T173 C75 oasu.LoggingInfoStream.message [DW][qtp1495064932-173]: anyChanges? numDocsInRam=1 deletes=true hasTickets:false pendingChangesInFullFlush: false
   [junit4]   2> 85539 T173 C75 oasu.LoggingInfoStream.message [DWFC][qtp1495064932-173]: addFlushableState DocumentsWriterPerThread [pendingDeletes=gen=0, segment=_1, aborting=false, numDocsInRAM=1, deleteQueue=DWDQ: [ generation: 4 ]]
   [junit4]   2> 85540 T173 C75 oasu.LoggingInfoStream.message [DWPT][qtp1495064932-173]: flush postings as segment _1 numDocs=1
   [junit4]   2> 85542 T173 C75 oasu.LoggingInfoStream.message [DWPT][qtp1495064932-173]: new segment has 0 deleted docs
   [junit4]   2> 85543 T173 C75 oasu.LoggingInfoStream.message [DWPT][qtp1495064932-173]: new segment has no vectors; no norms; no docValues; no prox; no freqs
   [junit4]   2> 85543 T173 C75 oasu.LoggingInfoStream.message [DWPT][qtp1495064932-173]: flushedFiles=[_1.fdx, _1_Lucene41_0.doc, _1.fdt, _1_Lucene41_0.tim, _1_Lucene41_0.tip, _1.fnm]
   [junit4]   2> 85544 T173 C75 oasu.LoggingInfoStream.message [DWPT][qtp1495064932-173]: flushed codec=Lucene42
   [junit4]   2> 85545 T173 C75 oasu.LoggingInfoStream.message [DWPT][qtp1495064932-173]: flushed: segment=_1 ramUsed=0.063 MB newFlushedSize(includes docstores)=0.001 MB docs/MB=1,154.819
   [junit4]   2> 85545 T173 C75 oasu.LoggingInfoStream.message [DW][qtp1495064932-173]: publishFlushedSegment seg-private deletes=null
   [junit4]   2> 85546 T173 C75 oasu.LoggingInfoStream.message [IW][qtp1495064932-173]: publishFlushedSegment
   [junit4]   2> 85547 T173 C75 oasu.LoggingInfoStream.message [BD][qtp1495064932-173]: push deletes  1 deleted terms (unique count=1) bytesUsed=1024 delGen=8 packetCount=1 totBytesUsed=1024
   [junit4]   2> 85547 T173 C75 oasu.LoggingInfoStream.message [IW][qtp1495064932-173]: publish sets newSegment delGen=9 seg=_1(4.5):C1
   [junit4]   2> 85548 T173 C75 oasu.LoggingInfoStream.message [IFD][qtp1495064932-173]: now checkpoint "_0(4.5):C1 _1(4.5):C1" [2 segments ; isCommit = false]
   [junit4]   2> 85549 T173 C75 oasu.LoggingInfoStream.message [IFD][qtp1495064932-173]: 0 msec to checkpoint
   [junit4]   2> 85549 T173 C75 oasu.LoggingInfoStream.message [IW][qtp1495064932-173]: apply all deletes during flush
   [junit4]   2> 85550 T173 C75 oasu.LoggingInfoStream.message [BD][qtp1495064932-173]: applyDeletes: infos=[_0(4.5):C1, _1(4.5):C1] packetCount=1
   [junit4]   2> 85551 T173 C75 oasu.LoggingInfoStream.message [BD][qtp1495064932-173]: seg=_0(4.5):C1 segGen=6 coalesced deletes=[CoalescedDeletes(termSets=1,queries=0)] newDelCount=0
   [junit4]   2> 85552 T173 C75 oasu.LoggingInfoStream.message [BD][qtp1495064932-173]: applyDeletes took 2 msec
   [junit4]   2> 85552 T173 C75 oasu.LoggingInfoStream.message [BD][qtp1495064932-173]: prune sis=org.apache.lucene.index.SegmentInfos@1e88579c minGen=10 packetCount=1
   [junit4]   2> 85553 T173 C75 oasu.LoggingInfoStream.message [BD][qtp1495064932-173]: pruneDeletes: prune 1 packets; 0 packets remain
   [junit4]   2> 85554 T173 C75 oasu.LoggingInfoStream.message [DW][qtp1495064932-173]: qtp1495064932-173 finishFullFlush success=true
   [junit4]   2> 85554 T173 C75 oasu.LoggingInfoStream.message [TMP][qtp1495064932-173]: findMerges: 2 segments
   [junit4]   2> 85555 T173 C75 oasu.LoggingInfoStream.message [TMP][qtp1495064932-173]:   seg=_0(4.5):C1 size=0.001 MB [floored]
   [junit4]   2> 85556 T173 C75 oasu.LoggingInfoStream.message [TMP][qtp1495064932-173]:   seg=_1(4.5):C1 size=0.001 MB [floored]
   [junit4]   2> 85556 T173 C75 oasu.LoggingInfoStream.message [TMP][qtp1495064932-173]:   allowedSegmentCount=1 vs count=2 (eligible count=2) tooBigCount=0
   [junit4]   2> 85557 T173 C75 oasu.LoggingInfoStream.message [CMS][qtp1495064932-173]: now merge
   [junit4]   2> 85558 T173 C75 oasu.LoggingInfoStream.message [CMS][qtp1495064932-173]:   index: _0(4.5):C1 _1(4.5):C1
   [junit4]   2> 85558 T173 C75 oasu.LoggingInfoStream.message [CMS][qtp1495064932-173]:   no more merges pending; now return
   [junit4]   2> 85559 T173 C75 oasu.LoggingInfoStream.message [IW][qtp1495064932-173]: startCommit(): start
   [junit4]   2> 85559 T173 C75 oasu.LoggingInfoStream.message [IW][qtp1495064932-173]: startCommit index=_0(4.5):C1 _1(4.5):C1 changeCount=6
   [junit4]   2> 85560 T173 C75 oasu.LoggingInfoStream.message [IW][qtp1495064932-173]: done all syncs: [_1_Lucene41_0.doc, _0.fnm, _0_Lucene41_0.pos, _1_Lucene41_0.tim, _1_Lucene41_0.tip, _0.nvm, _1.fnm, _1.fdx, _0_Lucene41_0.doc, _1.fdt, _1.si, _0.nvd, _0.fdx, _0.si, _0_Lucene41_0.tim, _0_Lucene41_0.tip, _0.fdt]
   [junit4]   2> 85560 T173 C75 oasu.LoggingInfoStream.message [IW][qtp1495064932-173]: commit: pendingCommit != null
   [junit4]   2> 85561 T173 C75 oasu.LoggingInfoStream.message [IW][qtp1495064932-173]: commit: wrote segments file "segments_3"
   [junit4]   2> 85561 T173 C75 oasu.LoggingInfoStream.message [IFD][qtp1495064932-173]: now checkpoint "_0(4.5):C1 _1(4.5):C1" [2 segments ; isCommit = true]
   [junit4]   2> 85562 T173 C75 oasc.SolrDeletionPolicy.onCommit SolrDeletionPolicy.onCommit: commits: num=2
   [junit4]   2> commit{dir=MockDirWrapper(org.apache.lucene.store.RAMDirectory@3486a602 lockFactory=org.apache.lucene.store.NativeFSLockFactory@10ca6ba3),segFN=segments_2,generation=2}
   [junit4]   2> commit{dir=MockDirWrapper(org.apache.lucene.store.RAMDirectory@3486a602 lockFactory=org.apache.lucene.store.NativeFSLockFactory@10ca6ba3),segFN=segments_3,generation=3}
   [junit4]   2> 85562 T173 C75 oasc.SolrDeletionPolicy.updateCommits newest commit generation = 3
   [junit4]   2> 85563 T173 C75 oasu.LoggingInfoStream.message [IFD][qtp1495064932-173]: deleteCommits: now decRef commit "segments_2"
   [junit4]   2> 85563 T173 C75 oasu.LoggingInfoStream.message [IFD][qtp1495064932-173]: delete "segments_2"
   [junit4]   2> 85564 T173 C75 oasu.LoggingInfoStream.message [IFD][qtp1495064932-173]: 2 msec to checkpoint
   [junit4]   2> 85564 T173 C75 oasu.LoggingInfoStream.message [IW][qtp1495064932-173]: commit: done
   [junit4]   2> 85565 T173 C75 oasu.LoggingInfoStream.message [DW][qtp1495064932-173]: anyChanges? numDocsInRam=0 deletes=false hasTickets:false pendingChangesInFullFlush: false
   [junit4]   2> 85565 T173 C75 oasu.LoggingInfoStream.message [IW][qtp1495064932-173]: nrtIsCurrent: infoVersion matches: false; DW changes: false; BD changes: false
   [junit4]   2> 85566 T173 C75 oasu.LoggingInfoStream.message [IW][qtp1495064932-173]: flush at getReader
   [junit4]   2> 85566 T173 C75 oasu.LoggingInfoStream.message [DW][qtp1495064932-173]: qtp1495064932-173 startFullFlush
   [junit4]   2> 85567 T173 C75 oasu.LoggingInfoStream.message [DW][qtp1495064932-173]: anyChanges? numDocsInRam=0 deletes=false hasTickets:false pendingChangesInFullFlush: false
   [junit4]   2> 85567 T173 C75 oasu.LoggingInfoStream.message [IW][qtp1495064932-173]: apply all deletes during flush
   [junit4]   2> 85568 T173 C75 oasu.LoggingInfoStream.message [BD][qtp1495064932-173]: applyDeletes: no deletes; skipping
   [junit4]   2> 85569 T173 C75 oasu.LoggingInfoStream.message [BD][qtp1495064932-173]: prune sis=org.apache.lucene.index.SegmentInfos@1e88579c minGen=10 packetCount=0
   [junit4]   2> 85571 T173 C75 oasu.LoggingInfoStream.message [IW][qtp1495064932-173]: return reader version=5 reader=StandardDirectoryReader(segments_3:5:nrt _0(4.5):C1 _1(4.5):C1)
   [junit4]   2> 85572 T173 C75 oasu.LoggingInfoStream.message [DW][qtp1495064932-173]: qtp1495064932-173 finishFullFlush success=true
   [junit4]   2> 85573 T173 C75 oasu.LoggingInfoStream.message [IW][qtp1495064932-173]: getReader took 7 msec
   [junit4]   2> 85573 T173 C75 oass.SolrIndexSearcher.<init> Opening Searcher@40773f4b main
   [junit4]   2> 85575 T173 C75 oasu.DirectUpdateHandler2.commit end_commit_flush
   [junit4]   2> 85575 T180 oasc.QuerySenderListener.newSearcher QuerySenderListener sending requests to Searcher@40773f4b main{StandardDirectoryReader(segments_3:5:nrt _0(4.5):C1 _1(4.5):C1)}
   [junit4]   2> 85576 T180 oasc.QuerySenderListener.newSearcher QuerySenderListener done.
   [junit4]   2> 85581 T180 oasc.SolrCore.registerSearcher [collection1] Registered new searcher Searcher@40773f4b main{StandardDirectoryReader(segments_3:5:nrt _0(4.5):C1 _1(4.5):C1)}
   [junit4]   2> 85583 T173 C75 oasup.LogUpdateProcessor.finish [collection1] webapp=/solr path=/update params={waitSearcher=true&commit=true&wt=javabin&version=2&softCommit=false} {commit=} 0 48
   [junit4]   2> 85595 T174 C75 oasup.LogUpdateProcessor.finish [collection1] webapp=/solr path=/update params={wt=javabin&version=2} {add=[testSetNullUpdates (1443859751931740160)]} 0 4
   [junit4]   2> 85606 T175 C75 oasu.DirectUpdateHandler2.commit start commit{,optimize=false,openSearcher=true,waitSearcher=true,expungeDeletes=false,softCommit=false,prepareCommit=false}
   [junit4]   2> 85607 T175 C75 oasu.LoggingInfoStream.message [IW][qtp1495064932-175]: commit: start
   [junit4]   2> 85608 T175 C75 oasu.LoggingInfoStream.message [IW][qtp1495064932-175]: commit: enter lock
   [junit4]   2> 85609 T175 C75 oasu.LoggingInfoStream.message [IW][qtp1495064932-175]: commit: now prepare
   [junit4]   2> 85610 T175 C75 oasu.LoggingInfoStream.message [IW][qtp1495064932-175]: prepareCommit: flush
   [junit4]   2> 85611 T175 C75 oasu.LoggingInfoStream.message [IW][qtp1495064932-175]:   index before flush _0(4.5):C1 _1(4.5):C1
   [junit4]   2> 85612 T175 C75 oasu.LoggingInfoStream.message [DW][qtp1495064932-175]: qtp1495064932-175 startFullFlush
   [junit4]   2> 85613 T175 C75 oasu.LoggingInfoStream.message [DW][qtp1495064932-175]: anyChanges? numDocsInRam=1 deletes=true hasTickets:false pendingChangesInFullFlush: false
   [junit4]   2> 85613 T175 C75 oasu.LoggingInfoStream.message [DWFC][qtp1495064932-175]: addFlushableState DocumentsWriterPerThread [pendingDeletes=gen=0, segment=_2, aborting=false, numDocsInRAM=1, deleteQueue=DWDQ: [ generation: 6 ]]
   [junit4]   2> 85614 T175 C75 oasu.LoggingInfoStream.message [DWPT][qtp1495064932-175]: flush postings as segment _2 numDocs=1
   [junit4]   2> 85616 T175 C75 oasu.LoggingInfoStream.message [DWPT][qtp1495064932-175]: new segment has 0 deleted docs
   [junit4]   2> 85617 T175 C75 oasu.LoggingInfoStream.message [DWPT][qtp1495064932-175]: new segment has no vectors; no norms; no docValues; no prox; no freqs
   [junit4]   2> 85617 T175 C75 oasu.LoggingInfoStream.message [DWPT][qtp1495064932-175]: flushedFiles=[_2_Lucene41_0.tim, _2.fdt, _2_Lucene41_0.doc, _2_Lucene41_0.tip, _2.fdx, _2.fnm]
   [junit4]   2> 85618 T175 C75 oasu.LoggingInfoStream.message [DWPT][qtp1495064932-175]: flushed codec=Lucene42
   [junit4]   2> 85619 T175 C75 oasu.LoggingInfoStream.message [DWPT][qtp1495064932-175]: flushed: segment=_2 ramUsed=0.063 MB newFlushedSize(includes docstores)=0.001 MB docs/MB=1,394.383
   [junit4]   2> 85620 T175 C75 oasu.LoggingInfoStream.message [DW][qtp1495064932-175]: publishFlushedSegment seg-private deletes=null
   [junit4]   2> 85621 T175 C75 oasu.LoggingInfoStream.message [IW][qtp1495064932-175]: publishFlushedSegment
   [junit4]   2> 85622 T175 C75 oasu.LoggingInfoStream.message [BD][qtp1495064932-175]: push deletes  1 deleted terms (unique count=1) bytesUsed=1024 delGen=12 packetCount=1 totBytesUsed=1024
   [junit4]   2> 85623 T175 C75 oasu.LoggingInfoStream.message [IW][qtp1495064932-175]: publish sets newSegment delGen=13 seg=_2(4.5):C1
   [junit4]   2> 85624 T175 C75 oasu.LoggingInfoStream.message [IFD][qtp1495064932-175]: now checkpoint "_0(4.5):C1 _1(4.5):C1 _2(4.5):C1" [3 segments ; isCommit = false]
   [junit4]   2> 85625 T175 C75 oasu.LoggingInfoStream.message [IFD][qtp1495064932-175]: 1 msec to checkpoint
   [junit4]   2> 85626 T175 C75 oasu.LoggingInfoStream.message [IW][qtp1495064932-175]: apply all deletes during flush
   [junit4]   2> 85627 T175 C75 oasu.LoggingInfoStream.message [BD][qtp1495064932-175]: applyDeletes: infos=[_0(4.5):C1, _1(4.5):C1, _2(4.5):C1] packetCount=1
   [junit4]   2> 85628 T175 C75 oasu.LoggingInfoStream.message [BD][qtp1495064932-175]: seg=_1(4.5):C1 segGen=10 coalesced deletes=[CoalescedDeletes(termSets=1,queries=0)] newDelCount=1 100% deleted
   [junit4]   2> 85630 T175 C75 oasu.LoggingInfoStream.message [BD][qtp1495064932-175]: seg=_0(4.5):C1 segGen=10 coalesced deletes=[CoalescedDeletes(termSets=1,queries=0)] newDelCount=0
   [junit4]   2> 85631 T175 C75 oasu.LoggingInfoStream.message [BD][qtp1495064932-175]: applyDeletes took 4 msec
   [junit4]   2> 85632 T175 C75 oasu.LoggingInfoStream.message [IFD][qtp1495064932-175]: now checkpoint "_0(4.5):C1 _1(4.5):C1/1 _2(4.5):C1" [3 segments ; isCommit = false]
   [junit4]   2> 85633 T175 C75 oasu.LoggingInfoStream.message [IFD][qtp1495064932-175]: 1 msec to checkpoint
   [junit4]   2> 85634 T175 C75 oasu.LoggingInfoStream.message [IW][qtp1495064932-175]: drop 100% deleted segments: _1(4.5):C1/1
   [junit4]   2> 85635 T175 C75 oasu.LoggingInfoStream.message [IFD][qtp1495064932-175]: now checkpoint "_0(4.5):C1 _2(4.5):C1" [2 segments ; isCommit = false]
   [junit4]   2> 85636 T175 C75 oasu.LoggingInfoStream.message [IFD][qtp1495064932-175]: 1 msec to checkpoint
   [junit4]   2> 85637 T175 C75 oasu.LoggingInfoStream.message [BD][qtp1495064932-175]: prune sis=org.apache.lucene.index.SegmentInfos@1e88579c minGen=14 packetCount=1
   [junit4]   2> 85638 T175 C75 oasu.LoggingInfoStream.message [BD][qtp1495064932-175]: pruneDeletes: prune 1 packets; 0 packets remain
   [junit4]   2> 85638 T175 C75 oasu.LoggingInfoStream.message [DW][qtp1495064932-175]: qtp1495064932-175 finishFullFlush success=true
   [junit4]   2> 85639 T175 C75 oasu.LoggingInfoStream.message [TMP][qtp1495064932-175]: findMerges: 2 segments
   [junit4]   2> 85641 T175 C75 oasu.LoggingInfoStream.message [TMP][qtp1495064932-175]:   seg=_0(4.5):C1 size=0.001 MB [floored]
   [junit4]   2> 85643 T175 C75 oasu.LoggingInfoStream.message [TMP][qtp1495064932-175]:   seg=_2(4.5):C1 size=0.001 MB [floored]
   [junit4]   2> 85644 T175 C75 oasu.LoggingInfoStream.message [TMP][qtp1495064932-175]:   allowedSegmentCount=1 vs count=2 (eligible count=2) tooBigCount=0
   [junit4]   2> 85644 T175 C75 oasu.LoggingInfoStream.message [CMS][qtp1495064932-175]: now merge
   [junit4]   2> 85645 T175 C75 oasu.LoggingInfoStream.message [CMS][qtp1495064932-175]:   index: _0(4.5):C1 _2(4.5):C1
   [junit4]   2> 85646 T175 C75 oasu.LoggingInfoStream.message [CMS][qtp1495064932-175]:   no more merges pending; now return
   [junit4]   2> 85647 T175 C75 oasu.LoggingInfoStream.message [IW][qtp1495064932-175]: startCommit(): start
   [junit4]   2> 85648 T175 C75 oasu.LoggingInfoStream.message [IW][qtp1495064932-175]: startCommit index=_0(4.5):C1 _2(4.5):C1 changeCount=11
   [junit4]   2> 85650 T175 C75 oasu.LoggingInfoStream.message [IW][qtp1495064932-175]: done all syncs: [_2.si, _0.fnm, _2_Lucene41_0.tim, _0_Lucene41_0.pos, _2.fdt, _2_Lucene41_0.doc, _2_Lucene41_0.tip, _0.nvm, _2.fdx, _2.fnm, _0_Lucene41_0.doc, _0.nvd, _0.fdx, _0.si, _0_Lucene41_0.tim, _0_Lucene41_0.tip, _0.fdt]
   [junit4]   2> 85651 T175 C75 oasu.LoggingInfoStream.message [IW][qtp1495064932-175]: commit: pendingCommit != null
   [junit4]   2> 85652 T175 C75 oasu.LoggingInfoStream.message [IW][qtp1495064932-175]: commit: wrote segments file "segments_4"
   [junit4]   2> 85653 T175 C75 oasu.LoggingInfoStream.message [IFD][qtp1495064932-175]: now checkpoint "_0(4.5):C1 _2(4.5):C1" [2 segments ; isCommit = true]
   [junit4]   2> 85654 T175 C75 oasc.SolrDeletionPolicy.onCommit SolrDeletionPolicy.onCommit: commits: num=2
   [junit4]   2> commit{dir=MockDirWrapper(org.apache.lucene.store.RAMDirectory@3486a602 lockFactory=org.apache.lucene.store.NativeFSLockFactory@10ca6ba3),segFN=segments_3,generation=3}
   [junit4]   2> commit{dir=MockDirWrapper(org.apache.lucene.store.RAMDirectory@3486a602 lockFactory=org.apache.lucene.store.NativeFSLockFactory@10ca6ba3),segFN=segments_4,generation=4}
   [junit4]   2> 85655 T175 C75 oasc.SolrDeletionPolicy.updateCommits newest commit generation = 4
   [junit4]   2> 85656 T175 C75 oasu.LoggingInfoStream.message [IFD][qtp1495064932-175]: deleteCommits: now decRef commit "segments_3"
   [junit4]   2> 85657 T175 C75 oasu.LoggingInfoStream.message [IFD][qtp1495064932-175]: delete "_1_Lucene41_0.doc"
   [junit4]   2> 85658 T175 C75 oasu.LoggingInfoStream.message [IFD][qtp1495064932-175]: unable to remove file "_1_Lucene41_0.doc": java.io.IOException: MockDirectoryWrapper: file "_1_Lucene41_0.doc" is still open: cannot delete; Will re-try later.
   [junit4]   2> 85659 T175 C75 oasu.LoggingInfoStream.message [IFD][qtp1495064932-175]: delete "_1_Lucene41_0.tim"
   [junit4]   2> 85660 T175 C75 oasu.LoggingInfoStream.message [IFD][qtp1495064932-175]: unable to remove file "_1_Lucene41_0.tim": java.io.IOException: MockDirectoryWrapper: file "_1_Lucene41_0.tim" is still open: cannot delete; Will re-try later.
   [junit4]   2> 85661 T175 C75 oasu.LoggingInfoStream.message [IFD][qtp1495064932-175]: delete "_1_Lucene41_0.tip"
   [junit4]   2> 85662 T175 C75 oasu.LoggingInfoStream.message [IFD][qtp1495064932-175]: delete "_1.fnm"
   [junit4]   2> 85663 T175 C75 oasu.LoggingInfoStream.message [IFD][qtp1495064932-175]: delete "_1.fdx"
   [junit4]   2> 85664 T175 C75 oasu.LoggingInfoStream.message [IFD][qtp1495064932-175]: delete "_1.fdt"
   [junit4]   2> 85665 T175 C75 oasu.LoggingInfoStream.message [IFD][qtp1495064932-175]: unable to remove file "_1.fdt": java.io.IOException: MockDirectoryWrapper: file "_1.fdt" is still open: cannot delete; Will re-try later.
   [junit4]   2> 85666 T175 C75 oasu.LoggingInfoStream.message [IFD][qtp1495064932-175]: delete "_1.si"
   [junit4]   2> 85667 T175 C75 oasu.LoggingInfoStream.message [IFD][qtp1495064932-175]: delete "segments_3"
   [junit4]   2> 85668 T175 C75 oasu.LoggingInfoStream.message [IFD][qtp1495064932-175]: 14 msec to checkpoint
   [junit4]   2> 85668 T175 C75 oasu.LoggingInfoStream.message [IW][qtp1495064932-175]: commit: done
   [junit4]   2> 85669 T175 C75 oasu.LoggingInfoStream.message [DW][qtp1495064932-175]: anyChanges? numDocsInRam=0 deletes=false hasTickets:false pendingChangesInFullFlush: false
   [junit4]   2> 85670 T175 C75 oasu.LoggingInfoStream.message [IW][qtp1495064932-175]: nrtIsCurrent: infoVersion matches: false; DW changes: false; BD changes: false
   [junit4]   2> 85679 T175 C75 oasu.LoggingInfoStream.message [IW][qtp1495064932-175]: flush at getReader
   [junit4]   2> 85680 T175 C75 oasu.LoggingInfoStream.message [DW][qtp1495064932-175]: qtp1495064932-175 startFullFlush
   [junit4]   2> 85681 T175 C75 oasu.LoggingInfoStream.message [DW][qtp1495064932-175]: anyChanges? numDocsInRam=0 deletes=false hasTickets:false pendingChangesInFullFlush: false
   [junit4]   2> 85682 T175 C75 oasu.LoggingInfoStream.message [IW][qtp1495064932-175]: apply all deletes during flush
   [junit4]   2> 85682 T175 C75 oasu.LoggingInfoStream.message [BD][qtp1495064932-175]: applyDeletes: no deletes; skipping
   [junit4]   2> 85683 T175 C75 oasu.LoggingInfoStream.message [BD][qtp1495064932-175]: prune sis=org.apache.lucene.index.SegmentInfos@1e88579c minGen=14 packetCount=0
   [junit4]   2> 85685 T175 C75 oasu.LoggingInfoStream.message [IW][qtp1495064932-175]: return reader version=9 reader=StandardDirectoryReader(segments_4:9:nrt _0(4.5):C1 _2(4.5):C1)
   [junit4]   2> 85686 T175 C75 oasu.LoggingInfoStream.message [DW][qtp1495064932-175]: qtp1495064932-175 finishFullFlush success=true
   [junit4]   2> 85687 T175 C75 oasu.LoggingInfoStream.message [IW][qtp1495064932-175]: getReader took 8 msec
   [junit4]   2> 85688 T175 C75 oass.SolrIndexSearcher.<init> Opening Searcher@560be823 main
   [junit4]   2> 85689 T175 C75 oasu.DirectUpdateHandler2.commit end_commit_flush
   [junit4]   2> 85690 T180 oasc.QuerySenderListener.newSearcher QuerySenderListener sending requests to Searcher@560be823 main{StandardDirectoryReader(segments_4:9:nrt _0(4.5):C1 _2(4.5):C1)}
   [junit4]   2> 85691 T180 oasc.QuerySenderListener.newSearcher QuerySenderListener done.
   [junit4]   2> 85695 T180 oasc.SolrCore.registerSearcher [collection1] Registered new searcher Searcher@560be823 main{StandardDirectoryReader(segments_4:9:nrt _0(4.5):C1 _2(4.5):C1)}
   [junit4]   2> 85696 T180 oasu.LoggingInfoStream.message [IFD][searcherExecutor-128-thread-1]: delete pending file _1_Lucene41_0.doc
   [junit4]   2> 85697 T180 oasu.LoggingInfoStream.message [IFD][searcherExecutor-128-thread-1]: delete "_1_Lucene41_0.doc"
   [junit4]   2> 85699 T180 oasu.LoggingInfoStream.message [IFD][searcherExecutor-128-thread-1]: delete pending file _1_Lucene41_0.tim
   [junit4]   2> 85700 T180 oasu.LoggingInfoStream.message [IFD][searcherExecutor-128-thread-1]: delete "_1_Lucene41_0.tim"
   [junit4]   2> 85700 T180 oasu.LoggingInfoStream.message [IFD][searcherExecutor-128-thread-1]: delete pending file _1.fdt
   [junit4]   2> 85700 T180 oasu.LoggingInfoStream.message [IFD][searcherExecutor-128-thread-1]: delete "_1.fdt"
   [junit4]   2> 85701 T175 C75 oasup.LogUpdateProcessor.finish [collection1] webapp=/solr path=/update params={waitSearcher=true&commit=true&wt=javabin&version=2&softCommit=false} {commit=} 0 95
   [junit4]   2> 85709 T176 C75 oasc.SolrCore.execute [collection1] webapp=/solr path=/select params={q=id:testSetNullUpdates&wt=javabin&version=2} hits=1 status=0 QTime=1
   [junit4]   2> 85713 T169 oas.SolrTestCaseJ4.tearDown ###Ending testSetNullUpdates
   [junit4]   2> 85731 T169 oas.SolrTestCaseJ4.setUp ###Starting testStatistics
   [junit4]   2> 85742 T177 C75 oasu.LoggingInfoStream.message [DW][qtp1495064932-177]: anyChanges? numDocsInRam=0 deletes=true hasTickets:false pendingChangesInFullFlush: false
   [junit4]   2> 85744 T177 C75 oasu.LoggingInfoStream.message [IW][qtp1495064932-177]: nrtIsCurrent: infoVersion matches: true; DW changes: true; BD changes: false
   [junit4]   2> 85744 T177 C75 oasu.LoggingInfoStream.message [DW][qtp1495064932-177]: anyChanges? numDocsInRam=0 deletes=true hasTickets:false pendingChangesInFullFlush: false
   [junit4]   2> 85745 T177 C75 oasu.LoggingInfoStream.message [IW][qtp1495064932-177]: flush at getReader
   [junit4]   2> 85746 T177 C75 oasu.LoggingInfoStream.message [DW][qtp1495064932-177]: qtp1495064932-177 startFullFlush
   [junit4]   2> 85747 T177 C75 oasu.LoggingInfoStream.message [DW][qtp1495064932-177]: anyChanges? numDocsInRam=0 deletes=true hasTickets:false pendingChangesInFullFlush: false
   [junit4]   2> 85748 T177 C75 oasu.LoggingInfoStream.message [DW][qtp1495064932-177]: qtp1495064932-177: flush naked frozen global deletes
   [junit4]   2> 85749 T177 C75 oasu.LoggingInfoStream.message [BD][qtp1495064932-177]: push deletes  1 deleted queries bytesUsed=32 delGen=16 packetCount=1 totBytesUsed=32
   [junit4]   2> 85750 T177 C75 oasu.LoggingInfoStream.message [DW][qtp1495064932-177]: flush: push buffered deletes:  1 deleted queries bytesUsed=32
   [junit4]   2> 85751 T177 C75 oasu.LoggingInfoStream.message [IW][qtp1495064932-177]: apply all deletes during flush
   [junit4]   2> 85752 T177 C75 oasu.LoggingInfoStream.message [BD][qtp1495064932-177]: applyDeletes: infos=[_0(4.5):C1, _2(4.5):C1] packetCount=1
   [junit4]   2> 85754 T177 C75 oasu.LoggingInfoStream.message [BD][qtp1495064932-177]: seg=_2(4.5):C1 segGen=14 coalesced deletes=[CoalescedDeletes(termSets=1,queries=1)] newDelCount=1 100% deleted
   [junit4]   2> 85755 T177 C75 oasu.LoggingInfoStream.message [BD][qtp1495064932-177]: seg=_0(4.5):C1 segGen=14 coalesced deletes=[CoalescedDeletes(termSets=1,queries=1)] newDelCount=1 100% deleted
   [junit4]   2> 85755 T177 C75 oasu.LoggingInfoStream.message [BD][qtp1495064932-177]: applyDeletes took 3 msec
   [junit4]   2> 85756 T177 C75 oasu.LoggingInfoStream.message [IFD][qtp1495064932-177]: now checkpoint "_0(4.5):C1/1 _2(4.5):C1/1" [2 segments ; isCommit = false]
   [junit4]   2> 85756 T177 C75 oasu.LoggingInfoStream.message [IFD][qtp1495064932-177]: 0 msec to checkpoint
   [junit4]   2> 85757 T177 C75 oasu.LoggingInfoStream.message [IW][qtp1495064932-177]: drop 100% deleted segments: _2(4.5):C1/1 _0(4.5):C1/1
   [junit4]   2> 85757 T177 C75 oasu.LoggingInfoStream.message [IFD][qtp1495064932-177]: now checkpoint "" [0 segments ; isCommit = false]
   [junit4]   2> 85758 T177 C75 oasu.LoggingInfoStream.message [IFD][qtp1495064932-177]: 0 msec to checkpoint
   [junit4]   2> 85759 T177 C75 oasu.LoggingInfoStream.message [BD][qtp1495064932-177]: prune sis=org.apache.lucene.index.SegmentInfos@1e88579c minGen=9223372036854775807 packetCount=1
   [junit4]   2> 85760 T177 C75 oasu.LoggingInfoStream.message [BD][qtp1495064932-177]: pruneDeletes: prune 1 packets; 0 packets remain
   [junit4]   2> 85760 T177 C75 oasu.LoggingInfoStream.message [IW][qtp1495064932-177]: return reader version=11 reader=StandardDirectoryReader(segments_4:11:nrt)
   [junit4]   2> 85761 T177 C75 oasu.LoggingInfoStream.message [DW][qtp1495064932-177]: qtp1495064932-177 finishFullFlush success=true
   [junit4]   2> 85761 T177 C75 oasu.LoggingInfoStream.message [IW][qtp1495064932-177]: getReader took 16 msec
   [junit4]   2> 85762 T177 C75 oass.SolrIndexSearcher.<init> Opening Searcher@1a39aa42 realtime
   [junit4]   2> 85763 T177 C75 oasup.LogUpdateProcessor.finish [collection1] webapp=/solr path=/update params={wt=javabin&version=2} {deleteByQuery=*:* (-1443859752086929408)} 0 23
   [junit4]   2> 85773 T178 C75 oasu.DirectUpdateHandler2.commit start commit{,optimize=false,openSearcher=true,waitSearcher=true,expungeDeletes=false,softCommit=false,prepareCommit=false}
   [junit4]   2> 85774 T178 C75 oasu.LoggingInfoStream.message [IW][qtp1495064932-178]: commit: start
   [junit4]   2> 85774 T178 C75 oasu.LoggingInfoStream.message [IW][qtp1495064932-178]: commit: enter lock
   [junit4]   2> 85775 T178 C75 oasu.LoggingInfoStream.message [IW][qtp1495064932-178]: commit: now prepare
   [junit4]   2> 85775 T178 C75 oasu.LoggingInfoStream.message [IW][qtp1495064932-178]: prepareCommit: flush
   [junit4]   2> 85776 T178 C75 oasu.LoggingInfoStream.message [IW][qtp1495064932-178]:   index before flush
   [junit4]   2> 85776 T178 C75 oasu.LoggingInfoStream.message [DW][qtp1495064932-178]: qtp1495064932-178 startFullFlush
   [junit4]   2> 85777 T178 C75 oasu.LoggingInfoStream.message [DW][qtp1495064932-178]: anyChanges? numDocsInRam=0 deletes=false hasTickets:false pendingChangesInFullFlush: false
   [junit4]   2> 85777 T178 C75 oasu.LoggingInfoStream.message [IW][qtp1495064932-178]: apply all deletes during flush
   [junit4]   2> 85778 T178 C75 oasu.LoggingInfoStream.message [BD][qtp1495064932-178]: prune sis=org.apache.lucene.index.SegmentInfos@1e88579c minGen=9223372036854775807 packetCount=0
   [junit4]   2> 85778 T178 C75 oasu.LoggingInfoStream.message [DW][qtp1495064932-178]: qtp1495064932-178 finishFullFlush success=true
   [junit4]   2> 85779 T178 C75 oasu.LoggingInfoStream.message [IW][qtp1495064932-178]: startCommit(): start
   [junit4]   2> 85779 T178 C75 oasu.LoggingInfoStream.message [IW][qtp1495064932-178]: startCommit index= changeCount=14
   [junit4]   2> 85780 T178 C75 oasu.LoggingInfoStream.message [IW][qtp1495064932-178]: done all syncs: []
   [junit4]   2> 85781 T178 C75 oasu.LoggingInfoStream.message [IW][qtp1495064932-178]: commit: pendingCommit != null
   [junit4]   2> 85782 T178 C75 oasu.LoggingInfoStream.message [IW][qtp1495064932-178]: commit: wrote segments file "segments_5"
   [junit4]   2> 85782 T178 C75 oasu.LoggingInfoStream.message [IFD][qtp1495064932-178]: now checkpoint "" [0 segments ; isCommit = true]
   [junit4]   2> 85783 T178 C75 oasc.SolrDeletionPolicy.onCommit SolrDeletionPolicy.onCommit: commits: num=2
   [junit4]   2> commit{dir=MockDirWrapper(org.apache.lucene.store.RAMDirectory@3486a602 lockFactory=org.apache.lucene.store.NativeFSLockFactory@10ca6ba3),segFN=segments_4,generation=4}
   [junit4]   2> commit{dir=MockDirWrapper(org.apache.lucene.store.RAMDirectory@3486a602 lockFactory=org.apache.lucene.store.NativeFSLockFactory@10ca6ba3),segFN=segments_5,generation=5}
   [junit4]   2> 85784 T178 C75 oasc.SolrDeletionPolicy.updateCommits newest commit generation = 5
   [junit4]   2> 85784 T178 C75 oasu.LoggingInfoStream.message [IFD][qtp1495064932-178]: deleteCommits: now decRef commit "segments_4"
   [junit4]   2> 85785 T178 C75 oasu.LoggingInfoStream.message [IFD][qtp1495064932-178]: delete "_2.si"
   [junit4]   2> 85785 T178 C75 oasu.LoggingInfoStream.message [IFD][qtp1495064932-178]: delete "_0.fnm"
   [junit4]   2> 85786 T178 C75 oasu.LoggingInfoStream.message [IFD][qtp1495064932-178]: delete "_2_Lucene41_0.tim"
   [junit4]   2> 85787 T178 C75 oasu.LoggingInfoStream.message [IFD][qtp1495064932-178]: unable to remove file "_2_Lucene41_0.tim": java.io.IOException: MockDirectoryWrapper: file "_2_Lucene41_0.tim" is still open: cannot delete; Will re-try later.
   [junit4]   2> 85787 T178 C75 oasu.LoggingInfoStream.message [IFD][qtp1495064932-178]: delete "_0_Lucene41_0.pos"
   [junit4]   2> 85788 T178 C75 oasu.LoggingInfoStream.message [IFD][qtp1495064932-178]: unable to remove file "_0_Lucene41_0.pos": java.io.IOException: MockDirectoryWrapper: file "_0_Lucene41_0.pos" is still open: cannot delete; Will re-try later.
   [junit4]   2> 85788 T178 C75 oasu.LoggingInfoStream.message [IFD][qtp1495064932-178]: delete "_2.fdt"
   [junit4]   2> 85789 T178 C75 oasu.LoggingInfoStream.message [IFD][qtp1495064932-178]: unable to remove file "_2.fdt": java.io.IOException: MockDirectoryWrapper: file "_2.fdt" is still open: cannot delete; Will re-try later.
   [junit4]   2> 85790 T178 C75 oasu.LoggingInfoStream.message [IFD][qtp1495064932-178]: delete "_2_Lucene41_0.doc"
   [junit4]   2> 85791 T178 C75 oasu.LoggingInfoStream.message [IFD][qtp1495064932-178]: unable to remove file "_2_Lucene41_0.doc": java.io.IOException: MockDirectoryWrapper: file "_2_Lucene41_0.doc" is still open: cannot delete; Will re-try later.
   [junit4]   2> 85791 T178 C75 oasu.LoggingInfoStream.message [IFD][qtp1495064932-178]: delete "_2_Lucene41_0.tip"
   [junit4]   2> 85792 T178 C75 oasu.LoggingInfoStream.message [IFD][qtp1495064932-178]: delete "_0.nvm"
   [junit4]   2> 85793 T178 C75 oasu.LoggingInfoStream.message [IFD][qtp1495064932-178]: delete "_2.fdx"
   [junit4]   2> 85793 T178 C75 oasu.LoggingInfoStream.message [IFD][qtp1495064932-178]: delete "_2.fnm"
   [junit4]   2> 85794 T178 C75 oasu.LoggingInfoStream.message [IFD][qtp1495064932-178]: delete "_0_Lucene41_0.doc"
   [junit4]   2> 85794 T178 C75 oasu.LoggingInfoStream.message [IFD][qtp1495064932-178]: unable to remove file "_0_Lucene41_0.doc": java.io.IOException: MockDirectoryWrapper: file "_0_Lucene41_0.doc" is still open: cannot delete; Will re-try later.
   [junit4]   2> 85795 T178 C75 oasu.LoggingInfoStream.message [IFD][qtp1495064932-178]: delete "_0.nvd"
   [junit4]   2> 85795 T178 C75 oasu.LoggingInfoStream.message [IFD][qtp1495064932-178]: unable to remove file "_0.nvd": java.io.IOException: MockDirectoryWrapper: file "_0.nvd" is still open: cannot delete; Will re-try later.
   [junit4]   2> 85796 T178 C75 oasu.LoggingInfoStream.message [IFD][qtp1495064932-178]: delete "_0.fdx"
   [junit4]   2> 85796 T178 C75 oasu.LoggingInfoStream.message [IFD][qtp1495064932-178]: delete "_0.si"
   [junit4]   2> 85797 T178 C75 oasu.LoggingInfoStream.message [IFD][qtp1495064932-178]: delete "_0_Lucene41_0.tim"
   [junit4]   2> 85798 T178 C75 oasu.LoggingInfoStream.message [IFD][qtp1495064932-178]: unable to remove file "_0_Lucene41_0.tim": java.io.IOException: MockDirectoryWrapper: file "_0_Lucene41_0.tim" is still open: cannot delete; Will re-try later.
   [junit4]   2> 85798 T178 C75 oasu.LoggingInfoStream.message [IFD][qtp1495064932-178]: delete "_0_Lucene41_0.tip"
   [junit4]   2> 85799 T178 C75 oasu.LoggingInfoStream.message [IFD][qtp1495064932-178]: delete "_0.fdt"
   [junit4]   2> 85799 T178 C75 oasu.LoggingInfoStream.message [IFD][qtp1495064932-178]: unable to remove file "_0.fdt": java.io.IOException: MockDirectoryWrapper: file "_0.fdt" is still open: cannot delete; Will re-try later.
   [junit4]   2> 85800 T178 C75 oasu.LoggingInfoStream.message [IFD][qtp1495064932-178]: delete "segments_4"
   [junit4]   2> 85800 T178 C75 oasu.LoggingInfoStream.message [IFD][qtp1495064932-178]: 17 msec to checkpoint
   [junit4]   2> 85801 T178 C75 oasu.LoggingInfoStream.message [IW][qtp1495064932-178]: commit: done
   [junit4]   2> 85801 T178 C75 oasu.LoggingInfoStream.message [DW][qtp1495064932-178]: anyChanges? numDocsInRam=0 deletes=false hasTickets:false pendingChangesInFullFlush: false
   [junit4]   2> 85802 T178 C75 oasu.LoggingInfoStream.message [IW][qtp1495064932-178]: nrtIsCurrent: infoVersion matches: true; DW changes: false; BD changes: false
   [junit4]   2> 85802 T178 C75 oasu.LoggingInfoStream.message [DW][qtp1495064932-178]: anyChanges? numDocsInRam=0 deletes=false hasTickets:false pendingChangesInFullFlush: false
   [junit4]   2> 85803 T178 C75 oass.SolrIndexSearcher.<init> Opening Searcher@62224002 main
   [junit4]   2> 85804 T178 C75 oasu.DirectUpdateHandler2.commit end_commit_flush
   [junit4]   2> 85804 T180 oasc.QuerySenderListener.newSearcher QuerySenderListener sending requests to Searcher@62224002 main{StandardDirectoryReader(segments_4:11:nrt)}
   [junit4]   2> 85804 T180 oasc.QuerySenderListener.newSearcher QuerySenderListener done.
   [junit4]   2> 85824 T180 oasc.SolrCore.registerSearcher [collection1] Registered new searcher Searcher@62224002 main{StandardDirectoryReader(segments_4:11:nrt)}
   [junit4]   2> 85826 T180 oasu.LoggingInfoStream.message [IFD][searcherExecutor-128-thread-1]: delete pending file _2_Lucene41_0.tim
   [junit4]   2> 85827 T180 oasu.LoggingInfoStream.message [IFD][searcherExecutor-128-thread-1]: delete "_2_Lucene41_0.tim"
   [junit4]   2> 85827 T180 oasu.LoggingInfoStream.message [IFD][searcherExecutor-128-thread-1]: delete pending file _0_Lucene41_0.pos
   [junit4]   2> 85828 T180 oasu.LoggingInfoStream.message [IFD][searcherExecutor-128-thread-1]: delete "_0_Lucene41_0.pos"
   [junit4]   2> 85829 T180 oasu.LoggingInfoStream.message [IFD][searcherExecutor-128-thread-1]: delete pending file _2.fdt
   [junit4]   2> 85829 T180 oasu.LoggingInfoStream.message [IFD][searcherExecutor-128-thread-1]: delete "_2.fdt"
   [junit4]   2> 85830 T180 oasu.LoggingInfoStream.message [IFD][searcherExecutor-128-thread-1]: delete pending file _2_Lucene41_0.doc
   [junit4]   2> 85830 T180 oasu.LoggingInfoStream.message [IFD][searcherExecutor-128-thread-1]: delete "_2_Lucene41_0.doc"
   [junit4]   2> 85831 T180 oasu.LoggingInfoStream.message [IFD][searcherExecutor-128-thread-1]: delete pending file _0_Lucene41_0.doc
   [junit4]   2> 85831 T180 oasu.LoggingInfoStream.message [IFD][searcherExecutor-128-thread-1]: delete "_0_Lucene41_0.doc"
   [junit4]   2> 85832 T180 oasu.LoggingInfoStream.message [IFD][searcherExecutor-128-thread-1]: delete pending file _0.nvd
   [junit4]   2> 85833 T180 oasu.LoggingInfoStream.message [IFD][searcherExecutor-128-thread-1]: delete "_0.nvd"
   [junit4]   2> 85839 T180 oasu.LoggingInfoStream.message [IFD][searcherExecutor-128-thread-1]: delete pending file _0_Lucene41_0.tim
   [junit4]   2> 85839 T180 oasu.LoggingInfoStream.message [IFD][searcherExecutor-128-thread-1]: delete "_0_Lucene41_0.tim"
   [junit4]   2> 85840 T180 oasu.LoggingInfoStream.message [IFD][searcherExecutor-128-thread-1]: delete pending file _0.fdt
   [junit4]   2> 85840 T180 oasu.LoggingInfoStream.message [IFD][searcherExecutor-128-thread-1]: delete "_0.fdt"
   [junit4]   2> ASYNC  NEW_CORE C76 name=collection1 org.apache.solr.core.SolrCore@78c4f9e6
   [junit4]   2> 85841 T178 C76 oasup.LogUpdateProcessor.finish [collection1] webapp=/solr path=/update params={waitSearcher=true&commit=true&wt=javabin&version=2&softCommit=false} {commit=} 0 68
   [junit4]   2> 85848 T173 C76 oasc.SolrCore.execute [collection1] webapp=/solr path=/select params={q=*:*&wt=javabin&version=2} hits=0 status=0 QTime=1
   [junit4]   2> 85859 T174 C76 oasup.LogUpdateProcessor.finish [collection1] webapp=/solr path=/update params={wt=javabin&version=2} {add=[doc0 (1443859752207515648)]} 0 5
   [junit4]   2> 85868 T175 C76 oasup.LogUpdateProcessor.finish [collection1] webapp=/solr path=/update params={wt=javabin&version=2} {add=[doc1 (1443859752220098560)]} 0 2
   [junit4]   2> 85877 T177 C76 oasup.LogUpdateProcessor.finish [collection1] webapp=/solr path=/update params={wt=javabin&version=2} {add=[doc2 (1443859752229535744)]} 0 2
   [junit4]   2> 85888 T178 C76 oasup.LogUpdateProcessor.finish [collection1] webapp=/solr path=/update params={wt=javabin&version=2} {add=[doc3 (1443859752240021504)]} 0 2
   [junit4]   2> 85895 T173 C76 oasup.LogUpdateProcessor.finish [collection1] webapp=/solr path=/update params={wt=javabin&version=2} {add=[doc4 (1443859752249458688)]} 0 1
   [junit4]   2> 85903 T174 C76 oasup.LogUpdateProcessor.finish [collection1] webapp=/solr path=/update params={wt=javabin&version=2} {add=[doc5 (1443859752255750144)]} 0 2
   [junit4]   2> 85911 T175 C76 oasup.LogUpdateProcessor.finish [collection1] webapp=/solr path=/update params={wt=javabin&version=2} {add=[doc6 (1443859752265187328)]} 0 1
   [junit4]   2> 85918 T176 C76 oasup.LogUpdateProcessor.finish [collection1] webapp=/solr path=/update params={wt=javabin&version=2} {add=[doc7 (1443859752272527360)]} 0 2
   [junit4]   2> 85931 T177 C76 oasup.LogUpdateProcessor.finish [collection1] webapp=/solr path=/update params={wt=javabin&version=2} {add=[doc8 (1443859752285110272)]} 0 2
   [junit4]   2> 85940 T178 C76 oasup.LogUpdateProcessor.finish [collection1] webapp=/solr path=/update params={wt=javabin&version=2} {add=[doc9 (1443859752295596032)]} 0 1
   [junit4]   2> 85952 T173 C76 oasu.DirectUpdateHandler2.commit start commit{,optimize=false,openSearcher=true,waitSearcher=true,expungeDeletes=false,softCommit=false,prepareCommit=false}
   [junit4]   2> 85952 T173 C76 oasu.LoggingInfoStream.message [IW][qtp1495064932-173]: commit: start
   [junit4]   2> 85953 T173 C76 oasu.LoggingInfoStream.message [IW][qtp1495064932-173

[...truncated too long message...]

169 oas.SolrTestCaseJ4.tearDown ###Ending testAddRetrieve
   [junit4]   2> 297508 T169 oasc.CoreContainer.shutdown Shutting down CoreContainer instance=65949717
   [junit4]   2> 297510 T169 oasc.SolrCore.close [collection1]  CLOSING SolrCore org.apache.solr.core.SolrCore@78c4f9e6
   [junit4]   2> 297568 T169 oasu.DirectUpdateHandler2.close closing DirectUpdateHandler2{commits=60,autocommit maxTime=15000ms,autocommits=1,soft autocommits=3,optimizes=2,rollbacks=0,expungeDeletes=0,docsPending=0,adds=0,deletesById=0,deletesByQuery=0,errors=1,cumulative_adds=153,cumulative_deletesById=5,cumulative_deletesByQuery=28,cumulative_errors=1}
   [junit4]   2> 297572 T169 oasu.SolrCoreState.decrefSolrCoreState Closing SolrCoreState
   [junit4]   2> 297573 T169 oasu.DefaultSolrCoreState.closeIndexWriter SolrCoreState ref count has reached 0 - closing IndexWriter
   [junit4]   2> 297573 T169 oasu.DefaultSolrCoreState.closeIndexWriter closing IndexWriter with IndexWriterCloser
   [junit4]   2> ASYNC  NEW_CORE C96 name=collection1 org.apache.solr.core.SolrCore@78c4f9e6
   [junit4]   2> 297577 T169 C96 oasu.LoggingInfoStream.message [IW][SUITE-SolrExampleBinaryTest-seed#[28D83842A44A956B]-worker]: now flush at close waitForMerges=true
   [junit4]   2> 297578 T169 C96 oasu.LoggingInfoStream.message [IW][SUITE-SolrExampleBinaryTest-seed#[28D83842A44A956B]-worker]:   start flush: applyAllDeletes=true
   [junit4]   2> 297578 T169 C96 oasu.LoggingInfoStream.message [IW][SUITE-SolrExampleBinaryTest-seed#[28D83842A44A956B]-worker]:   index before flush _14(4.5):C2
   [junit4]   2> 297579 T169 C96 oasu.LoggingInfoStream.message [DW][SUITE-SolrExampleBinaryTest-seed#[28D83842A44A956B]-worker]: SUITE-SolrExampleBinaryTest-seed#[28D83842A44A956B]-worker startFullFlush
   [junit4]   2> 297579 T169 C96 oasu.LoggingInfoStream.message [DW][SUITE-SolrExampleBinaryTest-seed#[28D83842A44A956B]-worker]: anyChanges? numDocsInRam=0 deletes=false hasTickets:false pendingChangesInFullFlush: false
   [junit4]   2> 297580 T169 C96 oasu.LoggingInfoStream.message [DW][SUITE-SolrExampleBinaryTest-seed#[28D83842A44A956B]-worker]: SUITE-SolrExampleBinaryTest-seed#[28D83842A44A956B]-worker finishFullFlush success=true
   [junit4]   2> 297580 T169 C96 oasu.LoggingInfoStream.message [IW][SUITE-SolrExampleBinaryTest-seed#[28D83842A44A956B]-worker]: apply all deletes during flush
   [junit4]   2> 297581 T169 C96 oasu.LoggingInfoStream.message [BD][SUITE-SolrExampleBinaryTest-seed#[28D83842A44A956B]-worker]: applyDeletes: no deletes; skipping
   [junit4]   2> 297581 T169 C96 oasu.LoggingInfoStream.message [BD][SUITE-SolrExampleBinaryTest-seed#[28D83842A44A956B]-worker]: prune sis=org.apache.lucene.index.SegmentInfos@1e88579c minGen=236 packetCount=0
   [junit4]   2> 297582 T169 C96 oasu.LoggingInfoStream.message [CMS][SUITE-SolrExampleBinaryTest-seed#[28D83842A44A956B]-worker]: now merge
   [junit4]   2> 297582 T169 C96 oasu.LoggingInfoStream.message [CMS][SUITE-SolrExampleBinaryTest-seed#[28D83842A44A956B]-worker]:   index: _14(4.5):C2
   [junit4]   2> 297583 T169 C96 oasu.LoggingInfoStream.message [CMS][SUITE-SolrExampleBinaryTest-seed#[28D83842A44A956B]-worker]:   no more merges pending; now return
   [junit4]   2> 297583 T169 C96 oasu.LoggingInfoStream.message [IW][SUITE-SolrExampleBinaryTest-seed#[28D83842A44A956B]-worker]: waitForMerges
   [junit4]   2> 297584 T169 C96 oasu.LoggingInfoStream.message [IW][SUITE-SolrExampleBinaryTest-seed#[28D83842A44A956B]-worker]: waitForMerges done
   [junit4]   2> 297584 T169 C96 oasu.LoggingInfoStream.message [IW][SUITE-SolrExampleBinaryTest-seed#[28D83842A44A956B]-worker]: now call final commit()
   [junit4]   2> 297585 T169 C96 oasu.LoggingInfoStream.message [IW][SUITE-SolrExampleBinaryTest-seed#[28D83842A44A956B]-worker]: commit: start
   [junit4]   2> 297586 T169 C96 oasu.LoggingInfoStream.message [IW][SUITE-SolrExampleBinaryTest-seed#[28D83842A44A956B]-worker]: commit: enter lock
   [junit4]   2> 297587 T169 C96 oasu.LoggingInfoStream.message [IW][SUITE-SolrExampleBinaryTest-seed#[28D83842A44A956B]-worker]: commit: now prepare
   [junit4]   2> 297587 T169 C96 oasu.LoggingInfoStream.message [IW][SUITE-SolrExampleBinaryTest-seed#[28D83842A44A956B]-worker]: prepareCommit: flush
   [junit4]   2> 297588 T169 C96 oasu.LoggingInfoStream.message [IW][SUITE-SolrExampleBinaryTest-seed#[28D83842A44A956B]-worker]:   index before flush _14(4.5):C2
   [junit4]   2> 297588 T169 C96 oasu.LoggingInfoStream.message [DW][SUITE-SolrExampleBinaryTest-seed#[28D83842A44A956B]-worker]: SUITE-SolrExampleBinaryTest-seed#[28D83842A44A956B]-worker startFullFlush
   [junit4]   2> 297589 T169 C96 oasu.LoggingInfoStream.message [DW][SUITE-SolrExampleBinaryTest-seed#[28D83842A44A956B]-worker]: anyChanges? numDocsInRam=0 deletes=false hasTickets:false pendingChangesInFullFlush: false
   [junit4]   2> 297590 T169 C96 oasu.LoggingInfoStream.message [IW][SUITE-SolrExampleBinaryTest-seed#[28D83842A44A956B]-worker]: apply all deletes during flush
   [junit4]   2> 297590 T169 C96 oasu.LoggingInfoStream.message [BD][SUITE-SolrExampleBinaryTest-seed#[28D83842A44A956B]-worker]: applyDeletes: no deletes; skipping
   [junit4]   2> 297591 T169 C96 oasu.LoggingInfoStream.message [BD][SUITE-SolrExampleBinaryTest-seed#[28D83842A44A956B]-worker]: prune sis=org.apache.lucene.index.SegmentInfos@1e88579c minGen=236 packetCount=0
   [junit4]   2> 297592 T169 C96 oasu.LoggingInfoStream.message [DW][SUITE-SolrExampleBinaryTest-seed#[28D83842A44A956B]-worker]: SUITE-SolrExampleBinaryTest-seed#[28D83842A44A956B]-worker finishFullFlush success=true
   [junit4]   2> 297592 T169 C96 oasu.LoggingInfoStream.message [IW][SUITE-SolrExampleBinaryTest-seed#[28D83842A44A956B]-worker]: startCommit(): start
   [junit4]   2> 297593 T169 C96 oasu.LoggingInfoStream.message [IW][SUITE-SolrExampleBinaryTest-seed#[28D83842A44A956B]-worker]:   skip startCommit(): no changes pending
   [junit4]   2> 297593 T169 C96 oasu.LoggingInfoStream.message [IW][SUITE-SolrExampleBinaryTest-seed#[28D83842A44A956B]-worker]: commit: pendingCommit == null; skip
   [junit4]   2> 297594 T169 C96 oasu.LoggingInfoStream.message [IW][SUITE-SolrExampleBinaryTest-seed#[28D83842A44A956B]-worker]: commit: done
   [junit4]   2> 297595 T169 C96 oasu.LoggingInfoStream.message [IW][SUITE-SolrExampleBinaryTest-seed#[28D83842A44A956B]-worker]: at close: _14(4.5):C2
   [junit4]   2> 297598 T169 oasc.SolrCore.closeSearcher [collection1] Closing main searcher on request.
   [junit4]   2> 297599 T169 oasc.CachingDirectoryFactory.close Closing MockDirectoryFactory - 2 directories currently being tracked
   [junit4]   2> 297603 T169 oasc.CachingDirectoryFactory.closeCacheValue looking to close /Users/jenkins/workspace/Lucene-Solr-4.x-MacOSX/solr/build/solr-solrj/test/J0/solrtest-SolrExampleBinaryTest-1376971958930/index [CachedDir<<refCount=0;path=/Users/jenkins/workspace/Lucene-Solr-4.x-MacOSX/solr/build/solr-solrj/test/J0/solrtest-SolrExampleBinaryTest-1376971958930/index;done=false>>]
   [junit4]   2> 297604 T169 oasc.CachingDirectoryFactory.close Closing directory: /Users/jenkins/workspace/Lucene-Solr-4.x-MacOSX/solr/build/solr-solrj/test/J0/solrtest-SolrExampleBinaryTest-1376971958930/index
   [junit4]   2> 297604 T169 oasc.CachingDirectoryFactory.closeCacheValue looking to close /Users/jenkins/workspace/Lucene-Solr-4.x-MacOSX/solr/build/solr-solrj/test/J0/solrtest-SolrExampleBinaryTest-1376971958930 [CachedDir<<refCount=0;path=/Users/jenkins/workspace/Lucene-Solr-4.x-MacOSX/solr/build/solr-solrj/test/J0/solrtest-SolrExampleBinaryTest-1376971958930;done=false>>]
   [junit4]   2> 297605 T169 oasc.CachingDirectoryFactory.close Closing directory: /Users/jenkins/workspace/Lucene-Solr-4.x-MacOSX/solr/build/solr-solrj/test/J0/solrtest-SolrExampleBinaryTest-1376971958930
   [junit4]   2> 297605 T169 oejsh.ContextHandler.doStop stopped o.e.j.s.ServletContextHandler{/solr,null}
   [junit4]   2> 297670 T169 oas.SolrTestCaseJ4.deleteCore ###deleteCore
   [junit4]   2> NOTE: test params are: codec=Lucene41, sim=RandomSimilarityProvider(queryNorm=false,coord=crazy): {}, locale=sr, timezone=IST
   [junit4]   2> NOTE: Mac OS X 10.8.4 x86_64/Apple Inc. 1.6.0_51 (64-bit)/cpus=2,threads=1,free=7343984,total=48824320
   [junit4]   2> NOTE: All tests run in this JVM: [AnlysisResponseBaseTest, DocumentAnalysisResponseTest, TestDocumentObjectBinder, MergeIndexesEmbeddedTest, TestUpdateRequestCodec, LargeVolumeEmbeddedTest, IteratorChainTest, SolrExceptionTest, ContentStreamTest, MultiCoreEmbeddedTest, TestCoreAdmin, SolrPingTest, TestSpellCheckResponse, TestNamedListCodec, QueryResponseTest, TestHash, LargeVolumeJettyTest, TestBatchUpdate, SolrExampleXMLTest, FieldAnalysisResponseTest, SolrExampleBinaryTest]
   [junit4] Completed in 215.15s, 26 tests, 1 error <<< FAILURES!

[...truncated 78 lines...]
BUILD FAILED
/Users/jenkins/workspace/Lucene-Solr-4.x-MacOSX/build.xml:395: The following error occurred while executing this line:
/Users/jenkins/workspace/Lucene-Solr-4.x-MacOSX/build.xml:375: The following error occurred while executing this line:
/Users/jenkins/workspace/Lucene-Solr-4.x-MacOSX/build.xml:39: The following error occurred while executing this line:
/Users/jenkins/workspace/Lucene-Solr-4.x-MacOSX/solr/build.xml:194: The following error occurred while executing this line:
/Users/jenkins/workspace/Lucene-Solr-4.x-MacOSX/solr/common-build.xml:450: The following error occurred while executing this line:
/Users/jenkins/workspace/Lucene-Solr-4.x-MacOSX/lucene/common-build.xml:1233: The following error occurred while executing this line:
/Users/jenkins/workspace/Lucene-Solr-4.x-MacOSX/lucene/common-build.xml:876: There were test failures: 46 suites, 272 tests, 1 error

Total time: 100 minutes 31 seconds
Build step 'Invoke Ant' marked build as failure
Description set: Java: 64bit/jdk1.6.0 -XX:+UseCompressedOops -XX:+UseSerialGC
Archiving artifacts
Recording test results
Email was triggered for: Failure
Sending email for trigger: Failure




---------------------------------------------------------------------
To unsubscribe, e-mail: [hidden email]
For additional commands, e-mail: [hidden email]
Reply | Threaded
Open this post in threaded view
|

[JENKINS] Lucene-Solr-4.x-MacOSX (64bit/jdk1.7.0) - Build # 728 - Still Failing!

Policeman Jenkins Server-2
Build: http://jenkins.thetaphi.de/job/Lucene-Solr-4.x-MacOSX/728/
Java: 64bit/jdk1.7.0 -XX:+UseCompressedOops -XX:+UseConcMarkSweepGC

All tests passed

Build Log:
[...truncated 9629 lines...]
   [junit4] ERROR: JVM J0 ended with an exception, command line: /Library/Java/JavaVirtualMachines/jdk1.7.0_25.jdk/Contents/Home/jre/bin/java -XX:+UseCompressedOops -XX:+UseConcMarkSweepGC -XX:+HeapDumpOnOutOfMemoryError -XX:HeapDumpPath=/Users/jenkins/workspace/Lucene-Solr-4.x-MacOSX/heapdumps -Dtests.prefix=tests -Dtests.seed=5F21763931E0D427 -Xmx512M -Dtests.iters= -Dtests.verbose=false -Dtests.infostream=false -Dtests.codec=random -Dtests.postingsformat=random -Dtests.docvaluesformat=random -Dtests.locale=random -Dtests.timezone=random -Dtests.directory=random -Dtests.linedocsfile=europarl.lines.txt.gz -Dtests.luceneMatchVersion=4.5 -Dtests.cleanthreads=perClass -Djava.util.logging.config.file=/Users/jenkins/workspace/Lucene-Solr-4.x-MacOSX/lucene/tools/junit4/logging.properties -Dtests.nightly=false -Dtests.weekly=false -Dtests.slow=true -Dtests.asserts.gracious=false -Dtests.multiplier=1 -DtempDir=. -Djava.io.tmpdir=. -Djunit4.tempDir=/Users/jenkins/workspace/Lucene-Solr-4.x-MacOSX/solr/build/solr-core/test/temp -Dclover.db.dir=/Users/jenkins/workspace/Lucene-Solr-4.x-MacOSX/lucene/build/clover/db -Djava.security.manager=org.apache.lucene.util.TestSecurityManager -Djava.security.policy=/Users/jenkins/workspace/Lucene-Solr-4.x-MacOSX/lucene/tools/junit4/tests.policy -Dlucene.version=4.5-SNAPSHOT -Djetty.testMode=1 -Djetty.insecurerandom=1 -Dsolr.directoryFactory=org.apache.solr.core.MockDirectoryFactory -Djava.awt.headless=true -Dtests.disableHdfs=true -classpath /Users/jenkins/workspace/Lucene-Solr-4.x-MacOSX/solr/build/solr-core/classes/test:/Users/jenkins/workspace/Lucene-Solr-4.x-MacOSX/solr/build/solr-test-framework/classes/java:/Users/jenkins/workspace/Lucene-Solr-4.x-MacOSX/solr/test-framework/lib/junit4-ant-2.0.10.jar:/Users/jenkins/workspace/Lucene-Solr-4.x-MacOSX/solr/build/solr-core/test-files:/Users/jenkins/workspace/Lucene-Solr-4.x-MacOSX/lucene/build/test-framework/classes/java:/Users/jenkins/workspace/Lucene-Solr-4.x-MacOSX/lucene/build/codecs/classes/java:/Users/jenkins/workspace/Lucene-Solr-4.x-MacOSX/solr/build/solr-solrj/classes/java:/Users/jenkins/workspace/Lucene-Solr-4.x-MacOSX/solr/build/solr-core/classes/java:/Users/jenkins/workspace/Lucene-Solr-4.x-MacOSX/lucene/build/analysis/common/lucene-analyzers-common-4.5-SNAPSHOT.jar:/Users/jenkins/workspace/Lucene-Solr-4.x-MacOSX/lucene/build/analysis/kuromoji/lucene-analyzers-kuromoji-4.5-SNAPSHOT.jar:/Users/jenkins/workspace/Lucene-Solr-4.x-MacOSX/lucene/build/analysis/phonetic/lucene-analyzers-phonetic-4.5-SNAPSHOT.jar:/Users/jenkins/workspace/Lucene-Solr-4.x-MacOSX/lucene/build/codecs/lucene-codecs-4.5-SNAPSHOT.jar:/Users/jenkins/workspace/Lucene-Solr-4.x-MacOSX/lucene/build/highlighter/lucene-highlighter-4.5-SNAPSHOT.jar:/Users/jenkins/workspace/Lucene-Solr-4.x-MacOSX/lucene/build/memory/lucene-memory-4.5-SNAPSHOT.jar:/Users/jenkins/workspace/Lucene-Solr-4.x-MacOSX/lucene/build/misc/lucene-misc-4.5-SNAPSHOT.jar:/Users/jenkins/workspace/Lucene-Solr-4.x-MacOSX/lucene/build/spatial/lucene-spatial-4.5-SNAPSHOT.jar:/Users/jenkins/workspace/Lucene-Solr-4.x-MacOSX/lucene/build/suggest/lucene-suggest-4.5-SNAPSHOT.jar:/Users/jenkins/workspace/Lucene-Solr-4.x-MacOSX/lucene/build/grouping/lucene-grouping-4.5-SNAPSHOT.jar:/Users/jenkins/workspace/Lucene-Solr-4.x-MacOSX/lucene/build/queries/lucene-queries-4.5-SNAPSHOT.jar:/Users/jenkins/workspace/Lucene-Solr-4.x-MacOSX/lucene/build/queryparser/lucene-queryparser-4.5-SNAPSHOT.jar:/Users/jenkins/workspace/Lucene-Solr-4.x-MacOSX/lucene/build/join/lucene-join-4.5-SNAPSHOT.jar:/Users/jenkins/workspace/Lucene-Solr-4.x-MacOSX/solr/core/lib/commons-cli-1.2.jar:/Users/jenkins/workspace/Lucene-Solr-4.x-MacOSX/solr/core/lib/commons-codec-1.7.jar:/Users/jenkins/workspace/Lucene-Solr-4.x-MacOSX/solr/core/lib/commons-configuration-1.6.jar:/Users/jenkins/workspace/Lucene-Solr-4.x-MacOSX/solr/core/lib/commons-fileupload-1.2.1.jar:/Users/jenkins/workspace/Lucene-Solr-4.x-MacOSX/solr/core/lib/commons-lang-2.6.jar:/Users/jenkins/workspace/Lucene-Solr-4.x-MacOSX/solr/core/lib/concurrentlinkedhashmap-lru-1.2.jar:/Users/jenkins/workspace/Lucene-Solr-4.x-MacOSX/solr/core/lib/dom4j-1.6.1.jar:/Users/jenkins/workspace/Lucene-Solr-4.x-MacOSX/solr/core/lib/guava-14.0.1.jar:/Users/jenkins/workspace/Lucene-Solr-4.x-MacOSX/solr/core/lib/hadoop-annotations-2.0.5-alpha.jar:/Users/jenkins/workspace/Lucene-Solr-4.x-MacOSX/solr/core/lib/hadoop-auth-2.0.5-alpha.jar:/Users/jenkins/workspace/Lucene-Solr-4.x-MacOSX/solr/core/lib/hadoop-common-2.0.5-alpha.jar:/Users/jenkins/workspace/Lucene-Solr-4.x-MacOSX/solr/core/lib/hadoop-hdfs-2.0.5-alpha.jar:/Users/jenkins/workspace/Lucene-Solr-4.x-MacOSX/solr/core/lib/joda-time-2.2.jar:/Users/jenkins/workspace/Lucene-Solr-4.x-MacOSX/solr/core/lib/org.restlet-2.1.1.jar:/Users/jenkins/workspace/Lucene-Solr-4.x-MacOSX/solr/core/lib/org.restlet.ext.servlet-2.1.1.jar:/Users/jenkins/workspace/Lucene-Solr-4.x-MacOSX/solr/core/lib/protobuf-java-2.4.0a.jar:/Users/jenkins/workspace/Lucene-Solr-4.x-MacOSX/solr/core/lib/spatial4j-0.3.jar:/Users/jenkins/workspace/Lucene-Solr-4.x-MacOSX/solr/solrj/lib/commons-io-2.1.jar:/Users/jenkins/workspace/Lucene-Solr-4.x-MacOSX/solr/solrj/lib/httpclient-4.2.3.jar:/Users/jenkins/workspace/Lucene-Solr-4.x-MacOSX/solr/solrj/lib/httpcore-4.2.2.jar:/Users/jenkins/workspace/Lucene-Solr-4.x-MacOSX/solr/solrj/lib/httpmime-4.2.3.jar:/Users/jenkins/workspace/Lucene-Solr-4.x-MacOSX/solr/solrj/lib/jcl-over-slf4j-1.6.6.jar:/Users/jenkins/workspace/Lucene-Solr-4.x-MacOSX/solr/solrj/lib/jul-to-slf4j-1.6.6.jar:/Users/jenkins/workspace/Lucene-Solr-4.x-MacOSX/solr/solrj/lib/log4j-1.2.16.jar:/Users/jenkins/workspace/Lucene-Solr-4.x-MacOSX/solr/solrj/lib/noggit-0.5.jar:/Users/jenkins/workspace/Lucene-Solr-4.x-MacOSX/solr/solrj/lib/slf4j-api-1.6.6.jar:/Users/jenkins/workspace/Lucene-Solr-4.x-MacOSX/solr/solrj/lib/slf4j-log4j12-1.6.6.jar:/Users/jenkins/workspace/Lucene-Solr-4.x-MacOSX/solr/solrj/lib/wstx-asl-3.2.7.jar:/Users/jenkins/workspace/Lucene-Solr-4.x-MacOSX/solr/solrj/lib/zookeeper-3.4.5.jar:/Users/jenkins/workspace/Lucene-Solr-4.x-MacOSX/solr/example/lib/jetty-continuation-8.1.10.v20130312.jar:/Users/jenkins/workspace/Lucene-Solr-4.x-MacOSX/solr/example/lib/jetty-deploy-8.1.10.v20130312.jar:/Users/jenkins/workspace/Lucene-Solr-4.x-MacOSX/solr/example/lib/jetty-http-8.1.10.v20130312.jar:/Users/jenkins/workspace/Lucene-Solr-4.x-MacOSX/solr/example/lib/jetty-io-8.1.10.v20130312.jar:/Users/jenkins/workspace/Lucene-Solr-4.x-MacOSX/solr/example/lib/jetty-jmx-8.1.10.v20130312.jar:/Users/jenkins/workspace/Lucene-Solr-4.x-MacOSX/solr/example/lib/jetty-security-8.1.10.v20130312.jar:/Users/jenkins/workspace/Lucene-Solr-4.x-MacOSX/solr/example/lib/jetty-server-8.1.10.v20130312.jar:/Users/jenkins/workspace/Lucene-Solr-4.x-MacOSX/solr/example/lib/jetty-servlet-8.1.10.v20130312.jar:/Users/jenkins/workspace/Lucene-Solr-4.x-MacOSX/solr/example/lib/jetty-util-8.1.10.v20130312.jar:/Users/jenkins/workspace/Lucene-Solr-4.x-MacOSX/solr/example/lib/jetty-webapp-8.1.10.v20130312.jar:/Users/jenkins/workspace/Lucene-Solr-4.x-MacOSX/solr/example/lib/jetty-xml-8.1.10.v20130312.jar:/Users/jenkins/workspace/Lucene-Solr-4.x-MacOSX/solr/example/lib/servlet-api-3.0.jar:/Users/jenkins/workspace/Lucene-Solr-4.x-MacOSX/solr/example/example-DIH/solr/db/lib/derby-10.9.1.0.jar:/Users/jenkins/workspace/Lucene-Solr-4.x-MacOSX/solr/example/example-DIH/solr/db/lib/hsqldb-1.8.0.10.jar:/Users/jenkins/workspace/Lucene-Solr-4.x-MacOSX/lucene/build/core/classes/java:/Users/jenkins/workspace/Lucene-Solr-4.x-MacOSX/lucene/test-framework/lib/junit-4.10.jar:/Users/jenkins/workspace/Lucene-Solr-4.x-MacOSX/lucene/test-framework/lib/randomizedtesting-runner-2.0.10.jar:/Users/jenkins/workspace/Lucene-Solr-4.x-MacOSX/solr/core/test-lib/cglib-nodep-2.2.jar:/Users/jenkins/workspace/Lucene-Solr-4.x-MacOSX/solr/core/test-lib/commons-collections-3.2.1.jar:/Users/jenkins/workspace/Lucene-Solr-4.x-MacOSX/solr/core/test-lib/dom4j-1.6.1.jar:/Users/jenkins/workspace/Lucene-Solr-4.x-MacOSX/solr/core/test-lib/easymock-3.0.jar:/Users/jenkins/workspace/Lucene-Solr-4.x-MacOSX/solr/core/test-lib/hadoop-common-2.0.5-alpha-tests.jar:/Users/jenkins/workspace/Lucene-Solr-4.x-MacOSX/solr/core/test-lib/hadoop-hdfs-2.0.5-alpha-tests.jar:/Users/jenkins/workspace/Lucene-Solr-4.x-MacOSX/solr/core/test-lib/javax.servlet-api-3.0.1.jar:/Users/jenkins/workspace/Lucene-Solr-4.x-MacOSX/solr/core/test-lib/jersey-core-1.16.jar:/Users/jenkins/workspace/Lucene-Solr-4.x-MacOSX/solr/core/test-lib/jetty-6.1.26.jar:/Users/jenkins/workspace/Lucene-Solr-4.x-MacOSX/solr/core/test-lib/jetty-util-6.1.26.jar:/Users/jenkins/workspace/Lucene-Solr-4.x-MacOSX/solr/core/test-lib/objenesis-1.2.jar:/Users/jenkins/tools/hudson.tasks.Ant_AntInstallation/ANT_1.8.2/lib/ant-launcher.jar:/Users/jenkins/.ant/lib/ivy-2.3.0.jar:/Users/jenkins/tools/hudson.tasks.Ant_AntInstallation/ANT_1.8.2/lib/ant-antlr.jar:/Users/jenkins/tools/hudson.tasks.Ant_AntInstallation/ANT_1.8.2/lib/ant-apache-bcel.jar:/Users/jenkins/tools/hudson.tasks.Ant_AntInstallation/ANT_1.8.2/lib/ant-apache-bsf.jar:/Users/jenkins/tools/hudson.tasks.Ant_AntInstallation/ANT_1.8.2/lib/ant-apache-log4j.jar:/Users/jenkins/tools/hudson.tasks.Ant_AntInstallation/ANT_1.8.2/lib/ant-apache-oro.jar:/Users/jenkins/tools/hudson.tasks.Ant_AntInstallation/ANT_1.8.2/lib/ant-apache-regexp.jar:/Users/jenkins/tools/hudson.tasks.Ant_AntInstallation/ANT_1.8.2/lib/ant-apache-resolver.jar:/Users/jenkins/tools/hudson.tasks.Ant_AntInstallation/ANT_1.8.2/lib/ant-apache-xalan2.jar:/Users/jenkins/tools/hudson.tasks.Ant_AntInstallation/ANT_1.8.2/lib/ant-commons-logging.jar:/Users/jenkins/tools/hudson.tasks.Ant_AntInstallation/ANT_1.8.2/lib/ant-commons-net.jar:/Users/jenkins/tools/hudson.tasks.Ant_AntInstallation/ANT_1.8.2/lib/ant-jai.jar:/Users/jenkins/tools/hudson.tasks.Ant_AntInstallation/ANT_1.8.2/lib/ant-javamail.jar:/Users/jenkins/tools/hudson.tasks.Ant_AntInstallation/ANT_1.8.2/lib/ant-jdepend.jar:/Users/jenkins/tools/hudson.tasks.Ant_AntInstallation/ANT_1.8.2/lib/ant-jmf.jar:/Users/jenkins/tools/hudson.tasks.Ant_AntInstallation/ANT_1.8.2/lib/ant-jsch.jar:/Users/jenkins/tools/hudson.tasks.Ant_AntInstallation/ANT_1.8.2/lib/ant-junit.jar:/Users/jenkins/tools/hudson.tasks.Ant_AntInstallation/ANT_1.8.2/lib/ant-junit4.jar:/Users/jenkins/tools/hudson.tasks.Ant_AntInstallation/ANT_1.8.2/lib/ant-netrexx.jar:/Users/jenkins/tools/hudson.tasks.Ant_AntInstallation/ANT_1.8.2/lib/ant-swing.jar:/Users/jenkins/tools/hudson.tasks.Ant_AntInstallation/ANT_1.8.2/lib/ant-testutil.jar:/Users/jenkins/tools/hudson.tasks.Ant_AntInstallation/ANT_1.8.2/lib/ant.jar:/Library/Java/JavaVirtualMachines/jdk1.7.0_25.jdk/Contents/Home/lib/tools.jar:/Users/jenkins/.ivy2/cache/com.carrotsearch.randomizedtesting/junit4-ant/jars/junit4-ant-2.0.10.jar -ea:org.apache.lucene... -ea:org.apache.solr... com.carrotsearch.ant.tasks.junit4.slave.SlaveMainSafe -flush -eventsfile /Users/jenkins/workspace/Lucene-Solr-4.x-MacOSX/solr/build/solr-core/test/temp/junit4-J0-20130820_110836_909.events @/Users/jenkins/workspace/Lucene-Solr-4.x-MacOSX/solr/build/solr-core/test/temp/junit4-J0-20130820_110836_909.suites
   [junit4] ERROR: JVM J0 ended with an exception: Forked process returned with error code: 134. Very likely a JVM crash.  Process output piped in logs above.
   [junit4] at com.carrotsearch.ant.tasks.junit4.JUnit4.executeSlave(JUnit4.java:1254)
   [junit4] at com.carrotsearch.ant.tasks.junit4.JUnit4.access$000(JUnit4.java:67)
   [junit4] at com.carrotsearch.ant.tasks.junit4.JUnit4$2.call(JUnit4.java:822)
   [junit4] at com.carrotsearch.ant.tasks.junit4.JUnit4$2.call(JUnit4.java:819)
   [junit4] at java.util.concurrent.FutureTask$Sync.innerRun(FutureTask.java:334)
   [junit4] at java.util.concurrent.FutureTask.run(FutureTask.java:166)
   [junit4] at java.util.concurrent.ThreadPoolExecutor.runWorker(ThreadPoolExecutor.java:1145)
   [junit4] at java.util.concurrent.ThreadPoolExecutor$Worker.run(ThreadPoolExecutor.java:615)
   [junit4] at java.lang.Thread.run(Thread.java:724)

BUILD FAILED
/Users/jenkins/workspace/Lucene-Solr-4.x-MacOSX/build.xml:395: The following error occurred while executing this line:
/Users/jenkins/workspace/Lucene-Solr-4.x-MacOSX/build.xml:375: The following error occurred while executing this line:
/Users/jenkins/workspace/Lucene-Solr-4.x-MacOSX/build.xml:39: The following error occurred while executing this line:
/Users/jenkins/workspace/Lucene-Solr-4.x-MacOSX/solr/build.xml:181: The following error occurred while executing this line:
/Users/jenkins/workspace/Lucene-Solr-4.x-MacOSX/solr/common-build.xml:450: The following error occurred while executing this line:
/Users/jenkins/workspace/Lucene-Solr-4.x-MacOSX/lucene/common-build.xml:1233: The following error occurred while executing this line:
/Users/jenkins/workspace/Lucene-Solr-4.x-MacOSX/lucene/common-build.xml:876: At least one slave process threw an exception, first: Forked process returned with error code: 134. Very likely a JVM crash.  Process output piped in logs above.

Total time: 58 minutes 41 seconds
Build step 'Invoke Ant' marked build as failure
Description set: Java: 64bit/jdk1.7.0 -XX:+UseCompressedOops -XX:+UseConcMarkSweepGC
Archiving artifacts
Recording test results
Email was triggered for: Failure
Sending email for trigger: Failure




---------------------------------------------------------------------
To unsubscribe, e-mail: [hidden email]
For additional commands, e-mail: [hidden email]