[JENKINS] Lucene-Solr-6.x-Linux (64bit/jdk1.8.0_121) - Build # 2719 - Unstable!

classic Classic list List threaded Threaded
3 messages Options
Reply | Threaded
Open this post in threaded view
|

[JENKINS] Lucene-Solr-6.x-Linux (64bit/jdk1.8.0_121) - Build # 2719 - Unstable!

Policeman Jenkins Server-2
Build: https://jenkins.thetaphi.de/job/Lucene-Solr-6.x-Linux/2719/
Java: 64bit/jdk1.8.0_121 -XX:+UseCompressedOops -XX:+UseG1GC

1 tests failed.
FAILED:  junit.framework.TestSuite.org.apache.solr.cloud.TestSolrCloudWithSecureImpersonation

Error Message:
2 threads leaked from SUITE scope at org.apache.solr.cloud.TestSolrCloudWithSecureImpersonation:     1) Thread[id=11095, name=jetty-launcher-1885-thread-1-EventThread, state=TIMED_WAITING, group=TGRP-TestSolrCloudWithSecureImpersonation]         at sun.misc.Unsafe.park(Native Method)         at java.util.concurrent.locks.LockSupport.parkNanos(LockSupport.java:215)         at java.util.concurrent.locks.AbstractQueuedSynchronizer.doAcquireSharedNanos(AbstractQueuedSynchronizer.java:1037)         at java.util.concurrent.locks.AbstractQueuedSynchronizer.tryAcquireSharedNanos(AbstractQueuedSynchronizer.java:1328)         at java.util.concurrent.CountDownLatch.await(CountDownLatch.java:277)         at org.apache.curator.CuratorZookeeperClient.internalBlockUntilConnectedOrTimedOut(CuratorZookeeperClient.java:323)         at org.apache.curator.RetryLoop.callWithRetry(RetryLoop.java:105)         at org.apache.curator.framework.imps.GetDataBuilderImpl.pathInForeground(GetDataBuilderImpl.java:288)         at org.apache.curator.framework.imps.GetDataBuilderImpl.forPath(GetDataBuilderImpl.java:279)         at org.apache.curator.framework.imps.GetDataBuilderImpl.forPath(GetDataBuilderImpl.java:41)         at org.apache.curator.framework.recipes.shared.SharedValue.readValue(SharedValue.java:244)         at org.apache.curator.framework.recipes.shared.SharedValue.access$100(SharedValue.java:44)         at org.apache.curator.framework.recipes.shared.SharedValue$1.process(SharedValue.java:61)         at org.apache.curator.framework.imps.NamespaceWatcher.process(NamespaceWatcher.java:67)         at org.apache.zookeeper.ClientCnxn$EventThread.processEvent(ClientCnxn.java:522)         at org.apache.zookeeper.ClientCnxn$EventThread.run(ClientCnxn.java:498)    2) Thread[id=11094, name=jetty-launcher-1885-thread-2-EventThread, state=TIMED_WAITING, group=TGRP-TestSolrCloudWithSecureImpersonation]         at sun.misc.Unsafe.park(Native Method)         at java.util.concurrent.locks.LockSupport.parkNanos(LockSupport.java:215)         at java.util.concurrent.locks.AbstractQueuedSynchronizer.doAcquireSharedNanos(AbstractQueuedSynchronizer.java:1037)         at java.util.concurrent.locks.AbstractQueuedSynchronizer.tryAcquireSharedNanos(AbstractQueuedSynchronizer.java:1328)         at java.util.concurrent.CountDownLatch.await(CountDownLatch.java:277)         at org.apache.curator.CuratorZookeeperClient.internalBlockUntilConnectedOrTimedOut(CuratorZookeeperClient.java:323)         at org.apache.curator.RetryLoop.callWithRetry(RetryLoop.java:105)         at org.apache.curator.framework.imps.GetDataBuilderImpl.pathInForeground(GetDataBuilderImpl.java:288)         at org.apache.curator.framework.imps.GetDataBuilderImpl.forPath(GetDataBuilderImpl.java:279)         at org.apache.curator.framework.imps.GetDataBuilderImpl.forPath(GetDataBuilderImpl.java:41)         at org.apache.curator.framework.recipes.shared.SharedValue.readValue(SharedValue.java:244)         at org.apache.curator.framework.recipes.shared.SharedValue.access$100(SharedValue.java:44)         at org.apache.curator.framework.recipes.shared.SharedValue$1.process(SharedValue.java:61)         at org.apache.curator.framework.imps.NamespaceWatcher.process(NamespaceWatcher.java:67)         at org.apache.zookeeper.ClientCnxn$EventThread.processEvent(ClientCnxn.java:522)         at org.apache.zookeeper.ClientCnxn$EventThread.run(ClientCnxn.java:498)

Stack Trace:
com.carrotsearch.randomizedtesting.ThreadLeakError: 2 threads leaked from SUITE scope at org.apache.solr.cloud.TestSolrCloudWithSecureImpersonation:
   1) Thread[id=11095, name=jetty-launcher-1885-thread-1-EventThread, state=TIMED_WAITING, group=TGRP-TestSolrCloudWithSecureImpersonation]
        at sun.misc.Unsafe.park(Native Method)
        at java.util.concurrent.locks.LockSupport.parkNanos(LockSupport.java:215)
        at java.util.concurrent.locks.AbstractQueuedSynchronizer.doAcquireSharedNanos(AbstractQueuedSynchronizer.java:1037)
        at java.util.concurrent.locks.AbstractQueuedSynchronizer.tryAcquireSharedNanos(AbstractQueuedSynchronizer.java:1328)
        at java.util.concurrent.CountDownLatch.await(CountDownLatch.java:277)
        at org.apache.curator.CuratorZookeeperClient.internalBlockUntilConnectedOrTimedOut(CuratorZookeeperClient.java:323)
        at org.apache.curator.RetryLoop.callWithRetry(RetryLoop.java:105)
        at org.apache.curator.framework.imps.GetDataBuilderImpl.pathInForeground(GetDataBuilderImpl.java:288)
        at org.apache.curator.framework.imps.GetDataBuilderImpl.forPath(GetDataBuilderImpl.java:279)
        at org.apache.curator.framework.imps.GetDataBuilderImpl.forPath(GetDataBuilderImpl.java:41)
        at org.apache.curator.framework.recipes.shared.SharedValue.readValue(SharedValue.java:244)
        at org.apache.curator.framework.recipes.shared.SharedValue.access$100(SharedValue.java:44)
        at org.apache.curator.framework.recipes.shared.SharedValue$1.process(SharedValue.java:61)
        at org.apache.curator.framework.imps.NamespaceWatcher.process(NamespaceWatcher.java:67)
        at org.apache.zookeeper.ClientCnxn$EventThread.processEvent(ClientCnxn.java:522)
        at org.apache.zookeeper.ClientCnxn$EventThread.run(ClientCnxn.java:498)
   2) Thread[id=11094, name=jetty-launcher-1885-thread-2-EventThread, state=TIMED_WAITING, group=TGRP-TestSolrCloudWithSecureImpersonation]
        at sun.misc.Unsafe.park(Native Method)
        at java.util.concurrent.locks.LockSupport.parkNanos(LockSupport.java:215)
        at java.util.concurrent.locks.AbstractQueuedSynchronizer.doAcquireSharedNanos(AbstractQueuedSynchronizer.java:1037)
        at java.util.concurrent.locks.AbstractQueuedSynchronizer.tryAcquireSharedNanos(AbstractQueuedSynchronizer.java:1328)
        at java.util.concurrent.CountDownLatch.await(CountDownLatch.java:277)
        at org.apache.curator.CuratorZookeeperClient.internalBlockUntilConnectedOrTimedOut(CuratorZookeeperClient.java:323)
        at org.apache.curator.RetryLoop.callWithRetry(RetryLoop.java:105)
        at org.apache.curator.framework.imps.GetDataBuilderImpl.pathInForeground(GetDataBuilderImpl.java:288)
        at org.apache.curator.framework.imps.GetDataBuilderImpl.forPath(GetDataBuilderImpl.java:279)
        at org.apache.curator.framework.imps.GetDataBuilderImpl.forPath(GetDataBuilderImpl.java:41)
        at org.apache.curator.framework.recipes.shared.SharedValue.readValue(SharedValue.java:244)
        at org.apache.curator.framework.recipes.shared.SharedValue.access$100(SharedValue.java:44)
        at org.apache.curator.framework.recipes.shared.SharedValue$1.process(SharedValue.java:61)
        at org.apache.curator.framework.imps.NamespaceWatcher.process(NamespaceWatcher.java:67)
        at org.apache.zookeeper.ClientCnxn$EventThread.processEvent(ClientCnxn.java:522)
        at org.apache.zookeeper.ClientCnxn$EventThread.run(ClientCnxn.java:498)
        at __randomizedtesting.SeedInfo.seed([4A0079D35339D180]:0)




Build Log:
[...truncated 12489 lines...]
   [junit4] Suite: org.apache.solr.cloud.TestSolrCloudWithSecureImpersonation
   [junit4]   2> Creating dataDir: /home/jenkins/workspace/Lucene-Solr-6.x-Linux/solr/build/solr-core/test/J0/temp/solr.cloud.TestSolrCloudWithSecureImpersonation_4A0079D35339D180-001/init-core-data-001
   [junit4]   2> 2006066 INFO  (SUITE-TestSolrCloudWithSecureImpersonation-seed#[4A0079D35339D180]-worker) [    ] o.a.s.SolrTestCaseJ4 Randomized ssl (true) and clientAuth (true) via: @org.apache.solr.util.RandomizeSSL(reason=, value=NaN, ssl=NaN, clientAuth=NaN)
   [junit4]   2> 2006113 WARN  (SUITE-TestSolrCloudWithSecureImpersonation-seed#[4A0079D35339D180]-worker) [    ] o.a.h.u.NativeCodeLoader Unable to load native-hadoop library for your platform... using builtin-java classes where applicable
   [junit4]   2> 2006208 INFO  (SUITE-TestSolrCloudWithSecureImpersonation-seed#[4A0079D35339D180]-worker) [    ] o.a.s.c.MiniSolrCloudCluster Starting cluster of 2 servers in /home/jenkins/workspace/Lucene-Solr-6.x-Linux/solr/build/solr-core/test/J0/temp/solr.cloud.TestSolrCloudWithSecureImpersonation_4A0079D35339D180-001/tempDir-001
   [junit4]   2> 2006208 INFO  (SUITE-TestSolrCloudWithSecureImpersonation-seed#[4A0079D35339D180]-worker) [    ] o.a.s.c.ZkTestServer STARTING ZK TEST SERVER
   [junit4]   2> 2006208 INFO  (Thread-2453) [    ] o.a.s.c.ZkTestServer client port:0.0.0.0/0.0.0.0:0
   [junit4]   2> 2006208 INFO  (Thread-2453) [    ] o.a.s.c.ZkTestServer Starting server
   [junit4]   2> 2006308 INFO  (SUITE-TestSolrCloudWithSecureImpersonation-seed#[4A0079D35339D180]-worker) [    ] o.a.s.c.ZkTestServer start zk server on port:35529
   [junit4]   2> 2006321 INFO  (jetty-launcher-1885-thread-1) [    ] o.e.j.s.Server jetty-9.3.14.v20161028
   [junit4]   2> 2006321 INFO  (jetty-launcher-1885-thread-2) [    ] o.e.j.s.Server jetty-9.3.14.v20161028
   [junit4]   2> 2006323 INFO  (jetty-launcher-1885-thread-1) [    ] o.e.j.s.h.ContextHandler Started o.e.j.s.ServletContextHandler@457b0d0b{/solr,null,AVAILABLE}
   [junit4]   2> 2006323 INFO  (jetty-launcher-1885-thread-2) [    ] o.e.j.s.h.ContextHandler Started o.e.j.s.ServletContextHandler@314ce5b9{/solr,null,AVAILABLE}
   [junit4]   2> 2006323 INFO  (jetty-launcher-1885-thread-1) [    ] o.e.j.s.AbstractConnector Started ServerConnector@4fcf1991{SSL,[ssl, http/1.1]}{127.0.0.1:34423}
   [junit4]   2> 2006323 INFO  (jetty-launcher-1885-thread-2) [    ] o.e.j.s.AbstractConnector Started ServerConnector@4996b86{SSL,[ssl, http/1.1]}{127.0.0.1:44092}
   [junit4]   2> 2006323 INFO  (jetty-launcher-1885-thread-1) [    ] o.e.j.s.Server Started @2008396ms
   [junit4]   2> 2006323 INFO  (jetty-launcher-1885-thread-2) [    ] o.e.j.s.Server Started @2008396ms
   [junit4]   2> 2006323 INFO  (jetty-launcher-1885-thread-1) [    ] o.a.s.c.s.e.JettySolrRunner Jetty properties: {hostContext=/solr, hostPort=34423}
   [junit4]   2> 2006324 INFO  (jetty-launcher-1885-thread-2) [    ] o.a.s.c.s.e.JettySolrRunner Jetty properties: {hostContext=/solr, hostPort=44092}
   [junit4]   2> 2006324 ERROR (jetty-launcher-1885-thread-1) [    ] o.a.s.s.StartupLoggingUtils Missing Java Option solr.log.dir. Logging may be missing or incomplete.
   [junit4]   2> 2006324 ERROR (jetty-launcher-1885-thread-2) [    ] o.a.s.s.StartupLoggingUtils Missing Java Option solr.log.dir. Logging may be missing or incomplete.
   [junit4]   2> 2006324 INFO  (jetty-launcher-1885-thread-1) [    ] o.a.s.s.SolrDispatchFilter  ___      _       Welcome to Apache Solr™ version 6.5.0
   [junit4]   2> 2006324 INFO  (jetty-launcher-1885-thread-2) [    ] o.a.s.s.SolrDispatchFilter  ___      _       Welcome to Apache Solr™ version 6.5.0
   [junit4]   2> 2006324 INFO  (jetty-launcher-1885-thread-1) [    ] o.a.s.s.SolrDispatchFilter / __| ___| |_ _   Starting in cloud mode on port null
   [junit4]   2> 2006324 INFO  (jetty-launcher-1885-thread-2) [    ] o.a.s.s.SolrDispatchFilter / __| ___| |_ _   Starting in cloud mode on port null
   [junit4]   2> 2006324 INFO  (jetty-launcher-1885-thread-1) [    ] o.a.s.s.SolrDispatchFilter \__ \/ _ \ | '_|  Install dir: null
   [junit4]   2> 2006324 INFO  (jetty-launcher-1885-thread-2) [    ] o.a.s.s.SolrDispatchFilter \__ \/ _ \ | '_|  Install dir: null
   [junit4]   2> 2006324 INFO  (jetty-launcher-1885-thread-1) [    ] o.a.s.s.SolrDispatchFilter |___/\___/_|_|    Start time: 2017-01-23T07:55:02.950Z
   [junit4]   2> 2006324 INFO  (jetty-launcher-1885-thread-2) [    ] o.a.s.s.SolrDispatchFilter |___/\___/_|_|    Start time: 2017-01-23T07:55:02.950Z
   [junit4]   2> 2006325 INFO  (jetty-launcher-1885-thread-1) [    ] o.a.s.s.SolrDispatchFilter solr.xml found in ZooKeeper. Loading...
   [junit4]   2> 2006326 INFO  (jetty-launcher-1885-thread-2) [    ] o.a.s.s.SolrDispatchFilter solr.xml found in ZooKeeper. Loading...
   [junit4]   2> 2006333 INFO  (jetty-launcher-1885-thread-1) [    ] o.a.s.u.UpdateShardHandler Creating UpdateShardHandler HTTP client with params: socketTimeout=340000&connTimeout=45000&retry=true
   [junit4]   2> 2006333 INFO  (jetty-launcher-1885-thread-2) [    ] o.a.s.u.UpdateShardHandler Creating UpdateShardHandler HTTP client with params: socketTimeout=340000&connTimeout=45000&retry=true
   [junit4]   2> 2006334 INFO  (jetty-launcher-1885-thread-1) [    ] o.a.s.c.ZkContainer Zookeeper client=127.0.0.1:35529/solr
   [junit4]   2> 2006334 INFO  (jetty-launcher-1885-thread-2) [    ] o.a.s.c.ZkContainer Zookeeper client=127.0.0.1:35529/solr
   [junit4]   2> 2006335 WARN  (NIOServerCxn.Factory:0.0.0.0/0.0.0.0:0) [    ] o.a.z.s.NIOServerCnxn caught end of stream exception
   [junit4]   2> EndOfStreamException: Unable to read additional data from client sessionid 0x159ca5237330004, likely client has closed socket
   [junit4]   2> at org.apache.zookeeper.server.NIOServerCnxn.doIO(NIOServerCnxn.java:228)
   [junit4]   2> at org.apache.zookeeper.server.NIOServerCnxnFactory.run(NIOServerCnxnFactory.java:208)
   [junit4]   2> at java.lang.Thread.run(Thread.java:745)
   [junit4]   2> 2006345 INFO  (jetty-launcher-1885-thread-2) [n:127.0.0.1:44092_solr    ] o.a.s.c.OverseerElectionContext I am going to be the leader 127.0.0.1:44092_solr
   [junit4]   2> 2006345 INFO  (jetty-launcher-1885-thread-1) [n:127.0.0.1:34423_solr    ] o.a.s.c.ZkController Register node as live in ZooKeeper:/live_nodes/127.0.0.1:34423_solr
   [junit4]   2> 2006345 INFO  (jetty-launcher-1885-thread-2) [n:127.0.0.1:44092_solr    ] o.a.s.c.Overseer Overseer (id=97331321427394566-127.0.0.1:44092_solr-n_0000000000) starting
   [junit4]   2> 2006346 INFO  (zkCallback-1896-thread-1-processing-n:127.0.0.1:44092_solr) [n:127.0.0.1:44092_solr    ] o.a.s.c.c.ZkStateReader Updated live nodes from ZooKeeper... (0) -> (1)
   [junit4]   2> 2006346 INFO  (zkCallback-1895-thread-1-processing-n:127.0.0.1:34423_solr) [n:127.0.0.1:34423_solr    ] o.a.s.c.c.ZkStateReader Updated live nodes from ZooKeeper... (0) -> (1)
   [junit4]   2> 2006349 INFO  (jetty-launcher-1885-thread-2) [n:127.0.0.1:44092_solr    ] o.a.s.c.ZkController Register node as live in ZooKeeper:/live_nodes/127.0.0.1:44092_solr
   [junit4]   2> 2006349 INFO  (zkCallback-1896-thread-1-processing-n:127.0.0.1:44092_solr) [n:127.0.0.1:44092_solr    ] o.a.s.c.c.ZkStateReader Updated live nodes from ZooKeeper... (1) -> (2)
   [junit4]   2> 2006349 INFO  (zkCallback-1895-thread-1-processing-n:127.0.0.1:34423_solr) [n:127.0.0.1:34423_solr    ] o.a.s.c.c.ZkStateReader Updated live nodes from ZooKeeper... (1) -> (2)
   [junit4]   2> 2006440 INFO  (jetty-launcher-1885-thread-2) [n:127.0.0.1:44092_solr    ] o.a.s.c.CoreContainer Authentication plugin class obtained from system property 'authenticationPlugin': org.apache.solr.security.HttpParamDelegationTokenPlugin
   [junit4]   2> 2006440 INFO  (jetty-launcher-1885-thread-1) [n:127.0.0.1:34423_solr    ] o.a.s.c.CoreContainer Authentication plugin class obtained from system property 'authenticationPlugin': org.apache.solr.security.HttpParamDelegationTokenPlugin
   [junit4]   2> 2006459 INFO  (jetty-launcher-1885-thread-2) [n:127.0.0.1:44092_solr    ] o.a.s.s.KerberosPlugin Params: {solr.kerberos.impersonator.user.noGroups.hosts=*, solr.kerberos.impersonator.user.bogusGroup.groups=__some_bogus_group, token.valid=30, cookie.domain=127.0.0.1, solr.kerberos.impersonator.user.anyHostAnyUser.groups=*, solr.kerberos.impersonator.user.bogusGroup.hosts=*, solr.kerberos.impersonator.user.anyHostAnyUser.hosts=*, token.validity=36000, solr.kerberos.impersonator.user.noHosts.groups=*, type=kerberos, solr.kerberos.impersonator.user.localHostAnyGroup.groups=*, delegation-token.token-kind=solr-dt, solr.kerberos.impersonator.user.wrongHost.hosts=1.1.1.1.1.1, cookie.path=/, zk-dt-secret-manager.znodeWorkingPath=solr/security/zkdtsm, solr.kerberos.impersonator.user.localHostAnyGroup.hosts=localhost.localdomain,localhost,127.0.0.1, signer.secret.provider.zookeeper.path=/token, solr.kerberos.impersonator.user.anyHostUsersGroup.groups=jenkins, zk-dt-secret-manager.enable=true, solr.kerberos.impersonator.user.wrongHost.groups=*, kerberos.name.rules=DEFAULT, signer.secret.provider=zookeeper, solr.kerberos.impersonator.user.anyHostUsersGroup.hosts=*}
   [junit4]   2> 2006459 INFO  (jetty-launcher-1885-thread-1) [n:127.0.0.1:34423_solr    ] o.a.s.s.KerberosPlugin Params: {solr.kerberos.impersonator.user.noGroups.hosts=*, solr.kerberos.impersonator.user.bogusGroup.groups=__some_bogus_group, token.valid=30, cookie.domain=127.0.0.1, solr.kerberos.impersonator.user.anyHostAnyUser.groups=*, solr.kerberos.impersonator.user.bogusGroup.hosts=*, solr.kerberos.impersonator.user.anyHostAnyUser.hosts=*, token.validity=36000, solr.kerberos.impersonator.user.noHosts.groups=*, type=kerberos, solr.kerberos.impersonator.user.localHostAnyGroup.groups=*, delegation-token.token-kind=solr-dt, solr.kerberos.impersonator.user.wrongHost.hosts=1.1.1.1.1.1, cookie.path=/, zk-dt-secret-manager.znodeWorkingPath=solr/security/zkdtsm, solr.kerberos.impersonator.user.localHostAnyGroup.hosts=localhost.localdomain,localhost,127.0.0.1, signer.secret.provider.zookeeper.path=/token, solr.kerberos.impersonator.user.anyHostUsersGroup.groups=jenkins, zk-dt-secret-manager.enable=true, solr.kerberos.impersonator.user.wrongHost.groups=*, kerberos.name.rules=DEFAULT, signer.secret.provider=zookeeper, solr.kerberos.impersonator.user.anyHostUsersGroup.hosts=*}
   [junit4]   2> 2006538 INFO  (jetty-launcher-1885-thread-1) [n:127.0.0.1:34423_solr    ] o.a.c.f.i.CuratorFrameworkImpl Starting
   [junit4]   2> 2006538 INFO  (jetty-launcher-1885-thread-2) [n:127.0.0.1:44092_solr    ] o.a.c.f.i.CuratorFrameworkImpl Starting
   [junit4]   2> 2006555 INFO  (jetty-launcher-1885-thread-1-EventThread) [n:127.0.0.1:34423_solr    ] o.a.c.f.s.ConnectionStateManager State change: CONNECTED
   [junit4]   2> 2006555 INFO  (jetty-launcher-1885-thread-2-EventThread) [n:127.0.0.1:44092_solr    ] o.a.c.f.s.ConnectionStateManager State change: CONNECTED
   [junit4]   2> 2006669 INFO  (jetty-launcher-1885-thread-1) [n:127.0.0.1:34423_solr    ] o.a.s.h.c.HttpShardHandlerFactory Reconfiguring the default client with: org.apache.solr.security.HttpParamDelegationTokenPlugin$2@41612f38
   [junit4]   2> 2006669 INFO  (jetty-launcher-1885-thread-2) [n:127.0.0.1:44092_solr    ] o.a.s.h.c.HttpShardHandlerFactory Reconfiguring the default client with: org.apache.solr.security.HttpParamDelegationTokenPlugin$2@1f607209
   [junit4]   2> 2006669 INFO  (jetty-launcher-1885-thread-1) [n:127.0.0.1:34423_solr    ] o.a.s.u.UpdateShardHandler Reconfiguring the default client with: org.apache.solr.security.HttpParamDelegationTokenPlugin$2@41612f38
   [junit4]   2> 2006669 INFO  (jetty-launcher-1885-thread-2) [n:127.0.0.1:44092_solr    ] o.a.s.u.UpdateShardHandler Reconfiguring the default client with: org.apache.solr.security.HttpParamDelegationTokenPlugin$2@1f607209
   [junit4]   2> 2006671 INFO  (jetty-launcher-1885-thread-2) [n:127.0.0.1:44092_solr    ] o.a.s.c.CorePropertiesLocator Found 0 core definitions underneath /home/jenkins/workspace/Lucene-Solr-6.x-Linux/solr/build/solr-core/test/J0/temp/solr.cloud.TestSolrCloudWithSecureImpersonation_4A0079D35339D180-001/tempDir-001/node2/.
   [junit4]   2> 2006671 INFO  (jetty-launcher-1885-thread-1) [n:127.0.0.1:34423_solr    ] o.a.s.c.CorePropertiesLocator Found 0 core definitions underneath /home/jenkins/workspace/Lucene-Solr-6.x-Linux/solr/build/solr-core/test/J0/temp/solr.cloud.TestSolrCloudWithSecureImpersonation_4A0079D35339D180-001/tempDir-001/node1/.
   [junit4]   2> 2007583 INFO  (TEST-TestSolrCloudWithSecureImpersonation.testProxyNoConfigGroups-seed#[4A0079D35339D180]) [    ] o.a.s.SolrTestCaseJ4 ###Starting testProxyNoConfigGroups
   [junit4]   2> 2007933 WARN  (TEST-TestSolrCloudWithSecureImpersonation.testProxyNoConfigGroups-seed#[4A0079D35339D180]) [    ] o.a.h.c.p.ResponseProcessCookies Invalid cookie header: "Set-Cookie: hadoop.auth="u=noGroups&p=noGroups&t=test&e=1485194104272&s=5dSwZNfhfNf+HF1k9jB4Lf68qXI="; Path=/; Domain=127.0.0.1; Expires= , 23-   -2017 17:55:04 GMT; Secure; HttpOnly". Invalid 'expires' attribute: , 23- -2017 17:55:04 GMT
   [junit4]   2> 2007934 INFO  (TEST-TestSolrCloudWithSecureImpersonation.testProxyNoConfigGroups-seed#[4A0079D35339D180]) [    ] o.a.s.SolrTestCaseJ4 ###Ending testProxyNoConfigGroups
   [junit4]   2> 2007950 INFO  (TEST-TestSolrCloudWithSecureImpersonation.testProxyNoConfigHosts-seed#[4A0079D35339D180]) [    ] o.a.s.SolrTestCaseJ4 ###Starting testProxyNoConfigHosts
   [junit4]   2> 2007956 WARN  (TEST-TestSolrCloudWithSecureImpersonation.testProxyNoConfigHosts-seed#[4A0079D35339D180]) [    ] o.a.h.c.p.ResponseProcessCookies Invalid cookie header: "Set-Cookie: hadoop.auth="u=noHosts&p=noHosts&t=test&e=1485194104578&s=/UGo+lJsgN5QLd8TO4qNWwyC8XU="; Path=/; Domain=127.0.0.1; Expires= , 23-   -2017 17:55:04 GMT; Secure; HttpOnly". Invalid 'expires' attribute: , 23- -2017 17:55:04 GMT
   [junit4]   2> 2007957 INFO  (TEST-TestSolrCloudWithSecureImpersonation.testProxyNoConfigHosts-seed#[4A0079D35339D180]) [    ] o.a.s.SolrTestCaseJ4 ###Ending testProxyNoConfigHosts
   [junit4]   2> 2007971 INFO  (TEST-TestSolrCloudWithSecureImpersonation.testProxyNullProxyUser-seed#[4A0079D35339D180]) [    ] o.a.s.SolrTestCaseJ4 ###Starting testProxyNullProxyUser
   [junit4]   2> 2007972 INFO  (qtp1877344686-11059) [    ] o.a.s.s.SolrDispatchFilter Error authenticating
   [junit4]   2> java.lang.IllegalArgumentException: userName is NULL, empty or contains a '&'
   [junit4]   2> at org.apache.hadoop.security.authentication.util.AuthToken.checkForIllegalArgument(AuthToken.java:87)
   [junit4]   2> at org.apache.hadoop.security.authentication.util.AuthToken.<init>(AuthToken.java:70)
   [junit4]   2> at org.apache.hadoop.security.authentication.server.AuthenticationToken.<init>(AuthenticationToken.java:58)
   [junit4]   2> at org.apache.solr.security.HttpParamDelegationTokenPlugin$HttpParamDelegationTokenAuthenticationHandler$HttpParamAuthenticationHandler.authenticate(HttpParamDelegationTokenPlugin.java:220)
   [junit4]   2> at org.apache.hadoop.security.token.delegation.web.DelegationTokenAuthenticationHandler.authenticate(DelegationTokenAuthenticationHandler.java:348)
   [junit4]   2> at org.apache.solr.security.RequestContinuesRecorderAuthenticationHandler.authenticate(RequestContinuesRecorderAuthenticationHandler.java:69)
   [junit4]   2> at org.apache.hadoop.security.authentication.server.AuthenticationFilter.doFilter(AuthenticationFilter.java:519)
   [junit4]   2> at org.apache.solr.security.DelegationTokenKerberosFilter.doFilter(DelegationTokenKerberosFilter.java:128)
   [junit4]   2> at org.apache.solr.security.HttpParamDelegationTokenPlugin$HttpParamToRequestFilter.doFilter(HttpParamDelegationTokenPlugin.java:252)
   [junit4]   2> at org.apache.solr.security.KerberosPlugin.doAuthenticate(KerberosPlugin.java:248)
   [junit4]   2> at org.apache.solr.servlet.SolrDispatchFilter.authenticateRequest(SolrDispatchFilter.java:404)
   [junit4]   2> at org.apache.solr.servlet.SolrDispatchFilter.doFilter(SolrDispatchFilter.java:310)
   [junit4]   2> at org.apache.solr.servlet.SolrDispatchFilter.doFilter(SolrDispatchFilter.java:296)
   [junit4]   2> at org.eclipse.jetty.servlet.ServletHandler$CachedChain.doFilter(ServletHandler.java:1699)
   [junit4]   2> at org.apache.solr.client.solrj.embedded.JettySolrRunner$DebugFilter.doFilter(JettySolrRunner.java:110)
   [junit4]   2> at org.eclipse.jetty.servlet.ServletHandler$CachedChain.doFilter(ServletHandler.java:1699)
   [junit4]   2> at org.eclipse.jetty.servlet.ServletHandler.doHandle(ServletHandler.java:582)
   [junit4]   2> at org.eclipse.jetty.server.session.SessionHandler.doHandle(SessionHandler.java:224)
   [junit4]   2> at org.eclipse.jetty.server.handler.ContextHandler.doHandle(ContextHandler.java:1180)
   [junit4]   2> at org.eclipse.jetty.servlet.ServletHandler.doScope(ServletHandler.java:512)
   [junit4]   2> at org.eclipse.jetty.server.session.SessionHandler.doScope(SessionHandler.java:185)
   [junit4]   2> at org.eclipse.jetty.server.handler.ContextHandler.doScope(ContextHandler.java:1112)
   [junit4]   2> at org.eclipse.jetty.server.handler.ScopedHandler.handle(ScopedHandler.java:141)
   [junit4]   2> at org.eclipse.jetty.server.handler.gzip.GzipHandler.handle(GzipHandler.java:462)
   [junit4]   2> at org.eclipse.jetty.server.handler.HandlerWrapper.handle(HandlerWrapper.java:134)
   [junit4]   2> at org.eclipse.jetty.server.Server.handle(Server.java:534)
   [junit4]   2> at org.eclipse.jetty.server.HttpChannel.handle(HttpChannel.java:320)
   [junit4]   2> at org.eclipse.jetty.server.HttpConnection.onFillable(HttpConnection.java:251)
   [junit4]   2> at org.eclipse.jetty.io.AbstractConnection$ReadCallback.succeeded(AbstractConnection.java:273)
   [junit4]   2> at org.eclipse.jetty.io.FillInterest.fillable(FillInterest.java:95)
   [junit4]   2> at org.eclipse.jetty.io.ssl.SslConnection.onFillable(SslConnection.java:202)
   [junit4]   2> at org.eclipse.jetty.io.AbstractConnection$ReadCallback.succeeded(AbstractConnection.java:273)
   [junit4]   2> at org.eclipse.jetty.io.FillInterest.fillable(FillInterest.java:95)
   [junit4]   2> at org.eclipse.jetty.io.SelectChannelEndPoint$2.run(SelectChannelEndPoint.java:93)
   [junit4]   2> at org.eclipse.jetty.util.thread.strategy.ExecuteProduceConsume.executeProduceConsume(ExecuteProduceConsume.java:303)
   [junit4]   2> at org.eclipse.jetty.util.thread.strategy.ExecuteProduceConsume.produceConsume(ExecuteProduceConsume.java:148)
   [junit4]   2> at org.eclipse.jetty.util.thread.strategy.ExecuteProduceConsume.run(ExecuteProduceConsume.java:136)
   [junit4]   2> at org.eclipse.jetty.util.thread.QueuedThreadPool.runJob(QueuedThreadPool.java:671)
   [junit4]   2> at org.eclipse.jetty.util.thread.QueuedThreadPool$2.run(QueuedThreadPool.java:589)
   [junit4]   2> at java.lang.Thread.run(Thread.java:745)
   [junit4]   2> 2007973 WARN  (qtp1877344686-11059) [    ] o.e.j.s.ServletHandler /solr/admin/collections
   [junit4]   2> org.apache.solr.common.SolrException: Error during request authentication,
   [junit4]   2> at org.apache.solr.servlet.SolrDispatchFilter.authenticateRequest(SolrDispatchFilter.java:410)
   [junit4]   2> at org.apache.solr.servlet.SolrDispatchFilter.doFilter(SolrDispatchFilter.java:310)
   [junit4]   2> at org.apache.solr.servlet.SolrDispatchFilter.doFilter(SolrDispatchFilter.java:296)
   [junit4]   2> at org.eclipse.jetty.servlet.ServletHandler$CachedChain.doFilter(ServletHandler.java:1699)
   [junit4]   2> at org.apache.solr.client.solrj.embedded.JettySolrRunner$DebugFilter.doFilter(JettySolrRunner.java:110)
   [junit4]   2> at org.eclipse.jetty.servlet.ServletHandler$CachedChain.doFilter(ServletHandler.java:1699)
   [junit4]   2> at org.eclipse.jetty.servlet.ServletHandler.doHandle(ServletHandler.java:582)
   [junit4]   2> at org.eclipse.jetty.server.session.SessionHandler.doHandle(SessionHandler.java:224)
   [junit4]   2> at org.eclipse.jetty.server.handler.ContextHandler.doHandle(ContextHandler.java:1180)
   [junit4]   2> at org.eclipse.jetty.servlet.ServletHandler.doScope(ServletHandler.java:512)
   [junit4]   2> at org.eclipse.jetty.server.session.SessionHandler.doScope(SessionHandler.java:185)
   [junit4]   2> at org.eclipse.jetty.server.handler.ContextHandler.doScope(ContextHandler.java:1112)
   [junit4]   2> at org.eclipse.jetty.server.handler.ScopedHandler.handle(ScopedHandler.java:141)
   [junit4]   2> at org.eclipse.jetty.server.handler.gzip.GzipHandler.handle(GzipHandler.java:462)
   [junit4]   2> at org.eclipse.jetty.server.handler.HandlerWrapper.handle(HandlerWrapper.java:134)
   [junit4]   2> at org.eclipse.jetty.server.Server.handle(Server.java:534)
   [junit4]   2> at org.eclipse.jetty.server.HttpChannel.handle(HttpChannel.java:320)
   [junit4]   2> at org.eclipse.jetty.server.HttpConnection.onFillable(HttpConnection.java:251)
   [junit4]   2> at org.eclipse.jetty.io.AbstractConnection$ReadCallback.succeeded(AbstractConnection.java:273)
   [junit4]   2> at org.eclipse.jetty.io.FillInterest.fillable(FillInterest.java:95)
   [junit4]   2> at org.eclipse.jetty.io.ssl.SslConnection.onFillable(SslConnection.java:202)
   [junit4]   2> at org.eclipse.jetty.io.AbstractConnection$ReadCallback.succeeded(AbstractConnection.java:273)
   [junit4]   2> at org.eclipse.jetty.io.FillInterest.fillable(FillInterest.java:95)
   [junit4]   2> at org.eclipse.jetty.io.SelectChannelEndPoint$2.run(SelectChannelEndPoint.java:93)
   [junit4]   2> at org.eclipse.jetty.util.thread.strategy.ExecuteProduceConsume.executeProduceConsume(ExecuteProduceConsume.java:303)
   [junit4]   2> at org.eclipse.jetty.util.thread.strategy.ExecuteProduceConsume.produceConsume(ExecuteProduceConsume.java:148)
   [junit4]   2> at org.eclipse.jetty.util.thread.strategy.ExecuteProduceConsume.run(ExecuteProduceConsume.java:136)
   [junit4]   2> at org.eclipse.jetty.util.thread.QueuedThreadPool.runJob(QueuedThreadPool.java:671)
   [junit4]   2> at org.eclipse.jetty.util.thread.QueuedThreadPool$2.run(QueuedThreadPool.java:589)
   [junit4]   2> at java.lang.Thread.run(Thread.java:745)
   [junit4]   2> Caused by: java.lang.IllegalArgumentException: userName is NULL, empty or contains a '&'
   [junit4]   2> at org.apache.hadoop.security.authentication.util.AuthToken.checkForIllegalArgument(AuthToken.java:87)
   [junit4]   2> at org.apache.hadoop.security.authentication.util.AuthToken.<init>(AuthToken.java:70)
   [junit4]   2> at org.apache.hadoop.security.authentication.server.AuthenticationToken.<init>(AuthenticationToken.java:58)
   [junit4]   2> at org.apache.solr.security.HttpParamDelegationTokenPlugin$HttpParamDelegationTokenAuthenticationHandler$HttpParamAuthenticationHandler.authenticate(HttpParamDelegationTokenPlugin.java:220)
   [junit4]   2> at org.apache.hadoop.security.token.delegation.web.DelegationTokenAuthenticationHandler.authenticate(DelegationTokenAuthenticationHandler.java:348)
   [junit4]   2> at org.apache.solr.security.RequestContinuesRecorderAuthenticationHandler.authenticate(RequestContinuesRecorderAuthenticationHandler.java:69)
   [junit4]   2> at org.apache.hadoop.security.authentication.server.AuthenticationFilter.doFilter(AuthenticationFilter.java:519)
   [junit4]   2> at org.apache.solr.security.DelegationTokenKerberosFilter.doFilter(DelegationTokenKerberosFilter.java:128)
   [junit4]   2> at org.apache.solr.security.HttpParamDelegationTokenPlugin$HttpParamToRequestFilter.doFilter(HttpParamDelegationTokenPlugin.java:252)
   [junit4]   2> at org.apache.solr.security.KerberosPlugin.doAuthenticate(KerberosPlugin.java:248)
   [junit4]   2> at org.apache.solr.servlet.SolrDispatchFilter.authenticateRequest(SolrDispatchFilter.java:404)
   [junit4]   2> ... 29 more
   [junit4]   2> 2007976 INFO  (TEST-TestSolrCloudWithSecureImpersonation.testProxyNullProxyUser-seed#[4A0079D35339D180]) [    ] o.a.s.SolrTestCaseJ4 ###Ending testProxyNullProxyUser
   [junit4]   2> 2007991 INFO  (TEST-TestSolrCloudWithSecureImpersonation.testProxyInvalidProxyUser-seed#[4A0079D35339D180]) [    ] o.a.s.SolrTestCaseJ4 ###Starting testProxyInvalidProxyUser
   [junit4]   2> 2007999 WARN  (TEST-TestSolrCloudWithSecureImpersonation.testProxyInvalidProxyUser-seed#[4A0079D35339D180]) [    ] o.a.h.c.p.ResponseProcessCookies Invalid cookie header: "Set-Cookie: hadoop.auth="u=bar&p=bar&t=test&e=1485194104621&s=WqM+gmzr2mj8hFY1D77GeiULqdg="; Path=/; Domain=127.0.0.1; Expires= , 23-   -2017 17:55:04 GMT; Secure; HttpOnly". Invalid 'expires' attribute: , 23- -2017 17:55:04 GMT
   [junit4]   2> 2007999 INFO  (TEST-TestSolrCloudWithSecureImpersonation.testProxyInvalidProxyUser-seed#[4A0079D35339D180]) [    ] o.a.s.SolrTestCaseJ4 ###Ending testProxyInvalidProxyUser
   [junit4]   2> 2008012 INFO  (TEST-TestSolrCloudWithSecureImpersonation.testForwarding-seed#[4A0079D35339D180]) [    ] o.a.s.SolrTestCaseJ4 ###Starting testForwarding
   [junit4]   2> 2008257 INFO  (TEST-TestSolrCloudWithSecureImpersonation.testForwarding-seed#[4A0079D35339D180]) [    ] o.a.s.c.c.ZkStateReader Updated live nodes from ZooKeeper... (0) -> (2)
   [junit4]   2> 2008258 INFO  (TEST-TestSolrCloudWithSecureImpersonation.testForwarding-seed#[4A0079D35339D180]) [    ] o.a.s.c.s.i.ZkClientClusterStateProvider Cluster at 127.0.0.1:35529/solr ready
   [junit4]   2> 2008265 INFO  (qtp1877344686-11051) [n:127.0.0.1:44092_solr    ] o.a.s.h.a.CollectionsHandler Invoked Collection Action :create with params replicationFactor=1&collection.configName=conf1&maxShardsPerNode=1&name=forwardingCollection&action=CREATE&numShards=1&wt=javabin&version=2 and sendToOCPQueue=true
   [junit4]   2> 2008268 INFO  (OverseerThreadFactory-5672-thread-1-processing-n:127.0.0.1:44092_solr) [n:127.0.0.1:44092_solr    ] o.a.s.c.CreateCollectionCmd Create collection forwardingCollection
   [junit4]   2> 2008434 INFO  (qtp1915961691-11045) [n:127.0.0.1:34423_solr    ] o.a.s.h.a.CoreAdminOperation core create command qt=/admin/cores&collection.configName=conf1&newCollection=true&name=forwardingCollection_shard1_replica1&action=CREATE&numShards=1&collection=forwardingCollection&shard=shard1&wt=javabin&version=2
   [junit4]   2> 2008536 INFO  (zkCallback-1895-thread-1-processing-n:127.0.0.1:34423_solr) [n:127.0.0.1:34423_solr    ] o.a.s.c.c.ZkStateReader A cluster state change: [WatchedEvent state:SyncConnected type:NodeDataChanged path:/collections/forwardingCollection/state.json] for collection [forwardingCollection] has occurred - updating... (live nodes size: [2])
   [junit4]   2> 2009447 WARN  (qtp1915961691-11045) [n:127.0.0.1:34423_solr c:forwardingCollection s:shard1  x:forwardingCollection_shard1_replica1] o.a.s.c.Config Beginning with Solr 5.5, <mergePolicy> is deprecated, use <mergePolicyFactory> instead.
   [junit4]   2> 2009448 INFO  (qtp1915961691-11045) [n:127.0.0.1:34423_solr c:forwardingCollection s:shard1  x:forwardingCollection_shard1_replica1] o.a.s.c.SolrConfig Using Lucene MatchVersion: 6.5.0
   [junit4]   2> 2009468 INFO  (qtp1915961691-11045) [n:127.0.0.1:34423_solr c:forwardingCollection s:shard1  x:forwardingCollection_shard1_replica1] o.a.s.s.IndexSchema [forwardingCollection_shard1_replica1] Schema name=test
   [junit4]   2> 2009531 WARN  (qtp1915961691-11045) [n:127.0.0.1:34423_solr c:forwardingCollection s:shard1  x:forwardingCollection_shard1_replica1] o.a.s.s.IndexSchema [forwardingCollection_shard1_replica1] default search field in schema is text. WARNING: Deprecated, please use 'df' on request instead.
   [junit4]   2> 2009533 INFO  (qtp1915961691-11045) [n:127.0.0.1:34423_solr c:forwardingCollection s:shard1  x:forwardingCollection_shard1_replica1] o.a.s.s.IndexSchema Loaded schema test/1.0 with uniqueid field id
   [junit4]   2> 2009540 INFO  (qtp1915961691-11045) [n:127.0.0.1:34423_solr c:forwardingCollection s:shard1  x:forwardingCollection_shard1_replica1] o.a.s.c.CoreContainer Creating SolrCore 'forwardingCollection_shard1_replica1' using configuration from collection forwardingCollection
   [junit4]   2> 2009540 INFO  (qtp1915961691-11045) [n:127.0.0.1:34423_solr c:forwardingCollection s:shard1  x:forwardingCollection_shard1_replica1] o.a.s.c.SolrCore [[forwardingCollection_shard1_replica1] ] Opening new SolrCore at [/home/jenkins/workspace/Lucene-Solr-6.x-Linux/solr/build/solr-core/test/J0/temp/solr.cloud.TestSolrCloudWithSecureImpersonation_4A0079D35339D180-001/tempDir-001/node1/forwardingCollection_shard1_replica1], dataDir=[/home/jenkins/workspace/Lucene-Solr-6.x-Linux/solr/build/solr-core/test/J0/temp/solr.cloud.TestSolrCloudWithSecureImpersonation_4A0079D35339D180-001/tempDir-001/node1/./forwardingCollection_shard1_replica1/data/]
   [junit4]   2> 2009541 INFO  (qtp1915961691-11045) [n:127.0.0.1:34423_solr c:forwardingCollection s:shard1  x:forwardingCollection_shard1_replica1] o.a.s.c.JmxMonitoredMap JMX monitoring is enabled. Adding Solr mbeans to JMX Server: com.sun.jmx.mbeanserver.JmxMBeanServer@74ca2d61
   [junit4]   2> 2009542 INFO  (qtp1915961691-11045) [n:127.0.0.1:34423_solr c:forwardingCollection s:shard1  x:forwardingCollection_shard1_replica1] o.a.s.u.RandomMergePolicy RandomMergePolicy wrapping class org.apache.lucene.index.TieredMergePolicy: [TieredMergePolicy: maxMergeAtOnce=25, maxMergeAtOnceExplicit=35, maxMergedSegmentMB=71.1357421875, floorSegmentMB=1.9013671875, forceMergeDeletesPctAllowed=27.4886718260753, segmentsPerTier=49.0, maxCFSSegmentSizeMB=8.796093022207999E12, noCFSRatio=0.5352788923167173
   [junit4]   2> 2009561 INFO  (qtp1915961691-11045) [n:127.0.0.1:34423_solr c:forwardingCollection s:shard1  x:forwardingCollection_shard1_replica1] o.a.s.u.UpdateHandler Using UpdateLog implementation: org.apache.solr.update.UpdateLog
   [junit4]   2> 2009562 INFO  (qtp1915961691-11045) [n:127.0.0.1:34423_solr c:forwardingCollection s:shard1  x:forwardingCollection_shard1_replica1] o.a.s.u.UpdateLog Initializing UpdateLog: dataDir= defaultSyncLevel=FLUSH numRecordsToKeep=100 maxNumLogsToKeep=10 numVersionBuckets=65536
   [junit4]   2> 2009575 INFO  (qtp1915961691-11045) [n:127.0.0.1:34423_solr c:forwardingCollection s:shard1  x:forwardingCollection_shard1_replica1] o.a.s.u.CommitTracker Hard AutoCommit: disabled
   [junit4]   2> 2009575 INFO  (qtp1915961691-11045) [n:127.0.0.1:34423_solr c:forwardingCollection s:shard1  x:forwardingCollection_shard1_replica1] o.a.s.u.CommitTracker Soft AutoCommit: disabled
   [junit4]   2> 2009575 INFO  (qtp1915961691-11045) [n:127.0.0.1:34423_solr c:forwardingCollection s:shard1  x:forwardingCollection_shard1_replica1] o.a.s.u.RandomMergePolicy RandomMergePolicy wrapping class org.apache.lucene.index.LogByteSizeMergePolicy: [LogByteSizeMergePolicy: minMergeSize=1677721, mergeFactor=28, maxMergeSize=2147483648, maxMergeSizeForForcedMerge=9223372036854775807, calibrateSizeByDeletes=true, maxMergeDocs=2147483647, maxCFSSegmentSizeMB=8.796093022207999E12, noCFSRatio=0.37312493206740605]
   [junit4]   2> 2009576 INFO  (qtp1915961691-11045) [n:127.0.0.1:34423_solr c:forwardingCollection s:shard1  x:forwardingCollection_shard1_replica1] o.a.s.s.SolrIndexSearcher Opening [Searcher@45c7f3b4[forwardingCollection_shard1_replica1] main]
   [junit4]   2> 2009576 INFO  (qtp1915961691-11045) [n:127.0.0.1:34423_solr c:forwardingCollection s:shard1  x:forwardingCollection_shard1_replica1] o.a.s.h.c.SpellCheckComponent Initializing spell checkers
   [junit4]   2> 2009654 INFO  (qtp1915961691-11045) [n:127.0.0.1:34423_solr c:forwardingCollection s:shard1  x:forwardingCollection_shard1_replica1] o.a.s.s.DirectSolrSpellChecker init: {name=direct,classname=DirectSolrSpellChecker,field=lowerfilt,minQueryLength=3}
   [junit4]   2> 2009839 INFO  (qtp1915961691-11045) [n:127.0.0.1:34423_solr c:forwardingCollection s:shard1  x:forwardingCollection_shard1_replica1] o.a.s.h.ReplicationHandler Commits will be reserved for  10000
   [junit4]   2> 2009840 INFO  (searcherExecutor-5677-thread-1-processing-n:127.0.0.1:34423_solr x:forwardingCollection_shard1_replica1 s:shard1 c:forwardingCollection) [n:127.0.0.1:34423_solr c:forwardingCollection s:shard1  x:forwardingCollection_shard1_replica1] o.a.s.h.c.SpellCheckComponent Loading spell index for spellchecker: default
   [junit4]   2> 2009841 INFO  (searcherExecutor-5677-thread-1-processing-n:127.0.0.1:34423_solr x:forwardingCollection_shard1_replica1 s:shard1 c:forwardingCollection) [n:127.0.0.1:34423_solr c:forwardingCollection s:shard1  x:forwardingCollection_shard1_replica1] o.a.s.h.c.SpellCheckComponent Loading spell index for spellchecker: direct
   [junit4]   2> 2009841 INFO  (searcherExecutor-5677-thread-1-processing-n:127.0.0.1:34423_solr x:forwardingCollection_shard1_replica1 s:shard1 c:forwardingCollection) [n:127.0.0.1:34423_solr c:forwardingCollection s:shard1  x:forwardingCollection_shard1_replica1] o.a.s.h.c.SpellCheckComponent Loading spell index for spellchecker: wordbreak
   [junit4]   2> 2009841 INFO  (searcherExecutor-5677-thread-1-processing-n:127.0.0.1:34423_solr x:forwardingCollection_shard1_replica1 s:shard1 c:forwardingCollection) [n:127.0.0.1:34423_solr c:forwardingCollection s:shard1  x:forwardingCollection_shard1_replica1] o.a.s.h.c.SpellCheckComponent Loading spell index for spellchecker: multipleFields
   [junit4]   2> 2009841 INFO  (searcherExecutor-5677-thread-1-processing-n:127.0.0.1:34423_solr x:forwardingCollection_shard1_replica1 s:shard1 c:forwardingCollection) [n:127.0.0.1:34423_solr c:forwardingCollection s:shard1  x:forwardingCollection_shard1_replica1] o.a.s.h.c.SpellCheckComponent Loading spell index for spellchecker: jarowinkler
   [junit4]   2> 2009841 INFO  (searcherExecutor-5677-thread-1-processing-n:127.0.0.1:34423_solr x:forwardingCollection_shard1_replica1 s:shard1 c:forwardingCollection) [n:127.0.0.1:34423_solr c:forwardingCollection s:shard1  x:forwardingCollection_shard1_replica1] o.a.s.h.c.SpellCheckComponent Loading spell index for spellchecker: external
   [junit4]   2> 2009842 INFO  (qtp1915961691-11045) [n:127.0.0.1:34423_solr c:forwardingCollection s:shard1  x:forwardingCollection_shard1_replica1] o.a.s.u.UpdateLog Could not find max version in index or recent updates, using new clock 1557301146647789568
   [junit4]   2> 2009846 INFO  (searcherExecutor-5677-thread-1-processing-n:127.0.0.1:34423_solr x:forwardingCollection_shard1_replica1 s:shard1 c:forwardingCollection) [n:127.0.0.1:34423_solr c:forwardingCollection s:shard1  x:forwardingCollection_shard1_replica1] o.a.s.h.c.SpellCheckComponent Loading spell index for spellchecker: freq
   [junit4]   2> 2009846 INFO  (searcherExecutor-5677-thread-1-processing-n:127.0.0.1:34423_solr x:forwardingCollection_shard1_replica1 s:shard1 c:forwardingCollection) [n:127.0.0.1:34423_solr c:forwardingCollection s:shard1  x:forwardingCollection_shard1_replica1] o.a.s.h.c.SpellCheckComponent Loading spell index for spellchecker: fqcn
   [junit4]   2> 2009846 INFO  (searcherExecutor-5677-thread-1-processing-n:127.0.0.1:34423_solr x:forwardingCollection_shard1_replica1 s:shard1 c:forwardingCollection) [n:127.0.0.1:34423_solr c:forwardingCollection s:shard1  x:forwardingCollection_shard1_replica1] o.a.s.h.c.SpellCheckComponent Loading spell index for spellchecker: perDict
   [junit4]   2> 2009846 INFO  (qtp1915961691-11045) [n:127.0.0.1:34423_solr c:forwardingCollection s:shard1  x:forwardingCollection_shard1_replica1] o.a.s.c.ShardLeaderElectionContext Enough replicas found to continue.
   [junit4]   2> 2009846 INFO  (qtp1915961691-11045) [n:127.0.0.1:34423_solr c:forwardingCollection s:shard1  x:forwardingCollection_shard1_replica1] o.a.s.c.ShardLeaderElectionContext I may be the new leader - try and sync
   [junit4]   2> 2009846 INFO  (qtp1915961691-11045) [n:127.0.0.1:34423_solr c:forwardingCollection s:shard1  x:forwardingCollection_shard1_replica1] o.a.s.c.SyncStrategy Sync replicas to https://127.0.0.1:34423/solr/forwardingCollection_shard1_replica1/
   [junit4]   2> 2009847 INFO  (qtp1915961691-11045) [n:127.0.0.1:34423_solr c:forwardingCollection s:shard1  x:forwardingCollection_shard1_replica1] o.a.s.c.SyncStrategy Sync Success - now sync replicas to me
   [junit4]   2> 2009847 INFO  (qtp1915961691-11045) [n:127.0.0.1:34423_solr c:forwardingCollection s:shard1  x:forwardingCollection_shard1_replica1] o.a.s.c.SyncStrategy https://127.0.0.1:34423/solr/forwardingCollection_shard1_replica1/ has no replicas
   [junit4]   2> 2009847 INFO  (searcherExecutor-5677-thread-1-processing-n:127.0.0.1:34423_solr x:forwardingCollection_shard1_replica1 s:shard1 c:forwardingCollection) [n:127.0.0.1:34423_solr c:forwardingCollection s:shard1  x:forwardingCollection_shard1_replica1] o.a.s.c.SolrCore [forwardingCollection_shard1_replica1] Registered new searcher Searcher@45c7f3b4[forwardingCollection_shard1_replica1] main{ExitableDirectoryReader(UninvertingDirectoryReader())}
   [junit4]   2> 2009874 INFO  (qtp1915961691-11045) [n:127.0.0.1:34423_solr c:forwardingCollection s:shard1  x:forwardingCollection_shard1_replica1] o.a.s.c.ShardLeaderElectionContext I am the new leader: https://127.0.0.1:34423/solr/forwardingCollection_shard1_replica1/ shard1
   [junit4]   2> 2009975 INFO  (zkCallback-1895-thread-1-processing-n:127.0.0.1:34423_solr) [n:127.0.0.1:34423_solr    ] o.a.s.c.c.ZkStateReader A cluster state change: [WatchedEvent state:SyncConnected type:NodeDataChanged path:/collections/forwardingCollection/state.json] for collection [forwardingCollection] has occurred - updating... (live nodes size: [2])
   [junit4]   2> 2010024 INFO  (qtp1915961691-11045) [n:127.0.0.1:34423_solr c:forwardingCollection s:shard1  x:forwardingCollection_shard1_replica1] o.a.s.c.ZkController I am the leader, no recovery necessary
   [junit4]   2> 2010028 INFO  (qtp1915961691-11045) [n:127.0.0.1:34423_solr c:forwardingCollection s:shard1  x:forwardingCollection_shard1_replica1] o.a.s.s.HttpSolrCall [admin] webapp=null path=/admin/cores params={qt=/admin/cores&collection.configName=conf1&newCollection=true&name=forwardingCollection_shard1_replica1&action=CREATE&numShards=1&collection=forwardingCollection&shard=shard1&wt=javabin&version=2} status=0 QTime=1594
   [junit4]   2> 2010029 WARN  (httpShardExecutor-5670-thread-1-processing-n:127.0.0.1:44092_solr [https:////127.0.0.1:34423//solr] https:////127.0.0.1:34423//solr) [n:127.0.0.1:44092_solr    ] o.a.h.c.p.ResponseProcessCookies Invalid cookie header: "Set-Cookie: hadoop.auth="u=$&p=$&t=test&e=1485194105059&s=BBm/+cxzUAgu4OQqJVLwKdvxL3k="; Path=/; Domain=127.0.0.1; Expires= , 23-   -2017 17:55:05 GMT; Secure; HttpOnly". Invalid 'expires' attribute: , 23- -2017 17:55:05 GMT
   [junit4]   2> 2010031 INFO  (qtp1877344686-11051) [n:127.0.0.1:44092_solr    ] o.a.s.h.a.CollectionsHandler Wait for new collection to be active for at most 30 seconds. Check all shard replicas
   [junit4]   2> 2010129 INFO  (zkCallback-1895-thread-1-processing-n:127.0.0.1:34423_solr) [n:127.0.0.1:34423_solr    ] o.a.s.c.c.ZkStateReader A cluster state change: [WatchedEvent state:SyncConnected type:NodeDataChanged path:/collections/forwardingCollection/state.json] for collection [forwardingCollection] has occurred - updating... (live nodes size: [2])
   [junit4]   2> 2010269 INFO  (OverseerCollectionConfigSetProcessor-97331321427394566-127.0.0.1:44092_solr-n_0000000000) [n:127.0.0.1:44092_solr    ] o.a.s.c.OverseerTaskQueue Response ZK path: /overseer/collection-queue-work/qnr-0000000000 doesn't exist.  Requestor may have disconnected from ZooKeeper
   [junit4]   2> 2011032 INFO  (qtp1877344686-11051) [n:127.0.0.1:44092_solr    ] o.a.s.s.HttpSolrCall [admin] webapp=null path=/admin/collections params={replicationFactor=1&collection.configName=conf1&maxShardsPerNode=1&name=forwardingCollection&action=CREATE&numShards=1&wt=javabin&version=2} status=0 QTime=2767
   [junit4]   2> 2011033 WARN  (TEST-TestSolrCloudWithSecureImpersonation.testForwarding-seed#[4A0079D35339D180]) [    ] o.a.h.c.p.ResponseProcessCookies Invalid cookie header: "Set-Cookie: hadoop.auth="u=user&p=user&t=test&e=1485194104887&s=fmlpOkQk0JTU82PLo1VrPKR9TuQ="; Path=/; Domain=127.0.0.1; Expires= , 23-   -2017 17:55:04 GMT; Secure; HttpOnly". Invalid 'expires' attribute: , 23- -2017 17:55:04 GMT
   [junit4]   2> 2011033 INFO  (TEST-TestSolrCloudWithSecureImpersonation.testForwarding-seed#[4A0079D35339D180]) [    ] o.a.s.c.AbstractDistribZkTestBase Wait for recoveries to finish - collection: forwardingCollection failOnTimeout:true timeout (sec):100
   [junit4]   2> 2011033 INFO  (TEST-TestSolrCloudWithSecureImpersonation.testForwarding-seed#[4A0079D35339D180]) [    ] o.a.s.c.AbstractDistribZkTestBase Recoveries finished - collection: forwardingCollection
   [junit4]   2> 2011052 INFO  (qtp1915961691-11047) [n:127.0.0.1:34423_solr c:forwardingCollection s:shard1 r:core_node1 x:forwardingCollection_shard1_replica1] o.a.s.c.S.Request [forwardingCollection_shard1_replica1]  webapp=/solr path=/select params={q=*:*&wt=javabin&version=2} hits=0 status=0 QTime=0
   [junit4]   2> 2011053 WARN  (qtp1877344686-11053) [n:127.0.0.1:44092_solr    ] o.a.h.c.p.ResponseProcessCookies Invalid cookie header: "Set-Cookie: hadoop.auth="u=$&p=$&t=test&e=1485194107678&s=J1bEPhn0re75DJjc+JCDQ5g7Vb4="; Path=/; Domain=127.0.0.1; Expires= , 23-   -2017 17:55:07 GMT; Secure; HttpOnly". Invalid 'expires' attribute: , 23- -2017 17:55:07 GMT
   [junit4]   2> 2011059 WARN  (TEST-TestSolrCloudWithSecureImpersonation.testForwarding-seed#[4A0079D35339D180]) [    ] o.a.h.c.p.ResponseProcessCookies Invalid cookie header: "Set-Cookie: hadoop.auth="u=user&p=user&t=test&e=1485194107673&s=RUeSuASNevXC4//mZupsyaG8OtQ="; Path=/; Domain=127.0.0.1; Expires= , 23-   -2017 17:55:07 GMT; Secure; HttpOnly". Invalid 'expires' attribute: , 23- -2017 17:55:07 GMT
   [junit4]   2> 2011059 WARN  (TEST-TestSolrCloudWithSecureImpersonation.testForwarding-seed#[4A0079D35339D180]) [    ] o.a.h.c.p.ResponseProcessCookies Invalid cookie header: "Set-Cookie: hadoop.auth="u=$&p=$&t=test&e=1485194107678&s=J1bEPhn0re75DJjc+JCDQ5g7Vb4="; Path=/; Domain=127.0.0.1; Expires= , 23-   -2017 17:55:07 GMT; Secure; HttpOnly". Invalid 'expires' attribute: , 23- -2017 17:55:07 GMT
   [junit4]   2> 2011063 INFO  (qtp1915961691-11058) [n:127.0.0.1:34423_solr c:forwardingCollection s:shard1 r:core_node1 x:forwardingCollection_shard1_replica1] o.a.s.c.S.Request [forwardingCollection_shard1_replica1]  webapp=/solr path=/select params={q=*:*&wt=javabin&version=2} hits=0 status=0 QTime=0
   [junit4]   2> 2011063 WARN  (TEST-TestSolrCloudWithSecureImpersonation.testForwarding-seed#[4A0079D35339D180]) [    ] o.a.h.c.p.ResponseProcessCookies Invalid cookie header: "Set-Cookie: hadoop.auth="u=user&p=user&t=test&e=1485194107688&s=IRmXQovg7wFhvKhOfUW+1Up7EpE="; Path=/; Domain=127.0.0.1; Expires= , 23-   -2017 17:55:07 GMT; Secure; HttpOnly". Invalid 'expires' attribute: , 23- -2017 17:55:07 GMT
   [junit4]   2> 2011064 INFO  (TEST-TestSolrCloudWithSecureImpersonation.testForwarding-seed#[4A0079D35339D180]) [    ] o.a.s.SolrTestCaseJ4 ###Ending testForwarding
   [junit4]   2> 2011078 INFO  (TEST-TestSolrCloudWithSecureImpersonation.testProxyWrongHost-seed#[4A0079D35339D180]) [    ] o.a.s.SolrTestCaseJ4 ###Starting testProxyWrongHost
   [junit4]   2> 2011097 WARN  (TEST-TestSolrCloudWithSecureImpersonation.testProxyWrongHost-seed#[4A0079D35339D180]) [    ] o.a.h.c.p.ResponseProcessCookies Invalid cookie header: "Set-Cookie: hadoop.auth="u=wrongHost&p=wrongHost&t=test&e=1485194107705&s=c8k6yD78mWW6dY3Jo9ix58t3aBE="; Path=/; Domain=127.0.0.1; Expires= , 23-   -2017 17:55:07 GMT; Secure; HttpOnly". Invalid 'expires' attribute: , 23- -2017 17:55:07 GMT
   [junit4]   2> 2011097 INFO  (TEST-TestSolrCloudWithSecureImpersonation.testProxyWrongHost-seed#[4A0079D35339D180]) [    ] o.a.s.SolrTestCaseJ4 ###Ending testProxyWrongHost
   [junit4]   2> 2011120 INFO  (TEST-TestSolrCloudWithSecureImpersonation.testProxyInvalidRemote-seed#[4A0079D35339D180]) [    ] o.a.s.SolrTestCaseJ4 ###Starting testProxyInvalidRemote
   [junit4]   2> 2011125 WARN  (TEST-TestSolrCloudWithSecureImpersonation.testProxyInvalidRemote-seed#[4A0079D35339D180]) [    ] o.a.h.c.p.ResponseProcessCookies Invalid cookie header: "Set-Cookie: hadoop.auth="u=localHostAnyGroup&p=localHostAnyGroup&t=test&e=1485194107748&s=6zJP02D6OmGwInisoMKWNqAv3R0="; Path=/; Domain=127.0.0.1; Expires= , 23-   -2017 17:55:07 GMT; Secure; HttpOnly". Invalid 'expires' attribute: , 23- -2017 17:55:07 GMT
   [junit4]   2> 2011125 INFO  (TEST-TestSolrCloudWithSecureImpersonation.testProxyInvalidRemote-seed#[4A0079D35339D180]) [    ] o.a.s.SolrTestCaseJ4 ###Ending testProxyInvalidRemote
   [junit4]   2> 2011144 INFO  (TEST-TestSolrCloudWithSecureImpersonation.testProxyValidateGroup-seed#[4A0079D35339D180]) [    ] o.a.s.SolrTestCaseJ4 ###Starting testProxyValidateGroup
   [junit4]   2> 2011179 INFO  (qtp1877344686-11046) [n:127.0.0.1:44092_solr    ] o.a.s.h.a.CollectionsHandler Invoked Collection Action :list with params doAs=jenkins&action=LIST&wt=javabin&version=2 and sendToOCPQueue=true
   [junit4]   2> 2011179 INFO  (qtp1877344686-11046) [n:127.0.0.1:44092_solr    ] o.a.s.s.HttpSolrCall [admin] webapp=null path=/admin/collections params={doAs=jenkins&action=LIST&wt=javabin&version=2} status=0 QTime=0
   [junit4]   2> 2011180 WARN  (TEST-TestSolrCloudWithSecureImpersonation.testProxyValidateGroup-seed#[4A0079D35339D180]) [    ] o.a.h.c.p.ResponseProcessCookies Invalid cookie header: "Set-Cookie: hadoop.auth="u=anyHostUsersGroup&p=anyHostUsersGroup&t=test&e=1485194107772&s=KDpH38VDo+dqnzZH/0twJtzDREw="; Path=/; Domain=127.0.0.1; Expires= , 23-   -2017 17:55:07 GMT; Secure; HttpOnly". Invalid 'expires' attribute: , 23- -2017 17:55:07 GMT
   [junit4]   2> 2011180 INFO  (TEST-TestSolrCloudWithSecureImpersonation.testProxyValidateGroup-seed#[4A0079D35339D180]) [    ] o.a.s.SolrTestCaseJ4 ###Ending testProxyValidateGroup
   [junit4]   2> 2011192 INFO  (TEST-TestSolrCloudWithSecureImpersonation.testProxyValidateAnyHostAnyUser-seed#[4A0079D35339D180]) [    ] o.a.s.SolrTestCaseJ4 ###Starting testProxyValidateAnyHostAnyUser
   [junit4]   2> 2011195 INFO  (qtp1877344686-11053) [n:127.0.0.1:44092_solr    ] o.a.s.h.a.CollectionsHandler Invoked Collection Action :list with params doAs=bar&action=LIST&wt=javabin&version=2 and sendToOCPQueue=true
   [junit4]   2> 2011195 INFO  (qtp1877344686-11053) [n:127.0.0.1:44092_solr    ] o.a.s.s.HttpSolrCall [admin] webapp=null path=/admin/collections params={doAs=bar&action=LIST&wt=javabin&version=2} status=0 QTime=0
   [junit4]   2> 2011195 WARN  (TEST-TestSolrCloudWithSecureImpersonation.testProxyValidateAnyHostAnyUser-seed#[4A0079D35339D180]) [    ] o.a.h.c.p.ResponseProcessCookies Invalid cookie header: "Set-Cookie: hadoop.auth="u=anyHostAnyUser&p=anyHostAnyUser&t=test&e=1485194107820&s=MsH4BpMIVojR3OcaIt6hElAXOHA="; Path=/; Domain=127.0.0.1; Expires= , 23-   -2017 17:55:07 GMT; Secure; HttpOnly". Invalid 'expires' attribute: , 23- -2017 17:55:07 GMT
   [junit4]   2> 2011196 INFO  (TEST-TestSolrCloudWithSecureImpersonation.testProxyValidateAnyHostAnyUser-seed#[4A0079D35339D180]) [    ] o.a.s.SolrTestCaseJ4 ###Ending testProxyValidateAnyHostAnyUser
   [junit4]   2> 2011209 INFO  (TEST-TestSolrCloudWithSecureImpersonation.testProxyValidateHost-seed#[4A0079D35339D180]) [    ] o.a.s.SolrTestCaseJ4 ###Starting testProxyValidateHost
   [junit4]   2> 2011212 INFO  (qtp1877344686-11057) [n:127.0.0.1:44092_solr    ] o.a.s.h.a.CollectionsHandler Invoked Collection Action :list with params doAs=bar&action=LIST&wt=javabin&version=2 and sendToOCPQueue=true
   [junit4]   2> 2011212 INFO  (qtp1877344686-11057) [n:127.0.0.1:44092_solr    ] o.a.s.s.HttpSolrCall [admin] webapp=null path=/admin/collections params={doAs=bar&action=LIST&wt=javabin&version=2} status=0 QTime=0
   [junit4]   2> 2011212 WARN  (TEST-TestSolrCloudWithSecureImpersonation.testProxyValidateHost-seed#[4A0079D35339D180]) [    ] o.a.h.c.p.ResponseProcessCookies Invalid cookie header: "Set-Cookie: hadoop.auth="u=localHostAnyGroup&p=localHostAnyGroup&t=test&e=1485194107837&s=zbkir12gRPxyNjSx1k7SPzxZZK8="; Path=/; Domain=127.0.0.1; Expires= , 23-   -2017 17:55:07 GMT; Secure; HttpOnly". Invalid 'expires' attribute: , 23- -2017 17:55:07 GMT
   [junit4]   2> 2011213 INFO  (TEST-TestSolrCloudWithSecureImpersonation.testProxyValidateHost-seed#[4A0079D35339D180]) [    ] o.a.s.SolrTestCaseJ4 ###Ending testProxyValidateHost
   [junit4]   2> 2011227 INFO  (TEST-TestSolrCloudWithSecureImpersonation.testProxyUnknownRemote-seed#[4A0079D35339D180]) [    ] o.a.s.SolrTestCaseJ4 ###Starting testProxyUnknownRemote
   [junit4]   2> 2031394 WARN  (TEST-TestSolrCloudWithSecureImpersonation.testProxyUnknownRemote-seed#[4A0079D35339D180]) [    ] o.a.h.c.p.ResponseProcessCookies Invalid cookie header: "Set-Cookie: hadoop.auth="u=localHostAnyGroup&p=localHostAnyGroup&t=test&e=1485194107854&s=GIHyM/bnjYFdFzNx3TAPkb6pVi4="; Path=/; Domain=127.0.0.1; Expires= , 23-   -2017 17:55:07 GMT; Secure; HttpOnly". Invalid 'expires' attribute: , 23- -2017 17:55:07 GMT
   [junit4]   2> 2031395 INFO  (TEST-TestSolrCloudWithSecureImpersonation.testProxyUnknownRemote-seed#[4A0079D35339D180]) [    ] o.a.s.SolrTestCaseJ4 ###Ending testProxyUnknownRemote
   [junit4]   2> 2031420 INFO  (TEST-TestSolrCloudWithSecureImpersonation.testProxyInvalidGroup-seed#[4A0079D35339D180]) [    ] o.a.s.SolrTestCaseJ4 ###Starting testProxyInvalidGroup
   [junit4]   2> 2031428 WARN  (qtp1877344686-11046) [n:127.0.0.1:44092_solr    ] o.a.h.s.ShellBasedUnixGroupsMapping got exception trying to get groups for user bar: id: bar: no such user
   [junit4]   2>
   [junit4]   2> 2031429 WARN  (qtp1877344686-11046) [n:127.0.0.1:44092_solr    ] o.a.h.s.UserGroupInformation No groups available for user bar
   [junit4]   2> 2031431 WARN  (TEST-TestSolrCloudWithSecureImpersonation.testProxyInvalidGroup-seed#[4A0079D35339D180]) [    ] o.a.h.c.p.ResponseProcessCookies Invalid cookie header: "Set-Cookie: hadoop.auth="u=bogusGroup&p=bogusGroup&t=test&e=1485194128049&s=jmFGtwT1PQ6Qw3mTCqMtoD4HD0I="; Path=/; Domain=127.0.0.1; Expires= , 23-   -2017 17:55:28 GMT; Secure; HttpOnly". Invalid 'expires' attribute: , 23- -2017 17:55:28 GMT
   [junit4]   2> 2031431 INFO  (TEST-TestSolrCloudWithSecureImpersonation.testProxyInvalidGroup-seed#[4A0079D35339D180]) [    ] o.a.s.SolrTestCaseJ4 ###Ending testProxyInvalidGroup
   [junit4]   2> 2031489 INFO  (jetty-launcher-1885-thread-1-EventThread) [n:127.0.0.1:34423_solr    ] o.a.c.f.s.ConnectionStateManager State change: SUSPENDED
   [junit4]   2> 2031489 WARN  (zkCallback-1903-thread-2) [    ] o.a.s.c.c.ConnectionManager Watcher org.apache.solr.common.cloud.ConnectionManager@5e1d0e0d name: ZooKeeperConnection Watcher:127.0.0.1:35529/solr got event WatchedEvent state:Disconnected type:None path:null path: null type: None
   [junit4]   2> 2031490 WARN  (zkCallback-1903-thread-2) [    ] o.a.s.c.c.ConnectionManager zkClient has disconnected
   [junit4]   2> 2031490 WARN  (zkCallback-1895-thread-2-processing-n:127.0.0.1:34423_solr) [n:127.0.0.1:34423_solr    ] o.a.s.c.c.ConnectionManager Watcher org.apache.solr.common.cloud.ConnectionManager@41450dc1 name: ZooKeeperConnection Watcher:127.0.0.1:35529/solr got event WatchedEvent state:Disconnected type:None path:null path: null type: None
   [junit4]   2> 2031491 WARN  (zkCallback-1895-thread-2-processing-n:127.0.0.1:34423_solr) [n:127.0.0.1:34423_solr    ] o.a.s.c.c.ConnectionManager zkClient has disconnected
   [junit4]   2> 2031491 WARN  (zkCallback-1896-thread-4-processing-n:127.0.0.1:44092_solr) [n:127.0.0.1:44092_solr    ] o.a.s.c.c.ConnectionManager Watcher org.apache.solr.common.cloud.ConnectionManager@6a83d2af name: ZooKeeperConnection Watcher:127.0.0.1:35529/solr got event WatchedEvent state:Disconnected type:None path:null path: null type: None
   [junit4]   2> 2031492 WARN  (zkCallback-1896-thread-4-processing-n:127.0.0.1:44092_solr) [n:127.0.0.1:44092_solr    ] o.a.s.c.c.ConnectionManager zkClient has disconnected
   [junit4]   2> 2031493 INFO  (jetty-launcher-1885-thread-1) [    ] o.e.j.s.AbstractConnector Stopped ServerConnector@4996b86{SSL,[ssl, http/1.1]}{127.0.0.1:0}
   [junit4]   2> 2031493 INFO  (jetty-launcher-1885-thread-2) [    ] o.e.j.s.AbstractConnector Stopped ServerConnector@4fcf1991{SSL,[ssl, http/1.1]}{127.0.0.1:0}
   [junit4]   2> 2031495 INFO  (jetty-launcher-1885-thread-1) [    ] o.a.s.c.CoreContainer Shutting down CoreContainer instance=123472894
   [junit4]   2> 2031496 INFO  (jetty-launcher-1885-thread-2) [    ] o.a.s.c.CoreContainer Shutting down CoreContainer instance=625421705
   [junit4]   2> 2032807 WARN  (zkCallback-1895-thread-5-processing-n:127.0.0.1:34423_solr) [n:127.0.0.1:34423_solr    ] o.a.s.c.c.ConnectionManager Watcher org.apache.solr.common.cloud.ConnectionManager@41450dc1 name: ZooKeeperConnection Watcher:127.0.0.1:35529/solr got event WatchedEvent state:Expired type:None path:null path: null type: None
   [junit4]   2> 2032807 WARN  (zkCallback-1895-thread-5-processing-n:127.0.0.1:34423_solr) [n:127.0.0.1:34423_solr    ] o.a.s.c.c.ConnectionManager Our previous ZooKeeper session was expired. Attempting to reconnect to recover relationship with ZooKeeper...
   [junit4]   2> 2032808 WARN  (zkCallback-1895-thread-5-processing-n:127.0.0.1:34423_solr) [n:127.0.0.1:34423_solr    ] o.a.s.c.c.DefaultConnectionStrategy Connection expired - starting a new one...
   [junit4]   2> 2032809 INFO  (zkCallback-1895-thread-5-processing-n:127.0.0.1:34423_solr) [n:127.0.0.1:34423_solr    ] o.a.s.c.c.ConnectionManager Connection with ZooKeeper reestablished.
   [junit4]   2> 2032809 INFO  (zkCallback-1895-thread-5-processing-n:127.0.0.1:34423_solr) [n:127.0.0.1:34423_solr    ] o.a.s.c.ZkController ZooKeeper session re-connected ... refreshing core states after session expiration.
   [junit4]   2> 2032809 INFO  (zkCallback-1895-thread-5-processing-n:127.0.0.1:34423_solr) [n:127.0.0.1:34423_solr    ] o.a.s.c.c.ZkStateReader Updated live nodes from ZooKeeper... (2) -> (0)
   [junit4]   2> 2032811 INFO  (zkCallback-1895-thread-5-processing-n:127.0.0.1:34423_solr) [n:127.0.0.1:34423_solr    ] o.a.s.c.OverseerElectionContext I am going to be the leader 127.0.0.1:34423_solr
   [junit4]   2> 2032812 INFO  (zkCallback-1895-thread-5-processing-n:127.0.0.1:34423_solr) [n:127.0.0.1:34423_solr    ] o.a.s.c.Overseer Overseer (id=97331321427394572-127.0.0.1:34423_solr-n_0000000002) starting
   [junit4]   2> 2032818 INFO  (zkCallback-1895-thread-5-processing-n:127.0.0.1:34423_solr) [n:127.0.0.1:34423_solr    ] o.a.s.c.ZkController Register node as live in ZooKeeper:/live_nodes/127.0.0.1:34423_solr
   [junit4]   2> 2032819 INFO  (zkCallback-1895-thread-1-processing-n:127.0.0.1:34423_solr) [n:127.0.0.1:34423_solr    ] o.a.s.c.c.ZkStateReader Updated live nodes from ZooKeeper... (0) -> (1)
   [junit4]   2> 2032819 INFO  (coreZkRegister-5663-thread-1-processing-n:127.0.0.1:34423_solr) [n:127.0.0.1:34423_solr    ] o.a.s.c.ZkController Registering core forwardingCollection_shard1_replica1 afterExpiration? true
   [junit4]   2> 2032819 INFO  (zkCallback-1895-thread-1-processing-n:127.0.0.1:34423_solr) [n:127.0.0.1:34423_solr    ] o.a.s.c.c.ZkStateReader A cluster state change: [WatchedEvent state:SyncConnected type:NodeDataChanged path:/collections/forwardingCollection/state.json] for collection [forwardingCollection] has occurred - updating... (live nodes size: [1])
   [junit4]   2> 2032820 INFO  (zkCallback-1895-thread-5-processing-n:127.0.0.1:34423_solr) [n:127.0.0.1:34423_solr    ] o.a.s.c.c.DefaultConnectionStrategy Reconnected to ZooKeeper
   [junit4]   2> 2032820 INFO  (zkCallback-1895-thread-5-processing-n:127.0.0.1:34423_solr) [n:127.0.0.1:34423_solr    ] o.a.s.c.c.ConnectionManager Connected:true
   [junit4]   2> 2032820 INFO  (Thread-2480) [n:127.0.0.1:34423_solr    ] o.a.s.c.SolrCore config update listener called for core forwardingCollection_shard1_replica1
   [junit4]   2> 2032820 INFO  (coreZkRegister-5663-thread-1-processing-n:127.0.0.1:34423_solr) [n:127.0.0.1:34423_solr c:forwardingCollection s:shard1 r:core_node1 x:forwardingCollection_shard1_replica1] o.a.s.c.ActionThrottle The last leader attempt started 22974ms ago.
   [junit4]   2> 2032821 INFO  (coreZkRegister-5663-thread-1-processing-n:127.0.0.1:34423_solr) [n:127.0.0.1:34423_solr c:forwardingCollection s:shard1 r:core_node1 x:forwardingCollection_shard1_replica1] o.a.s.c.ShardLeaderElectionContext I may be the new leader - try and sync
   [junit4]   2> 2032821 INFO  (coreZkRegister-5663-thread-1-processing-n:127.0.0.1:34423_solr) [n:127.0.0.1:34423_solr c:forwardingCollection s:shard1 r:core_node1 x:forwardingCollection_shard1_replica1] o.a.s.c.SyncStrategy Sync replicas to https://127.0.0.1:34423/solr/forwardingCollection_shard1_replica1/
   [junit4]   2> 2032821 INFO  (coreZkRegister-5663-thread-1-processing-n:127.0.0.1:34423_solr) [n:127.0.0.1:34423_solr c:forwardingCollection s:shard1 r:core_node1 x:forwardingCollection_shard1_replica1] o.a.s.c.SyncStrategy Sync Success - now sync replicas to me
   [junit4]   2> 2032821 INFO  (coreZkRegister-5663-thread-1-processing-n:127.0.0.1:34423_solr) [n:127.0.0.1:34423_solr c:forwardingCollection s:shard1 r:core_node1 x:forwardingCollection_shard1_replica1] o.a.s.c.SyncStrategy https://127.0.0.1:34423/solr/forwardingCollection_shard1_replica1/ has no replicas
   [junit4]   2> 2032823 INFO  (coreZkRegister-5663-thread-1-processing-n:127.0.0.1:34423_solr) [n:127.0.0.1:34423_solr c:forwardingCollection s:shard1 r:core_node1 x:forwardingCollection_shard1_replica1] o.a.s.c.ShardLeaderElectionContext I am the new leader: https://127.0.0.1:34423/solr/forwardingCollection_shard1_replica1/ shard1
   [junit4]   2> 2032823 INFO  (coreZkRegister-5663-thread-1-processing-n:127.0.0.1:34423_solr) [n:127.0.0.1:34423_solr c:forwardingCollection s:shard1 r:core_node1 x:forwardingCollection_shard1_replica1] o.a.s.c.ZkController I am the leader, no recovery necessary
   [junit4]   2> 2032907 ERROR (jetty-launcher-1885-thread-2) [    ] o.a.s.c.Overseer Could not create Overseer node
   [junit4]   2> org.apache.zookeeper.KeeperException$SessionExpiredException: KeeperErrorCode = Session expired for /overseer
   [junit4]   2> at org.apache.zookeeper.KeeperException.create(KeeperException.java:127)
   [junit4]   2> at org.apache.zookeeper.KeeperException.create(KeeperException.java:51)
   [junit4]   2> at org.apache.zookeeper.ZooKeeper.create(ZooKeeper.java:783)
   [junit4]   2> at org.apache.solr.common.cloud.SolrZkClient$9.execute(SolrZkClient.java:391)
   [junit4]   2> at org.apache.solr.common.cloud.SolrZkClient$9.execute(SolrZkClient.java:388)
   [junit4]   2> at org.apache.solr.common.cloud.ZkCmdExecutor.retryOperation(ZkCmdExecutor.java:60)
   [junit4]   2> at org.apache.solr.common.cloud.SolrZkClient.create(SolrZkClient.java:388)
   [junit4]   2> at org.apache.solr.cloud.Overseer.createOverseerNode(Overseer.java:728)
   [junit4]   2> at org.apache.solr.cloud.Overseer.getStateUpdateQueue(Overseer.java:601)
   [junit4]   2> at org.apache.solr.cloud.Overseer.getStateUpdateQueue(Overseer.java:588)
   [junit4]   2> at org.apache.solr.cloud.ZkController.publishNodeAsDown(ZkController.java:2407)
   [junit4]   2> at org.apache.solr.core.CoreContainer.shutdown(CoreContainer.java:641)
   [junit4]   2> at org.apache.solr.servlet.SolrDispatchFilter.destroy(SolrDispatchFilter.java:287)
   [junit4]   2> at org.eclipse.jetty.servlet.FilterHolder.destroyInstance(FilterHolder.java:172)
   [junit4]   2> at org.eclipse.jetty.servlet.FilterHolder.doStop(FilterHolder.java:150)
   [junit4]   2> at org.eclipse.jetty.util.component.AbstractLifeCycle.stop(AbstractLifeCycle.java:89)
   [junit4]   2> at org.eclipse.jetty.servlet.ServletHandler.doStop(ServletHandler.java:238)
   [junit4]   2> at org.eclipse.jetty.util.component.AbstractLifeCycle.stop(AbstractLifeCycle.java:89)
   [junit4]   2> at org.eclipse.jetty.util.component.ContainerLifeCycle.stop(ContainerLifeCycle.java:142)
   [junit4]   2> at org.eclipse.jetty.util.component.ContainerLifeCycle.doStop(ContainerLifeCycle.java:160)
   [junit4]   2> at org.eclipse.jetty.server.handler.AbstractHandler.doStop(AbstractHandler.java:73)
   [junit4]   2> at org.eclipse.jetty.server.session.SessionHandler.doStop(SessionHandler.java:127)
   [junit4]   2> at org.eclipse.jetty.util.component.AbstractLifeCycle.stop(AbstractLifeCycle.java:89)
   [junit4]   2> at org.eclipse.jetty.util.component.ContainerLifeCycle.stop(ContainerLifeCycle.java:142)
   [junit4]   2> at org.eclipse.jetty.util.component.ContainerLifeCycle.doStop(ContainerLifeCycle.java:160)
   [junit4]   2> at org.eclipse.jetty.server.handler.AbstractHandler.doStop(AbstractHandler.java:73)
   [junit4]   2> at org.eclipse.jetty.server.handler.ContextHandler.stopContext(ContextHandler.java:825)
   [junit4]   2> at org.eclipse.jetty.servlet.ServletContextHandler.stopContext(ServletContextHandler.java:356)
   [junit4]   2> at org.eclipse.jetty.server.handler.ContextHandler.doStop(ContextHandler.java:880)
   [junit4]   2> at org.eclipse.jetty.servlet.ServletContextHandler.doStop(ServletContextHandler.java:272)
   [junit4]   2> at org.eclipse.jetty.util.component.AbstractLifeCycle.stop(AbstractLifeCycle.java:89)
   [junit4]   2> at org.eclipse.jetty.util.component.ContainerLifeCycle.stop(ContainerLifeCycle.java:142)
   [junit4]   2> at org.eclipse.jetty.util.component.ContainerLifeCycle.doStop(ContainerLifeCycle.java:160)
   [junit4]   2> at org.eclipse.jetty.server.handler.AbstractHandler.doStop(AbstractHandler.java:73)
   [junit4]   2> at org.eclipse.jetty.util.component.AbstractLifeCycle.stop(AbstractLifeCycle.java:89)
   [junit4]   2> at org.eclipse.jetty.util.component.ContainerLifeCycle.stop(ContainerLifeCycle.java:142)
   [junit4]   2> at org.eclipse.jetty.util.component.ContainerLifeCycle.doStop(ContainerLifeCycle.java:160)
   [junit4]   2> at org.eclipse.jetty.server.handler.AbstractHandler.doStop(AbstractHandler.java:73)
   [junit4]   2> at org.eclipse.jetty.server.Server.doStop(Server.java:493)
   [junit4]   2> at org.eclipse.jetty.util.component.AbstractLifeCycle.stop(AbstractLifeCycle.java:89)
   [junit4]   2> at org.apache.solr.client.solrj.embedded.JettySolrRunner.stop(JettySolrRunner.java:382)
   [junit4]   2> at org.apache.solr.cloud.MiniSolrCloudCluster.stopJettySolrRunner(MiniSolrCloudCluster.java:424)
   [junit4]   2> at org.apache.solr.cloud.MiniSolrCloudCluster.lambda$shutdown$1(MiniSolrCloudCluster.java:523)
   [junit4]   2> at java.util.concurrent.FutureTask.run(FutureTask.java:266)
   [junit4]   2> at org.apache.solr.common.util.ExecutorUtil$MDCAwareThreadPoolExecutor.lambda$execute$0(ExecutorUtil.java:229)
   [junit4]   2> at java.util.concurrent.ThreadPoolExecutor.runWorker(ThreadPoolExecutor.java:1142)
   [junit4]   2> at java.util.concurrent.ThreadPoolExecutor$Worker.run(ThreadPoolExecutor.java:617)
   [junit4]   2> at java.lang.Thread.run(Thread.java:745)
   [junit4]   2> 2032908 WARN  (jetty-launcher-1885-thread-2) [    ] o.a.s.c.ZkController Could not publish node as down: org.apache.zookeeper.KeeperException$SessionExpiredException: KeeperErrorCode = Session expired for /overseer
   [junit4]   2> 2032908 INFO  (coreCloseExecutor-5684-thread-1) [n:127.0.0.1:34423_solr c:forwardingCollection s:shard1 r:core_node1 x:forwardingCollection_shard1_replica1] o.a.s.c.SolrCore [forwardingCollection_shard1_replica1]  CLOSING SolrCore org.apache.solr.core.SolrCore@62e5c5a8
   [junit4]   2> 2032925 INFO  (zkCallback-1895-thread-1-processing-n:127.0.0.1:34423_solr) [n:127.0.0.1:34423_solr    ] o.a.s.c.c.ZkStateReader A cluster state change: [WatchedEvent state:SyncConnected type:NodeDataChanged path:/collections/forwardingCollection/state.json] for collection [forwardingCollection] has occurred - updating... (live nodes size: [1])
   [junit4]   2> 2032929 INFO  (coreCloseExecutor-5684-thread-1) [n:127.0.0.1:34423_solr c:forwardingCollection s:shard1 r:core_node1 x:forwardingCollection_shard1_replica1] o.a.s.m.SolrMetricManager Closing metric reporters for: solr.core.forwardingCollection.shard1.replica1
   [junit4]   2> 2032929 INFO  (jetty-launcher-1885-thread-2) [    ] o.a.s.c.Overseer Overseer (id=97331321427394572-127.0.0.1:34423_solr-n_0000000002) closing
   [junit4]   2> 2032929 INFO  (OverseerStateUpdate-97331321427394572-127.0.0.1:34423_solr-n_0000000002) [n:127.0.0.1:34423_solr    ] o.a.s.c.Overseer Overseer Loop exiting : 127.0.0.1:34423_solr
   [junit4]   2> 2032930 WARN  (zkCallback-1895-thread-1-processing-n:127.0.0.1:34423_solr) [n:127.0.0.1:34423_solr    ] o.a.s.c.c.ZkStateReader ZooKeeper watch triggered, but Solr cannot talk to ZK: [KeeperErrorCode = Session expired for /live_nodes]
   [junit4]   2> 2032930 INFO  (jetty-launcher-1885-thread-2) [    ] o.a.s.m.SolrMetricManager Closing metric reporters for: solr.node
   [junit4]   2> 2032930 ERROR (Thread[Thread-2470,5,TGRP-TestSolrCloudWithSecureImpersonation]) [n:127.0.0.1:34423_solr    ] o.a.h.s.t.d.AbstractDelegationTokenSecretManager ExpiredTokenRemover received java.lang.InterruptedException: sleep interrupted
   [junit4]   2> 2033168 WARN  (zkCallback-1896-thread-3-processing-n:127.0.0.1:44092_solr) [n:127.0.0.1:44092_solr    ] o.a.s.c.c.ConnectionManager Watcher org.apache.solr.common.cloud.ConnectionManager@6a83d2af name: ZooKeeperConnection Watcher:127.0.0.1:35529/solr got event WatchedEvent state:Expired type:None path:null path: null type: None
   [junit4]   2> 2033168 WARN  (OverseerStateUpdate-97331321427394566-127.0.0.1:44092_solr-n_0000000000) [n:127.0.0.1:44092_solr    ] o.a.s.c.Overseer Solr cannot talk to ZK, exiting Overseer main queue loop
   [junit4]   2> org.apache.zookeeper.KeeperException$SessionExpiredException: KeeperErrorCode = Session expired for /overseer/queue
   [junit4]   2> at org.apache.zookeeper.KeeperException.create(KeeperException.java:127)
   [junit4]   2> at org.apache.zookeeper.KeeperException.create(KeeperException.java:51)
   [junit4]   2> at org.apache.zookeeper.ZooKeeper.getChildren(ZooKeeper.java:1472)
   [junit4]   2> at org.apache.solr.common.cloud.SolrZkClient$6.execute(SolrZkClient.java:339)
   [junit4]   2> at org.apache.solr.common.cloud.SolrZkClient$6.execute(SolrZkClient.java:336)
   [junit4]   2> at org.apache.solr.common.cloud.ZkCmdExecutor.retryOperation(ZkCmdExecutor.java:60)
   [junit4]   2> at org.apache.solr.common.cloud.SolrZkClient.getChildren(SolrZkClient.java:336)
   [junit4]   2> at org.apache.solr.cloud.DistributedQueue.fetchZkChildren(DistributedQueue.java:299)
   [junit4]   2> at org.apache.solr.cloud.DistributedQueue.firstChild(DistributedQueue.java:279)
   [junit4]   2> at org.apache.solr.cloud.DistributedQueue.firstElement(DistributedQueue.java:384)
   [junit4]   2> at org.apache.solr.cloud.DistributedQueue.peek(DistributedQueue.java:160)
   [junit4]   2> at org.apache.solr.cloud.DistributedQueue.peek(DistributedQueue.java:138)
   [junit4]   2> at org.apache.solr.cloud.Overseer$ClusterStateUpdater.run(Overseer.java:179)
   [junit4]   2> at java.lang.Thread.run(Thread.java:745)
   [junit4]   2> 2033168 WARN  (zkCallback-1896-thread-3-processing-n:127.0.0.1:44092_solr) [n:127.0.0.1:44092_solr    ] o.a.s.c.c.ConnectionManager Our previous ZooKeeper session was expired. Attempting to reconnect to recover relationship with ZooKeeper...
   [junit4]   2> 2033168 INFO  (OverseerStateUpdate-97331321427394566-127.0.0.1:44092_solr-n_0000000000) [n:127.0.0.1:44092_solr    ] o.a.s.c.Overseer Overseer Loop exiting : 127.0.0.1:44092_solr
   [junit4]   2> 2033169 INFO  (zkCallback-1896-thread-3-processing-n:127.0.0.1:44092_solr) [n:127.0.0.1:44092_solr    ] o.a.s.c.Overseer Overseer (id=97331321427394566-127.0.0.1:44092_solr-n_0000000000) closing
   [junit4]   2> 2033169 WARN  (zkCallback-1896-thread-3-processing-n:127.0.0.1:44092_solr) [n:127.0.0.1:44092_solr    ] o.a.s.c.c.DefaultConnectionStrategy Connection expired - starting a new one...
   [junit4]   2> 2033169 ERROR (OverseerHdfsCoreFailoverThread-97331321427394566-127.0.0.1:44092_solr-n_0000000000) [n:127.0.0.1:44092_solr    ] o.a.s.c.OverseerAutoReplicaFailoverThread OverseerAutoReplicaFailoverThread had an error in its thread work loop.:org.apache.solr.common.SolrException: Could not load collection from ZK: forwardingCollection
   [junit4]   2> at org.apache.solr.common.cloud.ZkStateReader.getCollectionLive(ZkStateReader.java:1101)
   [junit4]   2> at org.apache.solr.common.cloud.ZkStateReader$LazyCollectionRef.get(ZkStateReader.java:638)
   [junit4]   2> at org.apache.solr.common.cloud.ClusterState.getCollectionsMap(ClusterState.java:250)
   [junit4]   2> at org.apache.solr.cloud.OverseerAutoReplicaFailoverThread.doWork(OverseerAutoReplicaFailoverThread.java:166)
   [junit4]   2> at org.apache.solr.cloud.OverseerAutoReplicaFailoverThread.run(OverseerAutoReplicaFailoverThread.java:131)
   [junit4]   2> at java.lang.Thread.run(Thread.java:745)
   [junit4]   2> Caused by: java.lang.InterruptedException
   [junit4]   2> at java.lang.Object.wait(Native Method)
   [junit4]   2> at java.lang.Object.wait(Object.java:502)
   [junit4]   2> at org.apache.zookeeper.ClientCnxn.submitRequest(ClientCnxn.java:1342)
   [junit4]   2> at org.apache.zookeeper.ZooKeeper.getData(ZooKeeper.java:1153)
   [junit4]   2> at org.apache.solr.common.cloud.SolrZkClient$7.execute(SolrZkClient.java:356)
   [junit4]   2> at org.apache.solr.common.cloud.SolrZkClient$7.execute(SolrZkClient.java:353)
   [junit4]   2> at org.apache.solr.common.cloud.ZkCmdExecutor.retryOperation(ZkCmdExecutor.java:60)
   [junit4]   2> at org.apache.solr.common.cloud.SolrZkClient.getData(SolrZkClient.java:353)
   [junit4]   2> at org.apache.solr.common.cloud.ZkStateReader.fetchCollectionState(ZkStateReader.java:1110)
   [junit4]   2> at org.apache.solr.common.cloud.ZkStateReader.getCollectionLive(ZkStateReader.java:1096)
   [junit4]   2> ... 5 more
   [junit4]   2>
   [junit4]   2> 2033170 INFO  (zkCallback-1896-thread-3-processing-n:127.0.0.1:44092_solr) [n:127.0.0.1:44092_solr    ] o.a.s.c.c.ConnectionManager Connection with ZooKeeper reestablished.
   [junit4]   2> 2033170 INFO  (zkCallback-1896-thread-3-processing-n:127.0.0.1:44092_solr) [n:127.0.0.1:44092_solr    ] o.a.s.c.ZkController ZooKeeper session re-connected ... refreshing core states after session expiration.
   [junit4]   2> 2033171 INFO  (zkCallback-1896-thread-3-processing-n:127.0.0.1:44092_solr) [n:127.0.0.1:44092_solr    ] o.a.s.c.c.ZkStateReader Updated live nodes from ZooKeeper... (2) -> (0)
   [junit4]   2> 2033172 INFO  (zkCallback-1896-thread-3-processing-n:127.0.0.1:44092_solr) [n:127.0.0.1:44092_solr    ] o.a.s.c.OverseerElectionContext I am going to be the leader 127.0.0.1:44092_solr
   [junit4]   2> 2033172 INFO  (zkCallback-1896-thread-3-processing-n:127.0.0.1:44092_solr) [n:127.0.0.1:44092_solr    ] o.a.s.c.Overseer Overseer (id=97331321427394573-127.0.0.1:44092_solr-n_0000000003) starting
   [junit4]   2> 2033176 INFO  (zkCallback-1896-thread-3-processing-n:127.0.0.1:44092_solr) [n:127.0.0.1:44092_solr    ] o.a.s.c.ZkController Register node as live in ZooKeeper:/live_nodes/127.0.0.1:44092_solr
   [junit4]   2> 2033177 INFO  (zkCallback-1896-thread-1-processing-n:127.0.0.1:44092_solr) [n:127.0.0.1:44092_solr    ] o.a.s.c.c.ZkStateReader Updated live nodes from ZooKeeper... (0) -> (1)
   [junit4]   2> 2033177 INFO  (zkCallback-1896-thread-3-processing-n:127.0.0.1:44092_solr) [n:127.0.0.1:44092_solr    ] o.a.s.c.c.DefaultConnectionStrategy Reconnected to ZooKeeper
   [junit4]   2> 2033177 INFO  (zkCallback-1896-thread-3-processing-n:127.0.0.1:44092_solr) [n:127.0.0.1:44092_solr    ] o.a.s.c.c.ConnectionManager Connected:true
   [junit4]   2> 2033268 ERROR (jetty-launcher-1885-thread-1) [    ] o.a.s.c.Overseer Could not create Overseer node
   [junit4]   2> org.apache.zookeeper.KeeperException$SessionExpiredException: KeeperErrorCode = Session expired for /overseer
   [junit4]   2> at org.apache.zookeeper.KeeperException.create(KeeperException.java:127)
   [junit4]   2> at org.apache.zookeeper.KeeperException.create(KeeperException.java:51)
   [junit4]   2> at org.apache.zookeeper.ZooKeeper.create(ZooKeeper.java:783)
   [junit4]   2> at org.apache.solr.common.cloud.SolrZkClient$9.execute(SolrZkClient.java:391)
   [junit4]   2> at org.apache.solr.common.cloud.SolrZkClient$9.execute(SolrZkClient.java:388)
   [junit4]   2> at org.apache.solr.common.cloud.ZkCmdExecutor.retryOperation(ZkCmdExecutor.java:60)
   [junit4]   2> at org.apache.solr.common.cloud.SolrZkClient.create(SolrZkClient.java:388)
   [junit4]   2> at org.apache.solr.cloud.Overseer.createOverseerNode(Overseer.java:728)
   [junit4]   2> at org.apache.solr.cloud.Overseer.getStateUpdateQueue(Overseer.java:601)
   [junit4]   2> at org.apache.solr.cloud.Overseer.getStateUpdateQueue(Overseer.java:588)
   [junit4]   2> at org.apache.solr.cloud.ZkController.publishNodeAsDown(ZkController.java:2407)
   [junit4]   2> at org.apache.solr.core.CoreContainer.shutdown(CoreContainer.java:641)
   [junit4]   2> at org.apache.solr.servlet.SolrDispatchFilter.destroy(SolrDispatchFilter.java:287)
   [junit4]   2> at org.eclipse.jetty.servlet.FilterHolder.destroyInstance(FilterHolder.java:172)
   [junit4]   2> at org.eclipse.jetty.servlet.FilterHolder.doStop(FilterHolder.java:150)
   [junit4]   2> at org.eclipse.jetty.util.component.AbstractLifeCycle.stop(AbstractLifeCycle.java:89)
   [junit4]   2> at org.eclipse.jetty.servlet.ServletHandler.doStop(ServletHandler.java:238)
   [junit4]   2> at org.eclipse.jetty.util.component.AbstractLifeCycle.stop(AbstractLifeCycle.java:89)
   [junit4]   2> at org.eclipse.jetty.util.component.ContainerLifeCycle.stop(ContainerLifeCycle.java:142)
   [junit4]   2> at org.eclipse.jetty.util.component.ContainerLifeCycle.doStop(ContainerLifeCycle.java:160)
   [junit4]   2> at org.eclipse.jetty.server.handler.AbstractHandler.doStop(AbstractHandler.java:73)
   [junit4]   2> at org.eclipse.jetty.server.session.SessionHandler.doStop(SessionHandler.java:127)
   [junit4]   2> at org.eclipse.jetty.util.component.AbstractLifeCycle.stop(AbstractLifeCycle.java:89)
   [junit4]   2> at org.eclipse.jetty.util.component.ContainerLifeCycle.stop(ContainerLifeCycle.java:142)
   [junit4]   2> at org.eclipse.jetty.util.component.ContainerLifeCycle.doStop(ContainerLifeCycle.java:160)
   [junit4]   2> at org.eclipse.jetty.server.handler.AbstractHandler.doStop(AbstractHandler.java:73)
   [junit4]   2> at org.eclipse.jetty.server.handler.ContextHandler.stopContext(ContextHandler.java:825)
   [junit4]   2> at org.eclipse.jetty.servlet.ServletContextHandler.stopContext(ServletContextHandler.java:356)
   [junit4]   2> at org.eclipse.jetty.server.handler.ContextHandler.doStop(ContextHandler.java:880)
   [junit4]   2> at org.eclipse.jetty.servlet.ServletContextHandler.doStop(ServletContextHandler.java:272)
   [junit4]   2> at org.eclipse.jetty.util.component.AbstractLifeCycle.stop(AbstractLifeCycle.java:89)
   [junit4]   2> at org.eclipse.jetty.util.component.ContainerLifeCycle.stop(ContainerLifeCycle.java:142)
   [junit4]   2> at org.eclipse.jetty.util.component.ContainerLifeCycle.doStop(ContainerLifeCycle.java:160)
   [junit4]   2> at org.eclipse.jetty.server.handler.AbstractHandler.doStop(AbstractHandler.java:73)
   [junit4]   2> at org.eclipse.jetty.util.component.AbstractLifeCycle.stop(AbstractLifeCycle.java:89)
   [junit4]   2> at org.eclipse.jetty.util.component.ContainerLifeCycle.stop(ContainerLifeCycle.java:142)
   [junit4]   2> at org.eclipse.jetty.util.component.ContainerLifeCycle.doStop(ContainerLifeCycle.java:160)
   [junit4]   2> at org.eclipse.jetty.server.handler.AbstractHandler.doStop(AbstractHandler.java:73)
   [junit4]   2> at org.eclipse.jetty.server.Server.doStop(Server.java:493)
   [junit4]   2> at org.eclipse.jetty.util.component.AbstractLifeCycle.stop(AbstractLifeCycle.java:89)
   [junit4]   2> at org.apache.solr.client.solrj.embedded.JettySolrRunner.stop(JettySolrRunner.java:382)
   [junit4]   2> at org.apache.solr.cloud.MiniSolrCloudCluster.stopJettySolrRunner(MiniSolrCloudCluster.java:424)
   [junit4]   2> at org.apache.solr.cloud.MiniSolrCloudCluster.lambda$shutdown$1(MiniSolrCloudCluster.java:523)
   [junit4]   2> at java.util.concurrent.FutureTask.run(FutureTask.java:266)
   [junit4]   2> at org.apache.solr.common.util.ExecutorUtil$MDCAwareThreadPoolExecutor.lambda$execute$0(ExecutorUtil.java:229)
   [junit4]   2> at java.util.concurrent.ThreadPoolExecutor.runWorker(ThreadPoolExecutor.java:1142)
   [junit4]   2> at java.util.concurrent.ThreadPoolExecutor$Worker.run(ThreadPoolExecutor.java:617)
   [junit4]   2> at java.lang.Thread.run(Thread.java:745)
   [junit4]   2> 2033269 WARN  (jetty-launcher-1885-thread-1) [    ] o.a.s.c.ZkController Could not publish node as down: org.apache.zookeeper.KeeperException$SessionExpiredException: KeeperErrorCode = Session expired for /overseer
   [junit4]   2> 2033270 INFO  (jetty-launcher-1885-thread-1) [    ] o.a.s.c.Overseer Overseer (id=97331321427394573-127.0.0.1:44092_solr-n_0000000003) closing
   [junit4]   2> 2033270 INFO  (OverseerStateUpdate-97331321427394573-127.0.0.1:44092_solr-n_0000000003) [n:127.0.0.1:44092_solr    ] o.a.s.c.Overseer Overseer Loop exiting : 127.0.0.1:44092_solr
   [junit4]   2> 2033379 INFO  (jetty-launcher-1885-thread-2) [    ] o.e.j.s.h.ContextHandler Stopped o.e.j.s.ServletContextHandler@457b0d0b{/solr,null,UNAVAILABLE}
   [junit4]   2> 2034771 WARN  (zkCallback-1896-thread-3-processing-n:127.0.0.1:44092_solr) [n:127.0.0.1:44092_solr    ] o.a.s.c.c.ZkStateReader ZooKeeper watch triggered, but Solr cannot talk to ZK: [KeeperErrorCode = Session expired for /live_nodes]
   [junit4]   2> 2034771 INFO  (jetty-launcher-1885-thread-1) [    ] o.a.s.m.SolrMetricManager Closing metric reporters for: solr.node
   [junit4]   2> 2034771 ERROR (Thread[Thread-2471,5,TGRP-TestSolrCloudWithSecureImpersonation]) [n:127.0.0.1:44092_solr    ] o.a.h.s.t.d.AbstractDelegationTokenSecretManager ExpiredTokenRemover received java.lang.InterruptedException: sleep interrupted
   [junit4]   2> 2034772 INFO  (jetty-launcher-1885-thread-1) [    ] o.e.j.s.h.ContextHandler Stopped o.e.j.s.ServletContextHandler@314ce5b9{/solr,null,UNAVAILABLE}
   [junit4]   2> 2034773 INFO  (SUITE-TestSolrCloudWithSecureImpersonation-seed#[4A0079D35339D180]-worker) [    ] o.a.s.c.ZkTestServer connecting to 127.0.0.1:35529 35529
   [junit4]   2> 2034778 INFO  (Thread-2453) [    ] o.a.s.c.ZkTestServer connecting to 127.0.0.1:35529 35529
   [junit4]   2> 2034779 WARN  (Thread-2453) [    ] o.a.s.c.ZkTestServer Watch limit violations:
   [junit4]   2> Maximum concurrent create/delete watches above limit:
   [junit4]   2>
   [junit4]   2> 5 /solr/aliases.json
   [junit4]   2> 4 /solr/security.json
   [junit4]   2> 2 /solr/configs/conf1
   [junit4]   2>
   [junit4]   2> Maximum concurrent data watches above limit:
   [junit4]   2>
   [junit4]   2> 5 /solr/clusterstate.json
   [junit4]   2> 5 /solr/clusterprops.json
   [junit4]   2> 4 /solr/security/zkdtsm/ZKDTSMRoot/ZKDTSMKeyIdRoot
   [junit4]   2> 2 /solr/security/zkdtsm/ZKDTSMRoot/ZKDTSMMasterKeyRoot/DK_1
   [junit4]   2> 2 /solr/security/zkdtsm/ZKDTSMRoot/ZKDTSMMasterKeyRoot/DK_3
   [junit4]   2> 2 /solr/security/zkdtsm/ZKDTSMRoot/ZKDTSMMasterKeyRoot/DK_2
   [junit4]   2> 2 /solr/security/zkdtsm/ZKDTSMRoot/ZKDTSMMasterKeyRoot/DK_4
   [junit4]   2> 2 /solr/security/zkdtsm/ZKDTSMRoot/ZKDTSMSeqNumRoot
   [junit4]   2> 2 /solr/collections/forwardingCollection/state.json
   [junit4]   2>
   [junit4]   2> Maximum concurrent children watches above limit:
   [junit4]   2>
   [junit4]   2> 10 /solr/overseer/queue
   [junit4]   2> 5 /solr/collections
   [junit4]   2> 5 /solr/overseer/collection-queue-work
   [junit4]   2> 5 /solr/overseer/queue-work
   [junit4]   2> 3 /solr/live_nodes
   [junit4]   2> 2 /solr/security/zkdtsm/ZKDTSMRoot/ZKDTSMMasterKeyRoot
   [junit4]   2> 2 /solr/security/zkdtsm/ZKDTSMRoot/ZKDTSMTokensRoot
   [junit4]   2>
   [junit4]   2> 2034790 INFO  (SUITE-TestSolrCloudWithSecureImpersonation-seed#[4A0079D35339D180]-worker) [    ] o.a.s.SolrTestCaseJ4 ###deleteCore
   [junit4]   2> Jan 23, 2017 7:55:31 AM com.carrotsearch.randomizedtesting.ThreadLeakControl checkThreadLeaks
   [junit4]   2> WARNING: Will linger awaiting termination of 3 leaked thread(s).
   [junit4]   2> Jan 23, 2017 7:55:51 AM com.carrotsearch.randomizedtesting.ThreadLeakControl checkThreadLeaks
   [junit4]   2> SEVERE: 2 threads leaked from SUITE scope at org.apache.solr.cloud.TestSolrCloudWithSecureImpersonation:
   [junit4]   2>    1) Thread[id=11095, name=jetty-launcher-1885-thread-1-EventThread, state=TIMED_WAITING, group=TGRP-TestSolrCloudWithSecureImpersonation]
   [junit4]   2>         at sun.misc.Unsafe.park(Native Method)
   [junit4]   2>         at java.util.concurrent.locks.LockSupport.parkNanos(LockSupport.java:215)
   [junit4]   2>         at java.util.concurrent.locks.AbstractQueuedSynchronizer.doAcquireSharedNanos(AbstractQueuedSynchronizer.java:1037)
   [junit4]   2>         at java.util.concurrent.locks.AbstractQueuedSynchronizer.tryAcquireSharedNanos(AbstractQueuedSynchronizer.java:1328)
   [junit4]   2>         at java.util.concurrent.CountDownLatch.await(CountDownLatch.java:277)
   [junit4]   2>         at org.apache.curator.CuratorZookeeperClient.internalBlockUntilConnectedOrTimedOut(CuratorZookeeperClient.java:323)
   [junit4]   2>         at org.apache.curator.RetryLoop.callWithRetry(RetryLoop.java:105)
   [junit4]   2>         at org.apache.curator.framework.imps.GetDataBuilderImpl.pathInForeground(GetDataBuilderImpl.java:288)
   [junit4]   2>         at org.apache.curator.framework.imps.GetDataBuilderImpl.forPath(GetDataBuilderImpl.java:279)
   [junit4]   2>         at org.apache.curator.framework.imps.GetDataBuilderImpl.forPath(GetDataBuilderImpl.java:41)
   [junit4]   2>         at org.apache.curator.framework.recipes.shared.SharedValue.readValue(SharedValue.java:244)
   [junit4]   2>         at org.apache.curator.framework.recipes.shared.SharedValue.access$100(SharedValue.java:44)
   [junit4]   2>         at org.apache.curator.framework.recipes.shared.SharedValue$1.process(SharedValue.java:61)
   [junit4]   2>         at org.apache.curator.framework.imps.NamespaceWatcher.process(NamespaceWatcher.java:67)
   [junit4]   2>         at org.apache.zookeeper.ClientCnxn$EventThread.processEvent(ClientCnxn.java:522)
   [junit4]   2>         at org.apache.zookeeper.ClientCnxn$EventThread.run(ClientCnxn.java:498)
   [junit4]   2>

[...truncated too long message...]

 o.a.z.ClientCnxn Session 0x0 for server null, unexpected error, closing socket connection and attempting reconnect
   [junit4]   2> java.net.ConnectException: Connection refused
   [junit4]   2> at sun.nio.ch.SocketChannelImpl.checkConnect(Native Method)
   [junit4]   2> at sun.nio.ch.SocketChannelImpl.finishConnect(SocketChannelImpl.java:717)
   [junit4]   2> at org.apache.zookeeper.ClientCnxnSocketNIO.doTransport(ClientCnxnSocketNIO.java:361)
   [junit4]   2> at org.apache.zookeeper.ClientCnxn$SendThread.run(ClientCnxn.java:1081)
   [junit4]   2> NOTE: test params are: codec=FastCompressingStoredFields(storedFieldsFormat=CompressingStoredFieldsFormat(compressionMode=FAST, chunkSize=1, maxDocsPerChunk=10, blockSize=3), termVectorsFormat=CompressingTermVectorsFormat(compressionMode=FAST, chunkSize=1, blockSize=3)), sim=RandomSimilarity(queryNorm=false,coord=no): {}, locale=ar-YE, timezone=Pacific/Pohnpei
   [junit4]   2> NOTE: Linux 4.4.0-53-generic amd64/Oracle Corporation 1.8.0_121 (64-bit)/cpus=12,threads=3,free=245943712,total=536870912
   [junit4]   2> NOTE: All tests run in this JVM: [SpatialRPTFieldTypeTest, StandardRequestHandlerTest, DistributedFacetPivotSmallAdvancedTest, TestUnifiedSolrHighlighter, ResourceLoaderTest, CursorPagingTest, XsltUpdateRequestHandlerTest, BlockJoinFacetDistribTest, SolrMetricsIntegrationTest, TestClassicSimilarityFactory, UUIDUpdateProcessorFallbackTest, TestQuerySenderNoQuery, CacheHeaderTest, TestPerFieldSimilarityClassic, RemoteQueryErrorTest, TestBinaryResponseWriter, SolrCoreMetricManagerTest, TestCustomSort, TestFoldingMultitermQuery, TestSolrCoreProperties, TestMiniSolrCloudCluster, DefaultValueUpdateProcessorTest, HttpPartitionTest, OutOfBoxZkACLAndCredentialsProvidersTest, ActionThrottleTest, DateFieldTest, UtilsToolTest, TestConfigSets, FacetPivotSmallTest, TestFaceting, OverseerModifyCollectionTest, BufferStoreTest, TestCollapseQParserPlugin, DocumentAnalysisRequestHandlerTest, StatsReloadRaceTest, TestOmitPositions, TestOrdValues, TestHighFrequencyDictionaryFactory, TestSubQueryTransformerCrossCore, MBeansHandlerTest, DeleteLastCustomShardedReplicaTest, TestSchemaVersionResource, TestManagedResourceStorage, QueryElevationComponentTest, CursorMarkTest, TestInitParams, TestRuleBasedAuthorizationPlugin, HighlighterConfigTest, TestDocBasedVersionConstraints, BlobRepositoryCloudTest, TestRangeQuery, TestCodecSupport, OutputWriterTest, TestDefaultStatsCache, TestBlendedInfixSuggestions, TestFieldCacheSanityChecker, TestRandomFaceting, MetricsHandlerTest, RequestLoggingTest, DistribDocExpirationUpdateProcessorTest, TestRealTimeGet, NumericFieldsTest, TestSchemaNameResource, TestComponentsName, TestDocumentBuilder, TestJoin, AddBlockUpdateTest, ReturnFieldsTest, TestIBSimilarityFactory, TestSolrDeletionPolicy2, TestValueSourceCache, OverseerTaskQueueTest, UniqFieldsUpdateProcessorFactoryTest, TestGeoJSONResponseWriter, DisMaxRequestHandlerTest, ParsingFieldUpdateProcessorsTest, ChangedSchemaMergeTest, TestSolr4Spatial, DeleteShardTest, ResponseHeaderTest, DistributedSpellCheckComponentTest, BasicZkTest, AnalysisAfterCoreReloadTest, TestDynamicFieldCollectionResource, TestSolrXml, ChaosMonkeyNothingIsSafeTest, TestBadConfig, HLLSerializationTest, TestHdfsBackupRestoreCore, TlogReplayBufferedWhileIndexingTest, HdfsRecoverLeaseTest, BasicDistributedZkTest, TestConfigSetsAPIZkFailure, TestDistributedStatsComponentCardinality, GraphQueryTest, TestJsonFacetRefinement, PathHierarchyTokenizerFactoryTest, PKIAuthenticationIntegrationTest, TestFunctionQuery, TestRTimerTree, AsyncCallRequestStatusResponseTest, CloneFieldUpdateProcessorFactoryTest, LeaderElectionIntegrationTest, DistributedQueryElevationComponentTest, TestExactStatsCache, TestLazyCores, ClusterStateTest, HdfsChaosMonkeySafeLeaderTest, CollectionsAPIDistributedZkTest, OpenCloseCoreStressTest, OverseerTest, ClusterStateUpdateTest, ZkSolrClientTest, TestDistributedSearch, TestStressReorder, TestStressVersions, DistributedTermsComponentTest, TestGroupingSearch, TestSort, TestIndexSearcher, HighlighterTest, SoftAutoCommitTest, ShowFileRequestHandlerTest, CurrencyFieldOpenExchangeTest, SolrIndexSplitterTest, TestExtendedDismaxParser, SolrRequestParserTest, DocValuesTest, TestUpdate, TestAtomicUpdateErrorCases, DirectUpdateHandlerOptimizeTest, DocValuesMultiTest, IndexBasedSpellCheckerTest, TestQueryUtils, TestReversedWildcardFilterFactory, XmlUpdateRequestHandlerTest, RequestHandlersTest, TermVectorComponentTest, RequiredFieldsTest, FastVectorHighlighterTest, RegexBoostProcessorTest, TestJmxIntegration, TestCSVResponseWriter, JsonLoaderTest, TestPHPSerializedResponseWriter, TestBinaryResponseWriter, TestQuerySenderListener, AlternateDirectoryTest, BadComponentTest, TestStressRecovery, TestCrossCoreJoin, TestHighlightDedupGrouping, TestTolerantSearch, TestEmbeddedSolrServerConstructors, TestJettySolrRunner, ConnectionReuseTest, AssignTest, BaseCdcrDistributedZkTest, CdcrBootstrapTest, ConcurrentDeleteAndCreateCollectionTest, ConfigSetsAPITest, ConnectionManagerTest, CustomCollectionTest, ForceLeaderTest, SSLMigrationTest, SaslZkACLProviderTest, TestAuthenticationFramework, TestCloudRecovery, TestHdfsCloudBackupRestore, TestLeaderInitiatedRecoveryThread, TestRebalanceLeaders, TestRequestStatusCollectionAPI, TestShortCircuitedRequests, TestSolrCloudWithSecureImpersonation]
   [junit4]   2> NOTE: reproduce with: ant test  -Dtestcase=TestSolrCloudWithSecureImpersonation -Dtests.seed=4A0079D35339D180 -Dtests.multiplier=3 -Dtests.slow=true -Dtests.locale=ar-YE -Dtests.timezone=Pacific/Pohnpei -Dtests.asserts=true -Dtests.file.encoding=UTF-8
   [junit4] ERROR   0.00s J0 | TestSolrCloudWithSecureImpersonation (suite) <<<
   [junit4]    > Throwable #1: com.carrotsearch.randomizedtesting.ThreadLeakError: 2 threads leaked from SUITE scope at org.apache.solr.cloud.TestSolrCloudWithSecureImpersonation:
   [junit4]    >    1) Thread[id=11095, name=jetty-launcher-1885-thread-1-EventThread, state=TIMED_WAITING, group=TGRP-TestSolrCloudWithSecureImpersonation]
   [junit4]    >         at sun.misc.Unsafe.park(Native Method)
   [junit4]    >         at java.util.concurrent.locks.LockSupport.parkNanos(LockSupport.java:215)
   [junit4]    >         at java.util.concurrent.locks.AbstractQueuedSynchronizer.doAcquireSharedNanos(AbstractQueuedSynchronizer.java:1037)
   [junit4]    >         at java.util.concurrent.locks.AbstractQueuedSynchronizer.tryAcquireSharedNanos(AbstractQueuedSynchronizer.java:1328)
   [junit4]    >         at java.util.concurrent.CountDownLatch.await(CountDownLatch.java:277)
   [junit4]    >         at org.apache.curator.CuratorZookeeperClient.internalBlockUntilConnectedOrTimedOut(CuratorZookeeperClient.java:323)
   [junit4]    >         at org.apache.curator.RetryLoop.callWithRetry(RetryLoop.java:105)
   [junit4]    >         at org.apache.curator.framework.imps.GetDataBuilderImpl.pathInForeground(GetDataBuilderImpl.java:288)
   [junit4]    >         at org.apache.curator.framework.imps.GetDataBuilderImpl.forPath(GetDataBuilderImpl.java:279)
   [junit4]    >         at org.apache.curator.framework.imps.GetDataBuilderImpl.forPath(GetDataBuilderImpl.java:41)
   [junit4]    >         at org.apache.curator.framework.recipes.shared.SharedValue.readValue(SharedValue.java:244)
   [junit4]    >         at org.apache.curator.framework.recipes.shared.SharedValue.access$100(SharedValue.java:44)
   [junit4]    >         at org.apache.curator.framework.recipes.shared.SharedValue$1.process(SharedValue.java:61)
   [junit4]    >         at org.apache.curator.framework.imps.NamespaceWatcher.process(NamespaceWatcher.java:67)
   [junit4]    >         at org.apache.zookeeper.ClientCnxn$EventThread.processEvent(ClientCnxn.java:522)
   [junit4]    >         at org.apache.zookeeper.ClientCnxn$EventThread.run(ClientCnxn.java:498)
   [junit4]    >    2) Thread[id=11094, name=jetty-launcher-1885-thread-2-EventThread, state=TIMED_WAITING, group=TGRP-TestSolrCloudWithSecureImpersonation]
   [junit4]    >         at sun.misc.Unsafe.park(Native Method)
   [junit4]    >         at java.util.concurrent.locks.LockSupport.parkNanos(LockSupport.java:215)
   [junit4]    >         at java.util.concurrent.locks.AbstractQueuedSynchronizer.doAcquireSharedNanos(AbstractQueuedSynchronizer.java:1037)
   [junit4]    >         at java.util.concurrent.locks.AbstractQueuedSynchronizer.tryAcquireSharedNanos(AbstractQueuedSynchronizer.java:1328)
   [junit4]    >         at java.util.concurrent.CountDownLatch.await(CountDownLatch.java:277)
   [junit4]    >         at org.apache.curator.CuratorZookeeperClient.internalBlockUntilConnectedOrTimedOut(CuratorZookeeperClient.java:323)
   [junit4]    >         at org.apache.curator.RetryLoop.callWithRetry(RetryLoop.java:105)
   [junit4]    >         at org.apache.curator.framework.imps.GetDataBuilderImpl.pathInForeground(GetDataBuilderImpl.java:288)
   [junit4]    >         at org.apache.curator.framework.imps.GetDataBuilderImpl.forPath(GetDataBuilderImpl.java:279)
   [junit4]    >         at org.apache.curator.framework.imps.GetDataBuilderImpl.forPath(GetDataBuilderImpl.java:41)
   [junit4]    >         at org.apache.curator.framework.recipes.shared.SharedValue.readValue(SharedValue.java:244)
   [junit4]    >         at org.apache.curator.framework.recipes.shared.SharedValue.access$100(SharedValue.java:44)
   [junit4]    >         at org.apache.curator.framework.recipes.shared.SharedValue$1.process(SharedValue.java:61)
   [junit4]    >         at org.apache.curator.framework.imps.NamespaceWatcher.process(NamespaceWatcher.java:67)
   [junit4]    >         at org.apache.zookeeper.ClientCnxn$EventThread.processEvent(ClientCnxn.java:522)
   [junit4]    >         at org.apache.zookeeper.ClientCnxn$EventThread.run(ClientCnxn.java:498)
   [junit4]    > at __randomizedtesting.SeedInfo.seed([4A0079D35339D180]:0)
   [junit4] Completed [530/681 (1!)] on J0 in 48.86s, 12 tests, 1 error <<< FAILURES!

[...truncated 62982 lines...]



---------------------------------------------------------------------
To unsubscribe, e-mail: [hidden email]
For additional commands, e-mail: [hidden email]
Reply | Threaded
Open this post in threaded view
|

[JENKINS] Lucene-Solr-6.x-Linux (64bit/jdk1.8.0_121) - Build # 2720 - Still Unstable!

Policeman Jenkins Server-2
Build: https://jenkins.thetaphi.de/job/Lucene-Solr-6.x-Linux/2720/
Java: 64bit/jdk1.8.0_121 -XX:-UseCompressedOops -XX:+UseSerialGC

5 tests failed.
FAILED:  org.apache.lucene.facet.TestDrillSideways.testRandom

Error Message:


Stack Trace:
java.lang.AssertionError
        at __randomizedtesting.SeedInfo.seed([53C1D0D8EA07270E:218DF5D75B67917D]:0)
        at org.apache.lucene.search.AssertingScorer.getChildren(AssertingScorer.java:81)
        at org.apache.lucene.facet.AssertingSubDocsAtOnceCollector.setScorer(AssertingSubDocsAtOnceCollector.java:43)
        at org.apache.lucene.search.FilterLeafCollector.setScorer(FilterLeafCollector.java:38)
        at org.apache.lucene.search.AssertingLeafCollector.setScorer(AssertingLeafCollector.java:43)
        at org.apache.lucene.search.FilterLeafCollector.setScorer(FilterLeafCollector.java:38)
        at org.apache.lucene.search.AssertingLeafCollector.setScorer(AssertingLeafCollector.java:43)
        at org.apache.lucene.facet.DrillSidewaysScorer.score(DrillSidewaysScorer.java:86)
        at org.apache.lucene.search.BulkScorer.score(BulkScorer.java:39)
        at org.apache.lucene.search.AssertingBulkScorer.score(AssertingBulkScorer.java:69)
        at org.apache.lucene.search.IndexSearcher.search(IndexSearcher.java:669)
        at org.apache.lucene.search.AssertingIndexSearcher.search(AssertingIndexSearcher.java:91)
        at org.apache.lucene.search.IndexSearcher.search(IndexSearcher.java:473)
        at org.apache.lucene.facet.DrillSideways.search(DrillSideways.java:214)
        at org.apache.lucene.facet.TestDrillSideways.testRandom(TestDrillSideways.java:794)
        at sun.reflect.NativeMethodAccessorImpl.invoke0(Native Method)
        at sun.reflect.NativeMethodAccessorImpl.invoke(NativeMethodAccessorImpl.java:62)
        at sun.reflect.DelegatingMethodAccessorImpl.invoke(DelegatingMethodAccessorImpl.java:43)
        at java.lang.reflect.Method.invoke(Method.java:498)
        at com.carrotsearch.randomizedtesting.RandomizedRunner.invoke(RandomizedRunner.java:1713)
        at com.carrotsearch.randomizedtesting.RandomizedRunner$8.evaluate(RandomizedRunner.java:907)
        at com.carrotsearch.randomizedtesting.RandomizedRunner$9.evaluate(RandomizedRunner.java:943)
        at com.carrotsearch.randomizedtesting.RandomizedRunner$10.evaluate(RandomizedRunner.java:957)
        at org.apache.lucene.util.TestRuleSetupTeardownChained$1.evaluate(TestRuleSetupTeardownChained.java:49)
        at org.apache.lucene.util.AbstractBeforeAfterRule$1.evaluate(AbstractBeforeAfterRule.java:45)
        at org.apache.lucene.util.TestRuleThreadAndTestName$1.evaluate(TestRuleThreadAndTestName.java:48)
        at org.apache.lucene.util.TestRuleIgnoreAfterMaxFailures$1.evaluate(TestRuleIgnoreAfterMaxFailures.java:64)
        at org.apache.lucene.util.TestRuleMarkFailure$1.evaluate(TestRuleMarkFailure.java:47)
        at com.carrotsearch.randomizedtesting.rules.StatementAdapter.evaluate(StatementAdapter.java:36)
        at com.carrotsearch.randomizedtesting.ThreadLeakControl$StatementRunner.run(ThreadLeakControl.java:367)
        at com.carrotsearch.randomizedtesting.ThreadLeakControl.forkTimeoutingTask(ThreadLeakControl.java:811)
        at com.carrotsearch.randomizedtesting.ThreadLeakControl$3.evaluate(ThreadLeakControl.java:462)
        at com.carrotsearch.randomizedtesting.RandomizedRunner.runSingleTest(RandomizedRunner.java:916)
        at com.carrotsearch.randomizedtesting.RandomizedRunner$5.evaluate(RandomizedRunner.java:802)
        at com.carrotsearch.randomizedtesting.RandomizedRunner$6.evaluate(RandomizedRunner.java:852)
        at com.carrotsearch.randomizedtesting.RandomizedRunner$7.evaluate(RandomizedRunner.java:863)
        at org.apache.lucene.util.AbstractBeforeAfterRule$1.evaluate(AbstractBeforeAfterRule.java:45)
        at com.carrotsearch.randomizedtesting.rules.StatementAdapter.evaluate(StatementAdapter.java:36)
        at org.apache.lucene.util.TestRuleStoreClassName$1.evaluate(TestRuleStoreClassName.java:41)
        at com.carrotsearch.randomizedtesting.rules.NoShadowingOrOverridesOnMethodsRule$1.evaluate(NoShadowingOrOverridesOnMethodsRule.java:40)
        at com.carrotsearch.randomizedtesting.rules.NoShadowingOrOverridesOnMethodsRule$1.evaluate(NoShadowingOrOverridesOnMethodsRule.java:40)
        at com.carrotsearch.randomizedtesting.rules.StatementAdapter.evaluate(StatementAdapter.java:36)
        at com.carrotsearch.randomizedtesting.rules.StatementAdapter.evaluate(StatementAdapter.java:36)
        at com.carrotsearch.randomizedtesting.rules.StatementAdapter.evaluate(StatementAdapter.java:36)
        at org.apache.lucene.util.TestRuleAssertionsRequired$1.evaluate(TestRuleAssertionsRequired.java:53)
        at org.apache.lucene.util.TestRuleMarkFailure$1.evaluate(TestRuleMarkFailure.java:47)
        at org.apache.lucene.util.TestRuleIgnoreAfterMaxFailures$1.evaluate(TestRuleIgnoreAfterMaxFailures.java:64)
        at org.apache.lucene.util.TestRuleIgnoreTestSuites$1.evaluate(TestRuleIgnoreTestSuites.java:54)
        at com.carrotsearch.randomizedtesting.rules.StatementAdapter.evaluate(StatementAdapter.java:36)
        at com.carrotsearch.randomizedtesting.ThreadLeakControl$StatementRunner.run(ThreadLeakControl.java:367)
        at java.lang.Thread.run(Thread.java:745)


FAILED:  org.apache.lucene.facet.TestParallelDrillSideways.testRandom

Error Message:


Stack Trace:
java.lang.AssertionError
        at __randomizedtesting.SeedInfo.seed([53C1D0D8EA07270E:218DF5D75B67917D]:0)
        at org.apache.lucene.search.AssertingScorer.getChildren(AssertingScorer.java:81)
        at org.apache.lucene.facet.AssertingSubDocsAtOnceCollector.setScorer(AssertingSubDocsAtOnceCollector.java:43)
        at org.apache.lucene.search.FilterLeafCollector.setScorer(FilterLeafCollector.java:38)
        at org.apache.lucene.search.AssertingLeafCollector.setScorer(AssertingLeafCollector.java:43)
        at org.apache.lucene.search.FilterLeafCollector.setScorer(FilterLeafCollector.java:38)
        at org.apache.lucene.search.AssertingLeafCollector.setScorer(AssertingLeafCollector.java:43)
        at org.apache.lucene.facet.DrillSidewaysScorer.score(DrillSidewaysScorer.java:86)
        at org.apache.lucene.search.BulkScorer.score(BulkScorer.java:39)
        at org.apache.lucene.search.AssertingBulkScorer.score(AssertingBulkScorer.java:69)
        at org.apache.lucene.search.IndexSearcher.search(IndexSearcher.java:669)
        at org.apache.lucene.search.AssertingIndexSearcher.search(AssertingIndexSearcher.java:91)
        at org.apache.lucene.search.IndexSearcher.search(IndexSearcher.java:473)
        at org.apache.lucene.facet.DrillSideways.search(DrillSideways.java:214)
        at org.apache.lucene.facet.TestDrillSideways.testRandom(TestDrillSideways.java:794)
        at sun.reflect.NativeMethodAccessorImpl.invoke0(Native Method)
        at sun.reflect.NativeMethodAccessorImpl.invoke(NativeMethodAccessorImpl.java:62)
        at sun.reflect.DelegatingMethodAccessorImpl.invoke(DelegatingMethodAccessorImpl.java:43)
        at java.lang.reflect.Method.invoke(Method.java:498)
        at com.carrotsearch.randomizedtesting.RandomizedRunner.invoke(RandomizedRunner.java:1713)
        at com.carrotsearch.randomizedtesting.RandomizedRunner$8.evaluate(RandomizedRunner.java:907)
        at com.carrotsearch.randomizedtesting.RandomizedRunner$9.evaluate(RandomizedRunner.java:943)
        at com.carrotsearch.randomizedtesting.RandomizedRunner$10.evaluate(RandomizedRunner.java:957)
        at org.apache.lucene.util.TestRuleSetupTeardownChained$1.evaluate(TestRuleSetupTeardownChained.java:49)
        at org.apache.lucene.util.AbstractBeforeAfterRule$1.evaluate(AbstractBeforeAfterRule.java:45)
        at org.apache.lucene.util.TestRuleThreadAndTestName$1.evaluate(TestRuleThreadAndTestName.java:48)
        at org.apache.lucene.util.TestRuleIgnoreAfterMaxFailures$1.evaluate(TestRuleIgnoreAfterMaxFailures.java:64)
        at org.apache.lucene.util.TestRuleMarkFailure$1.evaluate(TestRuleMarkFailure.java:47)
        at com.carrotsearch.randomizedtesting.rules.StatementAdapter.evaluate(StatementAdapter.java:36)
        at com.carrotsearch.randomizedtesting.ThreadLeakControl$StatementRunner.run(ThreadLeakControl.java:367)
        at com.carrotsearch.randomizedtesting.ThreadLeakControl.forkTimeoutingTask(ThreadLeakControl.java:811)
        at com.carrotsearch.randomizedtesting.ThreadLeakControl$3.evaluate(ThreadLeakControl.java:462)
        at com.carrotsearch.randomizedtesting.RandomizedRunner.runSingleTest(RandomizedRunner.java:916)
        at com.carrotsearch.randomizedtesting.RandomizedRunner$5.evaluate(RandomizedRunner.java:802)
        at com.carrotsearch.randomizedtesting.RandomizedRunner$6.evaluate(RandomizedRunner.java:852)
        at com.carrotsearch.randomizedtesting.RandomizedRunner$7.evaluate(RandomizedRunner.java:863)
        at org.apache.lucene.util.AbstractBeforeAfterRule$1.evaluate(AbstractBeforeAfterRule.java:45)
        at com.carrotsearch.randomizedtesting.rules.StatementAdapter.evaluate(StatementAdapter.java:36)
        at org.apache.lucene.util.TestRuleStoreClassName$1.evaluate(TestRuleStoreClassName.java:41)
        at com.carrotsearch.randomizedtesting.rules.NoShadowingOrOverridesOnMethodsRule$1.evaluate(NoShadowingOrOverridesOnMethodsRule.java:40)
        at com.carrotsearch.randomizedtesting.rules.NoShadowingOrOverridesOnMethodsRule$1.evaluate(NoShadowingOrOverridesOnMethodsRule.java:40)
        at com.carrotsearch.randomizedtesting.rules.StatementAdapter.evaluate(StatementAdapter.java:36)
        at com.carrotsearch.randomizedtesting.rules.StatementAdapter.evaluate(StatementAdapter.java:36)
        at com.carrotsearch.randomizedtesting.rules.StatementAdapter.evaluate(StatementAdapter.java:36)
        at org.apache.lucene.util.TestRuleAssertionsRequired$1.evaluate(TestRuleAssertionsRequired.java:53)
        at org.apache.lucene.util.TestRuleMarkFailure$1.evaluate(TestRuleMarkFailure.java:47)
        at org.apache.lucene.util.TestRuleIgnoreAfterMaxFailures$1.evaluate(TestRuleIgnoreAfterMaxFailures.java:64)
        at org.apache.lucene.util.TestRuleIgnoreTestSuites$1.evaluate(TestRuleIgnoreTestSuites.java:54)
        at com.carrotsearch.randomizedtesting.rules.StatementAdapter.evaluate(StatementAdapter.java:36)
        at com.carrotsearch.randomizedtesting.ThreadLeakControl$StatementRunner.run(ThreadLeakControl.java:367)
        at java.lang.Thread.run(Thread.java:745)


FAILED:  org.apache.lucene.search.join.TestBlockJoin.testSimple

Error Message:


Stack Trace:
java.lang.AssertionError
        at __randomizedtesting.SeedInfo.seed([CA83BCDFD8F27072:F2309821FF01A4A3]:0)
        at org.apache.lucene.search.AssertingScorer.getChildren(AssertingScorer.java:81)
        at org.apache.lucene.search.join.ToParentBlockJoinCollector$1.setScorer(ToParentBlockJoinCollector.java:190)
        at org.apache.lucene.search.FilterLeafCollector.setScorer(FilterLeafCollector.java:38)
        at org.apache.lucene.search.AssertingLeafCollector.setScorer(AssertingLeafCollector.java:43)
        at org.apache.lucene.search.FilterLeafCollector.setScorer(FilterLeafCollector.java:38)
        at org.apache.lucene.search.AssertingLeafCollector.setScorer(AssertingLeafCollector.java:43)
        at org.apache.lucene.search.FilterLeafCollector.setScorer(FilterLeafCollector.java:38)
        at org.apache.lucene.search.AssertingLeafCollector.setScorer(AssertingLeafCollector.java:43)
        at org.apache.lucene.search.Weight$DefaultBulkScorer.score(Weight.java:195)
        at org.apache.lucene.search.AssertingBulkScorer.score(AssertingBulkScorer.java:79)
        at org.apache.lucene.search.AssertingBulkScorer.score(AssertingBulkScorer.java:63)
        at org.apache.lucene.search.IndexSearcher.search(IndexSearcher.java:669)
        at org.apache.lucene.search.AssertingIndexSearcher.search(AssertingIndexSearcher.java:91)
        at org.apache.lucene.search.IndexSearcher.search(IndexSearcher.java:473)
        at org.apache.lucene.search.join.TestBlockJoin.testSimple(TestBlockJoin.java:304)
        at sun.reflect.NativeMethodAccessorImpl.invoke0(Native Method)
        at sun.reflect.NativeMethodAccessorImpl.invoke(NativeMethodAccessorImpl.java:62)
        at sun.reflect.DelegatingMethodAccessorImpl.invoke(DelegatingMethodAccessorImpl.java:43)
        at java.lang.reflect.Method.invoke(Method.java:498)
        at com.carrotsearch.randomizedtesting.RandomizedRunner.invoke(RandomizedRunner.java:1713)
        at com.carrotsearch.randomizedtesting.RandomizedRunner$8.evaluate(RandomizedRunner.java:907)
        at com.carrotsearch.randomizedtesting.RandomizedRunner$9.evaluate(RandomizedRunner.java:943)
        at com.carrotsearch.randomizedtesting.RandomizedRunner$10.evaluate(RandomizedRunner.java:957)
        at org.apache.lucene.util.TestRuleSetupTeardownChained$1.evaluate(TestRuleSetupTeardownChained.java:49)
        at org.apache.lucene.util.AbstractBeforeAfterRule$1.evaluate(AbstractBeforeAfterRule.java:45)
        at org.apache.lucene.util.TestRuleThreadAndTestName$1.evaluate(TestRuleThreadAndTestName.java:48)
        at org.apache.lucene.util.TestRuleIgnoreAfterMaxFailures$1.evaluate(TestRuleIgnoreAfterMaxFailures.java:64)
        at org.apache.lucene.util.TestRuleMarkFailure$1.evaluate(TestRuleMarkFailure.java:47)
        at com.carrotsearch.randomizedtesting.rules.StatementAdapter.evaluate(StatementAdapter.java:36)
        at com.carrotsearch.randomizedtesting.ThreadLeakControl$StatementRunner.run(ThreadLeakControl.java:367)
        at com.carrotsearch.randomizedtesting.ThreadLeakControl.forkTimeoutingTask(ThreadLeakControl.java:811)
        at com.carrotsearch.randomizedtesting.ThreadLeakControl$3.evaluate(ThreadLeakControl.java:462)
        at com.carrotsearch.randomizedtesting.RandomizedRunner.runSingleTest(RandomizedRunner.java:916)
        at com.carrotsearch.randomizedtesting.RandomizedRunner$5.evaluate(RandomizedRunner.java:802)
        at com.carrotsearch.randomizedtesting.RandomizedRunner$6.evaluate(RandomizedRunner.java:852)
        at com.carrotsearch.randomizedtesting.RandomizedRunner$7.evaluate(RandomizedRunner.java:863)
        at org.apache.lucene.util.AbstractBeforeAfterRule$1.evaluate(AbstractBeforeAfterRule.java:45)
        at com.carrotsearch.randomizedtesting.rules.StatementAdapter.evaluate(StatementAdapter.java:36)
        at org.apache.lucene.util.TestRuleStoreClassName$1.evaluate(TestRuleStoreClassName.java:41)
        at com.carrotsearch.randomizedtesting.rules.NoShadowingOrOverridesOnMethodsRule$1.evaluate(NoShadowingOrOverridesOnMethodsRule.java:40)
        at com.carrotsearch.randomizedtesting.rules.NoShadowingOrOverridesOnMethodsRule$1.evaluate(NoShadowingOrOverridesOnMethodsRule.java:40)
        at com.carrotsearch.randomizedtesting.rules.StatementAdapter.evaluate(StatementAdapter.java:36)
        at com.carrotsearch.randomizedtesting.rules.StatementAdapter.evaluate(StatementAdapter.java:36)
        at com.carrotsearch.randomizedtesting.rules.StatementAdapter.evaluate(StatementAdapter.java:36)
        at org.apache.lucene.util.TestRuleAssertionsRequired$1.evaluate(TestRuleAssertionsRequired.java:53)
        at org.apache.lucene.util.TestRuleMarkFailure$1.evaluate(TestRuleMarkFailure.java:47)
        at org.apache.lucene.util.TestRuleIgnoreAfterMaxFailures$1.evaluate(TestRuleIgnoreAfterMaxFailures.java:64)
        at org.apache.lucene.util.TestRuleIgnoreTestSuites$1.evaluate(TestRuleIgnoreTestSuites.java:54)
        at com.carrotsearch.randomizedtesting.rules.StatementAdapter.evaluate(StatementAdapter.java:36)
        at com.carrotsearch.randomizedtesting.ThreadLeakControl$StatementRunner.run(ThreadLeakControl.java:367)
        at java.lang.Thread.run(Thread.java:745)


FAILED:  org.apache.lucene.search.join.TestBlockJoin.testMultiChildTypes

Error Message:


Stack Trace:
java.lang.AssertionError
        at __randomizedtesting.SeedInfo.seed([CA83BCDFD8F27072:5E14BFF5D3770BB1]:0)
        at org.apache.lucene.search.AssertingScorer.getChildren(AssertingScorer.java:81)
        at org.apache.lucene.search.join.ToParentBlockJoinCollector$1.setScorer(ToParentBlockJoinCollector.java:190)
        at org.apache.lucene.search.FilterLeafCollector.setScorer(FilterLeafCollector.java:38)
        at org.apache.lucene.search.AssertingLeafCollector.setScorer(AssertingLeafCollector.java:43)
        at org.apache.lucene.search.FilterLeafCollector.setScorer(FilterLeafCollector.java:38)
        at org.apache.lucene.search.AssertingLeafCollector.setScorer(AssertingLeafCollector.java:43)
        at org.apache.lucene.search.FilterLeafCollector.setScorer(FilterLeafCollector.java:38)
        at org.apache.lucene.search.AssertingLeafCollector.setScorer(AssertingLeafCollector.java:43)
        at org.apache.lucene.search.Weight$DefaultBulkScorer.score(Weight.java:195)
        at org.apache.lucene.search.AssertingBulkScorer.score(AssertingBulkScorer.java:79)
        at org.apache.lucene.search.AssertingBulkScorer.score(AssertingBulkScorer.java:63)
        at org.apache.lucene.search.IndexSearcher.search(IndexSearcher.java:669)
        at org.apache.lucene.search.AssertingIndexSearcher.search(AssertingIndexSearcher.java:91)
        at org.apache.lucene.search.IndexSearcher.search(IndexSearcher.java:473)
        at org.apache.lucene.search.join.TestBlockJoin.testMultiChildTypes(TestBlockJoin.java:1207)
        at sun.reflect.NativeMethodAccessorImpl.invoke0(Native Method)
        at sun.reflect.NativeMethodAccessorImpl.invoke(NativeMethodAccessorImpl.java:62)
        at sun.reflect.DelegatingMethodAccessorImpl.invoke(DelegatingMethodAccessorImpl.java:43)
        at java.lang.reflect.Method.invoke(Method.java:498)
        at com.carrotsearch.randomizedtesting.RandomizedRunner.invoke(RandomizedRunner.java:1713)
        at com.carrotsearch.randomizedtesting.RandomizedRunner$8.evaluate(RandomizedRunner.java:907)
        at com.carrotsearch.randomizedtesting.RandomizedRunner$9.evaluate(RandomizedRunner.java:943)
        at com.carrotsearch.randomizedtesting.RandomizedRunner$10.evaluate(RandomizedRunner.java:957)
        at org.apache.lucene.util.TestRuleSetupTeardownChained$1.evaluate(TestRuleSetupTeardownChained.java:49)
        at org.apache.lucene.util.AbstractBeforeAfterRule$1.evaluate(AbstractBeforeAfterRule.java:45)
        at org.apache.lucene.util.TestRuleThreadAndTestName$1.evaluate(TestRuleThreadAndTestName.java:48)
        at org.apache.lucene.util.TestRuleIgnoreAfterMaxFailures$1.evaluate(TestRuleIgnoreAfterMaxFailures.java:64)
        at org.apache.lucene.util.TestRuleMarkFailure$1.evaluate(TestRuleMarkFailure.java:47)
        at com.carrotsearch.randomizedtesting.rules.StatementAdapter.evaluate(StatementAdapter.java:36)
        at com.carrotsearch.randomizedtesting.ThreadLeakControl$StatementRunner.run(ThreadLeakControl.java:367)
        at com.carrotsearch.randomizedtesting.ThreadLeakControl.forkTimeoutingTask(ThreadLeakControl.java:811)
        at com.carrotsearch.randomizedtesting.ThreadLeakControl$3.evaluate(ThreadLeakControl.java:462)
        at com.carrotsearch.randomizedtesting.RandomizedRunner.runSingleTest(RandomizedRunner.java:916)
        at com.carrotsearch.randomizedtesting.RandomizedRunner$5.evaluate(RandomizedRunner.java:802)
        at com.carrotsearch.randomizedtesting.RandomizedRunner$6.evaluate(RandomizedRunner.java:852)
        at com.carrotsearch.randomizedtesting.RandomizedRunner$7.evaluate(RandomizedRunner.java:863)
        at org.apache.lucene.util.AbstractBeforeAfterRule$1.evaluate(AbstractBeforeAfterRule.java:45)
        at com.carrotsearch.randomizedtesting.rules.StatementAdapter.evaluate(StatementAdapter.java:36)
        at org.apache.lucene.util.TestRuleStoreClassName$1.evaluate(TestRuleStoreClassName.java:41)
        at com.carrotsearch.randomizedtesting.rules.NoShadowingOrOverridesOnMethodsRule$1.evaluate(NoShadowingOrOverridesOnMethodsRule.java:40)
        at com.carrotsearch.randomizedtesting.rules.NoShadowingOrOverridesOnMethodsRule$1.evaluate(NoShadowingOrOverridesOnMethodsRule.java:40)
        at com.carrotsearch.randomizedtesting.rules.StatementAdapter.evaluate(StatementAdapter.java:36)
        at com.carrotsearch.randomizedtesting.rules.StatementAdapter.evaluate(StatementAdapter.java:36)
        at com.carrotsearch.randomizedtesting.rules.StatementAdapter.evaluate(StatementAdapter.java:36)
        at org.apache.lucene.util.TestRuleAssertionsRequired$1.evaluate(TestRuleAssertionsRequired.java:53)
        at org.apache.lucene.util.TestRuleMarkFailure$1.evaluate(TestRuleMarkFailure.java:47)
        at org.apache.lucene.util.TestRuleIgnoreAfterMaxFailures$1.evaluate(TestRuleIgnoreAfterMaxFailures.java:64)
        at org.apache.lucene.util.TestRuleIgnoreTestSuites$1.evaluate(TestRuleIgnoreTestSuites.java:54)
        at com.carrotsearch.randomizedtesting.rules.StatementAdapter.evaluate(StatementAdapter.java:36)
        at com.carrotsearch.randomizedtesting.ThreadLeakControl$StatementRunner.run(ThreadLeakControl.java:367)
        at java.lang.Thread.run(Thread.java:745)


FAILED:  org.apache.lucene.search.join.TestBlockJoin.testBugCausedByRewritingTwice

Error Message:


Stack Trace:
java.lang.AssertionError
        at __randomizedtesting.SeedInfo.seed([CA83BCDFD8F27072:35FF6C7453CDAC0B]:0)
        at org.apache.lucene.search.AssertingScorer.getChildren(AssertingScorer.java:81)
        at org.apache.lucene.search.join.ToParentBlockJoinCollector$1.setScorer(ToParentBlockJoinCollector.java:190)
        at org.apache.lucene.search.FilterLeafCollector.setScorer(FilterLeafCollector.java:38)
        at org.apache.lucene.search.AssertingLeafCollector.setScorer(AssertingLeafCollector.java:43)
        at org.apache.lucene.search.FilterLeafCollector.setScorer(FilterLeafCollector.java:38)
        at org.apache.lucene.search.AssertingLeafCollector.setScorer(AssertingLeafCollector.java:43)
        at org.apache.lucene.search.Weight$DefaultBulkScorer.score(Weight.java:195)
        at org.apache.lucene.search.BulkScorer.score(BulkScorer.java:39)
        at org.apache.lucene.search.AssertingBulkScorer.score(AssertingBulkScorer.java:69)
        at org.apache.lucene.search.IndexSearcher.search(IndexSearcher.java:669)
        at org.apache.lucene.search.AssertingIndexSearcher.search(AssertingIndexSearcher.java:91)
        at org.apache.lucene.search.IndexSearcher.search(IndexSearcher.java:473)
        at org.apache.lucene.search.join.TestBlockJoin.testBugCausedByRewritingTwice(TestBlockJoin.java:406)
        at sun.reflect.NativeMethodAccessorImpl.invoke0(Native Method)
        at sun.reflect.NativeMethodAccessorImpl.invoke(NativeMethodAccessorImpl.java:62)
        at sun.reflect.DelegatingMethodAccessorImpl.invoke(DelegatingMethodAccessorImpl.java:43)
        at java.lang.reflect.Method.invoke(Method.java:498)
        at com.carrotsearch.randomizedtesting.RandomizedRunner.invoke(RandomizedRunner.java:1713)
        at com.carrotsearch.randomizedtesting.RandomizedRunner$8.evaluate(RandomizedRunner.java:907)
        at com.carrotsearch.randomizedtesting.RandomizedRunner$9.evaluate(RandomizedRunner.java:943)
        at com.carrotsearch.randomizedtesting.RandomizedRunner$10.evaluate(RandomizedRunner.java:957)
        at org.apache.lucene.util.TestRuleSetupTeardownChained$1.evaluate(TestRuleSetupTeardownChained.java:49)
        at org.apache.lucene.util.AbstractBeforeAfterRule$1.evaluate(AbstractBeforeAfterRule.java:45)
        at org.apache.lucene.util.TestRuleThreadAndTestName$1.evaluate(TestRuleThreadAndTestName.java:48)
        at org.apache.lucene.util.TestRuleIgnoreAfterMaxFailures$1.evaluate(TestRuleIgnoreAfterMaxFailures.java:64)
        at org.apache.lucene.util.TestRuleMarkFailure$1.evaluate(TestRuleMarkFailure.java:47)
        at com.carrotsearch.randomizedtesting.rules.StatementAdapter.evaluate(StatementAdapter.java:36)
        at com.carrotsearch.randomizedtesting.ThreadLeakControl$StatementRunner.run(ThreadLeakControl.java:367)
        at com.carrotsearch.randomizedtesting.ThreadLeakControl.forkTimeoutingTask(ThreadLeakControl.java:811)
        at com.carrotsearch.randomizedtesting.ThreadLeakControl$3.evaluate(ThreadLeakControl.java:462)
        at com.carrotsearch.randomizedtesting.RandomizedRunner.runSingleTest(RandomizedRunner.java:916)
        at com.carrotsearch.randomizedtesting.RandomizedRunner$5.evaluate(RandomizedRunner.java:802)
        at com.carrotsearch.randomizedtesting.RandomizedRunner$6.evaluate(RandomizedRunner.java:852)
        at com.carrotsearch.randomizedtesting.RandomizedRunner$7.evaluate(RandomizedRunner.java:863)
        at org.apache.lucene.util.AbstractBeforeAfterRule$1.evaluate(AbstractBeforeAfterRule.java:45)
        at com.carrotsearch.randomizedtesting.rules.StatementAdapter.evaluate(StatementAdapter.java:36)
        at org.apache.lucene.util.TestRuleStoreClassName$1.evaluate(TestRuleStoreClassName.java:41)
        at com.carrotsearch.randomizedtesting.rules.NoShadowingOrOverridesOnMethodsRule$1.evaluate(NoShadowingOrOverridesOnMethodsRule.java:40)
        at com.carrotsearch.randomizedtesting.rules.NoShadowingOrOverridesOnMethodsRule$1.evaluate(NoShadowingOrOverridesOnMethodsRule.java:40)
        at com.carrotsearch.randomizedtesting.rules.StatementAdapter.evaluate(StatementAdapter.java:36)
        at com.carrotsearch.randomizedtesting.rules.StatementAdapter.evaluate(StatementAdapter.java:36)
        at com.carrotsearch.randomizedtesting.rules.StatementAdapter.evaluate(StatementAdapter.java:36)
        at org.apache.lucene.util.TestRuleAssertionsRequired$1.evaluate(TestRuleAssertionsRequired.java:53)
        at org.apache.lucene.util.TestRuleMarkFailure$1.evaluate(TestRuleMarkFailure.java:47)
        at org.apache.lucene.util.TestRuleIgnoreAfterMaxFailures$1.evaluate(TestRuleIgnoreAfterMaxFailures.java:64)
        at org.apache.lucene.util.TestRuleIgnoreTestSuites$1.evaluate(TestRuleIgnoreTestSuites.java:54)
        at com.carrotsearch.randomizedtesting.rules.StatementAdapter.evaluate(StatementAdapter.java:36)
        at com.carrotsearch.randomizedtesting.ThreadLeakControl$StatementRunner.run(ThreadLeakControl.java:367)
        at java.lang.Thread.run(Thread.java:745)




Build Log:
[...truncated 6765 lines...]
   [junit4] Suite: org.apache.lucene.facet.TestParallelDrillSideways
   [junit4]   2> NOTE: reproduce with: ant test  -Dtestcase=TestParallelDrillSideways -Dtests.method=testRandom -Dtests.seed=53C1D0D8EA07270E -Dtests.multiplier=3 -Dtests.slow=true -Dtests.locale=en -Dtests.timezone=US/Aleutian -Dtests.asserts=true -Dtests.file.encoding=UTF-8
   [junit4] FAILURE 3.32s J2 | TestParallelDrillSideways.testRandom <<<
   [junit4]    > Throwable #1: java.lang.AssertionError
   [junit4]    > at __randomizedtesting.SeedInfo.seed([53C1D0D8EA07270E:218DF5D75B67917D]:0)
   [junit4]    > at org.apache.lucene.search.AssertingScorer.getChildren(AssertingScorer.java:81)
   [junit4]    > at org.apache.lucene.facet.AssertingSubDocsAtOnceCollector.setScorer(AssertingSubDocsAtOnceCollector.java:43)
   [junit4]    > at org.apache.lucene.search.FilterLeafCollector.setScorer(FilterLeafCollector.java:38)
   [junit4]    > at org.apache.lucene.search.AssertingLeafCollector.setScorer(AssertingLeafCollector.java:43)
   [junit4]    > at org.apache.lucene.search.FilterLeafCollector.setScorer(FilterLeafCollector.java:38)
   [junit4]    > at org.apache.lucene.search.AssertingLeafCollector.setScorer(AssertingLeafCollector.java:43)
   [junit4]    > at org.apache.lucene.facet.DrillSidewaysScorer.score(DrillSidewaysScorer.java:86)
   [junit4]    > at org.apache.lucene.search.BulkScorer.score(BulkScorer.java:39)
   [junit4]    > at org.apache.lucene.search.AssertingBulkScorer.score(AssertingBulkScorer.java:69)
   [junit4]    > at org.apache.lucene.search.IndexSearcher.search(IndexSearcher.java:669)
   [junit4]    > at org.apache.lucene.search.AssertingIndexSearcher.search(AssertingIndexSearcher.java:91)
   [junit4]    > at org.apache.lucene.search.IndexSearcher.search(IndexSearcher.java:473)
   [junit4]    > at org.apache.lucene.facet.DrillSideways.search(DrillSideways.java:214)
   [junit4]    > at org.apache.lucene.facet.TestDrillSideways.testRandom(TestDrillSideways.java:794)
   [junit4]    > at java.lang.Thread.run(Thread.java:745)
   [junit4]   2> NOTE: test params are: codec=FastDecompressionCompressingStoredFields(storedFieldsFormat=CompressingStoredFieldsFormat(compressionMode=FAST_DECOMPRESSION, chunkSize=363, maxDocsPerChunk=226, blockSize=925), termVectorsFormat=CompressingTermVectorsFormat(compressionMode=FAST_DECOMPRESSION, chunkSize=363, blockSize=925)), sim=RandomSimilarity(queryNorm=false,coord=yes): {foobar=DFR I(ne)B3(800.0), field=IB LL-D2, content=DFR I(n)B3(800.0)}, locale=en, timezone=US/Aleutian
   [junit4]   2> NOTE: Linux 4.4.0-53-generic amd64/Oracle Corporation 1.8.0_121 (64-bit)/cpus=12,threads=1,free=476308296,total=508887040
   [junit4]   2> NOTE: All tests run in this JVM: [TestFacetQuery, TestDirectoryTaxonomyWriter, TestConcurrentFacetedIndexing, TestParallelDrillSideways]
   [junit4] Completed [9/25 (1!)] on J2 in 3.79s, 6 tests, 1 failure <<< FAILURES!

[...truncated 28 lines...]
   [junit4] Suite: org.apache.lucene.facet.TestDrillSideways
   [junit4]   2> NOTE: reproduce with: ant test  -Dtestcase=TestDrillSideways -Dtests.method=testRandom -Dtests.seed=53C1D0D8EA07270E -Dtests.multiplier=3 -Dtests.slow=true -Dtests.locale=be-BY -Dtests.timezone=Etc/Zulu -Dtests.asserts=true -Dtests.file.encoding=UTF-8
   [junit4] FAILURE 1.78s J1 | TestDrillSideways.testRandom <<<
   [junit4]    > Throwable #1: java.lang.AssertionError
   [junit4]    > at __randomizedtesting.SeedInfo.seed([53C1D0D8EA07270E:218DF5D75B67917D]:0)
   [junit4]    > at org.apache.lucene.search.AssertingScorer.getChildren(AssertingScorer.java:81)
   [junit4]    > at org.apache.lucene.facet.AssertingSubDocsAtOnceCollector.setScorer(AssertingSubDocsAtOnceCollector.java:43)
   [junit4]    > at org.apache.lucene.search.FilterLeafCollector.setScorer(FilterLeafCollector.java:38)
   [junit4]    > at org.apache.lucene.search.AssertingLeafCollector.setScorer(AssertingLeafCollector.java:43)
   [junit4]    > at org.apache.lucene.search.FilterLeafCollector.setScorer(FilterLeafCollector.java:38)
   [junit4]    > at org.apache.lucene.search.AssertingLeafCollector.setScorer(AssertingLeafCollector.java:43)
   [junit4]    > at org.apache.lucene.facet.DrillSidewaysScorer.score(DrillSidewaysScorer.java:86)
   [junit4]    > at org.apache.lucene.search.BulkScorer.score(BulkScorer.java:39)
   [junit4]    > at org.apache.lucene.search.AssertingBulkScorer.score(AssertingBulkScorer.java:69)
   [junit4]    > at org.apache.lucene.search.IndexSearcher.search(IndexSearcher.java:669)
   [junit4]    > at org.apache.lucene.search.AssertingIndexSearcher.search(AssertingIndexSearcher.java:91)
   [junit4]    > at org.apache.lucene.search.IndexSearcher.search(IndexSearcher.java:473)
   [junit4]    > at org.apache.lucene.facet.DrillSideways.search(DrillSideways.java:214)
   [junit4]    > at org.apache.lucene.facet.TestDrillSideways.testRandom(TestDrillSideways.java:794)
   [junit4]    > at java.lang.Thread.run(Thread.java:745)
   [junit4]   2> NOTE: test params are: codec=Asserting(Lucene62): {$full_path$=FST50, $facets=TestBloomFilteredLucenePostings(BloomFilteringPostingsFormat(Lucene50(blocksize=128))), field=Lucene50(blocksize=128), dim3=PostingsFormat(name=Memory doPackFST= false), dim2=Lucene50(blocksize=128), $payloads$=PostingsFormat(name=Memory doPackFST= false), dim1=FST50, dim0=TestBloomFilteredLucenePostings(BloomFilteringPostingsFormat(Lucene50(blocksize=128))), id=PostingsFormat(name=Memory doPackFST= false), content=FST50}, docValues:{$facets=DocValuesFormat(name=Memory), dim3=DocValuesFormat(name=Lucene54), dim2=DocValuesFormat(name=Asserting), dim1=DocValuesFormat(name=Lucene54), dim0=DocValuesFormat(name=Memory), id=DocValuesFormat(name=Lucene54), content=DocValuesFormat(name=Lucene54)}, maxPointsInLeafNode=457, maxMBSortInHeap=5.522053107522147, sim=RandomSimilarity(queryNorm=true,coord=no): {foobar=IB SPL-L3(800.0), field=IB SPL-L2, content=DFR I(F)BZ(0.3)}, locale=be-BY, timezone=Etc/Zulu
   [junit4]   2> NOTE: Linux 4.4.0-53-generic amd64/Oracle Corporation 1.8.0_121 (64-bit)/cpus=12,threads=1,free=461698360,total=508887040
   [junit4]   2> NOTE: All tests run in this JVM: [TestRangeFacetCounts, TestSearcherTaxonomyManager, TestTaxonomyFacetCounts2, TestDrillSideways]
   [junit4] Completed [19/25 (2!)] on J1 in 2.02s, 6 tests, 1 failure <<< FAILURES!

[...truncated 598 lines...]
   [junit4] Suite: org.apache.lucene.search.join.TestBlockJoin
   [junit4]   2> NOTE: reproduce with: ant test  -Dtestcase=TestBlockJoin -Dtests.method=testSimple -Dtests.seed=CA83BCDFD8F27072 -Dtests.multiplier=3 -Dtests.slow=true -Dtests.locale=ms -Dtests.timezone=Asia/Kuching -Dtests.asserts=true -Dtests.file.encoding=ISO-8859-1
   [junit4] FAILURE 0.13s J0 | TestBlockJoin.testSimple <<<
   [junit4]    > Throwable #1: java.lang.AssertionError
   [junit4]    > at __randomizedtesting.SeedInfo.seed([CA83BCDFD8F27072:F2309821FF01A4A3]:0)
   [junit4]    > at org.apache.lucene.search.AssertingScorer.getChildren(AssertingScorer.java:81)
   [junit4]    > at org.apache.lucene.search.join.ToParentBlockJoinCollector$1.setScorer(ToParentBlockJoinCollector.java:190)
   [junit4]    > at org.apache.lucene.search.FilterLeafCollector.setScorer(FilterLeafCollector.java:38)
   [junit4]    > at org.apache.lucene.search.AssertingLeafCollector.setScorer(AssertingLeafCollector.java:43)
   [junit4]    > at org.apache.lucene.search.FilterLeafCollector.setScorer(FilterLeafCollector.java:38)
   [junit4]    > at org.apache.lucene.search.AssertingLeafCollector.setScorer(AssertingLeafCollector.java:43)
   [junit4]    > at org.apache.lucene.search.FilterLeafCollector.setScorer(FilterLeafCollector.java:38)
   [junit4]    > at org.apache.lucene.search.AssertingLeafCollector.setScorer(AssertingLeafCollector.java:43)
   [junit4]    > at org.apache.lucene.search.Weight$DefaultBulkScorer.score(Weight.java:195)
   [junit4]    > at org.apache.lucene.search.AssertingBulkScorer.score(AssertingBulkScorer.java:79)
   [junit4]    > at org.apache.lucene.search.AssertingBulkScorer.score(AssertingBulkScorer.java:63)
   [junit4]    > at org.apache.lucene.search.IndexSearcher.search(IndexSearcher.java:669)
   [junit4]    > at org.apache.lucene.search.AssertingIndexSearcher.search(AssertingIndexSearcher.java:91)
   [junit4]    > at org.apache.lucene.search.IndexSearcher.search(IndexSearcher.java:473)
   [junit4]    > at org.apache.lucene.search.join.TestBlockJoin.testSimple(TestBlockJoin.java:304)
   [junit4]    > at java.lang.Thread.run(Thread.java:745)
   [junit4]   2> NOTE: reproduce with: ant test  -Dtestcase=TestBlockJoin -Dtests.method=testMultiChildTypes -Dtests.seed=CA83BCDFD8F27072 -Dtests.multiplier=3 -Dtests.slow=true -Dtests.locale=ms -Dtests.timezone=Asia/Kuching -Dtests.asserts=true -Dtests.file.encoding=ISO-8859-1
   [junit4] FAILURE 0.04s J0 | TestBlockJoin.testMultiChildTypes <<<
   [junit4]    > Throwable #1: java.lang.AssertionError
   [junit4]    > at __randomizedtesting.SeedInfo.seed([CA83BCDFD8F27072:5E14BFF5D3770BB1]:0)
   [junit4]    > at org.apache.lucene.search.AssertingScorer.getChildren(AssertingScorer.java:81)
   [junit4]    > at org.apache.lucene.search.join.ToParentBlockJoinCollector$1.setScorer(ToParentBlockJoinCollector.java:190)
   [junit4]    > at org.apache.lucene.search.FilterLeafCollector.setScorer(FilterLeafCollector.java:38)
   [junit4]    > at org.apache.lucene.search.AssertingLeafCollector.setScorer(AssertingLeafCollector.java:43)
   [junit4]    > at org.apache.lucene.search.FilterLeafCollector.setScorer(FilterLeafCollector.java:38)
   [junit4]    > at org.apache.lucene.search.AssertingLeafCollector.setScorer(AssertingLeafCollector.java:43)
   [junit4]    > at org.apache.lucene.search.FilterLeafCollector.setScorer(FilterLeafCollector.java:38)
   [junit4]    > at org.apache.lucene.search.AssertingLeafCollector.setScorer(AssertingLeafCollector.java:43)
   [junit4]    > at org.apache.lucene.search.Weight$DefaultBulkScorer.score(Weight.java:195)
   [junit4]    > at org.apache.lucene.search.AssertingBulkScorer.score(AssertingBulkScorer.java:79)
   [junit4]    > at org.apache.lucene.search.AssertingBulkScorer.score(AssertingBulkScorer.java:63)
   [junit4]    > at org.apache.lucene.search.IndexSearcher.search(IndexSearcher.java:669)
   [junit4]    > at org.apache.lucene.search.AssertingIndexSearcher.search(AssertingIndexSearcher.java:91)
   [junit4]    > at org.apache.lucene.search.IndexSearcher.search(IndexSearcher.java:473)
   [junit4]    > at org.apache.lucene.search.join.TestBlockJoin.testMultiChildTypes(TestBlockJoin.java:1207)
   [junit4]    > at java.lang.Thread.run(Thread.java:745)
   [junit4]   2> NOTE: reproduce with: ant test  -Dtestcase=TestBlockJoin -Dtests.method=testBugCausedByRewritingTwice -Dtests.seed=CA83BCDFD8F27072 -Dtests.multiplier=3 -Dtests.slow=true -Dtests.locale=ms -Dtests.timezone=Asia/Kuching -Dtests.asserts=true -Dtests.file.encoding=ISO-8859-1
   [junit4] FAILURE 0.01s J0 | TestBlockJoin.testBugCausedByRewritingTwice <<<
   [junit4]    > Throwable #1: java.lang.AssertionError
   [junit4]    > at __randomizedtesting.SeedInfo.seed([CA83BCDFD8F27072:35FF6C7453CDAC0B]:0)
   [junit4]    > at org.apache.lucene.search.AssertingScorer.getChildren(AssertingScorer.java:81)
   [junit4]    > at org.apache.lucene.search.join.ToParentBlockJoinCollector$1.setScorer(ToParentBlockJoinCollector.java:190)
   [junit4]    > at org.apache.lucene.search.FilterLeafCollector.setScorer(FilterLeafCollector.java:38)
   [junit4]    > at org.apache.lucene.search.AssertingLeafCollector.setScorer(AssertingLeafCollector.java:43)
   [junit4]    > at org.apache.lucene.search.FilterLeafCollector.setScorer(FilterLeafCollector.java:38)
   [junit4]    > at org.apache.lucene.search.AssertingLeafCollector.setScorer(AssertingLeafCollector.java:43)
   [junit4]    > at org.apache.lucene.search.Weight$DefaultBulkScorer.score(Weight.java:195)
   [junit4]    > at org.apache.lucene.search.BulkScorer.score(BulkScorer.java:39)
   [junit4]    > at org.apache.lucene.search.AssertingBulkScorer.score(AssertingBulkScorer.java:69)
   [junit4]    > at org.apache.lucene.search.IndexSearcher.search(IndexSearcher.java:669)
   [junit4]    > at org.apache.lucene.search.AssertingIndexSearcher.search(AssertingIndexSearcher.java:91)
   [junit4]    > at org.apache.lucene.search.IndexSearcher.search(IndexSearcher.java:473)
   [junit4]    > at org.apache.lucene.search.join.TestBlockJoin.testBugCausedByRewritingTwice(TestBlockJoin.java:406)
   [junit4]    > at java.lang.Thread.run(Thread.java:745)
   [junit4]   2> NOTE: test params are: codec=Lucene62, sim=RandomSimilarity(queryNorm=false,coord=yes): {country=IB LL-DZ(0.3), qualification=DFR I(F)1, parent=DFR I(ne)LZ(0.3), skill=BM25(k1=1.2,b=0.75), childText=DFI(ChiSquared), parentText=DFR I(F)3(800.0), child=IB LL-D2}, locale=ms, timezone=Asia/Kuching
   [junit4]   2> NOTE: Linux 4.4.0-53-generic amd64/Oracle Corporation 1.8.0_121 (64-bit)/cpus=12,threads=1,free=398408728,total=508887040
   [junit4]   2> NOTE: All tests run in this JVM: [TestCheckJoinIndex, TestBlockJoinSelector, TestBlockJoin]
   [junit4] Completed [6/6 (1!)] on J0 in 24.66s, 21 tests, 3 failures <<< FAILURES!

[...truncated 68097 lines...]



---------------------------------------------------------------------
To unsubscribe, e-mail: [hidden email]
For additional commands, e-mail: [hidden email]
Reply | Threaded
Open this post in threaded view
|

Re: [JENKINS] Lucene-Solr-6.x-Linux (64bit/jdk1.8.0_121) - Build # 2720 - Still Unstable!

Alan Woodward
I ran tests from the wrong subdirectory, sorry for the noise…

> On 23 Jan 2017, at 11:08, Policeman Jenkins Server <[hidden email]> wrote:
>
> Build: https://jenkins.thetaphi.de/job/Lucene-Solr-6.x-Linux/2720/
> Java: 64bit/jdk1.8.0_121 -XX:-UseCompressedOops -XX:+UseSerialGC
>
> 5 tests failed.
> FAILED:  org.apache.lucene.facet.TestDrillSideways.testRandom
>
> Error Message:
>
>
> Stack Trace:
> java.lang.AssertionError
> at __randomizedtesting.SeedInfo.seed([53C1D0D8EA07270E:218DF5D75B67917D]:0)
> at org.apache.lucene.search.AssertingScorer.getChildren(AssertingScorer.java:81)
> at org.apache.lucene.facet.AssertingSubDocsAtOnceCollector.setScorer(AssertingSubDocsAtOnceCollector.java:43)
> at org.apache.lucene.search.FilterLeafCollector.setScorer(FilterLeafCollector.java:38)
> at org.apache.lucene.search.AssertingLeafCollector.setScorer(AssertingLeafCollector.java:43)
> at org.apache.lucene.search.FilterLeafCollector.setScorer(FilterLeafCollector.java:38)
> at org.apache.lucene.search.AssertingLeafCollector.setScorer(AssertingLeafCollector.java:43)
> at org.apache.lucene.facet.DrillSidewaysScorer.score(DrillSidewaysScorer.java:86)
> at org.apache.lucene.search.BulkScorer.score(BulkScorer.java:39)
> at org.apache.lucene.search.AssertingBulkScorer.score(AssertingBulkScorer.java:69)
> at org.apache.lucene.search.IndexSearcher.search(IndexSearcher.java:669)
> at org.apache.lucene.search.AssertingIndexSearcher.search(AssertingIndexSearcher.java:91)
> at org.apache.lucene.search.IndexSearcher.search(IndexSearcher.java:473)
> at org.apache.lucene.facet.DrillSideways.search(DrillSideways.java:214)
> at org.apache.lucene.facet.TestDrillSideways.testRandom(TestDrillSideways.java:794)
> at sun.reflect.NativeMethodAccessorImpl.invoke0(Native Method)
> at sun.reflect.NativeMethodAccessorImpl.invoke(NativeMethodAccessorImpl.java:62)
> at sun.reflect.DelegatingMethodAccessorImpl.invoke(DelegatingMethodAccessorImpl.java:43)
> at java.lang.reflect.Method.invoke(Method.java:498)
> at com.carrotsearch.randomizedtesting.RandomizedRunner.invoke(RandomizedRunner.java:1713)
> at com.carrotsearch.randomizedtesting.RandomizedRunner$8.evaluate(RandomizedRunner.java:907)
> at com.carrotsearch.randomizedtesting.RandomizedRunner$9.evaluate(RandomizedRunner.java:943)
> at com.carrotsearch.randomizedtesting.RandomizedRunner$10.evaluate(RandomizedRunner.java:957)
> at org.apache.lucene.util.TestRuleSetupTeardownChained$1.evaluate(TestRuleSetupTeardownChained.java:49)
> at org.apache.lucene.util.AbstractBeforeAfterRule$1.evaluate(AbstractBeforeAfterRule.java:45)
> at org.apache.lucene.util.TestRuleThreadAndTestName$1.evaluate(TestRuleThreadAndTestName.java:48)
> at org.apache.lucene.util.TestRuleIgnoreAfterMaxFailures$1.evaluate(TestRuleIgnoreAfterMaxFailures.java:64)
> at org.apache.lucene.util.TestRuleMarkFailure$1.evaluate(TestRuleMarkFailure.java:47)
> at com.carrotsearch.randomizedtesting.rules.StatementAdapter.evaluate(StatementAdapter.java:36)
> at com.carrotsearch.randomizedtesting.ThreadLeakControl$StatementRunner.run(ThreadLeakControl.java:367)
> at com.carrotsearch.randomizedtesting.ThreadLeakControl.forkTimeoutingTask(ThreadLeakControl.java:811)
> at com.carrotsearch.randomizedtesting.ThreadLeakControl$3.evaluate(ThreadLeakControl.java:462)
> at com.carrotsearch.randomizedtesting.RandomizedRunner.runSingleTest(RandomizedRunner.java:916)
> at com.carrotsearch.randomizedtesting.RandomizedRunner$5.evaluate(RandomizedRunner.java:802)
> at com.carrotsearch.randomizedtesting.RandomizedRunner$6.evaluate(RandomizedRunner.java:852)
> at com.carrotsearch.randomizedtesting.RandomizedRunner$7.evaluate(RandomizedRunner.java:863)
> at org.apache.lucene.util.AbstractBeforeAfterRule$1.evaluate(AbstractBeforeAfterRule.java:45)
> at com.carrotsearch.randomizedtesting.rules.StatementAdapter.evaluate(StatementAdapter.java:36)
> at org.apache.lucene.util.TestRuleStoreClassName$1.evaluate(TestRuleStoreClassName.java:41)
> at com.carrotsearch.randomizedtesting.rules.NoShadowingOrOverridesOnMethodsRule$1.evaluate(NoShadowingOrOverridesOnMethodsRule.java:40)
> at com.carrotsearch.randomizedtesting.rules.NoShadowingOrOverridesOnMethodsRule$1.evaluate(NoShadowingOrOverridesOnMethodsRule.java:40)
> at com.carrotsearch.randomizedtesting.rules.StatementAdapter.evaluate(StatementAdapter.java:36)
> at com.carrotsearch.randomizedtesting.rules.StatementAdapter.evaluate(StatementAdapter.java:36)
> at com.carrotsearch.randomizedtesting.rules.StatementAdapter.evaluate(StatementAdapter.java:36)
> at org.apache.lucene.util.TestRuleAssertionsRequired$1.evaluate(TestRuleAssertionsRequired.java:53)
> at org.apache.lucene.util.TestRuleMarkFailure$1.evaluate(TestRuleMarkFailure.java:47)
> at org.apache.lucene.util.TestRuleIgnoreAfterMaxFailures$1.evaluate(TestRuleIgnoreAfterMaxFailures.java:64)
> at org.apache.lucene.util.TestRuleIgnoreTestSuites$1.evaluate(TestRuleIgnoreTestSuites.java:54)
> at com.carrotsearch.randomizedtesting.rules.StatementAdapter.evaluate(StatementAdapter.java:36)
> at com.carrotsearch.randomizedtesting.ThreadLeakControl$StatementRunner.run(ThreadLeakControl.java:367)
> at java.lang.Thread.run(Thread.java:745)
>
>
> FAILED:  org.apache.lucene.facet.TestParallelDrillSideways.testRandom
>
> Error Message:
>
>
> Stack Trace:
> java.lang.AssertionError
> at __randomizedtesting.SeedInfo.seed([53C1D0D8EA07270E:218DF5D75B67917D]:0)
> at org.apache.lucene.search.AssertingScorer.getChildren(AssertingScorer.java:81)
> at org.apache.lucene.facet.AssertingSubDocsAtOnceCollector.setScorer(AssertingSubDocsAtOnceCollector.java:43)
> at org.apache.lucene.search.FilterLeafCollector.setScorer(FilterLeafCollector.java:38)
> at org.apache.lucene.search.AssertingLeafCollector.setScorer(AssertingLeafCollector.java:43)
> at org.apache.lucene.search.FilterLeafCollector.setScorer(FilterLeafCollector.java:38)
> at org.apache.lucene.search.AssertingLeafCollector.setScorer(AssertingLeafCollector.java:43)
> at org.apache.lucene.facet.DrillSidewaysScorer.score(DrillSidewaysScorer.java:86)
> at org.apache.lucene.search.BulkScorer.score(BulkScorer.java:39)
> at org.apache.lucene.search.AssertingBulkScorer.score(AssertingBulkScorer.java:69)
> at org.apache.lucene.search.IndexSearcher.search(IndexSearcher.java:669)
> at org.apache.lucene.search.AssertingIndexSearcher.search(AssertingIndexSearcher.java:91)
> at org.apache.lucene.search.IndexSearcher.search(IndexSearcher.java:473)
> at org.apache.lucene.facet.DrillSideways.search(DrillSideways.java:214)
> at org.apache.lucene.facet.TestDrillSideways.testRandom(TestDrillSideways.java:794)
> at sun.reflect.NativeMethodAccessorImpl.invoke0(Native Method)
> at sun.reflect.NativeMethodAccessorImpl.invoke(NativeMethodAccessorImpl.java:62)
> at sun.reflect.DelegatingMethodAccessorImpl.invoke(DelegatingMethodAccessorImpl.java:43)
> at java.lang.reflect.Method.invoke(Method.java:498)
> at com.carrotsearch.randomizedtesting.RandomizedRunner.invoke(RandomizedRunner.java:1713)
> at com.carrotsearch.randomizedtesting.RandomizedRunner$8.evaluate(RandomizedRunner.java:907)
> at com.carrotsearch.randomizedtesting.RandomizedRunner$9.evaluate(RandomizedRunner.java:943)
> at com.carrotsearch.randomizedtesting.RandomizedRunner$10.evaluate(RandomizedRunner.java:957)
> at org.apache.lucene.util.TestRuleSetupTeardownChained$1.evaluate(TestRuleSetupTeardownChained.java:49)
> at org.apache.lucene.util.AbstractBeforeAfterRule$1.evaluate(AbstractBeforeAfterRule.java:45)
> at org.apache.lucene.util.TestRuleThreadAndTestName$1.evaluate(TestRuleThreadAndTestName.java:48)
> at org.apache.lucene.util.TestRuleIgnoreAfterMaxFailures$1.evaluate(TestRuleIgnoreAfterMaxFailures.java:64)
> at org.apache.lucene.util.TestRuleMarkFailure$1.evaluate(TestRuleMarkFailure.java:47)
> at com.carrotsearch.randomizedtesting.rules.StatementAdapter.evaluate(StatementAdapter.java:36)
> at com.carrotsearch.randomizedtesting.ThreadLeakControl$StatementRunner.run(ThreadLeakControl.java:367)
> at com.carrotsearch.randomizedtesting.ThreadLeakControl.forkTimeoutingTask(ThreadLeakControl.java:811)
> at com.carrotsearch.randomizedtesting.ThreadLeakControl$3.evaluate(ThreadLeakControl.java:462)
> at com.carrotsearch.randomizedtesting.RandomizedRunner.runSingleTest(RandomizedRunner.java:916)
> at com.carrotsearch.randomizedtesting.RandomizedRunner$5.evaluate(RandomizedRunner.java:802)
> at com.carrotsearch.randomizedtesting.RandomizedRunner$6.evaluate(RandomizedRunner.java:852)
> at com.carrotsearch.randomizedtesting.RandomizedRunner$7.evaluate(RandomizedRunner.java:863)
> at org.apache.lucene.util.AbstractBeforeAfterRule$1.evaluate(AbstractBeforeAfterRule.java:45)
> at com.carrotsearch.randomizedtesting.rules.StatementAdapter.evaluate(StatementAdapter.java:36)
> at org.apache.lucene.util.TestRuleStoreClassName$1.evaluate(TestRuleStoreClassName.java:41)
> at com.carrotsearch.randomizedtesting.rules.NoShadowingOrOverridesOnMethodsRule$1.evaluate(NoShadowingOrOverridesOnMethodsRule.java:40)
> at com.carrotsearch.randomizedtesting.rules.NoShadowingOrOverridesOnMethodsRule$1.evaluate(NoShadowingOrOverridesOnMethodsRule.java:40)
> at com.carrotsearch.randomizedtesting.rules.StatementAdapter.evaluate(StatementAdapter.java:36)
> at com.carrotsearch.randomizedtesting.rules.StatementAdapter.evaluate(StatementAdapter.java:36)
> at com.carrotsearch.randomizedtesting.rules.StatementAdapter.evaluate(StatementAdapter.java:36)
> at org.apache.lucene.util.TestRuleAssertionsRequired$1.evaluate(TestRuleAssertionsRequired.java:53)
> at org.apache.lucene.util.TestRuleMarkFailure$1.evaluate(TestRuleMarkFailure.java:47)
> at org.apache.lucene.util.TestRuleIgnoreAfterMaxFailures$1.evaluate(TestRuleIgnoreAfterMaxFailures.java:64)
> at org.apache.lucene.util.TestRuleIgnoreTestSuites$1.evaluate(TestRuleIgnoreTestSuites.java:54)
> at com.carrotsearch.randomizedtesting.rules.StatementAdapter.evaluate(StatementAdapter.java:36)
> at com.carrotsearch.randomizedtesting.ThreadLeakControl$StatementRunner.run(ThreadLeakControl.java:367)
> at java.lang.Thread.run(Thread.java:745)
>
>
> FAILED:  org.apache.lucene.search.join.TestBlockJoin.testSimple
>
> Error Message:
>
>
> Stack Trace:
> java.lang.AssertionError
> at __randomizedtesting.SeedInfo.seed([CA83BCDFD8F27072:F2309821FF01A4A3]:0)
> at org.apache.lucene.search.AssertingScorer.getChildren(AssertingScorer.java:81)
> at org.apache.lucene.search.join.ToParentBlockJoinCollector$1.setScorer(ToParentBlockJoinCollector.java:190)
> at org.apache.lucene.search.FilterLeafCollector.setScorer(FilterLeafCollector.java:38)
> at org.apache.lucene.search.AssertingLeafCollector.setScorer(AssertingLeafCollector.java:43)
> at org.apache.lucene.search.FilterLeafCollector.setScorer(FilterLeafCollector.java:38)
> at org.apache.lucene.search.AssertingLeafCollector.setScorer(AssertingLeafCollector.java:43)
> at org.apache.lucene.search.FilterLeafCollector.setScorer(FilterLeafCollector.java:38)
> at org.apache.lucene.search.AssertingLeafCollector.setScorer(AssertingLeafCollector.java:43)
> at org.apache.lucene.search.Weight$DefaultBulkScorer.score(Weight.java:195)
> at org.apache.lucene.search.AssertingBulkScorer.score(AssertingBulkScorer.java:79)
> at org.apache.lucene.search.AssertingBulkScorer.score(AssertingBulkScorer.java:63)
> at org.apache.lucene.search.IndexSearcher.search(IndexSearcher.java:669)
> at org.apache.lucene.search.AssertingIndexSearcher.search(AssertingIndexSearcher.java:91)
> at org.apache.lucene.search.IndexSearcher.search(IndexSearcher.java:473)
> at org.apache.lucene.search.join.TestBlockJoin.testSimple(TestBlockJoin.java:304)
> at sun.reflect.NativeMethodAccessorImpl.invoke0(Native Method)
> at sun.reflect.NativeMethodAccessorImpl.invoke(NativeMethodAccessorImpl.java:62)
> at sun.reflect.DelegatingMethodAccessorImpl.invoke(DelegatingMethodAccessorImpl.java:43)
> at java.lang.reflect.Method.invoke(Method.java:498)
> at com.carrotsearch.randomizedtesting.RandomizedRunner.invoke(RandomizedRunner.java:1713)
> at com.carrotsearch.randomizedtesting.RandomizedRunner$8.evaluate(RandomizedRunner.java:907)
> at com.carrotsearch.randomizedtesting.RandomizedRunner$9.evaluate(RandomizedRunner.java:943)
> at com.carrotsearch.randomizedtesting.RandomizedRunner$10.evaluate(RandomizedRunner.java:957)
> at org.apache.lucene.util.TestRuleSetupTeardownChained$1.evaluate(TestRuleSetupTeardownChained.java:49)
> at org.apache.lucene.util.AbstractBeforeAfterRule$1.evaluate(AbstractBeforeAfterRule.java:45)
> at org.apache.lucene.util.TestRuleThreadAndTestName$1.evaluate(TestRuleThreadAndTestName.java:48)
> at org.apache.lucene.util.TestRuleIgnoreAfterMaxFailures$1.evaluate(TestRuleIgnoreAfterMaxFailures.java:64)
> at org.apache.lucene.util.TestRuleMarkFailure$1.evaluate(TestRuleMarkFailure.java:47)
> at com.carrotsearch.randomizedtesting.rules.StatementAdapter.evaluate(StatementAdapter.java:36)
> at com.carrotsearch.randomizedtesting.ThreadLeakControl$StatementRunner.run(ThreadLeakControl.java:367)
> at com.carrotsearch.randomizedtesting.ThreadLeakControl.forkTimeoutingTask(ThreadLeakControl.java:811)
> at com.carrotsearch.randomizedtesting.ThreadLeakControl$3.evaluate(ThreadLeakControl.java:462)
> at com.carrotsearch.randomizedtesting.RandomizedRunner.runSingleTest(RandomizedRunner.java:916)
> at com.carrotsearch.randomizedtesting.RandomizedRunner$5.evaluate(RandomizedRunner.java:802)
> at com.carrotsearch.randomizedtesting.RandomizedRunner$6.evaluate(RandomizedRunner.java:852)
> at com.carrotsearch.randomizedtesting.RandomizedRunner$7.evaluate(RandomizedRunner.java:863)
> at org.apache.lucene.util.AbstractBeforeAfterRule$1.evaluate(AbstractBeforeAfterRule.java:45)
> at com.carrotsearch.randomizedtesting.rules.StatementAdapter.evaluate(StatementAdapter.java:36)
> at org.apache.lucene.util.TestRuleStoreClassName$1.evaluate(TestRuleStoreClassName.java:41)
> at com.carrotsearch.randomizedtesting.rules.NoShadowingOrOverridesOnMethodsRule$1.evaluate(NoShadowingOrOverridesOnMethodsRule.java:40)
> at com.carrotsearch.randomizedtesting.rules.NoShadowingOrOverridesOnMethodsRule$1.evaluate(NoShadowingOrOverridesOnMethodsRule.java:40)
> at com.carrotsearch.randomizedtesting.rules.StatementAdapter.evaluate(StatementAdapter.java:36)
> at com.carrotsearch.randomizedtesting.rules.StatementAdapter.evaluate(StatementAdapter.java:36)
> at com.carrotsearch.randomizedtesting.rules.StatementAdapter.evaluate(StatementAdapter.java:36)
> at org.apache.lucene.util.TestRuleAssertionsRequired$1.evaluate(TestRuleAssertionsRequired.java:53)
> at org.apache.lucene.util.TestRuleMarkFailure$1.evaluate(TestRuleMarkFailure.java:47)
> at org.apache.lucene.util.TestRuleIgnoreAfterMaxFailures$1.evaluate(TestRuleIgnoreAfterMaxFailures.java:64)
> at org.apache.lucene.util.TestRuleIgnoreTestSuites$1.evaluate(TestRuleIgnoreTestSuites.java:54)
> at com.carrotsearch.randomizedtesting.rules.StatementAdapter.evaluate(StatementAdapter.java:36)
> at com.carrotsearch.randomizedtesting.ThreadLeakControl$StatementRunner.run(ThreadLeakControl.java:367)
> at java.lang.Thread.run(Thread.java:745)
>
>
> FAILED:  org.apache.lucene.search.join.TestBlockJoin.testMultiChildTypes
>
> Error Message:
>
>
> Stack Trace:
> java.lang.AssertionError
> at __randomizedtesting.SeedInfo.seed([CA83BCDFD8F27072:5E14BFF5D3770BB1]:0)
> at org.apache.lucene.search.AssertingScorer.getChildren(AssertingScorer.java:81)
> at org.apache.lucene.search.join.ToParentBlockJoinCollector$1.setScorer(ToParentBlockJoinCollector.java:190)
> at org.apache.lucene.search.FilterLeafCollector.setScorer(FilterLeafCollector.java:38)
> at org.apache.lucene.search.AssertingLeafCollector.setScorer(AssertingLeafCollector.java:43)
> at org.apache.lucene.search.FilterLeafCollector.setScorer(FilterLeafCollector.java:38)
> at org.apache.lucene.search.AssertingLeafCollector.setScorer(AssertingLeafCollector.java:43)
> at org.apache.lucene.search.FilterLeafCollector.setScorer(FilterLeafCollector.java:38)
> at org.apache.lucene.search.AssertingLeafCollector.setScorer(AssertingLeafCollector.java:43)
> at org.apache.lucene.search.Weight$DefaultBulkScorer.score(Weight.java:195)
> at org.apache.lucene.search.AssertingBulkScorer.score(AssertingBulkScorer.java:79)
> at org.apache.lucene.search.AssertingBulkScorer.score(AssertingBulkScorer.java:63)
> at org.apache.lucene.search.IndexSearcher.search(IndexSearcher.java:669)
> at org.apache.lucene.search.AssertingIndexSearcher.search(AssertingIndexSearcher.java:91)
> at org.apache.lucene.search.IndexSearcher.search(IndexSearcher.java:473)
> at org.apache.lucene.search.join.TestBlockJoin.testMultiChildTypes(TestBlockJoin.java:1207)
> at sun.reflect.NativeMethodAccessorImpl.invoke0(Native Method)
> at sun.reflect.NativeMethodAccessorImpl.invoke(NativeMethodAccessorImpl.java:62)
> at sun.reflect.DelegatingMethodAccessorImpl.invoke(DelegatingMethodAccessorImpl.java:43)
> at java.lang.reflect.Method.invoke(Method.java:498)
> at com.carrotsearch.randomizedtesting.RandomizedRunner.invoke(RandomizedRunner.java:1713)
> at com.carrotsearch.randomizedtesting.RandomizedRunner$8.evaluate(RandomizedRunner.java:907)
> at com.carrotsearch.randomizedtesting.RandomizedRunner$9.evaluate(RandomizedRunner.java:943)
> at com.carrotsearch.randomizedtesting.RandomizedRunner$10.evaluate(RandomizedRunner.java:957)
> at org.apache.lucene.util.TestRuleSetupTeardownChained$1.evaluate(TestRuleSetupTeardownChained.java:49)
> at org.apache.lucene.util.AbstractBeforeAfterRule$1.evaluate(AbstractBeforeAfterRule.java:45)
> at org.apache.lucene.util.TestRuleThreadAndTestName$1.evaluate(TestRuleThreadAndTestName.java:48)
> at org.apache.lucene.util.TestRuleIgnoreAfterMaxFailures$1.evaluate(TestRuleIgnoreAfterMaxFailures.java:64)
> at org.apache.lucene.util.TestRuleMarkFailure$1.evaluate(TestRuleMarkFailure.java:47)
> at com.carrotsearch.randomizedtesting.rules.StatementAdapter.evaluate(StatementAdapter.java:36)
> at com.carrotsearch.randomizedtesting.ThreadLeakControl$StatementRunner.run(ThreadLeakControl.java:367)
> at com.carrotsearch.randomizedtesting.ThreadLeakControl.forkTimeoutingTask(ThreadLeakControl.java:811)
> at com.carrotsearch.randomizedtesting.ThreadLeakControl$3.evaluate(ThreadLeakControl.java:462)
> at com.carrotsearch.randomizedtesting.RandomizedRunner.runSingleTest(RandomizedRunner.java:916)
> at com.carrotsearch.randomizedtesting.RandomizedRunner$5.evaluate(RandomizedRunner.java:802)
> at com.carrotsearch.randomizedtesting.RandomizedRunner$6.evaluate(RandomizedRunner.java:852)
> at com.carrotsearch.randomizedtesting.RandomizedRunner$7.evaluate(RandomizedRunner.java:863)
> at org.apache.lucene.util.AbstractBeforeAfterRule$1.evaluate(AbstractBeforeAfterRule.java:45)
> at com.carrotsearch.randomizedtesting.rules.StatementAdapter.evaluate(StatementAdapter.java:36)
> at org.apache.lucene.util.TestRuleStoreClassName$1.evaluate(TestRuleStoreClassName.java:41)
> at com.carrotsearch.randomizedtesting.rules.NoShadowingOrOverridesOnMethodsRule$1.evaluate(NoShadowingOrOverridesOnMethodsRule.java:40)
> at com.carrotsearch.randomizedtesting.rules.NoShadowingOrOverridesOnMethodsRule$1.evaluate(NoShadowingOrOverridesOnMethodsRule.java:40)
> at com.carrotsearch.randomizedtesting.rules.StatementAdapter.evaluate(StatementAdapter.java:36)
> at com.carrotsearch.randomizedtesting.rules.StatementAdapter.evaluate(StatementAdapter.java:36)
> at com.carrotsearch.randomizedtesting.rules.StatementAdapter.evaluate(StatementAdapter.java:36)
> at org.apache.lucene.util.TestRuleAssertionsRequired$1.evaluate(TestRuleAssertionsRequired.java:53)
> at org.apache.lucene.util.TestRuleMarkFailure$1.evaluate(TestRuleMarkFailure.java:47)
> at org.apache.lucene.util.TestRuleIgnoreAfterMaxFailures$1.evaluate(TestRuleIgnoreAfterMaxFailures.java:64)
> at org.apache.lucene.util.TestRuleIgnoreTestSuites$1.evaluate(TestRuleIgnoreTestSuites.java:54)
> at com.carrotsearch.randomizedtesting.rules.StatementAdapter.evaluate(StatementAdapter.java:36)
> at com.carrotsearch.randomizedtesting.ThreadLeakControl$StatementRunner.run(ThreadLeakControl.java:367)
> at java.lang.Thread.run(Thread.java:745)
>
>
> FAILED:  org.apache.lucene.search.join.TestBlockJoin.testBugCausedByRewritingTwice
>
> Error Message:
>
>
> Stack Trace:
> java.lang.AssertionError
> at __randomizedtesting.SeedInfo.seed([CA83BCDFD8F27072:35FF6C7453CDAC0B]:0)
> at org.apache.lucene.search.AssertingScorer.getChildren(AssertingScorer.java:81)
> at org.apache.lucene.search.join.ToParentBlockJoinCollector$1.setScorer(ToParentBlockJoinCollector.java:190)
> at org.apache.lucene.search.FilterLeafCollector.setScorer(FilterLeafCollector.java:38)
> at org.apache.lucene.search.AssertingLeafCollector.setScorer(AssertingLeafCollector.java:43)
> at org.apache.lucene.search.FilterLeafCollector.setScorer(FilterLeafCollector.java:38)
> at org.apache.lucene.search.AssertingLeafCollector.setScorer(AssertingLeafCollector.java:43)
> at org.apache.lucene.search.Weight$DefaultBulkScorer.score(Weight.java:195)
> at org.apache.lucene.search.BulkScorer.score(BulkScorer.java:39)
> at org.apache.lucene.search.AssertingBulkScorer.score(AssertingBulkScorer.java:69)
> at org.apache.lucene.search.IndexSearcher.search(IndexSearcher.java:669)
> at org.apache.lucene.search.AssertingIndexSearcher.search(AssertingIndexSearcher.java:91)
> at org.apache.lucene.search.IndexSearcher.search(IndexSearcher.java:473)
> at org.apache.lucene.search.join.TestBlockJoin.testBugCausedByRewritingTwice(TestBlockJoin.java:406)
> at sun.reflect.NativeMethodAccessorImpl.invoke0(Native Method)
> at sun.reflect.NativeMethodAccessorImpl.invoke(NativeMethodAccessorImpl.java:62)
> at sun.reflect.DelegatingMethodAccessorImpl.invoke(DelegatingMethodAccessorImpl.java:43)
> at java.lang.reflect.Method.invoke(Method.java:498)
> at com.carrotsearch.randomizedtesting.RandomizedRunner.invoke(RandomizedRunner.java:1713)
> at com.carrotsearch.randomizedtesting.RandomizedRunner$8.evaluate(RandomizedRunner.java:907)
> at com.carrotsearch.randomizedtesting.RandomizedRunner$9.evaluate(RandomizedRunner.java:943)
> at com.carrotsearch.randomizedtesting.RandomizedRunner$10.evaluate(RandomizedRunner.java:957)
> at org.apache.lucene.util.TestRuleSetupTeardownChained$1.evaluate(TestRuleSetupTeardownChained.java:49)
> at org.apache.lucene.util.AbstractBeforeAfterRule$1.evaluate(AbstractBeforeAfterRule.java:45)
> at org.apache.lucene.util.TestRuleThreadAndTestName$1.evaluate(TestRuleThreadAndTestName.java:48)
> at org.apache.lucene.util.TestRuleIgnoreAfterMaxFailures$1.evaluate(TestRuleIgnoreAfterMaxFailures.java:64)
> at org.apache.lucene.util.TestRuleMarkFailure$1.evaluate(TestRuleMarkFailure.java:47)
> at com.carrotsearch.randomizedtesting.rules.StatementAdapter.evaluate(StatementAdapter.java:36)
> at com.carrotsearch.randomizedtesting.ThreadLeakControl$StatementRunner.run(ThreadLeakControl.java:367)
> at com.carrotsearch.randomizedtesting.ThreadLeakControl.forkTimeoutingTask(ThreadLeakControl.java:811)
> at com.carrotsearch.randomizedtesting.ThreadLeakControl$3.evaluate(ThreadLeakControl.java:462)
> at com.carrotsearch.randomizedtesting.RandomizedRunner.runSingleTest(RandomizedRunner.java:916)
> at com.carrotsearch.randomizedtesting.RandomizedRunner$5.evaluate(RandomizedRunner.java:802)
> at com.carrotsearch.randomizedtesting.RandomizedRunner$6.evaluate(RandomizedRunner.java:852)
> at com.carrotsearch.randomizedtesting.RandomizedRunner$7.evaluate(RandomizedRunner.java:863)
> at org.apache.lucene.util.AbstractBeforeAfterRule$1.evaluate(AbstractBeforeAfterRule.java:45)
> at com.carrotsearch.randomizedtesting.rules.StatementAdapter.evaluate(StatementAdapter.java:36)
> at org.apache.lucene.util.TestRuleStoreClassName$1.evaluate(TestRuleStoreClassName.java:41)
> at com.carrotsearch.randomizedtesting.rules.NoShadowingOrOverridesOnMethodsRule$1.evaluate(NoShadowingOrOverridesOnMethodsRule.java:40)
> at com.carrotsearch.randomizedtesting.rules.NoShadowingOrOverridesOnMethodsRule$1.evaluate(NoShadowingOrOverridesOnMethodsRule.java:40)
> at com.carrotsearch.randomizedtesting.rules.StatementAdapter.evaluate(StatementAdapter.java:36)
> at com.carrotsearch.randomizedtesting.rules.StatementAdapter.evaluate(StatementAdapter.java:36)
> at com.carrotsearch.randomizedtesting.rules.StatementAdapter.evaluate(StatementAdapter.java:36)
> at org.apache.lucene.util.TestRuleAssertionsRequired$1.evaluate(TestRuleAssertionsRequired.java:53)
> at org.apache.lucene.util.TestRuleMarkFailure$1.evaluate(TestRuleMarkFailure.java:47)
> at org.apache.lucene.util.TestRuleIgnoreAfterMaxFailures$1.evaluate(TestRuleIgnoreAfterMaxFailures.java:64)
> at org.apache.lucene.util.TestRuleIgnoreTestSuites$1.evaluate(TestRuleIgnoreTestSuites.java:54)
> at com.carrotsearch.randomizedtesting.rules.StatementAdapter.evaluate(StatementAdapter.java:36)
> at com.carrotsearch.randomizedtesting.ThreadLeakControl$StatementRunner.run(ThreadLeakControl.java:367)
> at java.lang.Thread.run(Thread.java:745)
>
>
>
>
> Build Log:
> [...truncated 6765 lines...]
>   [junit4] Suite: org.apache.lucene.facet.TestParallelDrillSideways
>   [junit4]   2> NOTE: reproduce with: ant test  -Dtestcase=TestParallelDrillSideways -Dtests.method=testRandom -Dtests.seed=53C1D0D8EA07270E -Dtests.multiplier=3 -Dtests.slow=true -Dtests.locale=en -Dtests.timezone=US/Aleutian -Dtests.asserts=true -Dtests.file.encoding=UTF-8
>   [junit4] FAILURE 3.32s J2 | TestParallelDrillSideways.testRandom <<<
>   [junit4]    > Throwable #1: java.lang.AssertionError
>   [junit4]    > at __randomizedtesting.SeedInfo.seed([53C1D0D8EA07270E:218DF5D75B67917D]:0)
>   [junit4]    > at org.apache.lucene.search.AssertingScorer.getChildren(AssertingScorer.java:81)
>   [junit4]    > at org.apache.lucene.facet.AssertingSubDocsAtOnceCollector.setScorer(AssertingSubDocsAtOnceCollector.java:43)
>   [junit4]    > at org.apache.lucene.search.FilterLeafCollector.setScorer(FilterLeafCollector.java:38)
>   [junit4]    > at org.apache.lucene.search.AssertingLeafCollector.setScorer(AssertingLeafCollector.java:43)
>   [junit4]    > at org.apache.lucene.search.FilterLeafCollector.setScorer(FilterLeafCollector.java:38)
>   [junit4]    > at org.apache.lucene.search.AssertingLeafCollector.setScorer(AssertingLeafCollector.java:43)
>   [junit4]    > at org.apache.lucene.facet.DrillSidewaysScorer.score(DrillSidewaysScorer.java:86)
>   [junit4]    > at org.apache.lucene.search.BulkScorer.score(BulkScorer.java:39)
>   [junit4]    > at org.apache.lucene.search.AssertingBulkScorer.score(AssertingBulkScorer.java:69)
>   [junit4]    > at org.apache.lucene.search.IndexSearcher.search(IndexSearcher.java:669)
>   [junit4]    > at org.apache.lucene.search.AssertingIndexSearcher.search(AssertingIndexSearcher.java:91)
>   [junit4]    > at org.apache.lucene.search.IndexSearcher.search(IndexSearcher.java:473)
>   [junit4]    > at org.apache.lucene.facet.DrillSideways.search(DrillSideways.java:214)
>   [junit4]    > at org.apache.lucene.facet.TestDrillSideways.testRandom(TestDrillSideways.java:794)
>   [junit4]    > at java.lang.Thread.run(Thread.java:745)
>   [junit4]   2> NOTE: test params are: codec=FastDecompressionCompressingStoredFields(storedFieldsFormat=CompressingStoredFieldsFormat(compressionMode=FAST_DECOMPRESSION, chunkSize=363, maxDocsPerChunk=226, blockSize=925), termVectorsFormat=CompressingTermVectorsFormat(compressionMode=FAST_DECOMPRESSION, chunkSize=363, blockSize=925)), sim=RandomSimilarity(queryNorm=false,coord=yes): {foobar=DFR I(ne)B3(800.0), field=IB LL-D2, content=DFR I(n)B3(800.0)}, locale=en, timezone=US/Aleutian
>   [junit4]   2> NOTE: Linux 4.4.0-53-generic amd64/Oracle Corporation 1.8.0_121 (64-bit)/cpus=12,threads=1,free=476308296,total=508887040
>   [junit4]   2> NOTE: All tests run in this JVM: [TestFacetQuery, TestDirectoryTaxonomyWriter, TestConcurrentFacetedIndexing, TestParallelDrillSideways]
>   [junit4] Completed [9/25 (1!)] on J2 in 3.79s, 6 tests, 1 failure <<< FAILURES!
>
> [...truncated 28 lines...]
>   [junit4] Suite: org.apache.lucene.facet.TestDrillSideways
>   [junit4]   2> NOTE: reproduce with: ant test  -Dtestcase=TestDrillSideways -Dtests.method=testRandom -Dtests.seed=53C1D0D8EA07270E -Dtests.multiplier=3 -Dtests.slow=true -Dtests.locale=be-BY -Dtests.timezone=Etc/Zulu -Dtests.asserts=true -Dtests.file.encoding=UTF-8
>   [junit4] FAILURE 1.78s J1 | TestDrillSideways.testRandom <<<
>   [junit4]    > Throwable #1: java.lang.AssertionError
>   [junit4]    > at __randomizedtesting.SeedInfo.seed([53C1D0D8EA07270E:218DF5D75B67917D]:0)
>   [junit4]    > at org.apache.lucene.search.AssertingScorer.getChildren(AssertingScorer.java:81)
>   [junit4]    > at org.apache.lucene.facet.AssertingSubDocsAtOnceCollector.setScorer(AssertingSubDocsAtOnceCollector.java:43)
>   [junit4]    > at org.apache.lucene.search.FilterLeafCollector.setScorer(FilterLeafCollector.java:38)
>   [junit4]    > at org.apache.lucene.search.AssertingLeafCollector.setScorer(AssertingLeafCollector.java:43)
>   [junit4]    > at org.apache.lucene.search.FilterLeafCollector.setScorer(FilterLeafCollector.java:38)
>   [junit4]    > at org.apache.lucene.search.AssertingLeafCollector.setScorer(AssertingLeafCollector.java:43)
>   [junit4]    > at org.apache.lucene.facet.DrillSidewaysScorer.score(DrillSidewaysScorer.java:86)
>   [junit4]    > at org.apache.lucene.search.BulkScorer.score(BulkScorer.java:39)
>   [junit4]    > at org.apache.lucene.search.AssertingBulkScorer.score(AssertingBulkScorer.java:69)
>   [junit4]    > at org.apache.lucene.search.IndexSearcher.search(IndexSearcher.java:669)
>   [junit4]    > at org.apache.lucene.search.AssertingIndexSearcher.search(AssertingIndexSearcher.java:91)
>   [junit4]    > at org.apache.lucene.search.IndexSearcher.search(IndexSearcher.java:473)
>   [junit4]    > at org.apache.lucene.facet.DrillSideways.search(DrillSideways.java:214)
>   [junit4]    > at org.apache.lucene.facet.TestDrillSideways.testRandom(TestDrillSideways.java:794)
>   [junit4]    > at java.lang.Thread.run(Thread.java:745)
>   [junit4]   2> NOTE: test params are: codec=Asserting(Lucene62): {$full_path$=FST50, $facets=TestBloomFilteredLucenePostings(BloomFilteringPostingsFormat(Lucene50(blocksize=128))), field=Lucene50(blocksize=128), dim3=PostingsFormat(name=Memory doPackFST= false), dim2=Lucene50(blocksize=128), $payloads$=PostingsFormat(name=Memory doPackFST= false), dim1=FST50, dim0=TestBloomFilteredLucenePostings(BloomFilteringPostingsFormat(Lucene50(blocksize=128))), id=PostingsFormat(name=Memory doPackFST= false), content=FST50}, docValues:{$facets=DocValuesFormat(name=Memory), dim3=DocValuesFormat(name=Lucene54), dim2=DocValuesFormat(name=Asserting), dim1=DocValuesFormat(name=Lucene54), dim0=DocValuesFormat(name=Memory), id=DocValuesFormat(name=Lucene54), content=DocValuesFormat(name=Lucene54)}, maxPointsInLeafNode=457, maxMBSortInHeap=5.522053107522147, sim=RandomSimilarity(queryNorm=true,coord=no): {foobar=IB SPL-L3(800.0), field=IB SPL-L2, content=DFR I(F)BZ(0.3)}, locale=be-BY, timezone=Etc/Zulu
>   [junit4]   2> NOTE: Linux 4.4.0-53-generic amd64/Oracle Corporation 1.8.0_121 (64-bit)/cpus=12,threads=1,free=461698360,total=508887040
>   [junit4]   2> NOTE: All tests run in this JVM: [TestRangeFacetCounts, TestSearcherTaxonomyManager, TestTaxonomyFacetCounts2, TestDrillSideways]
>   [junit4] Completed [19/25 (2!)] on J1 in 2.02s, 6 tests, 1 failure <<< FAILURES!
>
> [...truncated 598 lines...]
>   [junit4] Suite: org.apache.lucene.search.join.TestBlockJoin
>   [junit4]   2> NOTE: reproduce with: ant test  -Dtestcase=TestBlockJoin -Dtests.method=testSimple -Dtests.seed=CA83BCDFD8F27072 -Dtests.multiplier=3 -Dtests.slow=true -Dtests.locale=ms -Dtests.timezone=Asia/Kuching -Dtests.asserts=true -Dtests.file.encoding=ISO-8859-1
>   [junit4] FAILURE 0.13s J0 | TestBlockJoin.testSimple <<<
>   [junit4]    > Throwable #1: java.lang.AssertionError
>   [junit4]    > at __randomizedtesting.SeedInfo.seed([CA83BCDFD8F27072:F2309821FF01A4A3]:0)
>   [junit4]    > at org.apache.lucene.search.AssertingScorer.getChildren(AssertingScorer.java:81)
>   [junit4]    > at org.apache.lucene.search.join.ToParentBlockJoinCollector$1.setScorer(ToParentBlockJoinCollector.java:190)
>   [junit4]    > at org.apache.lucene.search.FilterLeafCollector.setScorer(FilterLeafCollector.java:38)
>   [junit4]    > at org.apache.lucene.search.AssertingLeafCollector.setScorer(AssertingLeafCollector.java:43)
>   [junit4]    > at org.apache.lucene.search.FilterLeafCollector.setScorer(FilterLeafCollector.java:38)
>   [junit4]    > at org.apache.lucene.search.AssertingLeafCollector.setScorer(AssertingLeafCollector.java:43)
>   [junit4]    > at org.apache.lucene.search.FilterLeafCollector.setScorer(FilterLeafCollector.java:38)
>   [junit4]    > at org.apache.lucene.search.AssertingLeafCollector.setScorer(AssertingLeafCollector.java:43)
>   [junit4]    > at org.apache.lucene.search.Weight$DefaultBulkScorer.score(Weight.java:195)
>   [junit4]    > at org.apache.lucene.search.AssertingBulkScorer.score(AssertingBulkScorer.java:79)
>   [junit4]    > at org.apache.lucene.search.AssertingBulkScorer.score(AssertingBulkScorer.java:63)
>   [junit4]    > at org.apache.lucene.search.IndexSearcher.search(IndexSearcher.java:669)
>   [junit4]    > at org.apache.lucene.search.AssertingIndexSearcher.search(AssertingIndexSearcher.java:91)
>   [junit4]    > at org.apache.lucene.search.IndexSearcher.search(IndexSearcher.java:473)
>   [junit4]    > at org.apache.lucene.search.join.TestBlockJoin.testSimple(TestBlockJoin.java:304)
>   [junit4]    > at java.lang.Thread.run(Thread.java:745)
>   [junit4]   2> NOTE: reproduce with: ant test  -Dtestcase=TestBlockJoin -Dtests.method=testMultiChildTypes -Dtests.seed=CA83BCDFD8F27072 -Dtests.multiplier=3 -Dtests.slow=true -Dtests.locale=ms -Dtests.timezone=Asia/Kuching -Dtests.asserts=true -Dtests.file.encoding=ISO-8859-1
>   [junit4] FAILURE 0.04s J0 | TestBlockJoin.testMultiChildTypes <<<
>   [junit4]    > Throwable #1: java.lang.AssertionError
>   [junit4]    > at __randomizedtesting.SeedInfo.seed([CA83BCDFD8F27072:5E14BFF5D3770BB1]:0)
>   [junit4]    > at org.apache.lucene.search.AssertingScorer.getChildren(AssertingScorer.java:81)
>   [junit4]    > at org.apache.lucene.search.join.ToParentBlockJoinCollector$1.setScorer(ToParentBlockJoinCollector.java:190)
>   [junit4]    > at org.apache.lucene.search.FilterLeafCollector.setScorer(FilterLeafCollector.java:38)
>   [junit4]    > at org.apache.lucene.search.AssertingLeafCollector.setScorer(AssertingLeafCollector.java:43)
>   [junit4]    > at org.apache.lucene.search.FilterLeafCollector.setScorer(FilterLeafCollector.java:38)
>   [junit4]    > at org.apache.lucene.search.AssertingLeafCollector.setScorer(AssertingLeafCollector.java:43)
>   [junit4]    > at org.apache.lucene.search.FilterLeafCollector.setScorer(FilterLeafCollector.java:38)
>   [junit4]    > at org.apache.lucene.search.AssertingLeafCollector.setScorer(AssertingLeafCollector.java:43)
>   [junit4]    > at org.apache.lucene.search.Weight$DefaultBulkScorer.score(Weight.java:195)
>   [junit4]    > at org.apache.lucene.search.AssertingBulkScorer.score(AssertingBulkScorer.java:79)
>   [junit4]    > at org.apache.lucene.search.AssertingBulkScorer.score(AssertingBulkScorer.java:63)
>   [junit4]    > at org.apache.lucene.search.IndexSearcher.search(IndexSearcher.java:669)
>   [junit4]    > at org.apache.lucene.search.AssertingIndexSearcher.search(AssertingIndexSearcher.java:91)
>   [junit4]    > at org.apache.lucene.search.IndexSearcher.search(IndexSearcher.java:473)
>   [junit4]    > at org.apache.lucene.search.join.TestBlockJoin.testMultiChildTypes(TestBlockJoin.java:1207)
>   [junit4]    > at java.lang.Thread.run(Thread.java:745)
>   [junit4]   2> NOTE: reproduce with: ant test  -Dtestcase=TestBlockJoin -Dtests.method=testBugCausedByRewritingTwice -Dtests.seed=CA83BCDFD8F27072 -Dtests.multiplier=3 -Dtests.slow=true -Dtests.locale=ms -Dtests.timezone=Asia/Kuching -Dtests.asserts=true -Dtests.file.encoding=ISO-8859-1
>   [junit4] FAILURE 0.01s J0 | TestBlockJoin.testBugCausedByRewritingTwice <<<
>   [junit4]    > Throwable #1: java.lang.AssertionError
>   [junit4]    > at __randomizedtesting.SeedInfo.seed([CA83BCDFD8F27072:35FF6C7453CDAC0B]:0)
>   [junit4]    > at org.apache.lucene.search.AssertingScorer.getChildren(AssertingScorer.java:81)
>   [junit4]    > at org.apache.lucene.search.join.ToParentBlockJoinCollector$1.setScorer(ToParentBlockJoinCollector.java:190)
>   [junit4]    > at org.apache.lucene.search.FilterLeafCollector.setScorer(FilterLeafCollector.java:38)
>   [junit4]    > at org.apache.lucene.search.AssertingLeafCollector.setScorer(AssertingLeafCollector.java:43)
>   [junit4]    > at org.apache.lucene.search.FilterLeafCollector.setScorer(FilterLeafCollector.java:38)
>   [junit4]    > at org.apache.lucene.search.AssertingLeafCollector.setScorer(AssertingLeafCollector.java:43)
>   [junit4]    > at org.apache.lucene.search.Weight$DefaultBulkScorer.score(Weight.java:195)
>   [junit4]    > at org.apache.lucene.search.BulkScorer.score(BulkScorer.java:39)
>   [junit4]    > at org.apache.lucene.search.AssertingBulkScorer.score(AssertingBulkScorer.java:69)
>   [junit4]    > at org.apache.lucene.search.IndexSearcher.search(IndexSearcher.java:669)
>   [junit4]    > at org.apache.lucene.search.AssertingIndexSearcher.search(AssertingIndexSearcher.java:91)
>   [junit4]    > at org.apache.lucene.search.IndexSearcher.search(IndexSearcher.java:473)
>   [junit4]    > at org.apache.lucene.search.join.TestBlockJoin.testBugCausedByRewritingTwice(TestBlockJoin.java:406)
>   [junit4]    > at java.lang.Thread.run(Thread.java:745)
>   [junit4]   2> NOTE: test params are: codec=Lucene62, sim=RandomSimilarity(queryNorm=false,coord=yes): {country=IB LL-DZ(0.3), qualification=DFR I(F)1, parent=DFR I(ne)LZ(0.3), skill=BM25(k1=1.2,b=0.75), childText=DFI(ChiSquared), parentText=DFR I(F)3(800.0), child=IB LL-D2}, locale=ms, timezone=Asia/Kuching
>   [junit4]   2> NOTE: Linux 4.4.0-53-generic amd64/Oracle Corporation 1.8.0_121 (64-bit)/cpus=12,threads=1,free=398408728,total=508887040
>   [junit4]   2> NOTE: All tests run in this JVM: [TestCheckJoinIndex, TestBlockJoinSelector, TestBlockJoin]
>   [junit4] Completed [6/6 (1!)] on J0 in 24.66s, 21 tests, 3 failures <<< FAILURES!
>
> [...truncated 68097 lines...]



---------------------------------------------------------------------
To unsubscribe, e-mail: [hidden email]
For additional commands, e-mail: [hidden email]