[JENKINS] Lucene-Solr-8.x-Linux (64bit/jdk-12.0.1) - Build # 1092 - Unstable!

classic Classic list List threaded Threaded
1 message Options
Reply | Threaded
Open this post in threaded view
|

[JENKINS] Lucene-Solr-8.x-Linux (64bit/jdk-12.0.1) - Build # 1092 - Unstable!

Policeman Jenkins Server-2
Build: https://jenkins.thetaphi.de/job/Lucene-Solr-8.x-Linux/1092/
Java: 64bit/jdk-12.0.1 -XX:+UseCompressedOops -XX:+UseParallelGC

4 tests failed.
FAILED:  org.apache.lucene.index.TestTieredMergePolicy.testSimulateUpdates

Error Message:
numSegments=79, allowed=78.0

Stack Trace:
java.lang.AssertionError: numSegments=79, allowed=78.0
        at __randomizedtesting.SeedInfo.seed([E38D9351539C415B:6D6D0864885C2DA3]:0)
        at org.junit.Assert.fail(Assert.java:88)
        at org.junit.Assert.assertTrue(Assert.java:41)
        at org.apache.lucene.index.TestTieredMergePolicy.assertSegmentInfos(TestTieredMergePolicy.java:88)
        at org.apache.lucene.index.BaseMergePolicyTestCase.doTestSimulateUpdates(BaseMergePolicyTestCase.java:422)
        at org.apache.lucene.index.TestTieredMergePolicy.testSimulateUpdates(TestTieredMergePolicy.java:718)
        at java.base/jdk.internal.reflect.NativeMethodAccessorImpl.invoke0(Native Method)
        at java.base/jdk.internal.reflect.NativeMethodAccessorImpl.invoke(NativeMethodAccessorImpl.java:62)
        at java.base/jdk.internal.reflect.DelegatingMethodAccessorImpl.invoke(DelegatingMethodAccessorImpl.java:43)
        at java.base/java.lang.reflect.Method.invoke(Method.java:567)
        at com.carrotsearch.randomizedtesting.RandomizedRunner.invoke(RandomizedRunner.java:1750)
        at com.carrotsearch.randomizedtesting.RandomizedRunner$8.evaluate(RandomizedRunner.java:938)
        at com.carrotsearch.randomizedtesting.RandomizedRunner$9.evaluate(RandomizedRunner.java:974)
        at com.carrotsearch.randomizedtesting.RandomizedRunner$10.evaluate(RandomizedRunner.java:988)
        at org.apache.lucene.util.TestRuleSetupTeardownChained$1.evaluate(TestRuleSetupTeardownChained.java:49)
        at org.apache.lucene.util.AbstractBeforeAfterRule$1.evaluate(AbstractBeforeAfterRule.java:45)
        at org.apache.lucene.util.TestRuleThreadAndTestName$1.evaluate(TestRuleThreadAndTestName.java:48)
        at org.apache.lucene.util.TestRuleIgnoreAfterMaxFailures$1.evaluate(TestRuleIgnoreAfterMaxFailures.java:64)
        at org.apache.lucene.util.TestRuleMarkFailure$1.evaluate(TestRuleMarkFailure.java:47)
        at com.carrotsearch.randomizedtesting.rules.StatementAdapter.evaluate(StatementAdapter.java:36)
        at com.carrotsearch.randomizedtesting.ThreadLeakControl$StatementRunner.run(ThreadLeakControl.java:368)
        at com.carrotsearch.randomizedtesting.ThreadLeakControl.forkTimeoutingTask(ThreadLeakControl.java:817)
        at com.carrotsearch.randomizedtesting.ThreadLeakControl$3.evaluate(ThreadLeakControl.java:468)
        at com.carrotsearch.randomizedtesting.RandomizedRunner.runSingleTest(RandomizedRunner.java:947)
        at com.carrotsearch.randomizedtesting.RandomizedRunner$5.evaluate(RandomizedRunner.java:832)
        at com.carrotsearch.randomizedtesting.RandomizedRunner$6.evaluate(RandomizedRunner.java:883)
        at com.carrotsearch.randomizedtesting.RandomizedRunner$7.evaluate(RandomizedRunner.java:894)
        at org.apache.lucene.util.AbstractBeforeAfterRule$1.evaluate(AbstractBeforeAfterRule.java:45)
        at com.carrotsearch.randomizedtesting.rules.StatementAdapter.evaluate(StatementAdapter.java:36)
        at org.apache.lucene.util.TestRuleStoreClassName$1.evaluate(TestRuleStoreClassName.java:41)
        at com.carrotsearch.randomizedtesting.rules.NoShadowingOrOverridesOnMethodsRule$1.evaluate(NoShadowingOrOverridesOnMethodsRule.java:40)
        at com.carrotsearch.randomizedtesting.rules.NoShadowingOrOverridesOnMethodsRule$1.evaluate(NoShadowingOrOverridesOnMethodsRule.java:40)
        at com.carrotsearch.randomizedtesting.rules.StatementAdapter.evaluate(StatementAdapter.java:36)
        at com.carrotsearch.randomizedtesting.rules.StatementAdapter.evaluate(StatementAdapter.java:36)
        at org.apache.lucene.util.TestRuleAssertionsRequired$1.evaluate(TestRuleAssertionsRequired.java:53)
        at org.apache.lucene.util.TestRuleMarkFailure$1.evaluate(TestRuleMarkFailure.java:47)
        at org.apache.lucene.util.TestRuleIgnoreAfterMaxFailures$1.evaluate(TestRuleIgnoreAfterMaxFailures.java:64)
        at org.apache.lucene.util.TestRuleIgnoreTestSuites$1.evaluate(TestRuleIgnoreTestSuites.java:54)
        at com.carrotsearch.randomizedtesting.rules.StatementAdapter.evaluate(StatementAdapter.java:36)
        at com.carrotsearch.randomizedtesting.ThreadLeakControl$StatementRunner.run(ThreadLeakControl.java:368)
        at java.base/java.lang.Thread.run(Thread.java:835)


FAILED:  org.apache.lucene.index.TestTieredMergePolicy.testSimulateUpdates

Error Message:
numSegments=79, allowed=78.0

Stack Trace:
java.lang.AssertionError: numSegments=79, allowed=78.0
        at __randomizedtesting.SeedInfo.seed([E38D9351539C415B:6D6D0864885C2DA3]:0)
        at org.junit.Assert.fail(Assert.java:88)
        at org.junit.Assert.assertTrue(Assert.java:41)
        at org.apache.lucene.index.TestTieredMergePolicy.assertSegmentInfos(TestTieredMergePolicy.java:88)
        at org.apache.lucene.index.BaseMergePolicyTestCase.doTestSimulateUpdates(BaseMergePolicyTestCase.java:422)
        at org.apache.lucene.index.TestTieredMergePolicy.testSimulateUpdates(TestTieredMergePolicy.java:718)
        at java.base/jdk.internal.reflect.NativeMethodAccessorImpl.invoke0(Native Method)
        at java.base/jdk.internal.reflect.NativeMethodAccessorImpl.invoke(NativeMethodAccessorImpl.java:62)
        at java.base/jdk.internal.reflect.DelegatingMethodAccessorImpl.invoke(DelegatingMethodAccessorImpl.java:43)
        at java.base/java.lang.reflect.Method.invoke(Method.java:567)
        at com.carrotsearch.randomizedtesting.RandomizedRunner.invoke(RandomizedRunner.java:1750)
        at com.carrotsearch.randomizedtesting.RandomizedRunner$8.evaluate(RandomizedRunner.java:938)
        at com.carrotsearch.randomizedtesting.RandomizedRunner$9.evaluate(RandomizedRunner.java:974)
        at com.carrotsearch.randomizedtesting.RandomizedRunner$10.evaluate(RandomizedRunner.java:988)
        at org.apache.lucene.util.TestRuleSetupTeardownChained$1.evaluate(TestRuleSetupTeardownChained.java:49)
        at org.apache.lucene.util.AbstractBeforeAfterRule$1.evaluate(AbstractBeforeAfterRule.java:45)
        at org.apache.lucene.util.TestRuleThreadAndTestName$1.evaluate(TestRuleThreadAndTestName.java:48)
        at org.apache.lucene.util.TestRuleIgnoreAfterMaxFailures$1.evaluate(TestRuleIgnoreAfterMaxFailures.java:64)
        at org.apache.lucene.util.TestRuleMarkFailure$1.evaluate(TestRuleMarkFailure.java:47)
        at com.carrotsearch.randomizedtesting.rules.StatementAdapter.evaluate(StatementAdapter.java:36)
        at com.carrotsearch.randomizedtesting.ThreadLeakControl$StatementRunner.run(ThreadLeakControl.java:368)
        at com.carrotsearch.randomizedtesting.ThreadLeakControl.forkTimeoutingTask(ThreadLeakControl.java:817)
        at com.carrotsearch.randomizedtesting.ThreadLeakControl$3.evaluate(ThreadLeakControl.java:468)
        at com.carrotsearch.randomizedtesting.RandomizedRunner.runSingleTest(RandomizedRunner.java:947)
        at com.carrotsearch.randomizedtesting.RandomizedRunner$5.evaluate(RandomizedRunner.java:832)
        at com.carrotsearch.randomizedtesting.RandomizedRunner$6.evaluate(RandomizedRunner.java:883)
        at com.carrotsearch.randomizedtesting.RandomizedRunner$7.evaluate(RandomizedRunner.java:894)
        at org.apache.lucene.util.AbstractBeforeAfterRule$1.evaluate(AbstractBeforeAfterRule.java:45)
        at com.carrotsearch.randomizedtesting.rules.StatementAdapter.evaluate(StatementAdapter.java:36)
        at org.apache.lucene.util.TestRuleStoreClassName$1.evaluate(TestRuleStoreClassName.java:41)
        at com.carrotsearch.randomizedtesting.rules.NoShadowingOrOverridesOnMethodsRule$1.evaluate(NoShadowingOrOverridesOnMethodsRule.java:40)
        at com.carrotsearch.randomizedtesting.rules.NoShadowingOrOverridesOnMethodsRule$1.evaluate(NoShadowingOrOverridesOnMethodsRule.java:40)
        at com.carrotsearch.randomizedtesting.rules.StatementAdapter.evaluate(StatementAdapter.java:36)
        at com.carrotsearch.randomizedtesting.rules.StatementAdapter.evaluate(StatementAdapter.java:36)
        at org.apache.lucene.util.TestRuleAssertionsRequired$1.evaluate(TestRuleAssertionsRequired.java:53)
        at org.apache.lucene.util.TestRuleMarkFailure$1.evaluate(TestRuleMarkFailure.java:47)
        at org.apache.lucene.util.TestRuleIgnoreAfterMaxFailures$1.evaluate(TestRuleIgnoreAfterMaxFailures.java:64)
        at org.apache.lucene.util.TestRuleIgnoreTestSuites$1.evaluate(TestRuleIgnoreTestSuites.java:54)
        at com.carrotsearch.randomizedtesting.rules.StatementAdapter.evaluate(StatementAdapter.java:36)
        at com.carrotsearch.randomizedtesting.ThreadLeakControl$StatementRunner.run(ThreadLeakControl.java:368)
        at java.base/java.lang.Thread.run(Thread.java:835)


FAILED:  org.apache.lucene.index.TestTieredMergePolicy.testSimulateUpdates

Error Message:
numSegments=79, allowed=78.0

Stack Trace:
java.lang.AssertionError: numSegments=79, allowed=78.0
        at __randomizedtesting.SeedInfo.seed([E38D9351539C415B:6D6D0864885C2DA3]:0)
        at org.junit.Assert.fail(Assert.java:88)
        at org.junit.Assert.assertTrue(Assert.java:41)
        at org.apache.lucene.index.TestTieredMergePolicy.assertSegmentInfos(TestTieredMergePolicy.java:88)
        at org.apache.lucene.index.BaseMergePolicyTestCase.doTestSimulateUpdates(BaseMergePolicyTestCase.java:422)
        at org.apache.lucene.index.TestTieredMergePolicy.testSimulateUpdates(TestTieredMergePolicy.java:718)
        at java.base/jdk.internal.reflect.NativeMethodAccessorImpl.invoke0(Native Method)
        at java.base/jdk.internal.reflect.NativeMethodAccessorImpl.invoke(NativeMethodAccessorImpl.java:62)
        at java.base/jdk.internal.reflect.DelegatingMethodAccessorImpl.invoke(DelegatingMethodAccessorImpl.java:43)
        at java.base/java.lang.reflect.Method.invoke(Method.java:567)
        at com.carrotsearch.randomizedtesting.RandomizedRunner.invoke(RandomizedRunner.java:1750)
        at com.carrotsearch.randomizedtesting.RandomizedRunner$8.evaluate(RandomizedRunner.java:938)
        at com.carrotsearch.randomizedtesting.RandomizedRunner$9.evaluate(RandomizedRunner.java:974)
        at com.carrotsearch.randomizedtesting.RandomizedRunner$10.evaluate(RandomizedRunner.java:988)
        at org.apache.lucene.util.TestRuleSetupTeardownChained$1.evaluate(TestRuleSetupTeardownChained.java:49)
        at org.apache.lucene.util.AbstractBeforeAfterRule$1.evaluate(AbstractBeforeAfterRule.java:45)
        at org.apache.lucene.util.TestRuleThreadAndTestName$1.evaluate(TestRuleThreadAndTestName.java:48)
        at org.apache.lucene.util.TestRuleIgnoreAfterMaxFailures$1.evaluate(TestRuleIgnoreAfterMaxFailures.java:64)
        at org.apache.lucene.util.TestRuleMarkFailure$1.evaluate(TestRuleMarkFailure.java:47)
        at com.carrotsearch.randomizedtesting.rules.StatementAdapter.evaluate(StatementAdapter.java:36)
        at com.carrotsearch.randomizedtesting.ThreadLeakControl$StatementRunner.run(ThreadLeakControl.java:368)
        at com.carrotsearch.randomizedtesting.ThreadLeakControl.forkTimeoutingTask(ThreadLeakControl.java:817)
        at com.carrotsearch.randomizedtesting.ThreadLeakControl$3.evaluate(ThreadLeakControl.java:468)
        at com.carrotsearch.randomizedtesting.RandomizedRunner.runSingleTest(RandomizedRunner.java:947)
        at com.carrotsearch.randomizedtesting.RandomizedRunner$5.evaluate(RandomizedRunner.java:832)
        at com.carrotsearch.randomizedtesting.RandomizedRunner$6.evaluate(RandomizedRunner.java:883)
        at com.carrotsearch.randomizedtesting.RandomizedRunner$7.evaluate(RandomizedRunner.java:894)
        at org.apache.lucene.util.AbstractBeforeAfterRule$1.evaluate(AbstractBeforeAfterRule.java:45)
        at com.carrotsearch.randomizedtesting.rules.StatementAdapter.evaluate(StatementAdapter.java:36)
        at org.apache.lucene.util.TestRuleStoreClassName$1.evaluate(TestRuleStoreClassName.java:41)
        at com.carrotsearch.randomizedtesting.rules.NoShadowingOrOverridesOnMethodsRule$1.evaluate(NoShadowingOrOverridesOnMethodsRule.java:40)
        at com.carrotsearch.randomizedtesting.rules.NoShadowingOrOverridesOnMethodsRule$1.evaluate(NoShadowingOrOverridesOnMethodsRule.java:40)
        at com.carrotsearch.randomizedtesting.rules.StatementAdapter.evaluate(StatementAdapter.java:36)
        at com.carrotsearch.randomizedtesting.rules.StatementAdapter.evaluate(StatementAdapter.java:36)
        at org.apache.lucene.util.TestRuleAssertionsRequired$1.evaluate(TestRuleAssertionsRequired.java:53)
        at org.apache.lucene.util.TestRuleMarkFailure$1.evaluate(TestRuleMarkFailure.java:47)
        at org.apache.lucene.util.TestRuleIgnoreAfterMaxFailures$1.evaluate(TestRuleIgnoreAfterMaxFailures.java:64)
        at org.apache.lucene.util.TestRuleIgnoreTestSuites$1.evaluate(TestRuleIgnoreTestSuites.java:54)
        at com.carrotsearch.randomizedtesting.rules.StatementAdapter.evaluate(StatementAdapter.java:36)
        at com.carrotsearch.randomizedtesting.ThreadLeakControl$StatementRunner.run(ThreadLeakControl.java:368)
        at java.base/java.lang.Thread.run(Thread.java:835)


FAILED:  org.apache.lucene.index.TestTieredMergePolicy.testSimulateUpdates

Error Message:
numSegments=79, allowed=78.0

Stack Trace:
java.lang.AssertionError: numSegments=79, allowed=78.0
        at __randomizedtesting.SeedInfo.seed([E38D9351539C415B:6D6D0864885C2DA3]:0)
        at org.junit.Assert.fail(Assert.java:88)
        at org.junit.Assert.assertTrue(Assert.java:41)
        at org.apache.lucene.index.TestTieredMergePolicy.assertSegmentInfos(TestTieredMergePolicy.java:88)
        at org.apache.lucene.index.BaseMergePolicyTestCase.doTestSimulateUpdates(BaseMergePolicyTestCase.java:422)
        at org.apache.lucene.index.TestTieredMergePolicy.testSimulateUpdates(TestTieredMergePolicy.java:718)
        at java.base/jdk.internal.reflect.NativeMethodAccessorImpl.invoke0(Native Method)
        at java.base/jdk.internal.reflect.NativeMethodAccessorImpl.invoke(NativeMethodAccessorImpl.java:62)
        at java.base/jdk.internal.reflect.DelegatingMethodAccessorImpl.invoke(DelegatingMethodAccessorImpl.java:43)
        at java.base/java.lang.reflect.Method.invoke(Method.java:567)
        at com.carrotsearch.randomizedtesting.RandomizedRunner.invoke(RandomizedRunner.java:1750)
        at com.carrotsearch.randomizedtesting.RandomizedRunner$8.evaluate(RandomizedRunner.java:938)
        at com.carrotsearch.randomizedtesting.RandomizedRunner$9.evaluate(RandomizedRunner.java:974)
        at com.carrotsearch.randomizedtesting.RandomizedRunner$10.evaluate(RandomizedRunner.java:988)
        at org.apache.lucene.util.TestRuleSetupTeardownChained$1.evaluate(TestRuleSetupTeardownChained.java:49)
        at org.apache.lucene.util.AbstractBeforeAfterRule$1.evaluate(AbstractBeforeAfterRule.java:45)
        at org.apache.lucene.util.TestRuleThreadAndTestName$1.evaluate(TestRuleThreadAndTestName.java:48)
        at org.apache.lucene.util.TestRuleIgnoreAfterMaxFailures$1.evaluate(TestRuleIgnoreAfterMaxFailures.java:64)
        at org.apache.lucene.util.TestRuleMarkFailure$1.evaluate(TestRuleMarkFailure.java:47)
        at com.carrotsearch.randomizedtesting.rules.StatementAdapter.evaluate(StatementAdapter.java:36)
        at com.carrotsearch.randomizedtesting.ThreadLeakControl$StatementRunner.run(ThreadLeakControl.java:368)
        at com.carrotsearch.randomizedtesting.ThreadLeakControl.forkTimeoutingTask(ThreadLeakControl.java:817)
        at com.carrotsearch.randomizedtesting.ThreadLeakControl$3.evaluate(ThreadLeakControl.java:468)
        at com.carrotsearch.randomizedtesting.RandomizedRunner.runSingleTest(RandomizedRunner.java:947)
        at com.carrotsearch.randomizedtesting.RandomizedRunner$5.evaluate(RandomizedRunner.java:832)
        at com.carrotsearch.randomizedtesting.RandomizedRunner$6.evaluate(RandomizedRunner.java:883)
        at com.carrotsearch.randomizedtesting.RandomizedRunner$7.evaluate(RandomizedRunner.java:894)
        at org.apache.lucene.util.AbstractBeforeAfterRule$1.evaluate(AbstractBeforeAfterRule.java:45)
        at com.carrotsearch.randomizedtesting.rules.StatementAdapter.evaluate(StatementAdapter.java:36)
        at org.apache.lucene.util.TestRuleStoreClassName$1.evaluate(TestRuleStoreClassName.java:41)
        at com.carrotsearch.randomizedtesting.rules.NoShadowingOrOverridesOnMethodsRule$1.evaluate(NoShadowingOrOverridesOnMethodsRule.java:40)
        at com.carrotsearch.randomizedtesting.rules.NoShadowingOrOverridesOnMethodsRule$1.evaluate(NoShadowingOrOverridesOnMethodsRule.java:40)
        at com.carrotsearch.randomizedtesting.rules.StatementAdapter.evaluate(StatementAdapter.java:36)
        at com.carrotsearch.randomizedtesting.rules.StatementAdapter.evaluate(StatementAdapter.java:36)
        at org.apache.lucene.util.TestRuleAssertionsRequired$1.evaluate(TestRuleAssertionsRequired.java:53)
        at org.apache.lucene.util.TestRuleMarkFailure$1.evaluate(TestRuleMarkFailure.java:47)
        at org.apache.lucene.util.TestRuleIgnoreAfterMaxFailures$1.evaluate(TestRuleIgnoreAfterMaxFailures.java:64)
        at org.apache.lucene.util.TestRuleIgnoreTestSuites$1.evaluate(TestRuleIgnoreTestSuites.java:54)
        at com.carrotsearch.randomizedtesting.rules.StatementAdapter.evaluate(StatementAdapter.java:36)
        at com.carrotsearch.randomizedtesting.ThreadLeakControl$StatementRunner.run(ThreadLeakControl.java:368)
        at java.base/java.lang.Thread.run(Thread.java:835)




Build Log:
[...truncated 1226 lines...]
   [junit4] Suite: org.apache.lucene.index.TestTieredMergePolicy
   [junit4]   2> NOTE: reproduce with: ant test  -Dtestcase=TestTieredMergePolicy -Dtests.method=testSimulateUpdates -Dtests.seed=E38D9351539C415B -Dtests.multiplier=3 -Dtests.slow=true -Dtests.locale=kw -Dtests.timezone=Asia/Samarkand -Dtests.asserts=true -Dtests.file.encoding=ISO-8859-1
   [junit4] FAILURE 0.02s J0 | TestTieredMergePolicy.testSimulateUpdates <<<
   [junit4]    > Throwable #1: java.lang.AssertionError: numSegments=79, allowed=78.0
   [junit4]    > at __randomizedtesting.SeedInfo.seed([E38D9351539C415B:6D6D0864885C2DA3]:0)
   [junit4]    > at org.apache.lucene.index.TestTieredMergePolicy.assertSegmentInfos(TestTieredMergePolicy.java:88)
   [junit4]    > at org.apache.lucene.index.BaseMergePolicyTestCase.doTestSimulateUpdates(BaseMergePolicyTestCase.java:422)
   [junit4]    > at org.apache.lucene.index.TestTieredMergePolicy.testSimulateUpdates(TestTieredMergePolicy.java:718)
   [junit4]    > at java.base/jdk.internal.reflect.NativeMethodAccessorImpl.invoke0(Native Method)
   [junit4]    > at java.base/jdk.internal.reflect.NativeMethodAccessorImpl.invoke(NativeMethodAccessorImpl.java:62)
   [junit4]    > at java.base/jdk.internal.reflect.DelegatingMethodAccessorImpl.invoke(DelegatingMethodAccessorImpl.java:43)
   [junit4]    > at java.base/java.lang.reflect.Method.invoke(Method.java:567)
   [junit4]    > at java.base/java.lang.Thread.run(Thread.java:835)
   [junit4]   2> NOTE: test params are: codec=Asserting(Lucene80): {id=PostingsFormat(name=Asserting), content=TestBloomFilteredLucenePostings(BloomFilteringPostingsFormat(Lucene50(blocksize=128)))}, docValues:{}, maxPointsInLeafNode=1101, maxMBSortInHeap=6.629484954943912, sim=Asserting(org.apache.lucene.search.similarities.AssertingSimilarity@5e1c5790), locale=kw, timezone=Asia/Samarkand
   [junit4]   2> NOTE: Linux 5.0.0-23-generic amd64/AdoptOpenJDK 12.0.1 (64-bit)/cpus=8,threads=1,free=302059176,total=454033408
   [junit4]   2> NOTE: All tests run in this JVM: [TestIndexWriter, TestSloppyMath, TestSpanSearchEquivalence, TestBinaryDocValuesUpdates, TestMultiCollector, TestPositiveScoresOnlyCollector, TestLongRange, TestLockFactory, TestCrashCausesCorruptIndex, TestAxiomaticF3EXP, TestTermsEnum, TestDocsWithFieldSet, TestSegmentTermDocs, TestDelegatingAnalyzerWrapper, TestIndependenceChiSquared, TestBooleanQueryVisitSubscorers, TestSpanCollection, TestLatLonPointDistanceFeatureQuery, TestIndexWriterMerging, TestSortedSetSortField, TestFieldInvertState, TestFlushByRamOrCountsPolicy, TestIndexWriterExceptions2, TestTotalHits, TestSPIClassIterator, TestPerSegmentDeletes, TestAnalyzerWrapper, TestFutureArrays, TestDirectoryReaderReopen, TestSparseFixedBitSet, TestBytesRefArray, TestFilterDirectory, TestDocIDMerger, TestSnapshotDeletionPolicy, TestSegmentInfos, TestInPlaceMergeSorter, TestTermStates, TestClassicSimilarity, TestSpansEnum, TestLucene80NormsFormat, TestConstantScoreQuery, TestReaderClosed, Test2BBKDPoints, TestNorms, TestFstDirect, TestFilterLeafReader, TestIndexWriterReader, TestLatLonPointQueries, TestFeatureDoubleValues, TestSpanExplanationsOfNonMatches, TestMathUtil, TestTransactions, TestEarlyTermination, TestNormsFieldExistsQuery, TestRegexpRandom2, Test2BSortedDocValuesFixedSorted, TestCharArraySet, TestPolygon, TestDocValuesFieldUpdates, TestAutomatonQuery, TestPagedBytes, TestFixedBitSet, TestMatchesIterator, TestSimpleFSLockFactory, TestByteArrayDataInput, TestRollback, TestInfoStream, TestFrozenBufferedUpdates, TestSortRescorer, TestDirectMonotonic, TestFieldValueQuery, FiniteStringsIteratorTest, TestMultiTermsEnum, TestMergeSchedulerExternal, TestMultiTermConstantScore, TestOrdinalMap, TestTieredMergePolicy]
   [junit4] Completed [272/525 (1!)] on J0 in 5.77s, 14 tests, 1 failure <<< FAILURES!

[...truncated 59642 lines...]
[repro] Jenkins log URL: https://jenkins.thetaphi.de/job/Lucene-Solr-8.x-Linux/1092/consoleText

[repro] Revision: 8459fde68e1a5d96c745ff528ed5cbb3921900f4

[repro] Ant options: "-Dargs=-XX:+UseCompressedOops -XX:+UseParallelGC"
[repro] Repro line:  ant test  -Dtestcase=TestTieredMergePolicy -Dtests.method=testSimulateUpdates -Dtests.seed=E38D9351539C415B -Dtests.multiplier=3 -Dtests.slow=true -Dtests.locale=kw -Dtests.timezone=Asia/Samarkand -Dtests.asserts=true -Dtests.file.encoding=ISO-8859-1

[repro] ant clean

[...truncated 6 lines...]
[repro] Test suites by module:
[repro]    lucene/core
[repro]       TestTieredMergePolicy
[repro] ant compile-test

[...truncated 213 lines...]
[repro] ant test-nocompile -Dtests.dups=5 -Dtests.maxfailures=5 -Dtests.class="*.TestTieredMergePolicy" -Dtests.showOutput=onerror "-Dargs=-XX:+UseCompressedOops -XX:+UseParallelGC" -Dtests.seed=E38D9351539C415B -Dtests.multiplier=3 -Dtests.slow=true -Dtests.locale=kw -Dtests.timezone=Asia/Samarkand -Dtests.asserts=true -Dtests.file.encoding=ISO-8859-1

[...truncated 32 lines...]
   [junit4] Suite: org.apache.lucene.index.TestTieredMergePolicy
   [junit4] OK      0.07s J2 | TestTieredMergePolicy.testManyMaxSizeSegments
   [junit4] OK      0.11s J2 | TestTieredMergePolicy.testForcedMergeWithPending
   [junit4] OK      0.35s J2 | TestTieredMergePolicy.testForceMergeNotNeeded
   [junit4] OK      1.57s J2 | TestTieredMergePolicy.testSimulateAppendOnly
   [junit4] OK      3.93s J2 | TestTieredMergePolicy.testForcedMergesRespectSegSize
   [junit4] OK      3.98s J2 | TestTieredMergePolicy.testPartialMerge
   [junit4] OK      2.34s J2 | TestTieredMergePolicy.testUnbalancedMergeSelection
   [junit4] OK      0.07s J2 | TestTieredMergePolicy.testForceMergeDeletes
   [junit4] OK      0.01s J2 | TestTieredMergePolicy.testFindForcedDeletesMerges
   [junit4] OK      0.06s J2 | TestTieredMergePolicy.testForceMergeDeletesMaxSegSize
   [junit4]   2> NOTE: reproduce with: ant test  -Dtestcase=TestTieredMergePolicy -Dtests.method=testSimulateUpdates -Dtests.seed=E38D9351539C415B -Dtests.multiplier=3 -Dtests.slow=true -Dtests.badapples=true -Dtests.locale=kw -Dtests.timezone=Asia/Samarkand -Dtests.asserts=true -Dtests.file.encoding=ISO-8859-1
   [junit4] FAILURE 0.05s J2 | TestTieredMergePolicy.testSimulateUpdates <<<
   [junit4]    > Throwable #1: java.lang.AssertionError: numSegments=79, allowed=78.0
   [junit4]    > at __randomizedtesting.SeedInfo.seed([E38D9351539C415B:6D6D0864885C2DA3]:0)
   [junit4]    > at org.apache.lucene.index.TestTieredMergePolicy.assertSegmentInfos(TestTieredMergePolicy.java:88)
   [junit4]    > at org.apache.lucene.index.BaseMergePolicyTestCase.doTestSimulateUpdates(BaseMergePolicyTestCase.java:422)
   [junit4]    > at org.apache.lucene.index.TestTieredMergePolicy.testSimulateUpdates(TestTieredMergePolicy.java:718)
   [junit4]    > at java.base/jdk.internal.reflect.NativeMethodAccessorImpl.invoke0(Native Method)
   [junit4]    > at java.base/jdk.internal.reflect.NativeMethodAccessorImpl.invoke(NativeMethodAccessorImpl.java:62)
   [junit4]    > at java.base/jdk.internal.reflect.DelegatingMethodAccessorImpl.invoke(DelegatingMethodAccessorImpl.java:43)
   [junit4]    > at java.base/java.lang.reflect.Method.invoke(Method.java:567)
   [junit4]    > at java.base/java.lang.Thread.run(Thread.java:835)
   [junit4] OK      0.01s J2 | TestTieredMergePolicy.testForcedMergesUseLeastNumberOfMerges
   [junit4] OK      0.01s J2 | TestTieredMergePolicy.testSetters
   [junit4] OK      0.00s J2 | TestTieredMergePolicy.testMergePurelyToReclaimDeletes
   [junit4]   2> NOTE: test params are: codec=Asserting(Lucene80): {id=PostingsFormat(name=Asserting), content=TestBloomFilteredLucenePostings(BloomFilteringPostingsFormat(Lucene50(blocksize=128)))}, docValues:{}, maxPointsInLeafNode=1101, maxMBSortInHeap=6.629484954943912, sim=Asserting(org.apache.lucene.search.similarities.AssertingSimilarity@1df23cf9), locale=kw, timezone=Asia/Samarkand
   [junit4]   2> NOTE: Linux 5.0.0-23-generic amd64/AdoptOpenJDK 12.0.1 (64-bit)/cpus=8,threads=1,free=427284392,total=519045120
   [junit4]   2> NOTE: All tests run in this JVM: [TestTieredMergePolicy]
   [junit4] Completed [1/5 (1!)] on J2 in 13.24s, 14 tests, 1 failure <<< FAILURES!

[...truncated 1 lines...]
   [junit4] Suite: org.apache.lucene.index.TestTieredMergePolicy
   [junit4] OK      0.06s J0 | TestTieredMergePolicy.testManyMaxSizeSegments
   [junit4] OK      0.10s J0 | TestTieredMergePolicy.testForcedMergeWithPending
   [junit4] OK      0.38s J0 | TestTieredMergePolicy.testForceMergeNotNeeded
   [junit4] OK      1.61s J0 | TestTieredMergePolicy.testSimulateAppendOnly
   [junit4] OK      3.58s J0 | TestTieredMergePolicy.testForcedMergesRespectSegSize
   [junit4] OK      3.65s J0 | TestTieredMergePolicy.testPartialMerge
   [junit4] OK      3.40s J0 | TestTieredMergePolicy.testUnbalancedMergeSelection
   [junit4] OK      0.04s J0 | TestTieredMergePolicy.testForceMergeDeletes
   [junit4] OK      0.01s J0 | TestTieredMergePolicy.testFindForcedDeletesMerges
   [junit4] OK      0.03s J0 | TestTieredMergePolicy.testForceMergeDeletesMaxSegSize
   [junit4]   2> NOTE: reproduce with: ant test  -Dtestcase=TestTieredMergePolicy -Dtests.method=testSimulateUpdates -Dtests.seed=E38D9351539C415B -Dtests.multiplier=3 -Dtests.slow=true -Dtests.badapples=true -Dtests.locale=kw -Dtests.timezone=Asia/Samarkand -Dtests.asserts=true -Dtests.file.encoding=ISO-8859-1
   [junit4] FAILURE 0.03s J0 | TestTieredMergePolicy.testSimulateUpdates <<<
   [junit4]    > Throwable #1: java.lang.AssertionError: numSegments=79, allowed=78.0
   [junit4]    > at __randomizedtesting.SeedInfo.seed([E38D9351539C415B:6D6D0864885C2DA3]:0)
   [junit4]    > at org.apache.lucene.index.TestTieredMergePolicy.assertSegmentInfos(TestTieredMergePolicy.java:88)
   [junit4]    > at org.apache.lucene.index.BaseMergePolicyTestCase.doTestSimulateUpdates(BaseMergePolicyTestCase.java:422)
   [junit4]    > at org.apache.lucene.index.TestTieredMergePolicy.testSimulateUpdates(TestTieredMergePolicy.java:718)
   [junit4]    > at java.base/jdk.internal.reflect.NativeMethodAccessorImpl.invoke0(Native Method)
   [junit4]    > at java.base/jdk.internal.reflect.NativeMethodAccessorImpl.invoke(NativeMethodAccessorImpl.java:62)
   [junit4]    > at java.base/jdk.internal.reflect.DelegatingMethodAccessorImpl.invoke(DelegatingMethodAccessorImpl.java:43)
   [junit4]    > at java.base/java.lang.reflect.Method.invoke(Method.java:567)
   [junit4]    > at java.base/java.lang.Thread.run(Thread.java:835)
   [junit4] OK      0.01s J0 | TestTieredMergePolicy.testForcedMergesUseLeastNumberOfMerges
   [junit4] OK      0.00s J0 | TestTieredMergePolicy.testSetters
   [junit4] OK      0.00s J0 | TestTieredMergePolicy.testMergePurelyToReclaimDeletes
   [junit4]   2> NOTE: test params are: codec=Asserting(Lucene80): {id=PostingsFormat(name=Asserting), content=TestBloomFilteredLucenePostings(BloomFilteringPostingsFormat(Lucene50(blocksize=128)))}, docValues:{}, maxPointsInLeafNode=1101, maxMBSortInHeap=6.629484954943912, sim=Asserting(org.apache.lucene.search.similarities.AssertingSimilarity@6b9c5ed), locale=kw, timezone=Asia/Samarkand
   [junit4]   2> NOTE: Linux 5.0.0-23-generic amd64/AdoptOpenJDK 12.0.1 (64-bit)/cpus=8,threads=1,free=503328752,total=519569408
   [junit4]   2> NOTE: All tests run in this JVM: [TestTieredMergePolicy]
   [junit4] Completed [2/5 (2!)] on J0 in 13.49s, 14 tests, 1 failure <<< FAILURES!

[...truncated 1 lines...]
   [junit4] Suite: org.apache.lucene.index.TestTieredMergePolicy
   [junit4] OK      0.06s J1 | TestTieredMergePolicy.testManyMaxSizeSegments
   [junit4] OK      0.10s J1 | TestTieredMergePolicy.testForcedMergeWithPending
   [junit4] OK      0.27s J1 | TestTieredMergePolicy.testForceMergeNotNeeded
   [junit4] OK      1.59s J1 | TestTieredMergePolicy.testSimulateAppendOnly
   [junit4] OK      3.66s J1 | TestTieredMergePolicy.testForcedMergesRespectSegSize
   [junit4] OK      4.85s J1 | TestTieredMergePolicy.testPartialMerge
   [junit4] OK      2.86s J1 | TestTieredMergePolicy.testUnbalancedMergeSelection
   [junit4] OK      0.06s J1 | TestTieredMergePolicy.testForceMergeDeletes
   [junit4] OK      0.01s J1 | TestTieredMergePolicy.testFindForcedDeletesMerges
   [junit4] OK      0.11s J1 | TestTieredMergePolicy.testForceMergeDeletesMaxSegSize
   [junit4]   2> NOTE: reproduce with: ant test  -Dtestcase=TestTieredMergePolicy -Dtests.method=testSimulateUpdates -Dtests.seed=E38D9351539C415B -Dtests.multiplier=3 -Dtests.slow=true -Dtests.badapples=true -Dtests.locale=kw -Dtests.timezone=Asia/Samarkand -Dtests.asserts=true -Dtests.file.encoding=ISO-8859-1
   [junit4] FAILURE 0.06s J1 | TestTieredMergePolicy.testSimulateUpdates <<<
   [junit4]    > Throwable #1: java.lang.AssertionError: numSegments=79, allowed=78.0
   [junit4]    > at __randomizedtesting.SeedInfo.seed([E38D9351539C415B:6D6D0864885C2DA3]:0)
   [junit4]    > at org.apache.lucene.index.TestTieredMergePolicy.assertSegmentInfos(TestTieredMergePolicy.java:88)
   [junit4]    > at org.apache.lucene.index.BaseMergePolicyTestCase.doTestSimulateUpdates(BaseMergePolicyTestCase.java:422)
   [junit4]    > at org.apache.lucene.index.TestTieredMergePolicy.testSimulateUpdates(TestTieredMergePolicy.java:718)
   [junit4]    > at java.base/jdk.internal.reflect.NativeMethodAccessorImpl.invoke0(Native Method)
   [junit4]    > at java.base/jdk.internal.reflect.NativeMethodAccessorImpl.invoke(NativeMethodAccessorImpl.java:62)
   [junit4]    > at java.base/jdk.internal.reflect.DelegatingMethodAccessorImpl.invoke(DelegatingMethodAccessorImpl.java:43)
   [junit4]    > at java.base/java.lang.reflect.Method.invoke(Method.java:567)
   [junit4]    > at java.base/java.lang.Thread.run(Thread.java:835)
   [junit4] OK      0.02s J1 | TestTieredMergePolicy.testForcedMergesUseLeastNumberOfMerges
   [junit4] OK      0.00s J1 | TestTieredMergePolicy.testSetters
   [junit4] OK      0.01s J1 | TestTieredMergePolicy.testMergePurelyToReclaimDeletes
   [junit4]   2> NOTE: test params are: codec=Asserting(Lucene80): {id=PostingsFormat(name=Asserting), content=TestBloomFilteredLucenePostings(BloomFilteringPostingsFormat(Lucene50(blocksize=128)))}, docValues:{}, maxPointsInLeafNode=1101, maxMBSortInHeap=6.629484954943912, sim=Asserting(org.apache.lucene.search.similarities.AssertingSimilarity@6c61e770), locale=kw, timezone=Asia/Samarkand
   [junit4]   2> NOTE: Linux 5.0.0-23-generic amd64/AdoptOpenJDK 12.0.1 (64-bit)/cpus=8,threads=1,free=370865024,total=498597888
   [junit4]   2> NOTE: All tests run in this JVM: [TestTieredMergePolicy]
   [junit4] Completed [3/5 (3!)] on J1 in 14.22s, 14 tests, 1 failure <<< FAILURES!

[...truncated 1 lines...]
   [junit4] Suite: org.apache.lucene.index.TestTieredMergePolicy
   [junit4] OK      0.00s J2 | TestTieredMergePolicy.testManyMaxSizeSegments
   [junit4] OK      0.01s J2 | TestTieredMergePolicy.testForcedMergeWithPending
   [junit4] OK      0.01s J2 | TestTieredMergePolicy.testForceMergeNotNeeded
   [junit4] OK      1.36s J2 | TestTieredMergePolicy.testSimulateAppendOnly
   [junit4] OK      1.11s J2 | TestTieredMergePolicy.testForcedMergesRespectSegSize
   [junit4] OK      2.11s J2 | TestTieredMergePolicy.testPartialMerge
   [junit4] OK      1.26s J2 | TestTieredMergePolicy.testUnbalancedMergeSelection
   [junit4] OK      0.05s J2 | TestTieredMergePolicy.testForceMergeDeletes
   [junit4] OK      0.00s J2 | TestTieredMergePolicy.testFindForcedDeletesMerges
   [junit4] OK      0.02s J2 | TestTieredMergePolicy.testForceMergeDeletesMaxSegSize
   [junit4]   2> NOTE: reproduce with: ant test  -Dtestcase=TestTieredMergePolicy -Dtests.method=testSimulateUpdates -Dtests.seed=E38D9351539C415B -Dtests.multiplier=3 -Dtests.slow=true -Dtests.badapples=true -Dtests.locale=kw -Dtests.timezone=Asia/Samarkand -Dtests.asserts=true -Dtests.file.encoding=ISO-8859-1
   [junit4] FAILURE 0.02s J2 | TestTieredMergePolicy.testSimulateUpdates <<<
   [junit4]    > Throwable #1: java.lang.AssertionError: numSegments=79, allowed=78.0
   [junit4]    > at __randomizedtesting.SeedInfo.seed([E38D9351539C415B:6D6D0864885C2DA3]:0)
   [junit4]    > at org.apache.lucene.index.TestTieredMergePolicy.assertSegmentInfos(TestTieredMergePolicy.java:88)
   [junit4]    > at org.apache.lucene.index.BaseMergePolicyTestCase.doTestSimulateUpdates(BaseMergePolicyTestCase.java:422)
   [junit4]    > at org.apache.lucene.index.TestTieredMergePolicy.testSimulateUpdates(TestTieredMergePolicy.java:718)
   [junit4]    > at java.base/jdk.internal.reflect.NativeMethodAccessorImpl.invoke0(Native Method)
   [junit4]    > at java.base/jdk.internal.reflect.NativeMethodAccessorImpl.invoke(NativeMethodAccessorImpl.java:62)
   [junit4]    > at java.base/jdk.internal.reflect.DelegatingMethodAccessorImpl.invoke(DelegatingMethodAccessorImpl.java:43)
   [junit4]    > at java.base/java.lang.reflect.Method.invoke(Method.java:567)
   [junit4]    > at java.base/java.lang.Thread.run(Thread.java:835)
   [junit4] OK      0.00s J2 | TestTieredMergePolicy.testForcedMergesUseLeastNumberOfMerges
   [junit4] OK      0.00s J2 | TestTieredMergePolicy.testSetters
   [junit4] OK      0.00s J2 | TestTieredMergePolicy.testMergePurelyToReclaimDeletes
   [junit4]   2> NOTE: test params are: codec=Asserting(Lucene80): {id=PostingsFormat(name=Asserting), content=TestBloomFilteredLucenePostings(BloomFilteringPostingsFormat(Lucene50(blocksize=128)))}, docValues:{}, maxPointsInLeafNode=1101, maxMBSortInHeap=6.629484954943912, sim=Asserting(org.apache.lucene.search.similarities.AssertingSimilarity@236fcbd7), locale=kw, timezone=Asia/Samarkand
   [junit4]   2> NOTE: Linux 5.0.0-23-generic amd64/AdoptOpenJDK 12.0.1 (64-bit)/cpus=8,threads=1,free=342261776,total=490733568
   [junit4]   2> NOTE: All tests run in this JVM: [TestTieredMergePolicy, TestTieredMergePolicy]
   [junit4] Completed [4/5 (4!)] on J2 in 6.03s, 14 tests, 1 failure <<< FAILURES!

[...truncated 1 lines...]
   [junit4] Suite: org.apache.lucene.index.TestTieredMergePolicy
   [junit4] OK      0.01s J0 | TestTieredMergePolicy.testManyMaxSizeSegments
   [junit4] OK      0.03s J0 | TestTieredMergePolicy.testForcedMergeWithPending
   [junit4] OK      0.04s J0 | TestTieredMergePolicy.testForceMergeNotNeeded
   [junit4] OK      1.15s J0 | TestTieredMergePolicy.testSimulateAppendOnly
   [junit4] OK      1.45s J0 | TestTieredMergePolicy.testForcedMergesRespectSegSize
   [junit4] OK      2.11s J0 | TestTieredMergePolicy.testPartialMerge
   [junit4] OK      1.07s J0 | TestTieredMergePolicy.testUnbalancedMergeSelection
   [junit4] OK      0.02s J0 | TestTieredMergePolicy.testForceMergeDeletes
   [junit4] OK      0.00s J0 | TestTieredMergePolicy.testFindForcedDeletesMerges
   [junit4] OK      0.01s J0 | TestTieredMergePolicy.testForceMergeDeletesMaxSegSize
   [junit4]   2> NOTE: reproduce with: ant test  -Dtestcase=TestTieredMergePolicy -Dtests.method=testSimulateUpdates -Dtests.seed=E38D9351539C415B -Dtests.multiplier=3 -Dtests.slow=true -Dtests.badapples=true -Dtests.locale=kw -Dtests.timezone=Asia/Samarkand -Dtests.asserts=true -Dtests.file.encoding=ISO-8859-1
   [junit4] FAILURE 0.01s J0 | TestTieredMergePolicy.testSimulateUpdates <<<
   [junit4]    > Throwable #1: java.lang.AssertionError: numSegments=79, allowed=78.0
   [junit4]    > at __randomizedtesting.SeedInfo.seed([E38D9351539C415B:6D6D0864885C2DA3]:0)
   [junit4]    > at org.apache.lucene.index.TestTieredMergePolicy.assertSegmentInfos(TestTieredMergePolicy.java:88)
   [junit4]    > at org.apache.lucene.index.BaseMergePolicyTestCase.doTestSimulateUpdates(BaseMergePolicyTestCase.java:422)
   [junit4]    > at org.apache.lucene.index.TestTieredMergePolicy.testSimulateUpdates(TestTieredMergePolicy.java:718)
   [junit4]    > at java.base/jdk.internal.reflect.NativeMethodAccessorImpl.invoke0(Native Method)
   [junit4]    > at java.base/jdk.internal.reflect.NativeMethodAccessorImpl.invoke(NativeMethodAccessorImpl.java:62)
   [junit4]    > at java.base/jdk.internal.reflect.DelegatingMethodAccessorImpl.invoke(DelegatingMethodAccessorImpl.java:43)
   [junit4]    > at java.base/java.lang.reflect.Method.invoke(Method.java:567)
   [junit4]    > at java.base/java.lang.Thread.run(Thread.java:835)
   [junit4] OK      0.00s J0 | TestTieredMergePolicy.testForcedMergesUseLeastNumberOfMerges
   [junit4] OK      0.00s J0 | TestTieredMergePolicy.testSetters
   [junit4] OK      0.00s J0 | TestTieredMergePolicy.testMergePurelyToReclaimDeletes
   [junit4]   2> NOTE: test params are: codec=Asserting(Lucene80): {id=PostingsFormat(name=Asserting), content=TestBloomFilteredLucenePostings(BloomFilteringPostingsFormat(Lucene50(blocksize=128)))}, docValues:{}, maxPointsInLeafNode=1101, maxMBSortInHeap=6.629484954943912, sim=Asserting(org.apache.lucene.search.similarities.AssertingSimilarity@561faf9b), locale=kw, timezone=Asia/Samarkand
   [junit4]   2> NOTE: Linux 5.0.0-23-generic amd64/AdoptOpenJDK 12.0.1 (64-bit)/cpus=8,threads=1,free=354176920,total=494403584
   [junit4]   2> NOTE: All tests run in this JVM: [TestTieredMergePolicy, TestTieredMergePolicy]
   [junit4] Completed [5/5 (5!)] on J0 in 6.03s, 14 tests, 1 failure <<< FAILURES!

[...truncated 15 lines...]
BUILD FAILED
/home/jenkins/workspace/Lucene-Solr-8.x-Linux/lucene/common-build.xml:1572: The following error occurred while executing this line:
/home/jenkins/workspace/Lucene-Solr-8.x-Linux/lucene/common-build.xml:1099: There were test failures: 5 suites, 70 tests, 5 failures [seed: E38D9351539C415B]

Total time: 23 seconds

[repro] Setting last failure code to 256

[repro] Failures:
[repro]   5/5 failed: org.apache.lucene.index.TestTieredMergePolicy
[repro] Exiting with code 256
+ mv lucene/build lucene/build.repro
+ mv solr/build solr/build.repro
mv: cannot stat 'solr/build': No such file or directory
+ true
+ mv lucene/build.orig lucene/build
+ mv solr/build.orig solr/build
Archiving artifacts
Setting ANT_1_8_2_HOME=/home/jenkins/tools/hudson.tasks.Ant_AntInstallation/ANT_1.8.2
[WARNINGS] Parsing warnings in console log with parser Java Compiler (javac)
Setting ANT_1_8_2_HOME=/home/jenkins/tools/hudson.tasks.Ant_AntInstallation/ANT_1.8.2
No credentials specified
Setting ANT_1_8_2_HOME=/home/jenkins/tools/hudson.tasks.Ant_AntInstallation/ANT_1.8.2
<Git Blamer> Using GitBlamer to create author and commit information for all warnings.
<Git Blamer> GIT_COMMIT=8459fde68e1a5d96c745ff528ed5cbb3921900f4, workspace=/home/jenkins/workspace/Lucene-Solr-8.x-Linux
[WARNINGS] Computing warning deltas based on reference build #1091
Recording test results
Setting ANT_1_8_2_HOME=/home/jenkins/tools/hudson.tasks.Ant_AntInstallation/ANT_1.8.2
Build step 'Publish JUnit test result report' changed build result to UNSTABLE
Email was triggered for: Unstable (Test Failures)
Sending email for trigger: Unstable (Test Failures)
Setting ANT_1_8_2_HOME=/home/jenkins/tools/hudson.tasks.Ant_AntInstallation/ANT_1.8.2
Setting ANT_1_8_2_HOME=/home/jenkins/tools/hudson.tasks.Ant_AntInstallation/ANT_1.8.2
Setting ANT_1_8_2_HOME=/home/jenkins/tools/hudson.tasks.Ant_AntInstallation/ANT_1.8.2
Setting ANT_1_8_2_HOME=/home/jenkins/tools/hudson.tasks.Ant_AntInstallation/ANT_1.8.2
Setting ANT_1_8_2_HOME=/home/jenkins/tools/hudson.tasks.Ant_AntInstallation/ANT_1.8.2
Setting ANT_1_8_2_HOME=/home/jenkins/tools/hudson.tasks.Ant_AntInstallation/ANT_1.8.2


---------------------------------------------------------------------
To unsubscribe, e-mail: [hidden email]
For additional commands, e-mail: [hidden email]