[JENKINS] Lucene-Solr-8.x-Linux (64bit/jdk1.8.0_201) - Build # 1074 - Unstable!

classic Classic list List threaded Threaded
1 message Options
Reply | Threaded
Open this post in threaded view
|

[JENKINS] Lucene-Solr-8.x-Linux (64bit/jdk1.8.0_201) - Build # 1074 - Unstable!

Policeman Jenkins Server-2
Build: https://jenkins.thetaphi.de/job/Lucene-Solr-8.x-Linux/1074/
Java: 64bit/jdk1.8.0_201 -XX:-UseCompressedOops -XX:+UseParallelGC

4 tests failed.
FAILED:  org.apache.solr.handler.TestContainerReqHandler.testCacheLoadFromPackage

Error Message:
Error from server at http://127.0.0.1:44135/solr: Underlying core creation failed while creating collection: globalCacheColl

Stack Trace:
org.apache.solr.client.solrj.impl.HttpSolrClient$RemoteSolrException: Error from server at http://127.0.0.1:44135/solr: Underlying core creation failed while creating collection: globalCacheColl
        at __randomizedtesting.SeedInfo.seed([51410E953C2360CD:9D645A0B3774D62E]:0)
        at org.apache.solr.client.solrj.impl.HttpSolrClient.executeMethod(HttpSolrClient.java:656)
        at org.apache.solr.client.solrj.impl.HttpSolrClient.request(HttpSolrClient.java:262)
        at org.apache.solr.client.solrj.impl.HttpSolrClient.request(HttpSolrClient.java:245)
        at org.apache.solr.client.solrj.impl.LBSolrClient.doRequest(LBSolrClient.java:368)
        at org.apache.solr.client.solrj.impl.LBSolrClient.request(LBSolrClient.java:296)
        at org.apache.solr.client.solrj.impl.BaseCloudSolrClient.sendRequest(BaseCloudSolrClient.java:1128)
        at org.apache.solr.client.solrj.impl.BaseCloudSolrClient.requestWithRetryOnStaleState(BaseCloudSolrClient.java:897)
        at org.apache.solr.client.solrj.impl.BaseCloudSolrClient.request(BaseCloudSolrClient.java:829)
        at org.apache.solr.client.solrj.SolrRequest.process(SolrRequest.java:211)
        at org.apache.solr.client.solrj.SolrRequest.process(SolrRequest.java:228)
        at org.apache.solr.handler.TestContainerReqHandler.testCacheLoadFromPackage(TestContainerReqHandler.java:687)
        at sun.reflect.NativeMethodAccessorImpl.invoke0(Native Method)
        at sun.reflect.NativeMethodAccessorImpl.invoke(NativeMethodAccessorImpl.java:62)
        at sun.reflect.DelegatingMethodAccessorImpl.invoke(DelegatingMethodAccessorImpl.java:43)
        at java.lang.reflect.Method.invoke(Method.java:498)
        at com.carrotsearch.randomizedtesting.RandomizedRunner.invoke(RandomizedRunner.java:1750)
        at com.carrotsearch.randomizedtesting.RandomizedRunner$8.evaluate(RandomizedRunner.java:938)
        at com.carrotsearch.randomizedtesting.RandomizedRunner$9.evaluate(RandomizedRunner.java:974)
        at com.carrotsearch.randomizedtesting.RandomizedRunner$10.evaluate(RandomizedRunner.java:988)
        at com.carrotsearch.randomizedtesting.rules.SystemPropertiesRestoreRule$1.evaluate(SystemPropertiesRestoreRule.java:57)
        at org.apache.lucene.util.TestRuleSetupTeardownChained$1.evaluate(TestRuleSetupTeardownChained.java:49)
        at org.apache.lucene.util.AbstractBeforeAfterRule$1.evaluate(AbstractBeforeAfterRule.java:45)
        at org.apache.lucene.util.TestRuleThreadAndTestName$1.evaluate(TestRuleThreadAndTestName.java:48)
        at org.apache.lucene.util.TestRuleIgnoreAfterMaxFailures$1.evaluate(TestRuleIgnoreAfterMaxFailures.java:64)
        at org.apache.lucene.util.TestRuleMarkFailure$1.evaluate(TestRuleMarkFailure.java:47)
        at com.carrotsearch.randomizedtesting.rules.StatementAdapter.evaluate(StatementAdapter.java:36)
        at com.carrotsearch.randomizedtesting.ThreadLeakControl$StatementRunner.run(ThreadLeakControl.java:368)
        at com.carrotsearch.randomizedtesting.ThreadLeakControl.forkTimeoutingTask(ThreadLeakControl.java:817)
        at com.carrotsearch.randomizedtesting.ThreadLeakControl$3.evaluate(ThreadLeakControl.java:468)
        at com.carrotsearch.randomizedtesting.RandomizedRunner.runSingleTest(RandomizedRunner.java:947)
        at com.carrotsearch.randomizedtesting.RandomizedRunner$5.evaluate(RandomizedRunner.java:832)
        at com.carrotsearch.randomizedtesting.RandomizedRunner$6.evaluate(RandomizedRunner.java:883)
        at com.carrotsearch.randomizedtesting.RandomizedRunner$7.evaluate(RandomizedRunner.java:894)
        at com.carrotsearch.randomizedtesting.rules.StatementAdapter.evaluate(StatementAdapter.java:36)
        at com.carrotsearch.randomizedtesting.rules.SystemPropertiesRestoreRule$1.evaluate(SystemPropertiesRestoreRule.java:57)
        at org.apache.lucene.util.AbstractBeforeAfterRule$1.evaluate(AbstractBeforeAfterRule.java:45)
        at com.carrotsearch.randomizedtesting.rules.StatementAdapter.evaluate(StatementAdapter.java:36)
        at org.apache.lucene.util.TestRuleStoreClassName$1.evaluate(TestRuleStoreClassName.java:41)
        at com.carrotsearch.randomizedtesting.rules.NoShadowingOrOverridesOnMethodsRule$1.evaluate(NoShadowingOrOverridesOnMethodsRule.java:40)
        at com.carrotsearch.randomizedtesting.rules.NoShadowingOrOverridesOnMethodsRule$1.evaluate(NoShadowingOrOverridesOnMethodsRule.java:40)
        at com.carrotsearch.randomizedtesting.rules.StatementAdapter.evaluate(StatementAdapter.java:36)
        at com.carrotsearch.randomizedtesting.rules.StatementAdapter.evaluate(StatementAdapter.java:36)
        at com.carrotsearch.randomizedtesting.rules.StatementAdapter.evaluate(StatementAdapter.java:36)
        at org.apache.lucene.util.TestRuleAssertionsRequired$1.evaluate(TestRuleAssertionsRequired.java:53)
        at org.apache.lucene.util.TestRuleMarkFailure$1.evaluate(TestRuleMarkFailure.java:47)
        at org.apache.lucene.util.TestRuleIgnoreAfterMaxFailures$1.evaluate(TestRuleIgnoreAfterMaxFailures.java:64)
        at org.apache.lucene.util.TestRuleIgnoreTestSuites$1.evaluate(TestRuleIgnoreTestSuites.java:54)
        at com.carrotsearch.randomizedtesting.rules.StatementAdapter.evaluate(StatementAdapter.java:36)
        at com.carrotsearch.randomizedtesting.ThreadLeakControl$StatementRunner.run(ThreadLeakControl.java:368)
        at java.lang.Thread.run(Thread.java:748)


FAILED:  org.apache.solr.handler.TestContainerReqHandler.testCacheLoadFromPackage

Error Message:
Error from server at http://127.0.0.1:43591/solr: Underlying core creation failed while creating collection: globalCacheColl

Stack Trace:
org.apache.solr.client.solrj.impl.HttpSolrClient$RemoteSolrException: Error from server at http://127.0.0.1:43591/solr: Underlying core creation failed while creating collection: globalCacheColl
        at __randomizedtesting.SeedInfo.seed([51410E953C2360CD:9D645A0B3774D62E]:0)
        at org.apache.solr.client.solrj.impl.HttpSolrClient.executeMethod(HttpSolrClient.java:656)
        at org.apache.solr.client.solrj.impl.HttpSolrClient.request(HttpSolrClient.java:262)
        at org.apache.solr.client.solrj.impl.HttpSolrClient.request(HttpSolrClient.java:245)
        at org.apache.solr.client.solrj.impl.LBSolrClient.doRequest(LBSolrClient.java:368)
        at org.apache.solr.client.solrj.impl.LBSolrClient.request(LBSolrClient.java:296)
        at org.apache.solr.client.solrj.impl.BaseCloudSolrClient.sendRequest(BaseCloudSolrClient.java:1128)
        at org.apache.solr.client.solrj.impl.BaseCloudSolrClient.requestWithRetryOnStaleState(BaseCloudSolrClient.java:897)
        at org.apache.solr.client.solrj.impl.BaseCloudSolrClient.request(BaseCloudSolrClient.java:829)
        at org.apache.solr.client.solrj.SolrRequest.process(SolrRequest.java:211)
        at org.apache.solr.client.solrj.SolrRequest.process(SolrRequest.java:228)
        at org.apache.solr.handler.TestContainerReqHandler.testCacheLoadFromPackage(TestContainerReqHandler.java:687)
        at sun.reflect.NativeMethodAccessorImpl.invoke0(Native Method)
        at sun.reflect.NativeMethodAccessorImpl.invoke(NativeMethodAccessorImpl.java:62)
        at sun.reflect.DelegatingMethodAccessorImpl.invoke(DelegatingMethodAccessorImpl.java:43)
        at java.lang.reflect.Method.invoke(Method.java:498)
        at com.carrotsearch.randomizedtesting.RandomizedRunner.invoke(RandomizedRunner.java:1750)
        at com.carrotsearch.randomizedtesting.RandomizedRunner$8.evaluate(RandomizedRunner.java:938)
        at com.carrotsearch.randomizedtesting.RandomizedRunner$9.evaluate(RandomizedRunner.java:974)
        at com.carrotsearch.randomizedtesting.RandomizedRunner$10.evaluate(RandomizedRunner.java:988)
        at com.carrotsearch.randomizedtesting.rules.SystemPropertiesRestoreRule$1.evaluate(SystemPropertiesRestoreRule.java:57)
        at org.apache.lucene.util.TestRuleSetupTeardownChained$1.evaluate(TestRuleSetupTeardownChained.java:49)
        at org.apache.lucene.util.AbstractBeforeAfterRule$1.evaluate(AbstractBeforeAfterRule.java:45)
        at org.apache.lucene.util.TestRuleThreadAndTestName$1.evaluate(TestRuleThreadAndTestName.java:48)
        at org.apache.lucene.util.TestRuleIgnoreAfterMaxFailures$1.evaluate(TestRuleIgnoreAfterMaxFailures.java:64)
        at org.apache.lucene.util.TestRuleMarkFailure$1.evaluate(TestRuleMarkFailure.java:47)
        at com.carrotsearch.randomizedtesting.rules.StatementAdapter.evaluate(StatementAdapter.java:36)
        at com.carrotsearch.randomizedtesting.ThreadLeakControl$StatementRunner.run(ThreadLeakControl.java:368)
        at com.carrotsearch.randomizedtesting.ThreadLeakControl.forkTimeoutingTask(ThreadLeakControl.java:817)
        at com.carrotsearch.randomizedtesting.ThreadLeakControl$3.evaluate(ThreadLeakControl.java:468)
        at com.carrotsearch.randomizedtesting.RandomizedRunner.runSingleTest(RandomizedRunner.java:947)
        at com.carrotsearch.randomizedtesting.RandomizedRunner$5.evaluate(RandomizedRunner.java:832)
        at com.carrotsearch.randomizedtesting.RandomizedRunner$6.evaluate(RandomizedRunner.java:883)
        at com.carrotsearch.randomizedtesting.RandomizedRunner$7.evaluate(RandomizedRunner.java:894)
        at com.carrotsearch.randomizedtesting.rules.StatementAdapter.evaluate(StatementAdapter.java:36)
        at com.carrotsearch.randomizedtesting.rules.SystemPropertiesRestoreRule$1.evaluate(SystemPropertiesRestoreRule.java:57)
        at org.apache.lucene.util.AbstractBeforeAfterRule$1.evaluate(AbstractBeforeAfterRule.java:45)
        at com.carrotsearch.randomizedtesting.rules.StatementAdapter.evaluate(StatementAdapter.java:36)
        at org.apache.lucene.util.TestRuleStoreClassName$1.evaluate(TestRuleStoreClassName.java:41)
        at com.carrotsearch.randomizedtesting.rules.NoShadowingOrOverridesOnMethodsRule$1.evaluate(NoShadowingOrOverridesOnMethodsRule.java:40)
        at com.carrotsearch.randomizedtesting.rules.NoShadowingOrOverridesOnMethodsRule$1.evaluate(NoShadowingOrOverridesOnMethodsRule.java:40)
        at com.carrotsearch.randomizedtesting.rules.StatementAdapter.evaluate(StatementAdapter.java:36)
        at com.carrotsearch.randomizedtesting.rules.StatementAdapter.evaluate(StatementAdapter.java:36)
        at com.carrotsearch.randomizedtesting.rules.StatementAdapter.evaluate(StatementAdapter.java:36)
        at org.apache.lucene.util.TestRuleAssertionsRequired$1.evaluate(TestRuleAssertionsRequired.java:53)
        at org.apache.lucene.util.TestRuleMarkFailure$1.evaluate(TestRuleMarkFailure.java:47)
        at org.apache.lucene.util.TestRuleIgnoreAfterMaxFailures$1.evaluate(TestRuleIgnoreAfterMaxFailures.java:64)
        at org.apache.lucene.util.TestRuleIgnoreTestSuites$1.evaluate(TestRuleIgnoreTestSuites.java:54)
        at com.carrotsearch.randomizedtesting.rules.StatementAdapter.evaluate(StatementAdapter.java:36)
        at com.carrotsearch.randomizedtesting.ThreadLeakControl$StatementRunner.run(ThreadLeakControl.java:368)
        at java.lang.Thread.run(Thread.java:748)


FAILED:  org.apache.solr.handler.TestContainerReqHandler.testCacheLoadFromPackage

Error Message:
Error from server at http://127.0.0.1:42961/solr: Underlying core creation failed while creating collection: globalCacheColl

Stack Trace:
org.apache.solr.client.solrj.impl.HttpSolrClient$RemoteSolrException: Error from server at http://127.0.0.1:42961/solr: Underlying core creation failed while creating collection: globalCacheColl
        at __randomizedtesting.SeedInfo.seed([51410E953C2360CD:9D645A0B3774D62E]:0)
        at org.apache.solr.client.solrj.impl.HttpSolrClient.executeMethod(HttpSolrClient.java:656)
        at org.apache.solr.client.solrj.impl.HttpSolrClient.request(HttpSolrClient.java:262)
        at org.apache.solr.client.solrj.impl.HttpSolrClient.request(HttpSolrClient.java:245)
        at org.apache.solr.client.solrj.impl.LBSolrClient.doRequest(LBSolrClient.java:368)
        at org.apache.solr.client.solrj.impl.LBSolrClient.request(LBSolrClient.java:296)
        at org.apache.solr.client.solrj.impl.BaseCloudSolrClient.sendRequest(BaseCloudSolrClient.java:1128)
        at org.apache.solr.client.solrj.impl.BaseCloudSolrClient.requestWithRetryOnStaleState(BaseCloudSolrClient.java:897)
        at org.apache.solr.client.solrj.impl.BaseCloudSolrClient.request(BaseCloudSolrClient.java:829)
        at org.apache.solr.client.solrj.SolrRequest.process(SolrRequest.java:211)
        at org.apache.solr.client.solrj.SolrRequest.process(SolrRequest.java:228)
        at org.apache.solr.handler.TestContainerReqHandler.testCacheLoadFromPackage(TestContainerReqHandler.java:687)
        at sun.reflect.NativeMethodAccessorImpl.invoke0(Native Method)
        at sun.reflect.NativeMethodAccessorImpl.invoke(NativeMethodAccessorImpl.java:62)
        at sun.reflect.DelegatingMethodAccessorImpl.invoke(DelegatingMethodAccessorImpl.java:43)
        at java.lang.reflect.Method.invoke(Method.java:498)
        at com.carrotsearch.randomizedtesting.RandomizedRunner.invoke(RandomizedRunner.java:1750)
        at com.carrotsearch.randomizedtesting.RandomizedRunner$8.evaluate(RandomizedRunner.java:938)
        at com.carrotsearch.randomizedtesting.RandomizedRunner$9.evaluate(RandomizedRunner.java:974)
        at com.carrotsearch.randomizedtesting.RandomizedRunner$10.evaluate(RandomizedRunner.java:988)
        at com.carrotsearch.randomizedtesting.rules.SystemPropertiesRestoreRule$1.evaluate(SystemPropertiesRestoreRule.java:57)
        at org.apache.lucene.util.TestRuleSetupTeardownChained$1.evaluate(TestRuleSetupTeardownChained.java:49)
        at org.apache.lucene.util.AbstractBeforeAfterRule$1.evaluate(AbstractBeforeAfterRule.java:45)
        at org.apache.lucene.util.TestRuleThreadAndTestName$1.evaluate(TestRuleThreadAndTestName.java:48)
        at org.apache.lucene.util.TestRuleIgnoreAfterMaxFailures$1.evaluate(TestRuleIgnoreAfterMaxFailures.java:64)
        at org.apache.lucene.util.TestRuleMarkFailure$1.evaluate(TestRuleMarkFailure.java:47)
        at com.carrotsearch.randomizedtesting.rules.StatementAdapter.evaluate(StatementAdapter.java:36)
        at com.carrotsearch.randomizedtesting.ThreadLeakControl$StatementRunner.run(ThreadLeakControl.java:368)
        at com.carrotsearch.randomizedtesting.ThreadLeakControl.forkTimeoutingTask(ThreadLeakControl.java:817)
        at com.carrotsearch.randomizedtesting.ThreadLeakControl$3.evaluate(ThreadLeakControl.java:468)
        at com.carrotsearch.randomizedtesting.RandomizedRunner.runSingleTest(RandomizedRunner.java:947)
        at com.carrotsearch.randomizedtesting.RandomizedRunner$5.evaluate(RandomizedRunner.java:832)
        at com.carrotsearch.randomizedtesting.RandomizedRunner$6.evaluate(RandomizedRunner.java:883)
        at com.carrotsearch.randomizedtesting.RandomizedRunner$7.evaluate(RandomizedRunner.java:894)
        at com.carrotsearch.randomizedtesting.rules.StatementAdapter.evaluate(StatementAdapter.java:36)
        at com.carrotsearch.randomizedtesting.rules.SystemPropertiesRestoreRule$1.evaluate(SystemPropertiesRestoreRule.java:57)
        at org.apache.lucene.util.AbstractBeforeAfterRule$1.evaluate(AbstractBeforeAfterRule.java:45)
        at com.carrotsearch.randomizedtesting.rules.StatementAdapter.evaluate(StatementAdapter.java:36)
        at org.apache.lucene.util.TestRuleStoreClassName$1.evaluate(TestRuleStoreClassName.java:41)
        at com.carrotsearch.randomizedtesting.rules.NoShadowingOrOverridesOnMethodsRule$1.evaluate(NoShadowingOrOverridesOnMethodsRule.java:40)
        at com.carrotsearch.randomizedtesting.rules.NoShadowingOrOverridesOnMethodsRule$1.evaluate(NoShadowingOrOverridesOnMethodsRule.java:40)
        at com.carrotsearch.randomizedtesting.rules.StatementAdapter.evaluate(StatementAdapter.java:36)
        at com.carrotsearch.randomizedtesting.rules.StatementAdapter.evaluate(StatementAdapter.java:36)
        at com.carrotsearch.randomizedtesting.rules.StatementAdapter.evaluate(StatementAdapter.java:36)
        at org.apache.lucene.util.TestRuleAssertionsRequired$1.evaluate(TestRuleAssertionsRequired.java:53)
        at org.apache.lucene.util.TestRuleMarkFailure$1.evaluate(TestRuleMarkFailure.java:47)
        at org.apache.lucene.util.TestRuleIgnoreAfterMaxFailures$1.evaluate(TestRuleIgnoreAfterMaxFailures.java:64)
        at org.apache.lucene.util.TestRuleIgnoreTestSuites$1.evaluate(TestRuleIgnoreTestSuites.java:54)
        at com.carrotsearch.randomizedtesting.rules.StatementAdapter.evaluate(StatementAdapter.java:36)
        at com.carrotsearch.randomizedtesting.ThreadLeakControl$StatementRunner.run(ThreadLeakControl.java:368)
        at java.lang.Thread.run(Thread.java:748)


FAILED:  org.apache.solr.handler.TestContainerReqHandler.testCacheLoadFromPackage

Error Message:
Error from server at http://127.0.0.1:39863/solr: Underlying core creation failed while creating collection: globalCacheColl

Stack Trace:
org.apache.solr.client.solrj.impl.HttpSolrClient$RemoteSolrException: Error from server at http://127.0.0.1:39863/solr: Underlying core creation failed while creating collection: globalCacheColl
        at __randomizedtesting.SeedInfo.seed([51410E953C2360CD:9D645A0B3774D62E]:0)
        at org.apache.solr.client.solrj.impl.HttpSolrClient.executeMethod(HttpSolrClient.java:656)
        at org.apache.solr.client.solrj.impl.HttpSolrClient.request(HttpSolrClient.java:262)
        at org.apache.solr.client.solrj.impl.HttpSolrClient.request(HttpSolrClient.java:245)
        at org.apache.solr.client.solrj.impl.LBSolrClient.doRequest(LBSolrClient.java:368)
        at org.apache.solr.client.solrj.impl.LBSolrClient.request(LBSolrClient.java:296)
        at org.apache.solr.client.solrj.impl.BaseCloudSolrClient.sendRequest(BaseCloudSolrClient.java:1128)
        at org.apache.solr.client.solrj.impl.BaseCloudSolrClient.requestWithRetryOnStaleState(BaseCloudSolrClient.java:897)
        at org.apache.solr.client.solrj.impl.BaseCloudSolrClient.request(BaseCloudSolrClient.java:829)
        at org.apache.solr.client.solrj.SolrRequest.process(SolrRequest.java:211)
        at org.apache.solr.client.solrj.SolrRequest.process(SolrRequest.java:228)
        at org.apache.solr.handler.TestContainerReqHandler.testCacheLoadFromPackage(TestContainerReqHandler.java:687)
        at sun.reflect.NativeMethodAccessorImpl.invoke0(Native Method)
        at sun.reflect.NativeMethodAccessorImpl.invoke(NativeMethodAccessorImpl.java:62)
        at sun.reflect.DelegatingMethodAccessorImpl.invoke(DelegatingMethodAccessorImpl.java:43)
        at java.lang.reflect.Method.invoke(Method.java:498)
        at com.carrotsearch.randomizedtesting.RandomizedRunner.invoke(RandomizedRunner.java:1750)
        at com.carrotsearch.randomizedtesting.RandomizedRunner$8.evaluate(RandomizedRunner.java:938)
        at com.carrotsearch.randomizedtesting.RandomizedRunner$9.evaluate(RandomizedRunner.java:974)
        at com.carrotsearch.randomizedtesting.RandomizedRunner$10.evaluate(RandomizedRunner.java:988)
        at com.carrotsearch.randomizedtesting.rules.SystemPropertiesRestoreRule$1.evaluate(SystemPropertiesRestoreRule.java:57)
        at org.apache.lucene.util.TestRuleSetupTeardownChained$1.evaluate(TestRuleSetupTeardownChained.java:49)
        at org.apache.lucene.util.AbstractBeforeAfterRule$1.evaluate(AbstractBeforeAfterRule.java:45)
        at org.apache.lucene.util.TestRuleThreadAndTestName$1.evaluate(TestRuleThreadAndTestName.java:48)
        at org.apache.lucene.util.TestRuleIgnoreAfterMaxFailures$1.evaluate(TestRuleIgnoreAfterMaxFailures.java:64)
        at org.apache.lucene.util.TestRuleMarkFailure$1.evaluate(TestRuleMarkFailure.java:47)
        at com.carrotsearch.randomizedtesting.rules.StatementAdapter.evaluate(StatementAdapter.java:36)
        at com.carrotsearch.randomizedtesting.ThreadLeakControl$StatementRunner.run(ThreadLeakControl.java:368)
        at com.carrotsearch.randomizedtesting.ThreadLeakControl.forkTimeoutingTask(ThreadLeakControl.java:817)
        at com.carrotsearch.randomizedtesting.ThreadLeakControl$3.evaluate(ThreadLeakControl.java:468)
        at com.carrotsearch.randomizedtesting.RandomizedRunner.runSingleTest(RandomizedRunner.java:947)
        at com.carrotsearch.randomizedtesting.RandomizedRunner$5.evaluate(RandomizedRunner.java:832)
        at com.carrotsearch.randomizedtesting.RandomizedRunner$6.evaluate(RandomizedRunner.java:883)
        at com.carrotsearch.randomizedtesting.RandomizedRunner$7.evaluate(RandomizedRunner.java:894)
        at com.carrotsearch.randomizedtesting.rules.StatementAdapter.evaluate(StatementAdapter.java:36)
        at com.carrotsearch.randomizedtesting.rules.SystemPropertiesRestoreRule$1.evaluate(SystemPropertiesRestoreRule.java:57)
        at org.apache.lucene.util.AbstractBeforeAfterRule$1.evaluate(AbstractBeforeAfterRule.java:45)
        at com.carrotsearch.randomizedtesting.rules.StatementAdapter.evaluate(StatementAdapter.java:36)
        at org.apache.lucene.util.TestRuleStoreClassName$1.evaluate(TestRuleStoreClassName.java:41)
        at com.carrotsearch.randomizedtesting.rules.NoShadowingOrOverridesOnMethodsRule$1.evaluate(NoShadowingOrOverridesOnMethodsRule.java:40)
        at com.carrotsearch.randomizedtesting.rules.NoShadowingOrOverridesOnMethodsRule$1.evaluate(NoShadowingOrOverridesOnMethodsRule.java:40)
        at com.carrotsearch.randomizedtesting.rules.StatementAdapter.evaluate(StatementAdapter.java:36)
        at com.carrotsearch.randomizedtesting.rules.StatementAdapter.evaluate(StatementAdapter.java:36)
        at com.carrotsearch.randomizedtesting.rules.StatementAdapter.evaluate(StatementAdapter.java:36)
        at org.apache.lucene.util.TestRuleAssertionsRequired$1.evaluate(TestRuleAssertionsRequired.java:53)
        at org.apache.lucene.util.TestRuleMarkFailure$1.evaluate(TestRuleMarkFailure.java:47)
        at org.apache.lucene.util.TestRuleIgnoreAfterMaxFailures$1.evaluate(TestRuleIgnoreAfterMaxFailures.java:64)
        at org.apache.lucene.util.TestRuleIgnoreTestSuites$1.evaluate(TestRuleIgnoreTestSuites.java:54)
        at com.carrotsearch.randomizedtesting.rules.StatementAdapter.evaluate(StatementAdapter.java:36)
        at com.carrotsearch.randomizedtesting.ThreadLeakControl$StatementRunner.run(ThreadLeakControl.java:368)
        at java.lang.Thread.run(Thread.java:748)




Build Log:
[...truncated 15347 lines...]
   [junit4] Suite: org.apache.solr.handler.TestContainerReqHandler
   [junit4]   2> 2247518 INFO  (SUITE-TestContainerReqHandler-seed#[51410E953C2360CD]-worker) [     ] o.a.s.SolrTestCaseJ4 SecureRandom sanity checks: test.solr.allowed.securerandom=null & java.security.egd=file:/dev/./urandom
   [junit4]   2> 2247519 INFO  (SUITE-TestContainerReqHandler-seed#[51410E953C2360CD]-worker) [     ] o.a.s.SolrTestCaseJ4 Created dataDir: /home/jenkins/workspace/Lucene-Solr-8.x-Linux/solr/build/solr-core/test/J0/temp/solr.handler.TestContainerReqHandler_51410E953C2360CD-001/data-dir-275-001
   [junit4]   2> 2247519 WARN  (SUITE-TestContainerReqHandler-seed#[51410E953C2360CD]-worker) [     ] o.a.s.SolrTestCaseJ4 startTrackingSearchers: numOpens=32 numCloses=32
   [junit4]   2> 2247519 INFO  (SUITE-TestContainerReqHandler-seed#[51410E953C2360CD]-worker) [     ] o.a.s.SolrTestCaseJ4 Using PointFields (NUMERIC_POINTS_SYSPROP=true) w/NUMERIC_DOCVALUES_SYSPROP=true
   [junit4]   2> 2247521 INFO  (SUITE-TestContainerReqHandler-seed#[51410E953C2360CD]-worker) [     ] o.a.s.SolrTestCaseJ4 Randomized ssl (false) and clientAuth (false) via: @org.apache.solr.SolrTestCaseJ4$SuppressSSL(bugUrl=None)
   [junit4]   2> 2247523 INFO  (TEST-TestContainerReqHandler.testPluginFrompackage-seed#[51410E953C2360CD]) [     ] o.a.s.SolrTestCaseJ4 ###Starting testPluginFrompackage
   [junit4]   2> 2247524 INFO  (TEST-TestContainerReqHandler.testPluginFrompackage-seed#[51410E953C2360CD]) [     ] o.e.j.s.Server jetty-9.4.19.v20190610; built: 2019-06-10T16:30:51.723Z; git: afcf563148970e98786327af5e07c261fda175d3; jvm 1.8.0_201-b09
   [junit4]   2> 2247525 INFO  (TEST-TestContainerReqHandler.testPluginFrompackage-seed#[51410E953C2360CD]) [     ] o.e.j.s.AbstractConnector Started ServerConnector@6cf35790{HTTP/1.1,[http/1.1]}{0.0.0.0:39571}
   [junit4]   2> 2247525 INFO  (TEST-TestContainerReqHandler.testPluginFrompackage-seed#[51410E953C2360CD]) [     ] o.e.j.s.Server Started @2247568ms
   [junit4]   2> 2247526 INFO  (TEST-TestContainerReqHandler.testPluginFrompackage-seed#[51410E953C2360CD]) [     ] o.a.s.c.MiniSolrCloudCluster Starting cluster of 4 servers in /home/jenkins/workspace/Lucene-Solr-8.x-Linux/solr/build/solr-core/test/J0/temp/solr.handler.TestContainerReqHandler_51410E953C2360CD-001/tempDir-001
   [junit4]   2> 2247526 INFO  (TEST-TestContainerReqHandler.testPluginFrompackage-seed#[51410E953C2360CD]) [     ] o.a.s.c.ZkTestServer STARTING ZK TEST SERVER
   [junit4]   2> 2247530 INFO  (ZkTestServer Run Thread) [     ] o.a.s.c.ZkTestServer client port:0.0.0.0/0.0.0.0:0
   [junit4]   2> 2247530 INFO  (ZkTestServer Run Thread) [     ] o.a.s.c.ZkTestServer Starting server
   [junit4]   2> 2247630 INFO  (TEST-TestContainerReqHandler.testPluginFrompackage-seed#[51410E953C2360CD]) [     ] o.a.s.c.ZkTestServer start zk server on port:43919
   [junit4]   2> 2247630 INFO  (TEST-TestContainerReqHandler.testPluginFrompackage-seed#[51410E953C2360CD]) [     ] o.a.s.c.ZkTestServer waitForServerUp: 127.0.0.1:43919
   [junit4]   2> 2247630 INFO  (TEST-TestContainerReqHandler.testPluginFrompackage-seed#[51410E953C2360CD]) [     ] o.a.s.c.ZkTestServer parse host and port list: 127.0.0.1:43919
   [junit4]   2> 2247630 INFO  (TEST-TestContainerReqHandler.testPluginFrompackage-seed#[51410E953C2360CD]) [     ] o.a.s.c.ZkTestServer connecting to 127.0.0.1 43919
   [junit4]   2> 2247631 INFO  (TEST-TestContainerReqHandler.testPluginFrompackage-seed#[51410E953C2360CD]) [     ] o.a.s.c.c.ConnectionManager Waiting for client to connect to ZooKeeper
   [junit4]   2> 2247633 INFO  (zkConnectionManagerCallback-17379-thread-1) [     ] o.a.s.c.c.ConnectionManager zkClient has connected
   [junit4]   2> 2247633 INFO  (TEST-TestContainerReqHandler.testPluginFrompackage-seed#[51410E953C2360CD]) [     ] o.a.s.c.c.ConnectionManager Client is connected to ZooKeeper
   [junit4]   2> 2247635 INFO  (TEST-TestContainerReqHandler.testPluginFrompackage-seed#[51410E953C2360CD]) [     ] o.a.s.c.c.ConnectionManager Waiting for client to connect to ZooKeeper
   [junit4]   2> 2247639 INFO  (zkConnectionManagerCallback-17381-thread-1) [     ] o.a.s.c.c.ConnectionManager zkClient has connected
   [junit4]   2> 2247639 INFO  (TEST-TestContainerReqHandler.testPluginFrompackage-seed#[51410E953C2360CD]) [     ] o.a.s.c.c.ConnectionManager Client is connected to ZooKeeper
   [junit4]   2> 2247641 INFO  (TEST-TestContainerReqHandler.testPluginFrompackage-seed#[51410E953C2360CD]) [     ] o.a.s.c.c.ConnectionManager Waiting for client to connect to ZooKeeper
   [junit4]   2> 2247644 INFO  (zkConnectionManagerCallback-17383-thread-1) [     ] o.a.s.c.c.ConnectionManager zkClient has connected
   [junit4]   2> 2247644 INFO  (TEST-TestContainerReqHandler.testPluginFrompackage-seed#[51410E953C2360CD]) [     ] o.a.s.c.c.ConnectionManager Client is connected to ZooKeeper
   [junit4]   2> 2247750 WARN  (jetty-launcher-17384-thread-1) [     ] o.e.j.s.AbstractConnector Ignoring deprecated socket close linger time
   [junit4]   2> 2247750 WARN  (jetty-launcher-17384-thread-3) [     ] o.e.j.s.AbstractConnector Ignoring deprecated socket close linger time
   [junit4]   2> 2247750 WARN  (jetty-launcher-17384-thread-2) [     ] o.e.j.s.AbstractConnector Ignoring deprecated socket close linger time
   [junit4]   2> 2247750 WARN  (jetty-launcher-17384-thread-4) [     ] o.e.j.s.AbstractConnector Ignoring deprecated socket close linger time
   [junit4]   2> 2247750 INFO  (jetty-launcher-17384-thread-1) [     ] o.a.s.c.s.e.JettySolrRunner Start Jetty (original configured port=0)
   [junit4]   2> 2247750 INFO  (jetty-launcher-17384-thread-3) [     ] o.a.s.c.s.e.JettySolrRunner Start Jetty (original configured port=0)
   [junit4]   2> 2247750 INFO  (jetty-launcher-17384-thread-2) [     ] o.a.s.c.s.e.JettySolrRunner Start Jetty (original configured port=0)
   [junit4]   2> 2247750 INFO  (jetty-launcher-17384-thread-1) [     ] o.a.s.c.s.e.JettySolrRunner Trying to start Jetty on port 0 try number 1 ...
   [junit4]   2> 2247750 INFO  (jetty-launcher-17384-thread-3) [     ] o.a.s.c.s.e.JettySolrRunner Trying to start Jetty on port 0 try number 1 ...
   [junit4]   2> 2247750 INFO  (jetty-launcher-17384-thread-2) [     ] o.a.s.c.s.e.JettySolrRunner Trying to start Jetty on port 0 try number 1 ...
   [junit4]   2> 2247750 INFO  (jetty-launcher-17384-thread-4) [     ] o.a.s.c.s.e.JettySolrRunner Start Jetty (original configured port=0)
   [junit4]   2> 2247750 INFO  (jetty-launcher-17384-thread-4) [     ] o.a.s.c.s.e.JettySolrRunner Trying to start Jetty on port 0 try number 1 ...
   [junit4]   2> 2247750 INFO  (jetty-launcher-17384-thread-1) [     ] o.e.j.s.Server jetty-9.4.19.v20190610; built: 2019-06-10T16:30:51.723Z; git: afcf563148970e98786327af5e07c261fda175d3; jvm 1.8.0_201-b09
   [junit4]   2> 2247750 INFO  (jetty-launcher-17384-thread-3) [     ] o.e.j.s.Server jetty-9.4.19.v20190610; built: 2019-06-10T16:30:51.723Z; git: afcf563148970e98786327af5e07c261fda175d3; jvm 1.8.0_201-b09
   [junit4]   2> 2247750 INFO  (jetty-launcher-17384-thread-2) [     ] o.e.j.s.Server jetty-9.4.19.v20190610; built: 2019-06-10T16:30:51.723Z; git: afcf563148970e98786327af5e07c261fda175d3; jvm 1.8.0_201-b09
   [junit4]   2> 2247750 INFO  (jetty-launcher-17384-thread-4) [     ] o.e.j.s.Server jetty-9.4.19.v20190610; built: 2019-06-10T16:30:51.723Z; git: afcf563148970e98786327af5e07c261fda175d3; jvm 1.8.0_201-b09
   [junit4]   2> 2247770 INFO  (jetty-launcher-17384-thread-1) [     ] o.e.j.s.session DefaultSessionIdManager workerName=node0
   [junit4]   2> 2247770 INFO  (jetty-launcher-17384-thread-1) [     ] o.e.j.s.session No SessionScavenger set, using defaults
   [junit4]   2> 2247770 INFO  (jetty-launcher-17384-thread-1) [     ] o.e.j.s.session node0 Scavenging every 660000ms
   [junit4]   2> 2247770 INFO  (jetty-launcher-17384-thread-3) [     ] o.e.j.s.session DefaultSessionIdManager workerName=node0
   [junit4]   2> 2247770 INFO  (jetty-launcher-17384-thread-3) [     ] o.e.j.s.session No SessionScavenger set, using defaults
   [junit4]   2> 2247770 INFO  (jetty-launcher-17384-thread-3) [     ] o.e.j.s.session node0 Scavenging every 660000ms
   [junit4]   2> 2247770 INFO  (jetty-launcher-17384-thread-2) [     ] o.e.j.s.session DefaultSessionIdManager workerName=node0
   [junit4]   2> 2247770 INFO  (jetty-launcher-17384-thread-2) [     ] o.e.j.s.session No SessionScavenger set, using defaults
   [junit4]   2> 2247770 INFO  (jetty-launcher-17384-thread-2) [     ] o.e.j.s.session node0 Scavenging every 660000ms
   [junit4]   2> 2247770 INFO  (jetty-launcher-17384-thread-3) [     ] o.e.j.s.h.ContextHandler Started o.e.j.s.ServletContextHandler@2af7b221{/solr,null,AVAILABLE}
   [junit4]   2> 2247774 INFO  (jetty-launcher-17384-thread-1) [     ] o.e.j.s.h.ContextHandler Started o.e.j.s.ServletContextHandler@39db05c{/solr,null,AVAILABLE}
   [junit4]   2> 2247776 INFO  (jetty-launcher-17384-thread-4) [     ] o.e.j.s.session DefaultSessionIdManager workerName=node0
   [junit4]   2> 2247776 INFO  (jetty-launcher-17384-thread-4) [     ] o.e.j.s.session No SessionScavenger set, using defaults
   [junit4]   2> 2247776 INFO  (jetty-launcher-17384-thread-4) [     ] o.e.j.s.session node0 Scavenging every 660000ms
   [junit4]   2> 2247776 INFO  (jetty-launcher-17384-thread-2) [     ] o.e.j.s.h.ContextHandler Started o.e.j.s.ServletContextHandler@6a573839{/solr,null,AVAILABLE}
   [junit4]   2> 2247778 INFO  (jetty-launcher-17384-thread-4) [     ] o.e.j.s.h.ContextHandler Started o.e.j.s.ServletContextHandler@d82b303{/solr,null,AVAILABLE}
   [junit4]   2> 2247778 INFO  (jetty-launcher-17384-thread-3) [     ] o.e.j.s.AbstractConnector Started ServerConnector@c26519c{HTTP/1.1,[http/1.1, h2c]}{127.0.0.1:38337}
   [junit4]   2> 2247778 INFO  (jetty-launcher-17384-thread-3) [     ] o.e.j.s.Server Started @2247820ms
   [junit4]   2> 2247778 INFO  (jetty-launcher-17384-thread-3) [     ] o.a.s.c.s.e.JettySolrRunner Jetty properties: {hostContext=/solr, hostPort=38337}
   [junit4]   2> 2247778 INFO  (jetty-launcher-17384-thread-1) [     ] o.e.j.s.AbstractConnector Started ServerConnector@60700bde{HTTP/1.1,[http/1.1, h2c]}{127.0.0.1:41041}
   [junit4]   2> 2247778 INFO  (jetty-launcher-17384-thread-1) [     ] o.e.j.s.Server Started @2247820ms
   [junit4]   2> 2247778 INFO  (jetty-launcher-17384-thread-1) [     ] o.a.s.c.s.e.JettySolrRunner Jetty properties: {hostContext=/solr, hostPort=41041}
   [junit4]   2> 2247778 INFO  (jetty-launcher-17384-thread-2) [     ] o.e.j.s.AbstractConnector Started ServerConnector@2b6be2e6{HTTP/1.1,[http/1.1, h2c]}{127.0.0.1:43439}
   [junit4]   2> 2247778 INFO  (jetty-launcher-17384-thread-2) [     ] o.e.j.s.Server Started @2247820ms
   [junit4]   2> 2247778 ERROR (jetty-launcher-17384-thread-3) [     ] o.a.s.u.StartupLoggingUtils Missing Java Option solr.log.dir. Logging may be missing or incomplete.
   [junit4]   2> 2247778 INFO  (jetty-launcher-17384-thread-3) [     ] o.a.s.s.SolrDispatchFilter Using logger factory org.apache.logging.slf4j.Log4jLoggerFactory
   [junit4]   2> 2247778 INFO  (jetty-launcher-17384-thread-2) [     ] o.a.s.c.s.e.JettySolrRunner Jetty properties: {hostContext=/solr, hostPort=43439}
   [junit4]   2> 2247778 ERROR (jetty-launcher-17384-thread-1) [     ] o.a.s.u.StartupLoggingUtils Missing Java Option solr.log.dir. Logging may be missing or incomplete.
   [junit4]   2> 2247778 INFO  (jetty-launcher-17384-thread-1) [     ] o.a.s.s.SolrDispatchFilter Using logger factory org.apache.logging.slf4j.Log4jLoggerFactory
   [junit4]   2> 2247778 INFO  (jetty-launcher-17384-thread-1) [     ] o.a.s.s.SolrDispatchFilter  ___      _       Welcome to Apache Solr? version 8.3.0
   [junit4]   2> 2247778 INFO  (jetty-launcher-17384-thread-3) [     ] o.a.s.s.SolrDispatchFilter  ___      _       Welcome to Apache Solr? version 8.3.0
   [junit4]   2> 2247778 INFO  (jetty-launcher-17384-thread-3) [     ] o.a.s.s.SolrDispatchFilter / __| ___| |_ _   Starting in cloud mode on port null
   [junit4]   2> 2247778 INFO  (jetty-launcher-17384-thread-1) [     ] o.a.s.s.SolrDispatchFilter / __| ___| |_ _   Starting in cloud mode on port null
   [junit4]   2> 2247778 INFO  (jetty-launcher-17384-thread-3) [     ] o.a.s.s.SolrDispatchFilter \__ \/ _ \ | '_|  Install dir: null
   [junit4]   2> 2247778 INFO  (jetty-launcher-17384-thread-1) [     ] o.a.s.s.SolrDispatchFilter \__ \/ _ \ | '_|  Install dir: null
   [junit4]   2> 2247778 INFO  (jetty-launcher-17384-thread-1) [     ] o.a.s.s.SolrDispatchFilter |___/\___/_|_|    Start time: 2019-08-25T01:22:29.138Z
   [junit4]   2> 2247778 INFO  (jetty-launcher-17384-thread-3) [     ] o.a.s.s.SolrDispatchFilter |___/\___/_|_|    Start time: 2019-08-25T01:22:29.138Z
   [junit4]   2> 2247778 ERROR (jetty-launcher-17384-thread-2) [     ] o.a.s.u.StartupLoggingUtils Missing Java Option solr.log.dir. Logging may be missing or incomplete.
   [junit4]   2> 2247778 INFO  (jetty-launcher-17384-thread-2) [     ] o.a.s.s.SolrDispatchFilter Using logger factory org.apache.logging.slf4j.Log4jLoggerFactory
   [junit4]   2> 2247778 INFO  (jetty-launcher-17384-thread-2) [     ] o.a.s.s.SolrDispatchFilter  ___      _       Welcome to Apache Solr? version 8.3.0
   [junit4]   2> 2247778 INFO  (jetty-launcher-17384-thread-2) [     ] o.a.s.s.SolrDispatchFilter / __| ___| |_ _   Starting in cloud mode on port null
   [junit4]   2> 2247778 INFO  (jetty-launcher-17384-thread-2) [     ] o.a.s.s.SolrDispatchFilter \__ \/ _ \ | '_|  Install dir: null
   [junit4]   2> 2247778 INFO  (jetty-launcher-17384-thread-2) [     ] o.a.s.s.SolrDispatchFilter |___/\___/_|_|    Start time: 2019-08-25T01:22:29.138Z
   [junit4]   2> 2247778 INFO  (jetty-launcher-17384-thread-4) [     ] o.e.j.s.AbstractConnector Started ServerConnector@7c4a717e{HTTP/1.1,[http/1.1, h2c]}{127.0.0.1:32841}
   [junit4]   2> 2247778 INFO  (jetty-launcher-17384-thread-4) [     ] o.e.j.s.Server Started @2247821ms
   [junit4]   2> 2247778 INFO  (jetty-launcher-17384-thread-4) [     ] o.a.s.c.s.e.JettySolrRunner Jetty properties: {hostContext=/solr, hostPort=32841}
   [junit4]   2> 2247778 ERROR (jetty-launcher-17384-thread-4) [     ] o.a.s.u.StartupLoggingUtils Missing Java Option solr.log.dir. Logging may be missing or incomplete.
   [junit4]   2> 2247778 INFO  (jetty-launcher-17384-thread-4) [     ] o.a.s.s.SolrDispatchFilter Using logger factory org.apache.logging.slf4j.Log4jLoggerFactory
   [junit4]   2> 2247778 INFO  (jetty-launcher-17384-thread-4) [     ] o.a.s.s.SolrDispatchFilter  ___      _       Welcome to Apache Solr? version 8.3.0
   [junit4]   2> 2247778 INFO  (jetty-launcher-17384-thread-4) [     ] o.a.s.s.SolrDispatchFilter / __| ___| |_ _   Starting in cloud mode on port null
   [junit4]   2> 2247778 INFO  (jetty-launcher-17384-thread-4) [     ] o.a.s.s.SolrDispatchFilter \__ \/ _ \ | '_|  Install dir: null
   [junit4]   2> 2247778 INFO  (jetty-launcher-17384-thread-4) [     ] o.a.s.s.SolrDispatchFilter |___/\___/_|_|    Start time: 2019-08-25T01:22:29.138Z
   [junit4]   2> 2247782 INFO  (jetty-launcher-17384-thread-3) [     ] o.a.s.c.c.ConnectionManager Waiting for client to connect to ZooKeeper
   [junit4]   2> 2247785 INFO  (jetty-launcher-17384-thread-2) [     ] o.a.s.c.c.ConnectionManager Waiting for client to connect to ZooKeeper
   [junit4]   2> 2247785 INFO  (jetty-launcher-17384-thread-1) [     ] o.a.s.c.c.ConnectionManager Waiting for client to connect to ZooKeeper
   [junit4]   2> 2247786 INFO  (jetty-launcher-17384-thread-4) [     ] o.a.s.c.c.ConnectionManager Waiting for client to connect to ZooKeeper
   [junit4]   2> 2247790 INFO  (zkConnectionManagerCallback-17390-thread-1) [     ] o.a.s.c.c.ConnectionManager zkClient has connected
   [junit4]   2> 2247790 INFO  (jetty-launcher-17384-thread-2) [     ] o.a.s.c.c.ConnectionManager Client is connected to ZooKeeper
   [junit4]   2> 2247790 INFO  (zkConnectionManagerCallback-17388-thread-1) [     ] o.a.s.c.c.ConnectionManager zkClient has connected
   [junit4]   2> 2247790 INFO  (jetty-launcher-17384-thread-3) [     ] o.a.s.c.c.ConnectionManager Client is connected to ZooKeeper
   [junit4]   2> 2247793 INFO  (zkConnectionManagerCallback-17387-thread-1) [     ] o.a.s.c.c.ConnectionManager zkClient has connected
   [junit4]   2> 2247793 INFO  (jetty-launcher-17384-thread-1) [     ] o.a.s.c.c.ConnectionManager Client is connected to ZooKeeper
   [junit4]   2> 2247793 INFO  (zkConnectionManagerCallback-17392-thread-1) [     ] o.a.s.c.c.ConnectionManager zkClient has connected
   [junit4]   2> 2247793 INFO  (jetty-launcher-17384-thread-4) [     ] o.a.s.c.c.ConnectionManager Client is connected to ZooKeeper
   [junit4]   2> 2247793 INFO  (jetty-launcher-17384-thread-3) [     ] o.a.s.s.SolrDispatchFilter solr.xml found in ZooKeeper. Loading...
   [junit4]   2> 2247793 INFO  (jetty-launcher-17384-thread-2) [     ] o.a.s.s.SolrDispatchFilter solr.xml found in ZooKeeper. Loading...
   [junit4]   2> 2247793 INFO  (jetty-launcher-17384-thread-1) [     ] o.a.s.s.SolrDispatchFilter solr.xml found in ZooKeeper. Loading...
   [junit4]   2> 2247793 INFO  (jetty-launcher-17384-thread-4) [     ] o.a.s.s.SolrDispatchFilter solr.xml found in ZooKeeper. Loading...
   [junit4]   2> 2248021 INFO  (jetty-launcher-17384-thread-4) [     ] o.a.s.h.c.HttpShardHandlerFactory Host whitelist initialized: WhitelistHostChecker [whitelistHosts=null, whitelistHostCheckingEnabled=true]
   [junit4]   2> 2248021 WARN  (jetty-launcher-17384-thread-4) [     ] o.e.j.u.s.S.config Trusting all certificates configured for Client@28f5700[provider=null,keyStore=null,trustStore=null]
   [junit4]   2> 2248021 WARN  (jetty-launcher-17384-thread-4) [     ] o.e.j.u.s.S.config No Client EndPointIdentificationAlgorithm configured for Client@28f5700[provider=null,keyStore=null,trustStore=null]
   [junit4]   2> 2248023 WARN  (jetty-launcher-17384-thread-4) [     ] o.e.j.u.s.S.config Trusting all certificates configured for Client@fd4062a[provider=null,keyStore=null,trustStore=null]
   [junit4]   2> 2248023 WARN  (jetty-launcher-17384-thread-4) [     ] o.e.j.u.s.S.config No Client EndPointIdentificationAlgorithm configured for Client@fd4062a[provider=null,keyStore=null,trustStore=null]
   [junit4]   2> 2248024 INFO  (jetty-launcher-17384-thread-4) [     ] o.a.s.c.ZkContainer Zookeeper client=127.0.0.1:43919/solr
   [junit4]   2> 2248025 INFO  (jetty-launcher-17384-thread-4) [     ] o.a.s.c.c.ConnectionManager Waiting for client to connect to ZooKeeper
   [junit4]   2> 2248025 INFO  (zkConnectionManagerCallback-17401-thread-1) [     ] o.a.s.c.c.ConnectionManager zkClient has connected
   [junit4]   2> 2248025 INFO  (jetty-launcher-17384-thread-4) [     ] o.a.s.c.c.ConnectionManager Client is connected to ZooKeeper
   [junit4]   2> 2248031 INFO  (jetty-launcher-17384-thread-2) [     ] o.a.s.h.c.HttpShardHandlerFactory Host whitelist initialized: WhitelistHostChecker [whitelistHosts=null, whitelistHostCheckingEnabled=true]
   [junit4]   2> 2248031 WARN  (jetty-launcher-17384-thread-2) [     ] o.e.j.u.s.S.config Trusting all certificates configured for Client@71a36f6a[provider=null,keyStore=null,trustStore=null]
   [junit4]   2> 2248031 WARN  (jetty-launcher-17384-thread-2) [     ] o.e.j.u.s.S.config No Client EndPointIdentificationAlgorithm configured for Client@71a36f6a[provider=null,keyStore=null,trustStore=null]
   [junit4]   2> 2248033 WARN  (jetty-launcher-17384-thread-2) [     ] o.e.j.u.s.S.config Trusting all certificates configured for Client@3065c261[provider=null,keyStore=null,trustStore=null]
   [junit4]   2> 2248033 WARN  (jetty-launcher-17384-thread-2) [     ] o.e.j.u.s.S.config No Client EndPointIdentificationAlgorithm configured for Client@3065c261[provider=null,keyStore=null,trustStore=null]
   [junit4]   2> 2248034 INFO  (jetty-launcher-17384-thread-2) [     ] o.a.s.c.ZkContainer Zookeeper client=127.0.0.1:43919/solr
   [junit4]   2> 2248034 INFO  (jetty-launcher-17384-thread-2) [     ] o.a.s.c.c.ConnectionManager Waiting for client to connect to ZooKeeper
   [junit4]   2> 2248035 INFO  (zkConnectionManagerCallback-17407-thread-1) [     ] o.a.s.c.c.ConnectionManager zkClient has connected
   [junit4]   2> 2248035 INFO  (jetty-launcher-17384-thread-2) [     ] o.a.s.c.c.ConnectionManager Client is connected to ZooKeeper
   [junit4]   2> 2248065 INFO  (jetty-launcher-17384-thread-3) [     ] o.a.s.h.c.HttpShardHandlerFactory Host whitelist initialized: WhitelistHostChecker [whitelistHosts=null, whitelistHostCheckingEnabled=true]
   [junit4]   2> 2248065 WARN  (jetty-launcher-17384-thread-3) [     ] o.e.j.u.s.S.config Trusting all certificates configured for Client@1e1cfa15[provider=null,keyStore=null,trustStore=null]
   [junit4]   2> 2248065 WARN  (jetty-launcher-17384-thread-3) [     ] o.e.j.u.s.S.config No Client EndPointIdentificationAlgorithm configured for Client@1e1cfa15[provider=null,keyStore=null,trustStore=null]
   [junit4]   2> 2248067 WARN  (jetty-launcher-17384-thread-3) [     ] o.e.j.u.s.S.config Trusting all certificates configured for Client@7c2976fa[provider=null,keyStore=null,trustStore=null]
   [junit4]   2> 2248067 WARN  (jetty-launcher-17384-thread-3) [     ] o.e.j.u.s.S.config No Client EndPointIdentificationAlgorithm configured for Client@7c2976fa[provider=null,keyStore=null,trustStore=null]
   [junit4]   2> 2248068 INFO  (jetty-launcher-17384-thread-3) [     ] o.a.s.c.ZkContainer Zookeeper client=127.0.0.1:43919/solr
   [junit4]   2> 2248068 INFO  (jetty-launcher-17384-thread-3) [     ] o.a.s.c.c.ConnectionManager Waiting for client to connect to ZooKeeper
   [junit4]   2> 2248069 INFO  (zkConnectionManagerCallback-17413-thread-1) [     ] o.a.s.c.c.ConnectionManager zkClient has connected
   [junit4]   2> 2248069 INFO  (jetty-launcher-17384-thread-3) [     ] o.a.s.c.c.ConnectionManager Client is connected to ZooKeeper
   [junit4]   2> 2248145 INFO  (jetty-launcher-17384-thread-1) [     ] o.a.s.h.c.HttpShardHandlerFactory Host whitelist initialized: WhitelistHostChecker [whitelistHosts=null, whitelistHostCheckingEnabled=true]
   [junit4]   2> 2248145 WARN  (jetty-launcher-17384-thread-1) [     ] o.e.j.u.s.S.config Trusting all certificates configured for Client@1b7e4428[provider=null,keyStore=null,trustStore=null]
   [junit4]   2> 2248145 WARN  (jetty-launcher-17384-thread-1) [     ] o.e.j.u.s.S.config No Client EndPointIdentificationAlgorithm configured for Client@1b7e4428[provider=null,keyStore=null,trustStore=null]
   [junit4]   2> 2248147 WARN  (jetty-launcher-17384-thread-1) [     ] o.e.j.u.s.S.config Trusting all certificates configured for Client@7e003a52[provider=null,keyStore=null,trustStore=null]
   [junit4]   2> 2248147 WARN  (jetty-launcher-17384-thread-1) [     ] o.e.j.u.s.S.config No Client EndPointIdentificationAlgorithm configured for Client@7e003a52[provider=null,keyStore=null,trustStore=null]
   [junit4]   2> 2248147 INFO  (jetty-launcher-17384-thread-1) [     ] o.a.s.c.ZkContainer Zookeeper client=127.0.0.1:43919/solr
   [junit4]   2> 2248148 INFO  (jetty-launcher-17384-thread-1) [     ] o.a.s.c.c.ConnectionManager Waiting for client to connect to ZooKeeper
   [junit4]   2> 2248148 INFO  (zkConnectionManagerCallback-17420-thread-1) [     ] o.a.s.c.c.ConnectionManager zkClient has connected
   [junit4]   2> 2248149 INFO  (jetty-launcher-17384-thread-1) [     ] o.a.s.c.c.ConnectionManager Client is connected to ZooKeeper
   [junit4]   2> 2248200 INFO  (jetty-launcher-17384-thread-3) [n:127.0.0.1:38337_solr     ] o.a.s.c.c.ConnectionManager Waiting for client to connect to ZooKeeper
   [junit4]   2> 2248201 INFO  (zkConnectionManagerCallback-17422-thread-1) [     ] o.a.s.c.c.ConnectionManager zkClient has connected
   [junit4]   2> 2248201 INFO  (jetty-launcher-17384-thread-3) [n:127.0.0.1:38337_solr     ] o.a.s.c.c.ConnectionManager Client is connected to ZooKeeper
   [junit4]   2> 2248234 DEBUG (jetty-launcher-17384-thread-3) [n:127.0.0.1:38337_solr     ] o.a.s.c.c.ZkStateReader Updating cluster state from ZooKeeper...
   [junit4]   2> 2248234 DEBUG (jetty-launcher-17384-thread-3) [n:127.0.0.1:38337_solr     ] o.a.s.c.c.ZkStateReader Loaded empty cluster properties
   [junit4]   2> 2248234 DEBUG (jetty-launcher-17384-thread-3) [n:127.0.0.1:38337_solr     ] o.a.s.c.c.ZkStateReader Updated live nodes from ZooKeeper... [] -> []
   [junit4]   2> 2248235 DEBUG (jetty-launcher-17384-thread-3) [n:127.0.0.1:38337_solr     ] o.a.s.c.c.ZkStateReader clusterStateSet: legacy [0] interesting [0] watched [0] lazy [0] total [0]
   [junit4]   2> 2248236 INFO  (jetty-launcher-17384-thread-3) [n:127.0.0.1:38337_solr     ] o.a.s.c.OverseerElectionContext I am going to be the leader 127.0.0.1:38337_solr
   [junit4]   2> 2248236 INFO  (jetty-launcher-17384-thread-3) [n:127.0.0.1:38337_solr     ] o.a.s.c.Overseer Overseer (id=72174910463279115-127.0.0.1:38337_solr-n_0000000000) starting
   [junit4]   2> 2248239 INFO  (jetty-launcher-17384-thread-3) [n:127.0.0.1:38337_solr     ] o.a.s.c.c.ConnectionManager Waiting for client to connect to ZooKeeper
   [junit4]   2> 2248239 INFO  (zkConnectionManagerCallback-17429-thread-1) [     ] o.a.s.c.c.ConnectionManager zkClient has connected
   [junit4]   2> 2248239 INFO  (jetty-launcher-17384-thread-3) [n:127.0.0.1:38337_solr     ] o.a.s.c.c.ConnectionManager Client is connected to ZooKeeper
   [junit4]   2> 2248239 DEBUG (jetty-launcher-17384-thread-3) [n:127.0.0.1:38337_solr     ] o.a.s.c.c.ZkStateReader Updating cluster state from ZooKeeper...
   [junit4]   2> 2248240 DEBUG (jetty-launcher-17384-thread-3) [n:127.0.0.1:38337_solr     ] o.a.s.c.c.ZkStateReader Loaded empty cluster properties
   [junit4]   2> 2248240 DEBUG (jetty-launcher-17384-thread-3) [n:127.0.0.1:38337_solr     ] o.a.s.c.c.ZkStateReader Updated live nodes from ZooKeeper... [] -> []
   [junit4]   2> 2248240 DEBUG (jetty-launcher-17384-thread-3) [n:127.0.0.1:38337_solr     ] o.a.s.c.c.ZkStateReader clusterStateSet: legacy [0] interesting [0] watched [0] lazy [0] total [0]
   [junit4]   2> 2248241 INFO  (jetty-launcher-17384-thread-3) [n:127.0.0.1:38337_solr     ] o.a.s.c.s.i.ZkClientClusterStateProvider Cluster at 127.0.0.1:43919/solr ready
   [junit4]   2> 2248241 INFO  (OverseerStateUpdate-72174910463279115-127.0.0.1:38337_solr-n_0000000000) [n:127.0.0.1:38337_solr     ] o.a.s.c.Overseer Starting to work on the main queue : 127.0.0.1:38337_solr
   [junit4]   2> 2248241 INFO  (jetty-launcher-17384-thread-3) [n:127.0.0.1:38337_solr     ] o.a.s.c.ZkController Register node as live in ZooKeeper:/live_nodes/127.0.0.1:38337_solr
   [junit4]   2> 2248241 DEBUG (OverseerStateUpdate-72174910463279115-127.0.0.1:38337_solr-n_0000000000) [n:127.0.0.1:38337_solr     ] o.a.s.c.c.ZkStateReader Updated live nodes from ZooKeeper... [] -> []
   [junit4]   2> 2248241 DEBUG (OverseerStateUpdate-72174910463279115-127.0.0.1:38337_solr-n_0000000000) [n:127.0.0.1:38337_solr     ] o.a.s.c.c.ZkStateReader clusterStateSet: legacy [0] interesting [0] watched [0] lazy [0] total [0]
   [junit4]   2> 2248242 DEBUG (zkCallback-17421-thread-1) [     ] o.a.s.c.c.ZkStateReader A live node change: [WatchedEvent state:SyncConnected type:NodeChildrenChanged path:/live_nodes], has occurred - updating... (live nodes size: [0])
   [junit4]   2> 2248242 DEBUG (zkCallback-17428-thread-1) [     ] o.a.s.c.c.ZkStateReader A live node change: [WatchedEvent state:SyncConnected type:NodeChildrenChanged path:/live_nodes], has occurred - updating... (live nodes size: [0])
   [junit4]   2> 2248242 INFO  (zkCallback-17428-thread-1) [     ] o.a.s.c.c.ZkStateReader Updated live nodes from ZooKeeper... (0) -> (1)
   [junit4]   2> 2248242 INFO  (zkCallback-17421-thread-1) [     ] o.a.s.c.c.ZkStateReader Updated live nodes from ZooKeeper... (0) -> (1)
   [junit4]   2> 2248242 DEBUG (zkCallback-17428-thread-1) [     ] o.a.s.c.c.ZkStateReader Updated live nodes from ZooKeeper... [] -> [127.0.0.1:38337_solr]
   [junit4]   2> 2248242 DEBUG (zkCallback-17421-thread-1) [     ] o.a.s.c.c.ZkStateReader Updated live nodes from ZooKeeper... [] -> [127.0.0.1:38337_solr]
   [junit4]   2> 2248242 INFO  (jetty-launcher-17384-thread-3) [n:127.0.0.1:38337_solr     ] o.a.s.c.PackageManager clusterprops.json changed , version -1
   [junit4]   2> 2248252 INFO  (jetty-launcher-17384-thread-3) [n:127.0.0.1:38337_solr     ] o.a.s.h.a.MetricsHistoryHandler No .system collection, keeping metrics history in memory.
   [junit4]   2> 2248267 INFO  (jetty-launcher-17384-thread-3) [n:127.0.0.1:38337_solr     ] o.a.s.m.r.SolrJmxReporter JMX monitoring for 'solr_38337.solr.node' (registry 'solr.node') enabled at server: com.sun.jmx.mbeanserver.JmxMBeanServer@639347fc
   [junit4]   2> 2248271 INFO  (jetty-launcher-17384-thread-3) [n:127.0.0.1:38337_solr     ] o.a.s.m.r.SolrJmxReporter JMX monitoring for 'solr_38337.solr.jvm' (registry 'solr.jvm') enabled at server: com.sun.jmx.mbeanserver.JmxMBeanServer@639347fc
   [junit4]   2> 2248271 INFO  (jetty-launcher-17384-thread-3) [n:127.0.0.1:38337_solr     ] o.a.s.m.r.SolrJmxReporter JMX monitoring for 'solr_38337.solr.jetty' (registry 'solr.jetty') enabled at server: com.sun.jmx.mbeanserver.JmxMBeanServer@639347fc
   [junit4]   2> 2248272 INFO  (jetty-launcher-17384-thread-3) [n:127.0.0.1:38337_solr     ] o.a.s.c.CorePropertiesLocator Found 0 core definitions underneath /home/jenkins/workspace/Lucene-Solr-8.x-Linux/solr/build/solr-core/test/J0/temp/solr.handler.TestContainerReqHandler_51410E953C2360CD-001/tempDir-001/node3/.
   [junit4]   2> 2248300 INFO  (jetty-launcher-17384-thread-2) [n:127.0.0.1:43439_solr     ] o.a.s.c.c.ConnectionManager Waiting for client to connect to ZooKeeper
   [junit4]   2> 2248301 INFO  (zkConnectionManagerCallback-17432-thread-1) [     ] o.a.s.c.c.ConnectionManager zkClient has connected
   [junit4]   2> 2248301 INFO  (jetty-launcher-17384-thread-2) [n:127.0.0.1:43439_solr     ] o.a.s.c.c.ConnectionManager Client is connected to ZooKeeper
   [junit4]   2> 2248304 DEBUG (jetty-launcher-17384-thread-2) [n:127.0.0.1:43439_solr     ] o.a.s.c.c.ZkStateReader Updating cluster state from ZooKeeper...
   [junit4]   2> 2248304 DEBUG (jetty-launcher-17384-thread-2) [n:127.0.0.1:43439_solr     ] o.a.s.c.c.ZkStateReader Loaded empty cluster properties
   [junit4]   2> 2248304 INFO  (jetty-launcher-17384-thread-2) [n:127.0.0.1:43439_solr     ] o.a.s.c.c.ZkStateReader Updated live nodes from ZooKeeper... (0) -> (1)
   [junit4]   2> 2248304 DEBUG (jetty-launcher-17384-thread-2) [n:127.0.0.1:43439_solr     ] o.a.s.c.c.ZkStateReader Updated live nodes from ZooKeeper... [] -> [127.0.0.1:38337_solr]
   [junit4]   2> 2248304 DEBUG (jetty-launcher-17384-thread-2) [n:127.0.0.1:43439_solr     ] o.a.s.c.c.ZkStateReader clusterStateSet: legacy [0] interesting [0] watched [0] lazy [0] total [0]
   [junit4]   2> 2248306 INFO  (jetty-launcher-17384-thread-2) [n:127.0.0.1:43439_solr     ] o.a.s.c.ZkController Publish node=127.0.0.1:43439_solr as DOWN
   [junit4]   2> 2248306 INFO  (jetty-launcher-17384-thread-2) [n:127.0.0.1:43439_solr     ] o.a.s.c.TransientSolrCoreCacheDefault Allocating transient cache for 2147483647 transient cores
   [junit4]   2> 2248306 INFO  (jetty-launcher-17384-thread-2) [n:127.0.0.1:43439_solr     ] o.a.s.c.ZkController Register node as live in ZooKeeper:/live_nodes/127.0.0.1:43439_solr
   [junit4]   2> 2248306 DEBUG (zkCallback-17421-thread-1) [     ] o.a.s.c.c.ZkStateReader A live node change: [WatchedEvent state:SyncConnected type:NodeChildrenChanged path:/live_nodes], has occurred - updating... (live nodes size: [1])
   [junit4]   2> 2248306 DEBUG (zkCallback-17428-thread-1) [     ] o.a.s.c.c.ZkStateReader A live node change: [WatchedEvent state:SyncConnected type:NodeChildrenChanged path:/live_nodes], has occurred - updating... (live nodes size: [1])
   [junit4]   2> 2248306 DEBUG (zkCallback-17431-thread-1) [     ] o.a.s.c.c.ZkStateReader A live node change: [WatchedEvent state:SyncConnected type:NodeChildrenChanged path:/live_nodes], has occurred - updating... (live nodes size: [1])
   [junit4]   2> 2248306 INFO  (zkCallback-17428-thread-1) [     ] o.a.s.c.c.ZkStateReader Updated live nodes from ZooKeeper... (1) -> (2)
   [junit4]   2> 2248306 DEBUG (zkCallback-17428-thread-1) [     ] o.a.s.c.c.ZkStateReader Updated live nodes from ZooKeeper... [127.0.0.1:38337_solr] -> [127.0.0.1:38337_solr, 127.0.0.1:43439_solr]
   [junit4]   2> 2248306 INFO  (zkCallback-17421-thread-1) [     ] o.a.s.c.c.ZkStateReader Updated live nodes from ZooKeeper... (1) -> (2)
   [junit4]   2> 2248306 DEBUG (zkCallback-17421-thread-1) [     ] o.a.s.c.c.ZkStateReader Updated live nodes from ZooKeeper... [127.0.0.1:38337_solr] -> [127.0.0.1:38337_solr, 127.0.0.1:43439_solr]
   [junit4]   2> 2248306 INFO  (zkCallback-17431-thread-1) [     ] o.a.s.c.c.ZkStateReader Updated live nodes from ZooKeeper... (1) -> (2)
   [junit4]   2> 2248307 DEBUG (zkCallback-17431-thread-1) [     ] o.a.s.c.c.ZkStateReader Updated live nodes from ZooKeeper... [127.0.0.1:38337_solr] -> [127.0.0.1:38337_solr, 127.0.0.1:43439_solr]
   [junit4]   2> 2248307 INFO  (jetty-launcher-17384-thread-2) [n:127.0.0.1:43439_solr     ] o.a.s.c.c.ConnectionManager Waiting for client to connect to ZooKeeper
   [junit4]   2> 2248307 INFO  (zkConnectionManagerCallback-17439-thread-1) [     ] o.a.s.c.c.ConnectionManager zkClient has connected
   [junit4]   2> 2248307 INFO  (jetty-launcher-17384-thread-2) [n:127.0.0.1:43439_solr     ] o.a.s.c.c.ConnectionManager Client is connected to ZooKeeper
   [junit4]   2> 2248308 DEBUG (jetty-launcher-17384-thread-2) [n:127.0.0.1:43439_solr     ] o.a.s.c.c.ZkStateReader Updating cluster state from ZooKeeper...
   [junit4]   2> 2248308 DEBUG (jetty-launcher-17384-thread-2) [n:127.0.0.1:43439_solr     ] o.a.s.c.c.ZkStateReader Loaded empty cluster properties
   [junit4]   2> 2248308 INFO  (jetty-launcher-17384-thread-2) [n:127.0.0.1:43439_solr     ] o.a.s.c.c.ZkStateReader Updated live nodes from ZooKeeper... (0) -> (2)
   [junit4]   2> 2248308 DEBUG (jetty-launcher-17384-thread-2) [n:127.0.0.1:43439_solr     ] o.a.s.c.c.ZkStateReader Updated live nodes from ZooKeeper... [] -> [127.0.0.1:38337_solr, 127.0.0.1:43439_solr]
   [junit4]   2> 2248308 DEBUG (jetty-launcher-17384-thread-2) [n:127.0.0.1:43439_solr     ] o.a.s.c.c.ZkStateReader clusterStateSet: legacy [0] interesting [0] watched [0] lazy [0] total [0]
   [junit4]   2> 2248308 INFO  (jetty-launcher-17384-thread-2) [n:127.0.0.1:43439_solr     ] o.a.s.c.s.i.ZkClientClusterStateProvider Cluster at 127.0.0.1:43919/solr ready
   [junit4]   2> 2248309 INFO  (jetty-launcher-17384-thread-2) [n:127.0.0.1:43439_solr     ] o.a.s.c.PackageManager clusterprops.json changed , version -1
   [junit4]   2> 2248318 INFO  (jetty-launcher-17384-thread-2) [n:127.0.0.1:43439_solr     ] o.a.s.h.a.MetricsHistoryHandler No .system collection, keeping metrics history in memory.
   [junit4]   2> 2248327 INFO  (jetty-launcher-17384-thread-2) [n:127.0.0.1:43439_solr     ] o.a.s.m.r.SolrJmxReporter JMX monitoring for 'solr_43439.solr.node' (registry 'solr.node') enabled at server: com.sun.jmx.mbeanserver.JmxMBeanServer@639347fc
   [junit4]   2> 2248332 INFO  (jetty-launcher-17384-thread-2) [n:127.0.0.1:43439_solr     ] o.a.s.m.r.SolrJmxReporter JMX monitoring for 'solr_43439.solr.jvm' (registry 'solr.jvm') enabled at server: com.sun.jmx.mbeanserver.JmxMBeanServer@639347fc
   [junit4]   2> 2248332 INFO  (jetty-launcher-17384-thread-2) [n:127.0.0.1:43439_solr     ] o.a.s.m.r.SolrJmxReporter JMX monitoring for 'solr_43439.solr.jetty' (registry 'solr.jetty') enabled at server: com.sun.jmx.mbeanserver.JmxMBeanServer@639347fc
   [junit4]   2> 2248332 INFO  (jetty-launcher-17384-thread-2) [n:127.0.0.1:43439_solr     ] o.a.s.c.CorePropertiesLocator Found 0 core definitions underneath /home/jenkins/workspace/Lucene-Solr-8.x-Linux/solr/build/solr-core/test/J0/temp/solr.handler.TestContainerReqHandler_51410E953C2360CD-001/tempDir-001/node1/.
   [junit4]   2> 2248400 INFO  (jetty-launcher-17384-thread-4) [n:127.0.0.1:32841_solr     ] o.a.s.c.c.ConnectionManager Waiting for client to connect to ZooKeeper
   [junit4]   2> 2248401 INFO  (zkConnectionManagerCallback-17442-thread-1) [     ] o.a.s.c.c.ConnectionManager zkClient has connected
   [junit4]   2> 2248401 INFO  (jetty-launcher-17384-thread-4) [n:127.0.0.1:32841_solr     ] o.a.s.c.c.ConnectionManager Client is connected to ZooKeeper
   [junit4]   2> 2248404 DEBUG (jetty-launcher-17384-thread-4) [n:127.0.0.1:32841_solr     ] o.a.s.c.c.ZkStateReader Updating cluster state from ZooKeeper...
   [junit4]   2> 2248405 DEBUG (jetty-launcher-17384-thread-4) [n:127.0.0.1:32841_solr     ] o.a.s.c.c.ZkStateReader Loaded empty cluster properties
   [junit4]   2> 2248405 INFO  (jetty-launcher-17384-thread-4) [n:127.0.0.1:32841_solr     ] o.a.s.c.c.ZkStateReader Updated live nodes from ZooKeeper... (0) -> (2)
   [junit4]   2> 2248405 DEBUG (jetty-launcher-17384-thread-4) [n:127.0.0.1:32841_solr     ] o.a.s.c.c.ZkStateReader Updated live nodes from ZooKeeper... [] -> [127.0.0.1:38337_solr, 127.0.0.1:43439_solr]
   [junit4]   2> 2248405 DEBUG (jetty-launcher-17384-thread-4) [n:127.0.0.1:32841_solr     ] o.a.s.c.c.ZkStateReader clusterStateSet: legacy [0] interesting [0] watched [0] lazy [0] total [0]
   [junit4]   2> 2248406 INFO  (jetty-launcher-17384-thread-4) [n:127.0.0.1:32841_solr     ] o.a.s.c.ZkController Publish node=127.0.0.1:32841_solr as DOWN
   [junit4]   2> 2248407 INFO  (jetty-launcher-17384-thread-4) [n:127.0.0.1:32841_solr     ] o.a.s.c.TransientSolrCoreCacheDefault Allocating transient cache for 2147483647 transient cores
   [junit4]   2> 2248407 INFO  (jetty-launcher-17384-thread-4) [n:127.0.0.1:32841_solr     ] o.a.s.c.ZkController Register node as live in ZooKeeper:/live_nodes/127.0.0.1:32841_solr
   [junit4]   2> 2248407 DEBUG (zkCallback-17428-thread-1) [     ] o.a.s.c.c.ZkStateReader A live node change: [WatchedEvent state:SyncConnected type:NodeChildrenChanged path:/live_nodes], has occurred - updating... (live nodes size: [2])
   [junit4]   2> 2248407 DEBUG (zkCallback-17421-thread-1) [     ] o.a.s.c.c.ZkStateReader A live node change: [WatchedEvent state:SyncConnected type:NodeChildrenChanged path:/live_nodes], has occurred - updating... (live nodes size: [2])
   [junit4]   2> 2248407 INFO  (zkCallback-17428-thread-1) [     ] o.a.s.c.c.ZkStateReader Updated live nodes from ZooKeeper... (2) -> (3)
   [junit4]   2> 2248407 DEBUG (zkCallback-17428-thread-1) [     ] o.a.s.c.c.ZkStateReader Updated live nodes from ZooKeeper... [127.0.0.1:38337_solr, 127.0.0.1:43439_solr] -> [127.0.0.1:32841_solr, 127.0.0.1:38337_solr, 127.0.0.1:43439_solr]
   [junit4]   2> 2248407 INFO  (zkCallback-17421-thread-1) [     ] o.a.s.c.c.ZkStateReader Updated live nodes from ZooKeeper... (2) -> (3)
   [junit4]   2> 2248407 DEBUG (zkCallback-17438-thread-1) [     ] o.a.s.c.c.ZkStateReader A live node change: [WatchedEvent state:SyncConnected type:NodeChildrenChanged path:/live_nodes], has occurred - updating... (live nodes size: [2])
   [junit4]   2> 2248407 DEBUG (zkCallback-17421-thread-1) [     ] o.a.s.c.c.ZkStateReader Updated live nodes from ZooKeeper... [127.0.0.1:38337_solr, 127.0.0.1:43439_solr] -> [127.0.0.1:32841_solr, 127.0.0.1:38337_solr, 127.0.0.1:43439_solr]
   [junit4]   2> 2248407 DEBUG (zkCallback-17431-thread-1) [     ] o.a.s.c.c.ZkStateReader A live node change: [WatchedEvent state:SyncConnected type:NodeChildrenChanged path:/live_nodes], has occurred - updating... (live nodes size: [2])
   [junit4]   2> 2248407 DEBUG (zkCallback-17441-thread-1) [     ] o.a.s.c.c.ZkStateReader A live node change: [WatchedEvent state:SyncConnected type:NodeChildrenChanged path:/live_nodes], has occurred - updating... (live nodes size: [2])
   [junit4]   2> 2248407 INFO  (zkCallback-17431-thread-1) [     ] o.a.s.c.c.ZkStateReader Updated live nodes from ZooKeeper... (2) -> (3)
   [junit4]   2> 2248407 DEBUG (zkCallback-17431-thread-1) [     ] o.a.s.c.c.ZkStateReader Updated live nodes from ZooKeeper... [127.0.0.1:38337_solr, 127.0.0.1:43439_solr] -> [127.0.0.1:32841_solr, 127.0.0.1:38337_solr, 127.0.0.1:43439_solr]
   [junit4]   2> 2248407 INFO  (zkCallback-17438-thread-1) [     ] o.a.s.c.c.ZkStateReader Updated live nodes from ZooKeeper... (2) -> (3)
   [junit4]   2> 2248407 DEBUG (zkCallback-17438-thread-1) [     ] o.a.s.c.c.ZkStateReader Updated live nodes from ZooKeeper... [127.0.0.1:38337_solr, 127.0.0.1:43439_solr] -> [127.0.0.1:32841_solr, 127.0.0.1:38337_solr, 127.0.0.1:43439_solr]
   [junit4]   2> 2248407 INFO  (zkCallback-17441-thread-1) [     ] o.a.s.c.c.ZkStateReader Updated live nodes from ZooKeeper... (2) -> (3)
   [junit4]   2> 2248407 DEBUG (zkCallback-17441-thread-1) [     ] o.a.s.c.c.ZkStateReader Updated live nodes from ZooKeeper... [127.0.0.1:38337_solr, 127.0.0.1:43439_solr] -> [127.0.0.1:32841_solr, 127.0.0.1:38337_solr, 127.0.0.1:43439_solr]
   [junit4]   2> 2248408 INFO  (jetty-launcher-17384-thread-4) [n:127.0.0.1:32841_solr     ] o.a.s.c.c.ConnectionManager Waiting for client to connect to ZooKeeper
   [junit4]   2> 2248408 INFO  (zkConnectionManagerCallback-17449-thread-1) [     ] o.a.s.c.c.ConnectionManager zkClient has connected
   [junit4]   2> 2248408 INFO  (jetty-launcher-17384-thread-4) [n:127.0.0.1:32841_solr     ] o.a.s.c.c.ConnectionManager Client is connected to ZooKeeper
   [junit4]   2> 2248408 DEBUG (jetty-launcher-17384-thread-4) [n:127.0.0.1:32841_solr     ] o.a.s.c.c.ZkStateReader Updating cluster state from ZooKeeper...
   [junit4]   2> 2248409 DEBUG (jetty-launcher-17384-thread-4) [n:127.0.0.1:32841_solr     ] o.a.s.c.c.ZkStateReader Loaded empty cluster properties
   [junit4]   2> 2248409 INFO  (jetty-launcher-17384-thread-4) [n:127.0.0.1:32841_solr     ] o.a.s.c.c.ZkStateReader Updated live nodes from ZooKeeper... (0) -> (3)
   [junit4]   2> 2248409 DEBUG (jetty-launcher-17384-thread-4) [n:127.0.0.1:32841_solr     ] o.a.s.c.c.ZkStateReader Updated live nodes from ZooKeeper... [] -> [127.0.0.1:32841_solr, 127.0.0.1:38337_solr, 127.0.0.1:43439_solr]
   [junit4]   2> 2248409 DEBUG (jetty-launcher-17384-thread-4) [n:127.0.0.1:32841_solr     ] o.a.s.c.c.ZkStateReader clusterStateSet: legacy [0] interesting [0] watched [0] lazy [0] total [0]
   [junit4]   2> 2248409 INFO  (jetty-launcher-17384-thread-4) [n:127.0.0.1:32841_solr     ] o.a.s.c.s.i.ZkClientClusterStateProvider Cluster at 127.0.0.1:43919/solr ready
   [junit4]   2> 2248409 INFO  (jetty-launcher-17384-thread-4) [n:127.0.0.1:32841_solr     ] o.a.s.c.PackageManager clusterprops.json changed , version -1
   [junit4]   2> 2248419 INFO  (jetty-launcher-17384-thread-4) [n:127.0.0.1:32841_solr     ] o.a.s.h.a.MetricsHistoryHandler No .system collection, keeping metrics history in memory.
   [junit4]   2> 2248428 INFO  (jetty-launcher-17384-thread-4) [n:127.0.0.1:32841_solr     ] o.a.s.m.r.SolrJmxReporter JMX monitoring for 'solr_32841.solr.node' (registry 'solr.node') enabled at server: com.sun.jmx.mbeanserver.JmxMBeanServer@639347fc
   [junit4]   2> 2248433 INFO  (jetty-launcher-17384-thread-4) [n:127.0.0.1:32841_solr     ] o.a.s.m.r.SolrJmxReporter JMX monitoring for 'solr_32841.solr.jvm' (registry 'solr.jvm') enabled at server: com.sun.jmx.mbeanserver.JmxMBeanServer@639347fc
   [junit4]   2> 2248433 INFO  (jetty-launcher-17384-thread-4) [n:127.0.0.1:32841_solr     ] o.a.s.m.r.SolrJmxReporter JMX monitoring for 'solr_32841.solr.jetty' (registry 'solr.jetty') enabled at server: com.sun.jmx.mbeanserver.JmxMBeanServer@639347fc
   [junit4]   2> 2248433 INFO  (jetty-launcher-17384-thread-4) [n:127.0.0.1:32841_solr     ] o.a.s.c.CorePropertiesLocator Found 0 core definitions underneath /home/jenkins/workspace/Lucene-Solr-8.x-Linux/solr/build/solr-core/test/J0/temp/solr.handler.TestContainerReqHandler_51410E953C2360CD-001/tempDir-001/node4/.
   [junit4]   2> 2248500 INFO  (jetty-launcher-17384-thread-1) [n:127.0.0.1:41041_solr     ] o.a.s.c.c.ConnectionManager Waiting for client to connect to ZooKeeper
   [junit4]   2> 2248501 INFO  (zkConnectionManagerCallback-17452-thread-1) [     ] o.a.s.c.c.ConnectionManager zkClient has connected
   [junit4]   2> 2248501 INFO  (jetty-launcher-17384-thread-1) [n:127.0.0.1:41041_solr     ] o.a.s.c.c.ConnectionManager Client is connected to ZooKeeper
   [junit4]   2> 2248504 DEBUG (jetty-launcher-17384-thread-1) [n:127.0.0.1:41041_solr     ] o.a.s.c.c.ZkStateReader Updating cluster state from ZooKeeper...
   [junit4]   2> 2248504 DEBUG (jetty-launcher-17384-thread-1) [n:127.0.0.1:41041_solr     ] o.a.s.c.c.ZkStateReader Loaded empty cluster properties
   [junit4]   2> 2248504 INFO  (jetty-launcher-17384-thread-1) [n:127.0.0.1:41041_solr     ] o.a.s.c.c.ZkStateReader Updated live nodes from ZooKeeper... (0) -> (3)
   [junit4]   2> 2248504 DEBUG (jetty-launcher-17384-thread-1) [n:127.0.0.1:41041_solr     ] o.a.s.c.c.ZkStateReader Updated live nodes from ZooKeeper... [] -> [127.0.0.1:32841_solr, 127.0.0.1:38337_solr, 127.0.0.1:43439_solr]
   [junit4]   2> 2248504 DEBUG (jetty-launcher-17384-thread-1) [n:127.0.0.1:41041_solr     ] o.a.s.c.c.ZkStateReader clusterStateSet: legacy [0] interesting [0] watched [0] lazy [0] total [0]
   [junit4]   2> 2248505 INFO  (jetty-launcher-17384-thread-1) [n:127.0.0.1:41041_solr     ] o.a.s.c.ZkController Publish node=127.0.0.1:41041_solr as DOWN
   [junit4]   2> 2248506 INFO  (jetty-launcher-17384-thread-1) [n:127.0.0.1:41041_solr     ] o.a.s.c.TransientSolrCoreCacheDefault Allocating transient cache for 2147483647 transient cores
   [junit4]   2> 2248506 INFO  (jetty-launcher-17384-thread-1) [n:127.0.0.1:41041_solr     ] o.a.s.c.ZkController Register node as live in ZooKeeper:/live_nodes/127.0.0.1:41041_solr
   [junit4]   2> 2248506 DEBUG (zkCallback-17421-thread-1) [     ] o.a.s.c.c.ZkStateReader A live node change: [WatchedEvent state:SyncConnected type:NodeChildrenChanged path:/live_nodes], has occurred - updating... (live nodes size: [3])
   [junit4]   2> 2248506 DEBUG (zkCallback-17428-thread-1) [     ] o.a.s.c.c.ZkStateReader A live node change: [WatchedEvent state:SyncConnected type:NodeChildrenChanged path:/live_nodes], has occurred - updating... (live nodes size: [3])
   [junit4]   2> 2248506 DEBUG (zkCallback-17431-thread-1) [     ] o.a.s.c.c.ZkStateReader A live node change: [WatchedEvent state:SyncConnected type:NodeChildrenChanged path:/live_nodes], has occurred - updating... (live nodes size: [3])
   [junit4]   2> 2248506 DEBUG (zkCallback-17441-thread-1) [     ] o.a.s.c.c.ZkStateReader A live node change: [WatchedEvent state:SyncConnected type:NodeChildrenChanged path:/live_nodes], has occurred - updating... (live nodes size: [3])
   [junit4]   2> 2248506 DEBUG (zkCallback-17451-thread-1) [     ] o.a.s.c.c.ZkStateReader A live node change: [WatchedEvent state:SyncConnected type:NodeChildrenChanged path:/live_nodes], has occurred - updating... (live nodes size: [3])
   [junit4]   2> 2248506 DEBUG (zkCallback-17438-thread-1) [     ] o.a.s.c.c.ZkStateReader A live node change: [WatchedEvent state:SyncConnected type:NodeChildrenChanged path:/live_nodes], has occurred - updating... (live nodes size: [3])
   [junit4]   2> 2248506 DEBUG (zkCallback-17448-thread-1) [     ] o.a.s.c.c.ZkStateReader A live node change: [WatchedEvent state:SyncConnected type:NodeChildrenChanged path:/live_nodes], has occurred - updating... (live nodes size: [3])
   [junit4]   2> 2248506 INFO  (zkCallback-17421-thread-1) [     ] o.a.s.c.c.ZkStateReader Updated live nodes from ZooKeeper... (3) -> (4)
   [junit4]   2> 2248506 INFO  (zkCallback-17428-thread-1) [     ] o.a.s.c.c.ZkStateReader Updated live nodes from ZooKeeper... (3) -> (4)
   [junit4]   2> 2248506 DEBUG (zkCallback-17421-thread-1) [     ] o.a.s.c.c.ZkStateReader Updated live nodes from ZooKeeper... [127.0.0.1:32841_solr, 127.0.0.1:38337_solr, 127.0.0.1:43439_solr] -> [127.0.0.1:32841_solr, 127.0.0.1:38337_solr, 127.0.0.1:41041_solr, 127.0.0.1:43439_solr]
   [junit4]   2> 2248506 DEBUG (zkCallback-17428-thread-1) [     ] o.a.s.c.c.ZkStateReader Updated live nodes from ZooKeeper... [127.0.0.1:32841_solr, 127.0.0.1:38337_solr, 127.0.0.1:43439_solr] -> [127.0.0.1:32841_solr, 127.0.0.1:38337_solr, 127.0.0.1:41041_solr, 127.0.0.1:43439_solr]
   [junit4]   2> 2248506 INFO  (zkCallback-17441-thread-1) [     ] o.a.s.c.c.ZkStateReader Updated live nodes from ZooKeeper... (3) -> (4)
   [junit4]   2> 2248506 DEBUG (zkCallback-17441-thread-1) [     ] o.a.s.c.c.ZkStateReader Updated live nodes from ZooKeeper... [127.0.0.1:32841_solr, 127.0.0.1:38337_solr, 127.0.0.1:43439_solr] -> [127.0.0.1:32841_solr, 127.0.0.1:38337_solr, 127.0.0.1:41041_solr, 127.0.0.1:43439_solr]
   [junit4]   2> 2248506 INFO  (zkCallback-17438-thread-1) [     ] o.a.s.c.c.ZkStateReader Updated live nodes from ZooKeeper... (3) -> (4)
   [junit4]   2> 2248506 DEBUG (zkCallback-17438-thread-1) [     ] o.a.s.c.c.ZkStateReader Updated live nodes from ZooKeeper... [127.0.0.1:32841_solr, 127.0.0.1:38337_solr, 127.0.0.1:43439_solr] -> [127.0.0.1:32841_solr, 127.0.0.1:38337_solr, 127.0.0.1:41041_solr, 127.0.0.1:43439_solr]
   [junit4]   2> 2248506 INFO  (zkCallback-17448-thread-1) [     ] o.a.s.c.c.ZkStateReader Updated live nodes from ZooKeeper... (3) -> (4)
   [junit4]   2> 2248506 DEBUG (zkCallback-17448-thread-1) [     ] o.a.s.c.c.ZkStateReader Updated live nodes from ZooKeeper... [127.0.0.1:32841_solr, 127.0.0.1:38337_solr, 127.0.0.1:43439_solr] -> [127.0.0.1:32841_solr, 127.0.0.1:38337_solr, 127.0.0.1:41041_solr, 127.0.0.1:43439_solr]
   [junit4]   2> 2248506 INFO  (zkCallback-17451-thread-1) [     ] o.a.s.c.c.ZkStateReader Updated live nodes from ZooKeeper... (3) -> (4)
   [junit4]   2> 2248506 DEBUG (zkCallback-17451-thread-1) [     ] o.a.s.c.c.ZkStateReader Updated live nodes from ZooKeeper... [127.0.0.1:32841_solr, 127.0.0.1:38337_solr, 127.0.0.1:43439_solr] -> [127.0.0.1:32841_solr, 127.0.0.1:38337_solr, 127.0.0.1:41041_solr, 127.0.0.1:43439_solr]
   [junit4]   2> 2248506 INFO  (zkCallback-17431-thread-1) [     ] o.a.s.c.c.ZkStateReader Updated live nodes from ZooKeeper... (3) -> (4)
   [junit4]   2> 2248506 DEBUG (zkCallback-17431-thread-1) [     ] o.a.s.c.c.ZkStateReader Updated live nodes from ZooKeeper... [127.0.0.1:32841_solr, 127.0.0.1:38337_solr, 127.0.0.1:43439_solr] -> [127.0.0.1:32841_solr, 127.0.0.1:38337_solr, 127.0.0.1:41041_solr, 127.0.0.1:43439_solr]
   [junit4]   2> 2248507 INFO  (jetty-launcher-17384-thread-1) [n:127.0.0.1:41041_solr     ] o.a.s.c.c.ConnectionManager Waiting for client to connect to ZooKeeper
   [junit4]   2> 2248507 INFO  (zkConnectionManagerCallback-17459-thread-1) [     ] o.a.s.c.c.ConnectionManager zkClient has connected
   [junit4]   2> 2248507 INFO  (jetty-launcher-17384-thread-1) [n:127.0.0.1:41041_solr     ] o.a.s.c.c.ConnectionManager Client is connected to ZooKeeper
   [junit4]   2> 2248507 DEBUG (jetty-launcher-17384-thread-1) [n:127.0.0.1:41041_solr     ] o.a.s.c.c.ZkStateReader Updating cluster state from ZooKeeper...
   [junit4]   2> 2248508 DEBUG (jetty-launcher-17384-thread-1) [n:127.0.0.1:41041_solr     ] o.a.s.c.c.ZkStateReader Loaded empty cluster properties
   [junit4]   2> 2248508 INFO  (jetty-launcher-17384-thread-1) [n:127.0.0.1:41041_solr     ] o.a.s.c.c.ZkStateReader Updated live nodes from ZooKeeper... (0) -> (4)
   [junit4]   2> 2248508 DEBUG (jetty-launcher-17384-thread-1) [n:127.0.0.1:41041_solr     ] o.a.s.c.c.ZkStateReader Updated live nodes from ZooKeeper... [] -> [127.0.0.1:32841_solr, 127.0.0.1:38337_solr, 127.0.0.1:41041_solr, 127.0.0.1:43439_solr]
   [junit4]   2> 2248508 DEBUG (jetty-launcher-17384-thread-1) [n:127.0.0.1:41041_solr     ] o.a.s.c.c.ZkStateReader clusterStateSet: legacy [0] interesting [0] watched [0] lazy [0] total [0]
   [junit4]   2> 2248508 INFO  (jetty-launcher-17384-thread-1) [n:127.0.0.1:41041_solr     ] o.a.s.c.s.i.ZkClientClusterStateProvider Cluster at 127.0.0.1:43919/solr ready
   [junit4]   2> 2248508 INFO  (jetty-launcher-17384-thread-1) [n:127.0.0.1:41041_solr     ] o.a.s.c.PackageManager clusterprops.json changed , version -1
   [junit4]   2> 2248518 INFO  (jetty-launcher-17384-thread-1) [n:127.0.0.1:41041_solr     ] o.a.s.h.a.MetricsHistoryHandler No .system collection, keeping metrics history in memory.
   [junit4]   2> 2248527 INFO  (jetty-launcher-17384-thread-1) [n:127.0.0.1:41041_solr     ] o.a.s.m.r.SolrJmxReporter JMX monitoring for 'solr_41041.solr.node' (registry 'solr.node') enabled at server: com.sun.jmx.mbeanserver.JmxMBeanServer@639347fc
   [junit4]   2> 2248531 INFO  (jetty-launcher-17384-thread-1) [n:127.0.0.1:41041_solr     ] o.a.s.m.r.SolrJmxReporter JMX monitoring for 'solr_41041.solr.jvm' (registry 'solr.jvm') enabled at server: com.sun.jmx.mbeanserver.JmxMBeanServer@639347fc
   [junit4]   2> 2248531 INFO  (jetty-launcher-17384-thread-1) [n:127.0.0.1:41041_solr     ] o.a.s.m.r.SolrJmxReporter JMX monitoring for 'solr_41041.solr.jetty' (registry 'solr.jetty') enabled at server: com.sun.jmx.mbeanserver.JmxMBeanServer@639347fc
   [junit4]   2> 2248532 INFO  (jetty-launcher-17384-thread-1) [n:127.0.0.1:41041_solr     ] o.a.s.c.CorePropertiesLocator Found 0 core definitions underneath /home/jenkins/workspace/Lucene-Solr-8.x-Linux/solr/build/solr-core/test/J0/temp/solr.handler.TestContainerReqHandler_51410E953C2360CD-001/tempDir-001/node2/.
   [junit4]   2> 2248563 INFO  (TEST-TestContainerReqHandler.testPluginFrompackage-seed#[51410E953C2360CD]) [     ] o.a.s.c.MiniSolrCloudCluster waitForAllNodes: numServers=4
   [junit4]   2> 2248563 INFO  (TEST-TestContainerReqHandler.testPluginFrompackage-seed#[51410E953C2360CD]) [     ] o.a.s.c.c.ConnectionManager Waiting for client to connect to ZooKeeper
   [junit4]   2> 2248564 INFO  (zkConnectionManagerCallback-17465-thread-1) [     ] o.a.s.c.c.ConnectionManager zkClient has connected
   [junit4]   2> 2248564 INFO  (TEST-TestContainerReqHandler.testPluginFrompackage-seed#[51410E953C2360CD]) [     ] o.a.s.c.c.ConnectionManager Client is connected to ZooKeeper
   [junit4]   2> 2248564 DEBUG (TEST-TestContainerReqHandler.testPluginFrompackage-seed#[51410E953C2360CD]) [     ] o.a.s.c.c.ZkStateReader Updating cluster state from ZooKeeper...
   [junit4]   2> 2248565 DEBUG (TEST-TestContainerReqHandler.testPluginFrompackage-seed#[51410E953C2360CD]) [     ] o.a.s.c.c.ZkStateReader Loaded empty cluster properties
   [junit4]   2> 2248565 INFO  (TEST-TestContainerReqHandler.testPluginFrompackage-seed#[51410E953C2360CD]) [     ] o.a.s.c.c.ZkStateReader Updated live nodes from ZooKeeper... (0) -> (4)
   [junit4]   2> 2248565 DEBUG (TEST-TestContainerReqHandler.testPluginFrompackage-seed#[51410E953C2360CD]) [     ] o.a.s.c.c.ZkStateReader Updated live nodes from ZooKeeper... [] -> [127.0.0.1:32841_solr, 127.0.0.1:38337_solr, 127.0.0.1:41041_solr, 127.0.0.1:43439_solr]
   [junit4]   2> 2248565 DEBUG (TEST-TestContainerReqHandler.testPluginFrompackage-seed#[51410E953C2360CD]) [     ] o.a.s.c.c.ZkStateReader clusterStateSet: legacy [0] interesting [0] watched [0] lazy [0] total [0]
   [junit4]   2> 2248566 INFO  (TEST-TestContainerReqHandler.testPluginFrompackage-seed#[51410E953C2360CD]) [     ] o.a.s.c.s.i.ZkClientClusterStateProvider Cluster at 127.0.0.1:43919/solr ready
   [junit4]   2> 2248568 INFO  (qtp1857550456-44983) [n:127.0.0.1:41041_solr     ] o.a.s.h.a.CollectionsHandler Invoked Collection Action :create with params collection.configName=conf&maxShardsPerNode=100&name=globalLoaderColl&nrtReplicas=1&action=CREATE&numShards=2&wt=javabin&version=2 and sendToOCPQueue=true
   [junit4]   2> 2248571 INFO  (OverseerThreadFactory-11305-thread-1-processing-n:127.0.0.1:38337_solr) [n:127.0.0.1:38337_solr     ] o.a.s.c.a.c.CreateCollectionCmd Create collection globalLoaderColl
   [junit4]   2> 2248571 DEBUG (zkCallback-17428-thread-1) [     ] o.a.s.c.c.ZkStateReader A collections change: [WatchedEvent state:SyncConnected type:NodeChildrenChanged path:/collections], has occurred - updating...
   [junit4]   2> 2248571 DEBUG (zkCallback-17431-thread-1) [     ] o.a.s.c.c.ZkStateReader A collections change: [WatchedEvent state:SyncConnected type:NodeChildrenChanged path:/collections], has occurred - updating...
   [junit4]   2> 2248571 DEBUG (zkCallback-17438-thread-1) [     ] o.a.s.c.c.ZkStateReader A collections change: [WatchedEvent state:SyncConnected type:NodeChildrenChanged path:/collections], has occurred - updating...
   [junit4]   2> 2248571 DEBUG (zkCallback-17441-thread-1) [     ] o.a.s.c.c.ZkStateReader A collections change: [WatchedEvent state:SyncConnected type:NodeChildrenChanged path:/collections], has occurred - updating...
   [junit4]   2> 2248572 DEBUG (zkCallback-17464-thread-1) [     ] o.a.s.c.c.ZkStateReader A collections change: [WatchedEvent state:SyncConnected type:NodeChildrenChanged path:/collections], has occurred - updating...
   [junit4]   2> 2248572 DEBUG (zkCallback-17451-thread-1) [     ] o.a.s.c.c.ZkStateReader A collections change: [WatchedEvent state:SyncConnected type:NodeChildrenChanged path:/collections], has occurred - updating...
   [junit4]   2> 2248572 DEBUG (zkCallback-17428-thread-1) [     ] o.a.s.c.c.ZkStateReader clusterStateSet: legacy [0] interesting [0] watched [0] lazy [1] total [1]
   [junit4]   2> 2248572 DEBUG (zkCallback-17458-thread-1) [     ] o.a.s.c.c.ZkStateReader A collections change: [WatchedEvent state:SyncConnected type:NodeChildrenChanged path:/collections], has occurred - updating...
   [junit4]   2> 2248572 DEBUG (zkCallback-17441-thread-1) [     ] o.a.s.c.c.ZkStateReader clusterStateSet: legacy [0] interesting [0] watched [0] lazy [1] total [1]
   [junit4]   2> 2248572 DEBUG (zkCallback-17421-thread-1) [     ] o.a.s.c.c.ZkStateReader A collections change: [WatchedEvent state:SyncConnected type:NodeChildrenChanged path:/collections], has occurred - updating...
   [junit4]   2> 2248572 DEBUG (zkCallback-17448-thread-1) [     ] o.a.s.c.c.ZkStateReader A collections change: [WatchedEvent state:SyncConnected type:NodeChildrenChanged path:/collections], has occurred - updating...
   [junit4]   2> 2248572 DEBUG (zkCallback-17431-thread-1) [     ] o.a.s.c.c.ZkStateReader clusterStateSet: legacy [0] interesting [0] watched [0] lazy [1] total [1]
   [junit4]   2> 2248572 DEBUG (zkCallback-17438-thread-1) [     ] o.a.s.c.c.ZkStateReader clusterStateSet: legacy [0] interesting [0] watched [0] lazy [1] total [1]
   [junit4]   2> 2248572 DEBUG (zkCallback-17451-thread-1) [     ] o.a.s.c.c.ZkStateReader clusterStateSet: legacy [0] interesting [0] watched [0] lazy [1] total [1]
   [junit4]   2> 2248572 DEBUG (zkCallback-17464-thread-1) [     ] o.a.s.c.c.ZkStateReader clusterStateSet: legacy [0] interesting [0] watched [0] lazy [1] total [1]
   [junit4]   2> 2248572 DEBUG (zkCallback-17448-thread-1) [     ] o.a.s.c.c.ZkStateReader clusterStateSet: legacy [0] interesting [0] watched [0] lazy [1] total [1]
   [junit4]   2> 2248572 DEBUG (zkCallback-17421-thread-1) [     ] o.a.s.c.c.ZkStateReader clusterStateSet: legacy [0] interesting [0] watched [0] lazy [1] total [1]
   [junit4]   2> 2248572 DEBUG (zkCallback-17458-thread-1) [     ] o.a.s.c.c.ZkStateReader clusterStateSet: legacy [0] interesting [0] watched [0] lazy [1] total [1]
   [junit4]   2> 2248676 INFO  (OverseerStateUpdate-72174910463279115-127.0.0.1:38337_solr-n_0000000000) [n:127.0.0.1:38337_solr     ] o.a.s.c.o.SliceMutator createReplica() {
   [junit4]   2>   "operation":"ADDREPLICA",
   [junit4]   2>   "collection":"globalLoaderColl",
   [junit4]   2>   "shard":"shard1",
   [junit4]   2>   "core":"globalLoaderColl_shard1_replica_n1",
   [junit4]   2>   "state":"down",
   [junit4]   2>   "base_url":"http://127.0.0.1:41041/solr",
   [junit4]   2>   "type":"NRT",
   [junit4]   2>   "waitForFinalState":"false"}
   [junit4]   2> 2248677 INFO  (OverseerStateUpdate-72174910463279115-127.0.0.1:38337_solr-n_0000000000) [n:127.0.0.1:38337_solr     ] o.a.s.c.o.SliceMutator createReplica() {
   [junit4]   2>   "operation":"ADDREPLICA",
   [junit4]   2>   "collection":"globalLoaderColl",
   [junit4]   2>   "shard":"shard2",
   [junit4]   2>   "core":"globalLoaderColl_shard2_replica_n2",
   [junit4]   2>   "state":"down",
   [junit4]   2>   "base_url":"http://127.0.0.1:43439/solr",
   [junit4]   2>   "type":"NRT",
   [junit4]   2>   "waitForFinalState":"false"}
   [junit4]   2> 2248879 INFO  (qtp632031267-44984) [n:127.0.0.1:43439_solr    x:globalLoaderColl_shard2_replica_n2 ] o.a.s.h.a.CoreAdminOperation core create command qt=/admin/cores&coreNodeName=core_node4&collection.configName=conf&newCollection=true&name=globalLoaderColl_shard2_replica_n2&action=CREATE&numShards=2&collection=globalLoaderColl&shard=shard2&wt=javabin&version=2&replicaType=NRT
   [junit4]   2> 2248879 INFO  (qtp1857550456-44978) [n:127.0.0.1:41041_solr    x:globalLoaderColl_shard1_replica_n1 ] o.a.s.h.a.CoreAdminOperation core create command qt=/admin/cores&coreNodeName=core_node3&collection.configName=conf&newCollection=true&name=globalLoaderColl_shard1_replica_n1&action=CREATE&numShards=2&collection=globalLoaderColl&shard=shard1&wt=javabin&version=2&replicaType=NRT
   [junit4]   2> 2248880 DEBUG (qtp632031267-44984) [n:127.0.0.1:43439_solr c:globalLoaderColl s:shard2 r:core_node4 x:globalLoaderColl_shard2_replica_n2 ] o.a.s.c.c.ZkStateReader Add data for [globalLoaderColl] ver [1]
   [junit4]   2> 2248880 DEBUG (qtp1857550456-44978) [n:127.0.0.1:41041_solr c:globalLoaderColl s:shard1 r:core_node3 x:globalLoaderColl_shard1_replica_n1 ] o.a.s.c.c.ZkStateReader Add data for [globalLoaderColl] ver [1]
   [junit4]   2> 2248880 DEBUG (qtp1857550456-44978) [n:127.0.0.1:41041_solr c:globalLoaderColl s:shard1 r:core_node3 x:globalLoaderColl_shard1_replica_n1 ] o.a.s.c.c.ZkStateReader clusterStateSet: legacy [0] interesting [1] watched [1] lazy [1] total [1]
   [junit4]   2> 2248880 DEBUG (qtp632031267-44984) [n:127.0.0.1:43439_solr c:globalLoaderColl s:shard2 r:core_node4 x:globalLoaderColl_shard2_replica_n2 ] o.a.s.c.c.ZkStateReader clusterStateSet: legacy [0] interesting [1] watched [1] lazy [1] total [1]
   [junit4]   2> 2248880 DEBUG (qtp632031267-44984) [n:127.0.0.1:43439_solr c:globalLoaderColl s:shard2 r:core_node4 x:globalLoaderColl_shard2_replica_n2 ] o.a.s.c.c.ZkStateReader clusterStateSet: legacy [0] interesting [0] watched [0] lazy [1] total [1]
   [junit4]   2> 2248880 DEBUG (qtp1857550456-44978) [n:127.0.0.1:41041_solr c:globalLoaderColl s:shard1 r:core_node3 x:globalLoaderColl_shard1_replica_n1 ] o.a.s.c.c.ZkStateReader clusterStateSet: legacy [0] interesting [0] watched [0] lazy [1] total [1]
   [junit4]   2> 2248982 DEBUG (zkCallback-17451-thread-1) [     ] o.a.s.c.c.ZkStateReader Uninteresting collection globalLoaderColl
   [junit4]   2> 2248982 DEBUG (zkCallback-17431-thread-1) [     ] o.a.s.c.c.ZkStateReader Uninteresting collection globalLoaderColl
   [junit4]   2> 2249882 DEBUG (qtp632031267-44984) [n:127.0.0.1:43439_solr c:globalLoaderColl s:shard2 r:core_node4 x:globalLoaderColl_shard2_replica_n2 ] o.a.s.c.c.ZkStateReader Loading collection config from: [/collections/globalLoaderColl]
   [junit4]   2> 2249882 DEBUG (qtp1857550456-44978) [n:127.0.0.1:41041_solr c:globalLoaderColl s:shard1 r:core_node3 x:globalLoaderColl_shard1_replica_n1 ] o.a.s.c.c.ZkStateReader Loading collection config from: [/collections/globalLoaderColl]
   [junit4]   2> 2249882 DEBUG (qtp1857550456-44978) [n:127.0.0.1:41041_solr c:globalLoaderColl s:shard1 r:core_node3 x:globalLoaderColl_shard1_replica_n1 ] o.a.s.c.c.ZkStateReader path=[/configs/conf] [configName]=[conf] specified config exists in ZooKeeper
   [junit4]   2> 2249882 DEBUG (qtp632031267-44984) [n:127.0.0.1:43439_solr c:globalLoaderColl s:shard2 r:core_node4 x:globalLoaderColl_shard2_replica_n2 ] o.a.s.c.c.ZkStateReader path=[/configs/conf] [configName]=[conf] specified config exists in ZooKeeper
   [junit4]   2> 2249886 INFO  (qtp1857550456-44978) [n:127.0.0.1:41041_solr c:globalLoaderColl s:shard1 r:core_node3 x:globalLoaderColl_shard1_replica_n1 ] o.a.s.c.SolrConfig Using Lucene MatchVersion: 8.3.0
   [junit4]   2> 2249886 INFO  (qtp632031267-44984) [n:127.0.0.1:43439_solr c:globalLoaderColl s:shard2 r:core_node4 x:globalLoaderColl_shard2_replica_n2 ] o.a.s.c.SolrConfig Using Lucene MatchVersion: 8.3.0
   [junit4]   2> 2249892 INFO  (qtp632031267-44984) [n:127.0.0.1:43439_solr c:globalLoaderColl s:shard2 r:core_node4 x:globalLoaderColl_shard2_replica_n2 ] o.a.s.s.IndexSchema [globalLoaderColl_shard2_replica_n2] Schema name=minimal
   [junit4]   2> 2249892 INFO  (qtp1857550456-44978) [n:127.0.0.1:41041_solr c:globalLoaderColl s:shard1 r:core_node3 x:globalLoaderColl_shard1_replica_n1 ] o.a.s.s.IndexSchema [globalLoaderColl_shard1_replica_n1] Schema name=minimal
   [junit4]   2> 2249894 INFO  (qtp1857550456-44978) [n:127.0.0.1:41041_solr c:globalLoaderColl s:shard1 r:core_node3 x:globalLoaderColl_shard1_replica_n1 ] o.a.s.s.IndexSchema Loaded schema minimal/1.1 with uniqueid field id
   [junit4]   2> 2249894 INFO  (qtp1857550456-44978) [n:127.0.0.1:41041_solr c:globalLoaderColl s:shard1 r:core_node3 x:globalLoaderColl_shard1_replica_n1 ] o.a.s.c.CoreContainer Creating SolrCore 'globalLoaderColl_shard1_replica_n1' using configuration from collection globalLoaderColl, trusted=true
   [junit4]   2> 2249894 INFO  (qtp632031267-44984) [n:127.0.0.1:43439_solr c:globalLoaderColl s:shard2 r:core_node4 x:globalLoaderColl_shard2_replica_n2 ] o.a.s.s.IndexSchema Loaded schema minimal/1.1 with uniqueid field id
   [junit4]   2> 2249894 INFO  (qtp632031267-44984) [n:127.0.0.1:43439_solr c:globalLoaderColl s:shard2 r:core_node4 x:globalLoaderColl_shard2_replica_n2 ] o.a.s.c.CoreContainer Creating SolrCore 'globalLoaderColl_shard2_replica_n2' using configuration from collection globalLoaderColl, trusted=true
   [junit4]   2> 2249894 INFO  (qtp1857550456-44978) [n:127.0.0.1:41041_solr c:globalLoaderColl s:shard1 r:core_node3 x:globalLoaderColl_shard1_replica_n1 ] o.a.s.m.r.SolrJmxReporter JMX monitoring for 'solr_41041.solr.core.globalLoaderColl.shard1.replica_n1' (registry 'solr.core.globalLoaderColl.shard1.replica_n1') enabled at server: com.sun.jmx.mbeanserver.JmxMBeanServer@639347fc
   [junit4]   2> 2249894 INFO  (qtp1857550456-44978) [n:127.0.0.1:41041_solr c:globalLoaderColl s:shard1 r:core_node3 x:globalLoaderColl_shard1_replica_n1 ] o.a.s.c.SolrCore [[globalLoaderColl_shard1_replica_n1] ] Opening new SolrCore at [/home/jenkins/workspace/Lucene-Solr-8.x-Linux/solr/build/solr-core/test/J0/temp/solr.handler.TestContainerReqHandler_51410E953C2360CD-001/tempDir-001/node2/globalLoaderColl_shard1_replica_n1], dataDir=[/home/jenkins/workspace/Lucene-Solr-8.x-Linux/solr/build/solr-core/test/J0/temp/solr.handler.TestContainerReqHandler_51410E953C2360CD-001/tempDir-001/node2/./globalLoaderColl_shard1_replica_n1/data/]
   [junit4]   2> 2249894 INFO  (qtp632031267-44984) [n:127.0.0.1:43439_solr c:globalLoaderColl s:shard2 r:core_node4 x:globalLoaderColl_shard2_replica_n2 ] o.a.s.m.r.SolrJmxReporter JMX monitoring for 'solr_43439.solr.core.globalLoaderColl.shard2.replica_n2' (registry 'solr.core.globalLoaderColl.shard2.replica_n2') enabled at server: com.sun.jmx.mbeanserver.JmxMBeanServer@639347fc
   [junit4]   2> 2249894 INFO  (qtp632031267-44984) [n:127.0.0.1:43439_solr c:globalLoaderColl s:shard2 r:core_node4 x:globalLoaderColl_shard2_replica_n2 ] o.a.s.c.SolrCore [[globalLoaderColl_shard2_replica_n2] ] Opening new SolrCore at [/home/jenkins/workspace/Lucene-Solr-8.x-Linux/solr/build/solr-core/test/J0/temp/solr.handler.TestContainerReqHandler_51410E953C2360CD-001/tempDir-001/node1/globalLoaderColl_shard2_replica_n2], dataDir=[/home/jenkins/workspace/Lucene-Solr-8.x-Linux/solr/build/solr-core/test/J0/temp/solr.handler.TestContainerReqHandler_51410E953C2360CD-001/tempDir-001/node1/./globalLoaderColl_shard2_replica_n2/data/]
   [junit4]   2> 2249927 INFO  (qtp1857550456-44978) [n:127.0.0.1:41041_solr c:globalLoaderColl s:shard1 r:core_node3 x:globalLoaderColl_shard1_replica_n1 ] o.a.s.u.UpdateHandler Using UpdateLog implementation: org.apache.solr.update.UpdateLog
   [junit4]   2> 2249927 INFO  (qtp1857550456-44978) [n:127.0.0.1:41041_solr c:globalLoaderColl s:shard1 r:core_node3 x:globalLoaderColl_shard1_replica_n1 ] o.a.s.u.UpdateLog Initializing UpdateLog: dataDir=null defaultSyncLevel=FLUSH numRecordsToKeep=100 maxNumLogsToKeep=10 numVersionBuckets=65536
   [junit4]   2> 2249927 INFO  (qtp632031267-44984) [n:127.0.0.1:43439_solr c:globalLoaderColl s:shard2 r:core_node4 x:globalLoaderColl_shard2_replica_n2 ] o.a.s.u.UpdateHandler Using UpdateLog implementation: org.apache.solr.update.UpdateLog
   [junit4]   2> 2249927 INFO  (qtp632031267-44984) [n:127.0.0.1:43439_solr c:globalLoaderColl s:shard2 r:core_node

[...truncated too long message...]

ol-1427-thread-1) [     ] o.a.s.c.Overseer Overseer (id=72175025301618701-127.0.0.1:37439_solr-n_0000000000) closing
   [junit4]   2> 74814 INFO  (OverseerStateUpdate-72175025301618701-127.0.0.1:37439_solr-n_0000000000) [n:127.0.0.1:37439_solr     ] o.a.s.c.Overseer Overseer Loop exiting : 127.0.0.1:37439_solr
   [junit4]   2> 74814 DEBUG (zkCallback-1386-thread-1) [     ] o.a.s.c.c.ZkStateReader A live node change: [WatchedEvent state:SyncConnected type:NodeChildrenChanged path:/live_nodes], has occurred - updating... (live nodes size: [4])
   [junit4]   2> 74815 INFO  (OverseerAutoScalingTriggerThread-72175025301618701-127.0.0.1:37439_solr-n_0000000000) [     ] o.a.s.c.a.OverseerTriggerThread OverseerTriggerThread woken up but we are closed, exiting.
   [junit4]   2> 74815 INFO  (zkCallback-1386-thread-1) [     ] o.a.s.c.c.ZkStateReader Updated live nodes from ZooKeeper... (4) -> (1)
   [junit4]   2> 74815 DEBUG (zkCallback-1386-thread-1) [     ] o.a.s.c.c.ZkStateReader Updated live nodes from ZooKeeper... [127.0.0.1:35943_solr, 127.0.0.1:37439_solr, 127.0.0.1:39769_solr, 127.0.0.1:45717_solr] -> [127.0.0.1:45717_solr]
   [junit4]   2> 74815 DEBUG (zkCallback-1371-thread-1) [     ] o.a.s.c.c.ZkStateReader A live node change: [WatchedEvent state:SyncConnected type:NodeChildrenChanged path:/live_nodes], has occurred - updating... (live nodes size: [4])
   [junit4]   2> 74816 INFO  (closeThreadPool-1427-thread-2) [     ] o.a.s.c.Overseer Overseer (id=72175025301618701-127.0.0.1:37439_solr-n_0000000000) closing
   [junit4]   2> 74916 INFO  (jetty-closer-1413-thread-2) [     ] o.a.s.c.Overseer Overseer (id=72175025301618701-127.0.0.1:37439_solr-n_0000000000) closing
   [junit4]   2> 74916 INFO  (zkCallback-1371-thread-1) [     ] o.a.s.c.c.ZkStateReader Updated live nodes from ZooKeeper... (4) -> (1)
   [junit4]   2> 74916 DEBUG (zkCallback-1371-thread-1) [     ] o.a.s.c.c.ZkStateReader Updated live nodes from ZooKeeper... [127.0.0.1:35943_solr, 127.0.0.1:37439_solr, 127.0.0.1:39769_solr, 127.0.0.1:45717_solr] -> [127.0.0.1:45717_solr]
   [junit4]   2> 75017 INFO  (jetty-closer-1413-thread-3) [     ] o.e.j.s.AbstractConnector Stopped ServerConnector@7b21abf4{HTTP/1.1,[http/1.1, h2c]}{127.0.0.1:0}
   [junit4]   2> 75017 INFO  (jetty-closer-1413-thread-3) [     ] o.e.j.s.h.ContextHandler Stopped o.e.j.s.ServletContextHandler@6bd28a77{/solr,null,UNAVAILABLE}
   [junit4]   2> 75017 INFO  (jetty-closer-1413-thread-3) [     ] o.e.j.s.session node0 Stopped scavenging
   [junit4]   2> 75218 INFO  (jetty-closer-1413-thread-1) [     ] o.e.j.s.AbstractConnector Stopped ServerConnector@41255641{HTTP/1.1,[http/1.1, h2c]}{127.0.0.1:0}
   [junit4]   2> 75218 INFO  (jetty-closer-1413-thread-1) [     ] o.e.j.s.h.ContextHandler Stopped o.e.j.s.ServletContextHandler@38da10fa{/solr,null,UNAVAILABLE}
   [junit4]   2> 75218 INFO  (jetty-closer-1413-thread-1) [     ] o.e.j.s.session node0 Stopped scavenging
   [junit4]   2> 75317 INFO  (jetty-closer-1413-thread-4) [     ] o.e.j.s.AbstractConnector Stopped ServerConnector@4379264{HTTP/1.1,[http/1.1, h2c]}{127.0.0.1:0}
   [junit4]   2> 75318 INFO  (jetty-closer-1413-thread-4) [     ] o.e.j.s.h.ContextHandler Stopped o.e.j.s.ServletContextHandler@3086b0cd{/solr,null,UNAVAILABLE}
   [junit4]   2> 75318 INFO  (jetty-closer-1413-thread-4) [     ] o.e.j.s.session node0 Stopped scavenging
   [junit4]   2> 75417 INFO  (jetty-closer-1413-thread-2) [     ] o.e.j.s.AbstractConnector Stopped ServerConnector@2c2ef167{HTTP/1.1,[http/1.1, h2c]}{127.0.0.1:0}
   [junit4]   2> 75417 INFO  (jetty-closer-1413-thread-2) [     ] o.e.j.s.h.ContextHandler Stopped o.e.j.s.ServletContextHandler@5afa7a43{/solr,null,UNAVAILABLE}
   [junit4]   2> 75418 INFO  (jetty-closer-1413-thread-2) [     ] o.e.j.s.session node0 Stopped scavenging
   [junit4]   2> 75418 INFO  (TEST-TestContainerReqHandler.testRuntimeLibWithSig512-seed#[51410E953C2360CD]) [     ] o.a.s.c.ZkTestServer Shutting down ZkTestServer.
   [junit4]   2> 75620 WARN  (ZkTestServer Run Thread) [     ] o.a.s.c.ZkTestServer Watch limit violations:
   [junit4]   2> Maximum concurrent create/delete watches above limit:
   [junit4]   2>
   [junit4]   2> 9 /solr/aliases.json
   [junit4]   2> 9 /solr/clusterprops.json
   [junit4]   2> 4 /solr/security.json
   [junit4]   2>
   [junit4]   2> Maximum concurrent data watches above limit:
   [junit4]   2>
   [junit4]   2> 27 /solr/clusterprops.json
   [junit4]   2> 9 /solr/clusterstate.json
   [junit4]   2>
   [junit4]   2> Maximum concurrent children watches above limit:
   [junit4]   2>
   [junit4]   2> 28 /solr/live_nodes
   [junit4]   2> 9 /solr/collections
   [junit4]   2> 7 /solr/overseer/queue
   [junit4]   2>
   [junit4]   2> 75622 INFO  (TEST-TestContainerReqHandler.testRuntimeLibWithSig512-seed#[51410E953C2360CD]) [     ] o.a.s.c.ZkTestServer waitForServerDown: 127.0.0.1:36169
   [junit4]   2> 75622 INFO  (TEST-TestContainerReqHandler.testRuntimeLibWithSig512-seed#[51410E953C2360CD]) [     ] o.a.s.c.ZkTestServer parse host and port list: 127.0.0.1:36169
   [junit4]   2> 75622 INFO  (TEST-TestContainerReqHandler.testRuntimeLibWithSig512-seed#[51410E953C2360CD]) [     ] o.a.s.c.ZkTestServer connecting to 127.0.0.1 36169
   [junit4]   2> 75622 INFO  (TEST-TestContainerReqHandler.testRuntimeLibWithSig512-seed#[51410E953C2360CD]) [     ] o.a.s.SolrTestCaseJ4 ###Ending testRuntimeLibWithSig512
   [junit4] OK      2.27s J0 | TestContainerReqHandler.testRuntimeLibWithSig512
   [junit4]   2> 75623 INFO  (SUITE-TestContainerReqHandler-seed#[51410E953C2360CD]-worker) [     ] o.a.s.c.ZkTestServer Shutting down ZkTestServer.
   [junit4]   2> 75623 INFO  (SUITE-TestContainerReqHandler-seed#[51410E953C2360CD]-worker) [     ] o.a.s.c.ZkTestServer waitForServerDown: 127.0.0.1:36169
   [junit4]   2> 75623 INFO  (SUITE-TestContainerReqHandler-seed#[51410E953C2360CD]-worker) [     ] o.a.s.c.ZkTestServer parse host and port list: 127.0.0.1:36169
   [junit4]   2> 75623 INFO  (SUITE-TestContainerReqHandler-seed#[51410E953C2360CD]-worker) [     ] o.a.s.c.ZkTestServer connecting to 127.0.0.1 36169
   [junit4]   2> NOTE: leaving temporary files on disk at: /home/jenkins/workspace/Lucene-Solr-8.x-Linux/solr/build/solr-core/test/J0/temp/solr.handler.TestContainerReqHandler_51410E953C2360CD-002
   [junit4]   2> Aug 25, 2019 1:51:43 AM com.carrotsearch.randomizedtesting.ThreadLeakControl checkThreadLeaks
   [junit4]   2> WARNING: Will linger awaiting termination of 1 leaked thread(s).
   [junit4]   2> NOTE: test params are: codec=Asserting(Lucene80): {}, docValues:{}, maxPointsInLeafNode=361, maxMBSortInHeap=7.3793707947022185, sim=Asserting(org.apache.lucene.search.similarities.AssertingSimilarity@4efadee7), locale=ar-SD, timezone=Australia/South
   [junit4]   2> NOTE: Linux 5.0.0-23-generic amd64/Oracle Corporation 1.8.0_201 (64-bit)/cpus=8,threads=1,free=386821104,total=505413632
   [junit4]   2> NOTE: All tests run in this JVM: [TestContainerReqHandler, TestContainerReqHandler]
   [junit4] Completed [5/5 (5!)] on J0 in 33.53s, 6 tests, 1 error <<< FAILURES!
   [junit4]
   [junit4]
   [junit4] Tests with failures [seed: 51410E953C2360CD]:
   [junit4]   - org.apache.solr.handler.TestContainerReqHandler.testCacheLoadFromPackage
   [junit4]   - org.apache.solr.handler.TestContainerReqHandler.testCacheLoadFromPackage
   [junit4]   - org.apache.solr.handler.TestContainerReqHandler.testCacheLoadFromPackage
   [junit4]   - org.apache.solr.handler.TestContainerReqHandler.testCacheLoadFromPackage
   [junit4]   - org.apache.solr.handler.TestContainerReqHandler.testCacheLoadFromPackage
   [junit4]
   [junit4]
   [junit4] JVM J0:     0.72 ..    77.19 =    76.47s
   [junit4] JVM J1:     0.71 ..    76.20 =    75.49s
   [junit4] JVM J2:     0.72 ..    44.44 =    43.72s
   [junit4] Execution time total: 1 minute 17 seconds
   [junit4] Tests summary: 5 suites, 30 tests, 5 errors

BUILD FAILED
/home/jenkins/workspace/Lucene-Solr-8.x-Linux/lucene/common-build.xml:1572: The following error occurred while executing this line:
/home/jenkins/workspace/Lucene-Solr-8.x-Linux/lucene/common-build.xml:1099: There were test failures: 5 suites, 30 tests, 5 errors [seed: 51410E953C2360CD]

Total time: 1 minute 18 seconds

[repro] Setting last failure code to 256

[repro] Failures:
[repro]   5/5 failed: org.apache.solr.handler.TestContainerReqHandler
[repro] Exiting with code 256
+ mv lucene/build lucene/build.repro
+ mv solr/build solr/build.repro
+ mv lucene/build.orig lucene/build
+ mv solr/build.orig solr/build
Archiving artifacts
Setting ANT_1_8_2_HOME=/home/jenkins/tools/hudson.tasks.Ant_AntInstallation/ANT_1.8.2
[WARNINGS] Parsing warnings in console log with parser Java Compiler (javac)
Setting ANT_1_8_2_HOME=/home/jenkins/tools/hudson.tasks.Ant_AntInstallation/ANT_1.8.2
No credentials specified
Setting ANT_1_8_2_HOME=/home/jenkins/tools/hudson.tasks.Ant_AntInstallation/ANT_1.8.2
<Git Blamer> Using GitBlamer to create author and commit information for all warnings.
<Git Blamer> GIT_COMMIT=cac4d012e1a8db4b3033bb902c92222fa932f10f, workspace=/home/jenkins/workspace/Lucene-Solr-8.x-Linux
[WARNINGS] Computing warning deltas based on reference build #1073
Recording test results
Setting ANT_1_8_2_HOME=/home/jenkins/tools/hudson.tasks.Ant_AntInstallation/ANT_1.8.2
Build step 'Publish JUnit test result report' changed build result to UNSTABLE
Email was triggered for: Unstable (Test Failures)
Sending email for trigger: Unstable (Test Failures)
Setting ANT_1_8_2_HOME=/home/jenkins/tools/hudson.tasks.Ant_AntInstallation/ANT_1.8.2
Setting ANT_1_8_2_HOME=/home/jenkins/tools/hudson.tasks.Ant_AntInstallation/ANT_1.8.2
Setting ANT_1_8_2_HOME=/home/jenkins/tools/hudson.tasks.Ant_AntInstallation/ANT_1.8.2
Setting ANT_1_8_2_HOME=/home/jenkins/tools/hudson.tasks.Ant_AntInstallation/ANT_1.8.2
Setting ANT_1_8_2_HOME=/home/jenkins/tools/hudson.tasks.Ant_AntInstallation/ANT_1.8.2
Setting ANT_1_8_2_HOME=/home/jenkins/tools/hudson.tasks.Ant_AntInstallation/ANT_1.8.2


---------------------------------------------------------------------
To unsubscribe, e-mail: [hidden email]
For additional commands, e-mail: [hidden email]