[JENKINS] Lucene-Solr-8.x-MacOSX (64bit/jdk-12.0.1) - Build # 294 - Unstable!

classic Classic list List threaded Threaded
1 message Options
Reply | Threaded
Open this post in threaded view
|

[JENKINS] Lucene-Solr-8.x-MacOSX (64bit/jdk-12.0.1) - Build # 294 - Unstable!

Policeman Jenkins Server-2
Build: https://jenkins.thetaphi.de/job/Lucene-Solr-8.x-MacOSX/294/
Java: 64bit/jdk-12.0.1 -XX:+UseCompressedOops -XX:+UseConcMarkSweepGC

5 tests failed.
FAILED:  org.apache.solr.handler.TestContainerReqHandler.testPackageAPI

Error Message:
attempt: 9 Mismatch for value : '[requestHandler]' in response {   "responseHeader":{     "status":0,     "QTime":0},   "metadata":{"version":3},   "runtimeLib":[{       "name":"global",       "url":"http://localhost:61438/jar3.jar",       "60ec88c2a2e9b409f7afc309273383810a0d07a078b482434eda9674f7e25b8adafa8a67c9913c996cbfb78a7f6ad2b9db26dbd4fe0ca4068f248d5db563f922":"60ec88c2a2e9b409f7afc309273383810a0d07a078b482434eda9674f7e25b8adafa8a67c9913c996cbfb78a7f6ad2b9db26dbd4fe0ca4068f248d5db563f922",       "znodeVersion":3}],   "requestHandler":[{       "name":"bar",       "znodeVersion":3,       "class":"org.apache.solr.core.RuntimeLibReqHandler",       "package":"global"}]}

Stack Trace:
java.lang.AssertionError: attempt: 9 Mismatch for value : '[requestHandler]' in response {
  "responseHeader":{
    "status":0,
    "QTime":0},
  "metadata":{"version":3},
  "runtimeLib":[{
      "name":"global",
      "url":"http://localhost:61438/jar3.jar",
      "60ec88c2a2e9b409f7afc309273383810a0d07a078b482434eda9674f7e25b8adafa8a67c9913c996cbfb78a7f6ad2b9db26dbd4fe0ca4068f248d5db563f922":"60ec88c2a2e9b409f7afc309273383810a0d07a078b482434eda9674f7e25b8adafa8a67c9913c996cbfb78a7f6ad2b9db26dbd4fe0ca4068f248d5db563f922",
      "znodeVersion":3}],
  "requestHandler":[{
      "name":"bar",
      "znodeVersion":3,
      "class":"org.apache.solr.core.RuntimeLibReqHandler",
      "package":"global"}]}
        at __randomizedtesting.SeedInfo.seed([5D1F2F1BE0B8E2C3:2F103A554CE3B8D3]:0)
        at org.junit.Assert.fail(Assert.java:88)
        at org.apache.solr.handler.TestContainerReqHandler.assertResponseValues(TestContainerReqHandler.java:117)
        at org.apache.solr.handler.TestContainerReqHandler.testPackageAPI(TestContainerReqHandler.java:232)
        at java.base/jdk.internal.reflect.NativeMethodAccessorImpl.invoke0(Native Method)
        at java.base/jdk.internal.reflect.NativeMethodAccessorImpl.invoke(NativeMethodAccessorImpl.java:62)
        at java.base/jdk.internal.reflect.DelegatingMethodAccessorImpl.invoke(DelegatingMethodAccessorImpl.java:43)
        at java.base/java.lang.reflect.Method.invoke(Method.java:567)
        at com.carrotsearch.randomizedtesting.RandomizedRunner.invoke(RandomizedRunner.java:1750)
        at com.carrotsearch.randomizedtesting.RandomizedRunner$8.evaluate(RandomizedRunner.java:938)
        at com.carrotsearch.randomizedtesting.RandomizedRunner$9.evaluate(RandomizedRunner.java:974)
        at com.carrotsearch.randomizedtesting.RandomizedRunner$10.evaluate(RandomizedRunner.java:988)
        at com.carrotsearch.randomizedtesting.rules.SystemPropertiesRestoreRule$1.evaluate(SystemPropertiesRestoreRule.java:57)
        at org.apache.lucene.util.TestRuleSetupTeardownChained$1.evaluate(TestRuleSetupTeardownChained.java:49)
        at org.apache.lucene.util.AbstractBeforeAfterRule$1.evaluate(AbstractBeforeAfterRule.java:45)
        at org.apache.lucene.util.TestRuleThreadAndTestName$1.evaluate(TestRuleThreadAndTestName.java:48)
        at org.apache.lucene.util.TestRuleIgnoreAfterMaxFailures$1.evaluate(TestRuleIgnoreAfterMaxFailures.java:64)
        at org.apache.lucene.util.TestRuleMarkFailure$1.evaluate(TestRuleMarkFailure.java:47)
        at com.carrotsearch.randomizedtesting.rules.StatementAdapter.evaluate(StatementAdapter.java:36)
        at com.carrotsearch.randomizedtesting.ThreadLeakControl$StatementRunner.run(ThreadLeakControl.java:368)
        at com.carrotsearch.randomizedtesting.ThreadLeakControl.forkTimeoutingTask(ThreadLeakControl.java:817)
        at com.carrotsearch.randomizedtesting.ThreadLeakControl$3.evaluate(ThreadLeakControl.java:468)
        at com.carrotsearch.randomizedtesting.RandomizedRunner.runSingleTest(RandomizedRunner.java:947)
        at com.carrotsearch.randomizedtesting.RandomizedRunner$5.evaluate(RandomizedRunner.java:832)
        at com.carrotsearch.randomizedtesting.RandomizedRunner$6.evaluate(RandomizedRunner.java:883)
        at com.carrotsearch.randomizedtesting.RandomizedRunner$7.evaluate(RandomizedRunner.java:894)
        at com.carrotsearch.randomizedtesting.rules.StatementAdapter.evaluate(StatementAdapter.java:36)
        at com.carrotsearch.randomizedtesting.rules.SystemPropertiesRestoreRule$1.evaluate(SystemPropertiesRestoreRule.java:57)
        at org.apache.lucene.util.AbstractBeforeAfterRule$1.evaluate(AbstractBeforeAfterRule.java:45)
        at com.carrotsearch.randomizedtesting.rules.StatementAdapter.evaluate(StatementAdapter.java:36)
        at org.apache.lucene.util.TestRuleStoreClassName$1.evaluate(TestRuleStoreClassName.java:41)
        at com.carrotsearch.randomizedtesting.rules.NoShadowingOrOverridesOnMethodsRule$1.evaluate(NoShadowingOrOverridesOnMethodsRule.java:40)
        at com.carrotsearch.randomizedtesting.rules.NoShadowingOrOverridesOnMethodsRule$1.evaluate(NoShadowingOrOverridesOnMethodsRule.java:40)
        at com.carrotsearch.randomizedtesting.rules.StatementAdapter.evaluate(StatementAdapter.java:36)
        at com.carrotsearch.randomizedtesting.rules.StatementAdapter.evaluate(StatementAdapter.java:36)
        at org.apache.lucene.util.TestRuleAssertionsRequired$1.evaluate(TestRuleAssertionsRequired.java:53)
        at org.apache.lucene.util.TestRuleMarkFailure$1.evaluate(TestRuleMarkFailure.java:47)
        at org.apache.lucene.util.TestRuleIgnoreAfterMaxFailures$1.evaluate(TestRuleIgnoreAfterMaxFailures.java:64)
        at org.apache.lucene.util.TestRuleIgnoreTestSuites$1.evaluate(TestRuleIgnoreTestSuites.java:54)
        at com.carrotsearch.randomizedtesting.rules.StatementAdapter.evaluate(StatementAdapter.java:36)
        at com.carrotsearch.randomizedtesting.ThreadLeakControl$StatementRunner.run(ThreadLeakControl.java:368)
        at java.base/java.lang.Thread.run(Thread.java:835)


FAILED:  org.apache.solr.handler.TestContainerReqHandler.testPackageAPI

Error Message:
attempt: 9 Mismatch for value : '[requestHandler]' in response {   "responseHeader":{     "status":0,     "QTime":0},   "metadata":{"version":3},   "runtimeLib":[{       "name":"global",       "url":"http://localhost:61890/jar3.jar",       "60ec88c2a2e9b409f7afc309273383810a0d07a078b482434eda9674f7e25b8adafa8a67c9913c996cbfb78a7f6ad2b9db26dbd4fe0ca4068f248d5db563f922":"60ec88c2a2e9b409f7afc309273383810a0d07a078b482434eda9674f7e25b8adafa8a67c9913c996cbfb78a7f6ad2b9db26dbd4fe0ca4068f248d5db563f922",       "znodeVersion":3}],   "requestHandler":[{       "name":"bar",       "znodeVersion":3,       "class":"org.apache.solr.core.RuntimeLibReqHandler",       "package":"global"}]}

Stack Trace:
java.lang.AssertionError: attempt: 9 Mismatch for value : '[requestHandler]' in response {
  "responseHeader":{
    "status":0,
    "QTime":0},
  "metadata":{"version":3},
  "runtimeLib":[{
      "name":"global",
      "url":"http://localhost:61890/jar3.jar",
      "60ec88c2a2e9b409f7afc309273383810a0d07a078b482434eda9674f7e25b8adafa8a67c9913c996cbfb78a7f6ad2b9db26dbd4fe0ca4068f248d5db563f922":"60ec88c2a2e9b409f7afc309273383810a0d07a078b482434eda9674f7e25b8adafa8a67c9913c996cbfb78a7f6ad2b9db26dbd4fe0ca4068f248d5db563f922",
      "znodeVersion":3}],
  "requestHandler":[{
      "name":"bar",
      "znodeVersion":3,
      "class":"org.apache.solr.core.RuntimeLibReqHandler",
      "package":"global"}]}
        at __randomizedtesting.SeedInfo.seed([5D1F2F1BE0B8E2C3:2F103A554CE3B8D3]:0)
        at org.junit.Assert.fail(Assert.java:88)
        at org.apache.solr.handler.TestContainerReqHandler.assertResponseValues(TestContainerReqHandler.java:117)
        at org.apache.solr.handler.TestContainerReqHandler.testPackageAPI(TestContainerReqHandler.java:232)
        at java.base/jdk.internal.reflect.NativeMethodAccessorImpl.invoke0(Native Method)
        at java.base/jdk.internal.reflect.NativeMethodAccessorImpl.invoke(NativeMethodAccessorImpl.java:62)
        at java.base/jdk.internal.reflect.DelegatingMethodAccessorImpl.invoke(DelegatingMethodAccessorImpl.java:43)
        at java.base/java.lang.reflect.Method.invoke(Method.java:567)
        at com.carrotsearch.randomizedtesting.RandomizedRunner.invoke(RandomizedRunner.java:1750)
        at com.carrotsearch.randomizedtesting.RandomizedRunner$8.evaluate(RandomizedRunner.java:938)
        at com.carrotsearch.randomizedtesting.RandomizedRunner$9.evaluate(RandomizedRunner.java:974)
        at com.carrotsearch.randomizedtesting.RandomizedRunner$10.evaluate(RandomizedRunner.java:988)
        at com.carrotsearch.randomizedtesting.rules.SystemPropertiesRestoreRule$1.evaluate(SystemPropertiesRestoreRule.java:57)
        at org.apache.lucene.util.TestRuleSetupTeardownChained$1.evaluate(TestRuleSetupTeardownChained.java:49)
        at org.apache.lucene.util.AbstractBeforeAfterRule$1.evaluate(AbstractBeforeAfterRule.java:45)
        at org.apache.lucene.util.TestRuleThreadAndTestName$1.evaluate(TestRuleThreadAndTestName.java:48)
        at org.apache.lucene.util.TestRuleIgnoreAfterMaxFailures$1.evaluate(TestRuleIgnoreAfterMaxFailures.java:64)
        at org.apache.lucene.util.TestRuleMarkFailure$1.evaluate(TestRuleMarkFailure.java:47)
        at com.carrotsearch.randomizedtesting.rules.StatementAdapter.evaluate(StatementAdapter.java:36)
        at com.carrotsearch.randomizedtesting.ThreadLeakControl$StatementRunner.run(ThreadLeakControl.java:368)
        at com.carrotsearch.randomizedtesting.ThreadLeakControl.forkTimeoutingTask(ThreadLeakControl.java:817)
        at com.carrotsearch.randomizedtesting.ThreadLeakControl$3.evaluate(ThreadLeakControl.java:468)
        at com.carrotsearch.randomizedtesting.RandomizedRunner.runSingleTest(RandomizedRunner.java:947)
        at com.carrotsearch.randomizedtesting.RandomizedRunner$5.evaluate(RandomizedRunner.java:832)
        at com.carrotsearch.randomizedtesting.RandomizedRunner$6.evaluate(RandomizedRunner.java:883)
        at com.carrotsearch.randomizedtesting.RandomizedRunner$7.evaluate(RandomizedRunner.java:894)
        at com.carrotsearch.randomizedtesting.rules.StatementAdapter.evaluate(StatementAdapter.java:36)
        at com.carrotsearch.randomizedtesting.rules.SystemPropertiesRestoreRule$1.evaluate(SystemPropertiesRestoreRule.java:57)
        at org.apache.lucene.util.AbstractBeforeAfterRule$1.evaluate(AbstractBeforeAfterRule.java:45)
        at com.carrotsearch.randomizedtesting.rules.StatementAdapter.evaluate(StatementAdapter.java:36)
        at org.apache.lucene.util.TestRuleStoreClassName$1.evaluate(TestRuleStoreClassName.java:41)
        at com.carrotsearch.randomizedtesting.rules.NoShadowingOrOverridesOnMethodsRule$1.evaluate(NoShadowingOrOverridesOnMethodsRule.java:40)
        at com.carrotsearch.randomizedtesting.rules.NoShadowingOrOverridesOnMethodsRule$1.evaluate(NoShadowingOrOverridesOnMethodsRule.java:40)
        at com.carrotsearch.randomizedtesting.rules.StatementAdapter.evaluate(StatementAdapter.java:36)
        at com.carrotsearch.randomizedtesting.rules.StatementAdapter.evaluate(StatementAdapter.java:36)
        at org.apache.lucene.util.TestRuleAssertionsRequired$1.evaluate(TestRuleAssertionsRequired.java:53)
        at org.apache.lucene.util.TestRuleMarkFailure$1.evaluate(TestRuleMarkFailure.java:47)
        at org.apache.lucene.util.TestRuleIgnoreAfterMaxFailures$1.evaluate(TestRuleIgnoreAfterMaxFailures.java:64)
        at org.apache.lucene.util.TestRuleIgnoreTestSuites$1.evaluate(TestRuleIgnoreTestSuites.java:54)
        at com.carrotsearch.randomizedtesting.rules.StatementAdapter.evaluate(StatementAdapter.java:36)
        at com.carrotsearch.randomizedtesting.ThreadLeakControl$StatementRunner.run(ThreadLeakControl.java:368)
        at java.base/java.lang.Thread.run(Thread.java:835)


FAILED:  org.apache.solr.handler.TestContainerReqHandler.testPackageAPI

Error Message:
attempt: 9 Mismatch for value : '[requestHandler]' in response {   "responseHeader":{     "status":0,     "QTime":0},   "metadata":{"version":3},   "runtimeLib":[{       "name":"global",       "url":"http://localhost:61963/jar3.jar",       "60ec88c2a2e9b409f7afc309273383810a0d07a078b482434eda9674f7e25b8adafa8a67c9913c996cbfb78a7f6ad2b9db26dbd4fe0ca4068f248d5db563f922":"60ec88c2a2e9b409f7afc309273383810a0d07a078b482434eda9674f7e25b8adafa8a67c9913c996cbfb78a7f6ad2b9db26dbd4fe0ca4068f248d5db563f922",       "znodeVersion":3}],   "requestHandler":[{       "name":"bar",       "znodeVersion":3,       "class":"org.apache.solr.core.RuntimeLibReqHandler",       "package":"global"}]}

Stack Trace:
java.lang.AssertionError: attempt: 9 Mismatch for value : '[requestHandler]' in response {
  "responseHeader":{
    "status":0,
    "QTime":0},
  "metadata":{"version":3},
  "runtimeLib":[{
      "name":"global",
      "url":"http://localhost:61963/jar3.jar",
      "60ec88c2a2e9b409f7afc309273383810a0d07a078b482434eda9674f7e25b8adafa8a67c9913c996cbfb78a7f6ad2b9db26dbd4fe0ca4068f248d5db563f922":"60ec88c2a2e9b409f7afc309273383810a0d07a078b482434eda9674f7e25b8adafa8a67c9913c996cbfb78a7f6ad2b9db26dbd4fe0ca4068f248d5db563f922",
      "znodeVersion":3}],
  "requestHandler":[{
      "name":"bar",
      "znodeVersion":3,
      "class":"org.apache.solr.core.RuntimeLibReqHandler",
      "package":"global"}]}
        at __randomizedtesting.SeedInfo.seed([5D1F2F1BE0B8E2C3:2F103A554CE3B8D3]:0)
        at org.junit.Assert.fail(Assert.java:88)
        at org.apache.solr.handler.TestContainerReqHandler.assertResponseValues(TestContainerReqHandler.java:117)
        at org.apache.solr.handler.TestContainerReqHandler.testPackageAPI(TestContainerReqHandler.java:232)
        at java.base/jdk.internal.reflect.NativeMethodAccessorImpl.invoke0(Native Method)
        at java.base/jdk.internal.reflect.NativeMethodAccessorImpl.invoke(NativeMethodAccessorImpl.java:62)
        at java.base/jdk.internal.reflect.DelegatingMethodAccessorImpl.invoke(DelegatingMethodAccessorImpl.java:43)
        at java.base/java.lang.reflect.Method.invoke(Method.java:567)
        at com.carrotsearch.randomizedtesting.RandomizedRunner.invoke(RandomizedRunner.java:1750)
        at com.carrotsearch.randomizedtesting.RandomizedRunner$8.evaluate(RandomizedRunner.java:938)
        at com.carrotsearch.randomizedtesting.RandomizedRunner$9.evaluate(RandomizedRunner.java:974)
        at com.carrotsearch.randomizedtesting.RandomizedRunner$10.evaluate(RandomizedRunner.java:988)
        at com.carrotsearch.randomizedtesting.rules.SystemPropertiesRestoreRule$1.evaluate(SystemPropertiesRestoreRule.java:57)
        at org.apache.lucene.util.TestRuleSetupTeardownChained$1.evaluate(TestRuleSetupTeardownChained.java:49)
        at org.apache.lucene.util.AbstractBeforeAfterRule$1.evaluate(AbstractBeforeAfterRule.java:45)
        at org.apache.lucene.util.TestRuleThreadAndTestName$1.evaluate(TestRuleThreadAndTestName.java:48)
        at org.apache.lucene.util.TestRuleIgnoreAfterMaxFailures$1.evaluate(TestRuleIgnoreAfterMaxFailures.java:64)
        at org.apache.lucene.util.TestRuleMarkFailure$1.evaluate(TestRuleMarkFailure.java:47)
        at com.carrotsearch.randomizedtesting.rules.StatementAdapter.evaluate(StatementAdapter.java:36)
        at com.carrotsearch.randomizedtesting.ThreadLeakControl$StatementRunner.run(ThreadLeakControl.java:368)
        at com.carrotsearch.randomizedtesting.ThreadLeakControl.forkTimeoutingTask(ThreadLeakControl.java:817)
        at com.carrotsearch.randomizedtesting.ThreadLeakControl$3.evaluate(ThreadLeakControl.java:468)
        at com.carrotsearch.randomizedtesting.RandomizedRunner.runSingleTest(RandomizedRunner.java:947)
        at com.carrotsearch.randomizedtesting.RandomizedRunner$5.evaluate(RandomizedRunner.java:832)
        at com.carrotsearch.randomizedtesting.RandomizedRunner$6.evaluate(RandomizedRunner.java:883)
        at com.carrotsearch.randomizedtesting.RandomizedRunner$7.evaluate(RandomizedRunner.java:894)
        at com.carrotsearch.randomizedtesting.rules.StatementAdapter.evaluate(StatementAdapter.java:36)
        at com.carrotsearch.randomizedtesting.rules.SystemPropertiesRestoreRule$1.evaluate(SystemPropertiesRestoreRule.java:57)
        at org.apache.lucene.util.AbstractBeforeAfterRule$1.evaluate(AbstractBeforeAfterRule.java:45)
        at com.carrotsearch.randomizedtesting.rules.StatementAdapter.evaluate(StatementAdapter.java:36)
        at org.apache.lucene.util.TestRuleStoreClassName$1.evaluate(TestRuleStoreClassName.java:41)
        at com.carrotsearch.randomizedtesting.rules.NoShadowingOrOverridesOnMethodsRule$1.evaluate(NoShadowingOrOverridesOnMethodsRule.java:40)
        at com.carrotsearch.randomizedtesting.rules.NoShadowingOrOverridesOnMethodsRule$1.evaluate(NoShadowingOrOverridesOnMethodsRule.java:40)
        at com.carrotsearch.randomizedtesting.rules.StatementAdapter.evaluate(StatementAdapter.java:36)
        at com.carrotsearch.randomizedtesting.rules.StatementAdapter.evaluate(StatementAdapter.java:36)
        at org.apache.lucene.util.TestRuleAssertionsRequired$1.evaluate(TestRuleAssertionsRequired.java:53)
        at org.apache.lucene.util.TestRuleMarkFailure$1.evaluate(TestRuleMarkFailure.java:47)
        at org.apache.lucene.util.TestRuleIgnoreAfterMaxFailures$1.evaluate(TestRuleIgnoreAfterMaxFailures.java:64)
        at org.apache.lucene.util.TestRuleIgnoreTestSuites$1.evaluate(TestRuleIgnoreTestSuites.java:54)
        at com.carrotsearch.randomizedtesting.rules.StatementAdapter.evaluate(StatementAdapter.java:36)
        at com.carrotsearch.randomizedtesting.ThreadLeakControl$StatementRunner.run(ThreadLeakControl.java:368)
        at java.base/java.lang.Thread.run(Thread.java:835)


FAILED:  org.apache.solr.handler.TestContainerReqHandler.testPackageAPI

Error Message:
attempt: 9 Mismatch for value : '[requestHandler]' in response {   "responseHeader":{     "status":0,     "QTime":0},   "metadata":{"version":3},   "runtimeLib":[{       "name":"global",       "url":"http://localhost:62205/jar3.jar",       "60ec88c2a2e9b409f7afc309273383810a0d07a078b482434eda9674f7e25b8adafa8a67c9913c996cbfb78a7f6ad2b9db26dbd4fe0ca4068f248d5db563f922":"60ec88c2a2e9b409f7afc309273383810a0d07a078b482434eda9674f7e25b8adafa8a67c9913c996cbfb78a7f6ad2b9db26dbd4fe0ca4068f248d5db563f922",       "znodeVersion":3}],   "requestHandler":[{       "name":"bar",       "znodeVersion":3,       "class":"org.apache.solr.core.RuntimeLibReqHandler",       "package":"global"}]}

Stack Trace:
java.lang.AssertionError: attempt: 9 Mismatch for value : '[requestHandler]' in response {
  "responseHeader":{
    "status":0,
    "QTime":0},
  "metadata":{"version":3},
  "runtimeLib":[{
      "name":"global",
      "url":"http://localhost:62205/jar3.jar",
      "60ec88c2a2e9b409f7afc309273383810a0d07a078b482434eda9674f7e25b8adafa8a67c9913c996cbfb78a7f6ad2b9db26dbd4fe0ca4068f248d5db563f922":"60ec88c2a2e9b409f7afc309273383810a0d07a078b482434eda9674f7e25b8adafa8a67c9913c996cbfb78a7f6ad2b9db26dbd4fe0ca4068f248d5db563f922",
      "znodeVersion":3}],
  "requestHandler":[{
      "name":"bar",
      "znodeVersion":3,
      "class":"org.apache.solr.core.RuntimeLibReqHandler",
      "package":"global"}]}
        at __randomizedtesting.SeedInfo.seed([5D1F2F1BE0B8E2C3:2F103A554CE3B8D3]:0)
        at org.junit.Assert.fail(Assert.java:88)
        at org.apache.solr.handler.TestContainerReqHandler.assertResponseValues(TestContainerReqHandler.java:117)
        at org.apache.solr.handler.TestContainerReqHandler.testPackageAPI(TestContainerReqHandler.java:232)
        at java.base/jdk.internal.reflect.NativeMethodAccessorImpl.invoke0(Native Method)
        at java.base/jdk.internal.reflect.NativeMethodAccessorImpl.invoke(NativeMethodAccessorImpl.java:62)
        at java.base/jdk.internal.reflect.DelegatingMethodAccessorImpl.invoke(DelegatingMethodAccessorImpl.java:43)
        at java.base/java.lang.reflect.Method.invoke(Method.java:567)
        at com.carrotsearch.randomizedtesting.RandomizedRunner.invoke(RandomizedRunner.java:1750)
        at com.carrotsearch.randomizedtesting.RandomizedRunner$8.evaluate(RandomizedRunner.java:938)
        at com.carrotsearch.randomizedtesting.RandomizedRunner$9.evaluate(RandomizedRunner.java:974)
        at com.carrotsearch.randomizedtesting.RandomizedRunner$10.evaluate(RandomizedRunner.java:988)
        at com.carrotsearch.randomizedtesting.rules.SystemPropertiesRestoreRule$1.evaluate(SystemPropertiesRestoreRule.java:57)
        at org.apache.lucene.util.TestRuleSetupTeardownChained$1.evaluate(TestRuleSetupTeardownChained.java:49)
        at org.apache.lucene.util.AbstractBeforeAfterRule$1.evaluate(AbstractBeforeAfterRule.java:45)
        at org.apache.lucene.util.TestRuleThreadAndTestName$1.evaluate(TestRuleThreadAndTestName.java:48)
        at org.apache.lucene.util.TestRuleIgnoreAfterMaxFailures$1.evaluate(TestRuleIgnoreAfterMaxFailures.java:64)
        at org.apache.lucene.util.TestRuleMarkFailure$1.evaluate(TestRuleMarkFailure.java:47)
        at com.carrotsearch.randomizedtesting.rules.StatementAdapter.evaluate(StatementAdapter.java:36)
        at com.carrotsearch.randomizedtesting.ThreadLeakControl$StatementRunner.run(ThreadLeakControl.java:368)
        at com.carrotsearch.randomizedtesting.ThreadLeakControl.forkTimeoutingTask(ThreadLeakControl.java:817)
        at com.carrotsearch.randomizedtesting.ThreadLeakControl$3.evaluate(ThreadLeakControl.java:468)
        at com.carrotsearch.randomizedtesting.RandomizedRunner.runSingleTest(RandomizedRunner.java:947)
        at com.carrotsearch.randomizedtesting.RandomizedRunner$5.evaluate(RandomizedRunner.java:832)
        at com.carrotsearch.randomizedtesting.RandomizedRunner$6.evaluate(RandomizedRunner.java:883)
        at com.carrotsearch.randomizedtesting.RandomizedRunner$7.evaluate(RandomizedRunner.java:894)
        at com.carrotsearch.randomizedtesting.rules.StatementAdapter.evaluate(StatementAdapter.java:36)
        at com.carrotsearch.randomizedtesting.rules.SystemPropertiesRestoreRule$1.evaluate(SystemPropertiesRestoreRule.java:57)
        at org.apache.lucene.util.AbstractBeforeAfterRule$1.evaluate(AbstractBeforeAfterRule.java:45)
        at com.carrotsearch.randomizedtesting.rules.StatementAdapter.evaluate(StatementAdapter.java:36)
        at org.apache.lucene.util.TestRuleStoreClassName$1.evaluate(TestRuleStoreClassName.java:41)
        at com.carrotsearch.randomizedtesting.rules.NoShadowingOrOverridesOnMethodsRule$1.evaluate(NoShadowingOrOverridesOnMethodsRule.java:40)
        at com.carrotsearch.randomizedtesting.rules.NoShadowingOrOverridesOnMethodsRule$1.evaluate(NoShadowingOrOverridesOnMethodsRule.java:40)
        at com.carrotsearch.randomizedtesting.rules.StatementAdapter.evaluate(StatementAdapter.java:36)
        at com.carrotsearch.randomizedtesting.rules.StatementAdapter.evaluate(StatementAdapter.java:36)
        at org.apache.lucene.util.TestRuleAssertionsRequired$1.evaluate(TestRuleAssertionsRequired.java:53)
        at org.apache.lucene.util.TestRuleMarkFailure$1.evaluate(TestRuleMarkFailure.java:47)
        at org.apache.lucene.util.TestRuleIgnoreAfterMaxFailures$1.evaluate(TestRuleIgnoreAfterMaxFailures.java:64)
        at org.apache.lucene.util.TestRuleIgnoreTestSuites$1.evaluate(TestRuleIgnoreTestSuites.java:54)
        at com.carrotsearch.randomizedtesting.rules.StatementAdapter.evaluate(StatementAdapter.java:36)
        at com.carrotsearch.randomizedtesting.ThreadLeakControl$StatementRunner.run(ThreadLeakControl.java:368)
        at java.base/java.lang.Thread.run(Thread.java:835)


FAILED:  org.apache.solr.handler.TestContainerReqHandler.testPackageAPI

Error Message:
attempt: 9 Mismatch for value : '[requestHandler]' in response {   "responseHeader":{     "status":0,     "QTime":0},   "metadata":{"version":3},   "runtimeLib":[{       "name":"global",       "url":"http://localhost:50198/jar3.jar",       "60ec88c2a2e9b409f7afc309273383810a0d07a078b482434eda9674f7e25b8adafa8a67c9913c996cbfb78a7f6ad2b9db26dbd4fe0ca4068f248d5db563f922":"60ec88c2a2e9b409f7afc309273383810a0d07a078b482434eda9674f7e25b8adafa8a67c9913c996cbfb78a7f6ad2b9db26dbd4fe0ca4068f248d5db563f922",       "znodeVersion":3}],   "requestHandler":[{       "name":"bar",       "znodeVersion":3,       "class":"org.apache.solr.core.RuntimeLibReqHandler",       "package":"global"}]}

Stack Trace:
java.lang.AssertionError: attempt: 9 Mismatch for value : '[requestHandler]' in response {
  "responseHeader":{
    "status":0,
    "QTime":0},
  "metadata":{"version":3},
  "runtimeLib":[{
      "name":"global",
      "url":"http://localhost:50198/jar3.jar",
      "60ec88c2a2e9b409f7afc309273383810a0d07a078b482434eda9674f7e25b8adafa8a67c9913c996cbfb78a7f6ad2b9db26dbd4fe0ca4068f248d5db563f922":"60ec88c2a2e9b409f7afc309273383810a0d07a078b482434eda9674f7e25b8adafa8a67c9913c996cbfb78a7f6ad2b9db26dbd4fe0ca4068f248d5db563f922",
      "znodeVersion":3}],
  "requestHandler":[{
      "name":"bar",
      "znodeVersion":3,
      "class":"org.apache.solr.core.RuntimeLibReqHandler",
      "package":"global"}]}
        at __randomizedtesting.SeedInfo.seed([5D1F2F1BE0B8E2C3:2F103A554CE3B8D3]:0)
        at org.junit.Assert.fail(Assert.java:88)
        at org.apache.solr.handler.TestContainerReqHandler.assertResponseValues(TestContainerReqHandler.java:117)
        at org.apache.solr.handler.TestContainerReqHandler.testPackageAPI(TestContainerReqHandler.java:232)
        at java.base/jdk.internal.reflect.NativeMethodAccessorImpl.invoke0(Native Method)
        at java.base/jdk.internal.reflect.NativeMethodAccessorImpl.invoke(NativeMethodAccessorImpl.java:62)
        at java.base/jdk.internal.reflect.DelegatingMethodAccessorImpl.invoke(DelegatingMethodAccessorImpl.java:43)
        at java.base/java.lang.reflect.Method.invoke(Method.java:567)
        at com.carrotsearch.randomizedtesting.RandomizedRunner.invoke(RandomizedRunner.java:1750)
        at com.carrotsearch.randomizedtesting.RandomizedRunner$8.evaluate(RandomizedRunner.java:938)
        at com.carrotsearch.randomizedtesting.RandomizedRunner$9.evaluate(RandomizedRunner.java:974)
        at com.carrotsearch.randomizedtesting.RandomizedRunner$10.evaluate(RandomizedRunner.java:988)
        at com.carrotsearch.randomizedtesting.rules.SystemPropertiesRestoreRule$1.evaluate(SystemPropertiesRestoreRule.java:57)
        at org.apache.lucene.util.TestRuleSetupTeardownChained$1.evaluate(TestRuleSetupTeardownChained.java:49)
        at org.apache.lucene.util.AbstractBeforeAfterRule$1.evaluate(AbstractBeforeAfterRule.java:45)
        at org.apache.lucene.util.TestRuleThreadAndTestName$1.evaluate(TestRuleThreadAndTestName.java:48)
        at org.apache.lucene.util.TestRuleIgnoreAfterMaxFailures$1.evaluate(TestRuleIgnoreAfterMaxFailures.java:64)
        at org.apache.lucene.util.TestRuleMarkFailure$1.evaluate(TestRuleMarkFailure.java:47)
        at com.carrotsearch.randomizedtesting.rules.StatementAdapter.evaluate(StatementAdapter.java:36)
        at com.carrotsearch.randomizedtesting.ThreadLeakControl$StatementRunner.run(ThreadLeakControl.java:368)
        at com.carrotsearch.randomizedtesting.ThreadLeakControl.forkTimeoutingTask(ThreadLeakControl.java:817)
        at com.carrotsearch.randomizedtesting.ThreadLeakControl$3.evaluate(ThreadLeakControl.java:468)
        at com.carrotsearch.randomizedtesting.RandomizedRunner.runSingleTest(RandomizedRunner.java:947)
        at com.carrotsearch.randomizedtesting.RandomizedRunner$5.evaluate(RandomizedRunner.java:832)
        at com.carrotsearch.randomizedtesting.RandomizedRunner$6.evaluate(RandomizedRunner.java:883)
        at com.carrotsearch.randomizedtesting.RandomizedRunner$7.evaluate(RandomizedRunner.java:894)
        at com.carrotsearch.randomizedtesting.rules.StatementAdapter.evaluate(StatementAdapter.java:36)
        at com.carrotsearch.randomizedtesting.rules.SystemPropertiesRestoreRule$1.evaluate(SystemPropertiesRestoreRule.java:57)
        at org.apache.lucene.util.AbstractBeforeAfterRule$1.evaluate(AbstractBeforeAfterRule.java:45)
        at com.carrotsearch.randomizedtesting.rules.StatementAdapter.evaluate(StatementAdapter.java:36)
        at org.apache.lucene.util.TestRuleStoreClassName$1.evaluate(TestRuleStoreClassName.java:41)
        at com.carrotsearch.randomizedtesting.rules.NoShadowingOrOverridesOnMethodsRule$1.evaluate(NoShadowingOrOverridesOnMethodsRule.java:40)
        at com.carrotsearch.randomizedtesting.rules.NoShadowingOrOverridesOnMethodsRule$1.evaluate(NoShadowingOrOverridesOnMethodsRule.java:40)
        at com.carrotsearch.randomizedtesting.rules.StatementAdapter.evaluate(StatementAdapter.java:36)
        at com.carrotsearch.randomizedtesting.rules.StatementAdapter.evaluate(StatementAdapter.java:36)
        at org.apache.lucene.util.TestRuleAssertionsRequired$1.evaluate(TestRuleAssertionsRequired.java:53)
        at org.apache.lucene.util.TestRuleMarkFailure$1.evaluate(TestRuleMarkFailure.java:47)
        at org.apache.lucene.util.TestRuleIgnoreAfterMaxFailures$1.evaluate(TestRuleIgnoreAfterMaxFailures.java:64)
        at org.apache.lucene.util.TestRuleIgnoreTestSuites$1.evaluate(TestRuleIgnoreTestSuites.java:54)
        at com.carrotsearch.randomizedtesting.rules.StatementAdapter.evaluate(StatementAdapter.java:36)
        at com.carrotsearch.randomizedtesting.ThreadLeakControl$StatementRunner.run(ThreadLeakControl.java:368)
        at java.base/java.lang.Thread.run(Thread.java:835)




Build Log:
[...truncated 2102 lines...]
   [junit4] JVM J0: stderr was not empty, see: /Users/jenkins/workspace/Lucene-Solr-8.x-MacOSX/lucene/build/core/test/temp/junit4-J0-20190825_105343_15616759460152666375510.syserr
   [junit4] >>> JVM J0 emitted unexpected output (verbatim) ----
   [junit4] OpenJDK 64-Bit Server VM warning: Option UseConcMarkSweepGC was deprecated in version 9.0 and will likely be removed in a future release.
   [junit4] <<< JVM J0: EOF ----

[...truncated 3 lines...]
   [junit4] JVM J1: stderr was not empty, see: /Users/jenkins/workspace/Lucene-Solr-8.x-MacOSX/lucene/build/core/test/temp/junit4-J1-20190825_105343_15716799849145847122446.syserr
   [junit4] >>> JVM J1 emitted unexpected output (verbatim) ----
   [junit4] OpenJDK 64-Bit Server VM warning: Option UseConcMarkSweepGC was deprecated in version 9.0 and will likely be removed in a future release.
   [junit4] <<< JVM J1: EOF ----

[...truncated 296 lines...]
   [junit4] JVM J0: stderr was not empty, see: /Users/jenkins/workspace/Lucene-Solr-8.x-MacOSX/lucene/build/test-framework/test/temp/junit4-J0-20190825_110535_21210273277990921505966.syserr
   [junit4] >>> JVM J0 emitted unexpected output (verbatim) ----
   [junit4] OpenJDK 64-Bit Server VM warning: Option UseConcMarkSweepGC was deprecated in version 9.0 and will likely be removed in a future release.
   [junit4] <<< JVM J0: EOF ----

[...truncated 3 lines...]
   [junit4] JVM J1: stderr was not empty, see: /Users/jenkins/workspace/Lucene-Solr-8.x-MacOSX/lucene/build/test-framework/test/temp/junit4-J1-20190825_110535_2129107113804256755709.syserr
   [junit4] >>> JVM J1 emitted unexpected output (verbatim) ----
   [junit4] OpenJDK 64-Bit Server VM warning: Option UseConcMarkSweepGC was deprecated in version 9.0 and will likely be removed in a future release.
   [junit4] <<< JVM J1: EOF ----

[...truncated 1093 lines...]
   [junit4] JVM J1: stderr was not empty, see: /Users/jenkins/workspace/Lucene-Solr-8.x-MacOSX/lucene/build/analysis/common/test/temp/junit4-J1-20190825_110705_8517556475715612052579.syserr
   [junit4] >>> JVM J1 emitted unexpected output (verbatim) ----
   [junit4] OpenJDK 64-Bit Server VM warning: Option UseConcMarkSweepGC was deprecated in version 9.0 and will likely be removed in a future release.
   [junit4] <<< JVM J1: EOF ----

[...truncated 3 lines...]
   [junit4] JVM J0: stderr was not empty, see: /Users/jenkins/workspace/Lucene-Solr-8.x-MacOSX/lucene/build/analysis/common/test/temp/junit4-J0-20190825_110705_8519821278224659877373.syserr
   [junit4] >>> JVM J0 emitted unexpected output (verbatim) ----
   [junit4] OpenJDK 64-Bit Server VM warning: Option UseConcMarkSweepGC was deprecated in version 9.0 and will likely be removed in a future release.
   [junit4] <<< JVM J0: EOF ----

[...truncated 256 lines...]
   [junit4] JVM J1: stderr was not empty, see: /Users/jenkins/workspace/Lucene-Solr-8.x-MacOSX/lucene/build/analysis/icu/test/temp/junit4-J1-20190825_111039_26715391833654289782247.syserr
   [junit4] >>> JVM J1 emitted unexpected output (verbatim) ----
   [junit4] OpenJDK 64-Bit Server VM warning: Option UseConcMarkSweepGC was deprecated in version 9.0 and will likely be removed in a future release.
   [junit4] <<< JVM J1: EOF ----

[...truncated 3 lines...]
   [junit4] JVM J0: stderr was not empty, see: /Users/jenkins/workspace/Lucene-Solr-8.x-MacOSX/lucene/build/analysis/icu/test/temp/junit4-J0-20190825_111039_2677384154337489939285.syserr
   [junit4] >>> JVM J0 emitted unexpected output (verbatim) ----
   [junit4] OpenJDK 64-Bit Server VM warning: Option UseConcMarkSweepGC was deprecated in version 9.0 and will likely be removed in a future release.
   [junit4] <<< JVM J0: EOF ----

[...truncated 216 lines...]
   [junit4] JVM J1: stderr was not empty, see: /Users/jenkins/workspace/Lucene-Solr-8.x-MacOSX/lucene/build/analysis/kuromoji/test/temp/junit4-J1-20190825_111109_5517202304974591537864.syserr
   [junit4] >>> JVM J1 emitted unexpected output (verbatim) ----
   [junit4] OpenJDK 64-Bit Server VM warning: Option UseConcMarkSweepGC was deprecated in version 9.0 and will likely be removed in a future release.
   [junit4] <<< JVM J1: EOF ----

[...truncated 12 lines...]
   [junit4] JVM J0: stderr was not empty, see: /Users/jenkins/workspace/Lucene-Solr-8.x-MacOSX/lucene/build/analysis/kuromoji/test/temp/junit4-J0-20190825_111109_5517995164845728409707.syserr
   [junit4] >>> JVM J0 emitted unexpected output (verbatim) ----
   [junit4] OpenJDK 64-Bit Server VM warning: Option UseConcMarkSweepGC was deprecated in version 9.0 and will likely be removed in a future release.
   [junit4] <<< JVM J0: EOF ----

[...truncated 162 lines...]
   [junit4] JVM J1: stderr was not empty, see: /Users/jenkins/workspace/Lucene-Solr-8.x-MacOSX/lucene/build/analysis/morfologik/test/temp/junit4-J1-20190825_111159_48812869428659305789216.syserr
   [junit4] >>> JVM J1 emitted unexpected output (verbatim) ----
   [junit4] OpenJDK 64-Bit Server VM warning: Option UseConcMarkSweepGC was deprecated in version 9.0 and will likely be removed in a future release.
   [junit4] <<< JVM J1: EOF ----

[...truncated 3 lines...]
   [junit4] JVM J0: stderr was not empty, see: /Users/jenkins/workspace/Lucene-Solr-8.x-MacOSX/lucene/build/analysis/morfologik/test/temp/junit4-J0-20190825_111159_4884151142807927688748.syserr
   [junit4] >>> JVM J0 emitted unexpected output (verbatim) ----
   [junit4] OpenJDK 64-Bit Server VM warning: Option UseConcMarkSweepGC was deprecated in version 9.0 and will likely be removed in a future release.
   [junit4] <<< JVM J0: EOF ----

[...truncated 188 lines...]
   [junit4] JVM J0: stderr was not empty, see: /Users/jenkins/workspace/Lucene-Solr-8.x-MacOSX/lucene/build/analysis/nori/test/temp/junit4-J0-20190825_111209_7935343458382025035491.syserr
   [junit4] >>> JVM J0 emitted unexpected output (verbatim) ----
   [junit4] OpenJDK 64-Bit Server VM warning: Option UseConcMarkSweepGC was deprecated in version 9.0 and will likely be removed in a future release.
   [junit4] <<< JVM J0: EOF ----

[...truncated 3 lines...]
   [junit4] JVM J1: stderr was not empty, see: /Users/jenkins/workspace/Lucene-Solr-8.x-MacOSX/lucene/build/analysis/nori/test/temp/junit4-J1-20190825_111209_804225836783832366261.syserr
   [junit4] >>> JVM J1 emitted unexpected output (verbatim) ----
   [junit4] OpenJDK 64-Bit Server VM warning: Option UseConcMarkSweepGC was deprecated in version 9.0 and will likely be removed in a future release.
   [junit4] <<< JVM J1: EOF ----

[...truncated 171 lines...]
   [junit4] JVM J0: stderr was not empty, see: /Users/jenkins/workspace/Lucene-Solr-8.x-MacOSX/lucene/build/analysis/opennlp/test/temp/junit4-J0-20190825_111229_22317988048771005040998.syserr
   [junit4] >>> JVM J0 emitted unexpected output (verbatim) ----
   [junit4] OpenJDK 64-Bit Server VM warning: Option UseConcMarkSweepGC was deprecated in version 9.0 and will likely be removed in a future release.
   [junit4] <<< JVM J0: EOF ----

   [junit4] JVM J1: stderr was not empty, see: /Users/jenkins/workspace/Lucene-Solr-8.x-MacOSX/lucene/build/analysis/opennlp/test/temp/junit4-J1-20190825_111229_22314940060375692788545.syserr
   [junit4] >>> JVM J1 emitted unexpected output (verbatim) ----
   [junit4] OpenJDK 64-Bit Server VM warning: Option UseConcMarkSweepGC was deprecated in version 9.0 and will likely be removed in a future release.
   [junit4] <<< JVM J1: EOF ----

[...truncated 179 lines...]
   [junit4] JVM J0: stderr was not empty, see: /Users/jenkins/workspace/Lucene-Solr-8.x-MacOSX/lucene/build/analysis/phonetic/test/temp/junit4-J0-20190825_111236_26912640349119987610337.syserr
   [junit4] >>> JVM J0 emitted unexpected output (verbatim) ----
   [junit4] OpenJDK 64-Bit Server VM warning: Option UseConcMarkSweepGC was deprecated in version 9.0 and will likely be removed in a future release.
   [junit4] <<< JVM J0: EOF ----

   [junit4] JVM J1: stderr was not empty, see: /Users/jenkins/workspace/Lucene-Solr-8.x-MacOSX/lucene/build/analysis/phonetic/test/temp/junit4-J1-20190825_111236_26992869270925299489.syserr
   [junit4] >>> JVM J1 emitted unexpected output (verbatim) ----
   [junit4] OpenJDK 64-Bit Server VM warning: Option UseConcMarkSweepGC was deprecated in version 9.0 and will likely be removed in a future release.
   [junit4] <<< JVM J1: EOF ----

[...truncated 159 lines...]
   [junit4] JVM J0: stderr was not empty, see: /Users/jenkins/workspace/Lucene-Solr-8.x-MacOSX/lucene/build/analysis/smartcn/test/temp/junit4-J0-20190825_111253_92713734361867391075245.syserr
   [junit4] >>> JVM J0 emitted unexpected output (verbatim) ----
   [junit4] OpenJDK 64-Bit Server VM warning: Option UseConcMarkSweepGC was deprecated in version 9.0 and will likely be removed in a future release.
   [junit4] <<< JVM J0: EOF ----

[...truncated 3 lines...]
   [junit4] JVM J1: stderr was not empty, see: /Users/jenkins/workspace/Lucene-Solr-8.x-MacOSX/lucene/build/analysis/smartcn/test/temp/junit4-J1-20190825_111253_9271388226146330665627.syserr
   [junit4] >>> JVM J1 emitted unexpected output (verbatim) ----
   [junit4] OpenJDK 64-Bit Server VM warning: Option UseConcMarkSweepGC was deprecated in version 9.0 and will likely be removed in a future release.
   [junit4] <<< JVM J1: EOF ----

[...truncated 164 lines...]
   [junit4] JVM J1: stderr was not empty, see: /Users/jenkins/workspace/Lucene-Solr-8.x-MacOSX/lucene/build/analysis/stempel/test/temp/junit4-J1-20190825_111308_06213584506402229981197.syserr
   [junit4] >>> JVM J1 emitted unexpected output (verbatim) ----
   [junit4] OpenJDK 64-Bit Server VM warning: Option UseConcMarkSweepGC was deprecated in version 9.0 and will likely be removed in a future release.
   [junit4] <<< JVM J1: EOF ----

[...truncated 3 lines...]
   [junit4] JVM J0: stderr was not empty, see: /Users/jenkins/workspace/Lucene-Solr-8.x-MacOSX/lucene/build/analysis/stempel/test/temp/junit4-J0-20190825_111308_06214695621831356704037.syserr
   [junit4] >>> JVM J0 emitted unexpected output (verbatim) ----
   [junit4] OpenJDK 64-Bit Server VM warning: Option UseConcMarkSweepGC was deprecated in version 9.0 and will likely be removed in a future release.
   [junit4] <<< JVM J0: EOF ----

[...truncated 174 lines...]
   [junit4] JVM J0: stderr was not empty, see: /Users/jenkins/workspace/Lucene-Solr-8.x-MacOSX/lucene/build/backward-codecs/test/temp/junit4-J0-20190825_111316_1989946531665030145686.syserr
   [junit4] >>> JVM J0 emitted unexpected output (verbatim) ----
   [junit4] OpenJDK 64-Bit Server VM warning: Option UseConcMarkSweepGC was deprecated in version 9.0 and will likely be removed in a future release.
   [junit4] <<< JVM J0: EOF ----

[...truncated 29 lines...]
   [junit4] JVM J1: stderr was not empty, see: /Users/jenkins/workspace/Lucene-Solr-8.x-MacOSX/lucene/build/backward-codecs/test/temp/junit4-J1-20190825_111316_19912936116250459173142.syserr
   [junit4] >>> JVM J1 emitted unexpected output (verbatim) ----
   [junit4] OpenJDK 64-Bit Server VM warning: Option UseConcMarkSweepGC was deprecated in version 9.0 and will likely be removed in a future release.
   [junit4] <<< JVM J1: EOF ----

[...truncated 1558 lines...]
   [junit4] JVM J1: stderr was not empty, see: /Users/jenkins/workspace/Lucene-Solr-8.x-MacOSX/lucene/build/benchmark/test/temp/junit4-J1-20190825_111846_9811652836399278192369.syserr
   [junit4] >>> JVM J1 emitted unexpected output (verbatim) ----
   [junit4] OpenJDK 64-Bit Server VM warning: Option UseConcMarkSweepGC was deprecated in version 9.0 and will likely be removed in a future release.
   [junit4] <<< JVM J1: EOF ----

[...truncated 3 lines...]
   [junit4] JVM J0: stderr was not empty, see: /Users/jenkins/workspace/Lucene-Solr-8.x-MacOSX/lucene/build/benchmark/test/temp/junit4-J0-20190825_111846_9815097535730226765289.syserr
   [junit4] >>> JVM J0 emitted unexpected output (verbatim) ----
   [junit4] OpenJDK 64-Bit Server VM warning: Option UseConcMarkSweepGC was deprecated in version 9.0 and will likely be removed in a future release.
   [junit4] <<< JVM J0: EOF ----

[...truncated 251 lines...]
   [junit4] JVM J0: stderr was not empty, see: /Users/jenkins/workspace/Lucene-Solr-8.x-MacOSX/lucene/build/classification/test/temp/junit4-J0-20190825_111901_7773815590960292501133.syserr
   [junit4] >>> JVM J0 emitted unexpected output (verbatim) ----
   [junit4] OpenJDK 64-Bit Server VM warning: Option UseConcMarkSweepGC was deprecated in version 9.0 and will likely be removed in a future release.
   [junit4] <<< JVM J0: EOF ----

[...truncated 3 lines...]
   [junit4] JVM J1: stderr was not empty, see: /Users/jenkins/workspace/Lucene-Solr-8.x-MacOSX/lucene/build/classification/test/temp/junit4-J1-20190825_111901_77717334780773929538986.syserr
   [junit4] >>> JVM J1 emitted unexpected output (verbatim) ----
   [junit4] OpenJDK 64-Bit Server VM warning: Option UseConcMarkSweepGC was deprecated in version 9.0 and will likely be removed in a future release.
   [junit4] <<< JVM J1: EOF ----

[...truncated 259 lines...]
   [junit4] JVM J1: stderr was not empty, see: /Users/jenkins/workspace/Lucene-Solr-8.x-MacOSX/lucene/build/codecs/test/temp/junit4-J1-20190825_111921_9237545292244719618831.syserr
   [junit4] >>> JVM J1 emitted unexpected output (verbatim) ----
   [junit4] OpenJDK 64-Bit Server VM warning: Option UseConcMarkSweepGC was deprecated in version 9.0 and will likely be removed in a future release.
   [junit4] <<< JVM J1: EOF ----

[...truncated 5 lines...]
   [junit4] JVM J0: stderr was not empty, see: /Users/jenkins/workspace/Lucene-Solr-8.x-MacOSX/lucene/build/codecs/test/temp/junit4-J0-20190825_111921_923569466046019566243.syserr
   [junit4] >>> JVM J0 emitted unexpected output (verbatim) ----
   [junit4] OpenJDK 64-Bit Server VM warning: Option UseConcMarkSweepGC was deprecated in version 9.0 and will likely be removed in a future release.
   [junit4] <<< JVM J0: EOF ----

[...truncated 231 lines...]
   [junit4] JVM J0: stderr was not empty, see: /Users/jenkins/workspace/Lucene-Solr-8.x-MacOSX/lucene/build/demo/test/temp/junit4-J0-20190825_112307_55515487424377085896885.syserr
   [junit4] >>> JVM J0 emitted unexpected output (verbatim) ----
   [junit4] OpenJDK 64-Bit Server VM warning: Option UseConcMarkSweepGC was deprecated in version 9.0 and will likely be removed in a future release.
   [junit4] <<< JVM J0: EOF ----

[...truncated 3 lines...]
   [junit4] JVM J1: stderr was not empty, see: /Users/jenkins/workspace/Lucene-Solr-8.x-MacOSX/lucene/build/demo/test/temp/junit4-J1-20190825_112307_55514910059746799087263.syserr
   [junit4] >>> JVM J1 emitted unexpected output (verbatim) ----
   [junit4] OpenJDK 64-Bit Server VM warning: Option UseConcMarkSweepGC was deprecated in version 9.0 and will likely be removed in a future release.
   [junit4] <<< JVM J1: EOF ----

[...truncated 170 lines...]
   [junit4] JVM J0: stderr was not empty, see: /Users/jenkins/workspace/Lucene-Solr-8.x-MacOSX/lucene/build/expressions/test/temp/junit4-J0-20190825_112315_5531936886551987009200.syserr
   [junit4] >>> JVM J0 emitted unexpected output (verbatim) ----
   [junit4] OpenJDK 64-Bit Server VM warning: Option UseConcMarkSweepGC was deprecated in version 9.0 and will likely be removed in a future release.
   [junit4] <<< JVM J0: EOF ----

[...truncated 6 lines...]
   [junit4] JVM J1: stderr was not empty, see: /Users/jenkins/workspace/Lucene-Solr-8.x-MacOSX/lucene/build/expressions/test/temp/junit4-J1-20190825_112315_55716078820039291681604.syserr
   [junit4] >>> JVM J1 emitted unexpected output (verbatim) ----
   [junit4] OpenJDK 64-Bit Server VM warning: Option UseConcMarkSweepGC was deprecated in version 9.0 and will likely be removed in a future release.
   [junit4] <<< JVM J1: EOF ----

[...truncated 234 lines...]
   [junit4] JVM J0: stderr was not empty, see: /Users/jenkins/workspace/Lucene-Solr-8.x-MacOSX/lucene/build/facet/test/temp/junit4-J0-20190825_112327_2044167319311959287411.syserr
   [junit4] >>> JVM J0 emitted unexpected output (verbatim) ----
   [junit4] OpenJDK 64-Bit Server VM warning: Option UseConcMarkSweepGC was deprecated in version 9.0 and will likely be removed in a future release.
   [junit4] <<< JVM J0: EOF ----

[...truncated 3 lines...]
   [junit4] JVM J1: stderr was not empty, see: /Users/jenkins/workspace/Lucene-Solr-8.x-MacOSX/lucene/build/facet/test/temp/junit4-J1-20190825_112327_2044151452210173713789.syserr
   [junit4] >>> JVM J1 emitted unexpected output (verbatim) ----
   [junit4] OpenJDK 64-Bit Server VM warning: Option UseConcMarkSweepGC was deprecated in version 9.0 and will likely be removed in a future release.
   [junit4] <<< JVM J1: EOF ----

[...truncated 182 lines...]
   [junit4] JVM J0: stderr was not empty, see: /Users/jenkins/workspace/Lucene-Solr-8.x-MacOSX/lucene/build/grouping/test/temp/junit4-J0-20190825_112416_50813141258823466404360.syserr
   [junit4] >>> JVM J0 emitted unexpected output (verbatim) ----
   [junit4] OpenJDK 64-Bit Server VM warning: Option UseConcMarkSweepGC was deprecated in version 9.0 and will likely be removed in a future release.
   [junit4] <<< JVM J0: EOF ----

[...truncated 3 lines...]
   [junit4] JVM J1: stderr was not empty, see: /Users/jenkins/workspace/Lucene-Solr-8.x-MacOSX/lucene/build/grouping/test/temp/junit4-J1-20190825_112416_5085357033717370934426.syserr
   [junit4] >>> JVM J1 emitted unexpected output (verbatim) ----
   [junit4] OpenJDK 64-Bit Server VM warning: Option UseConcMarkSweepGC was deprecated in version 9.0 and will likely be removed in a future release.
   [junit4] <<< JVM J1: EOF ----

[...truncated 255 lines...]
   [junit4] JVM J0: stderr was not empty, see: /Users/jenkins/workspace/Lucene-Solr-8.x-MacOSX/lucene/build/highlighter/test/temp/junit4-J0-20190825_112430_21912084119776786073424.syserr
   [junit4] >>> JVM J0 emitted unexpected output (verbatim) ----
   [junit4] OpenJDK 64-Bit Server VM warning: Option UseConcMarkSweepGC was deprecated in version 9.0 and will likely be removed in a future release.
   [junit4] <<< JVM J0: EOF ----

[...truncated 3 lines...]
   [junit4] JVM J1: stderr was not empty, see: /Users/jenkins/workspace/Lucene-Solr-8.x-MacOSX/lucene/build/highlighter/test/temp/junit4-J1-20190825_112430_21911191781647771483309.syserr
   [junit4] >>> JVM J1 emitted unexpected output (verbatim) ----
   [junit4] OpenJDK 64-Bit Server VM warning: Option UseConcMarkSweepGC was deprecated in version 9.0 and will likely be removed in a future release.
   [junit4] <<< JVM J1: EOF ----

[...truncated 169 lines...]
   [junit4] JVM J0: stderr was not empty, see: /Users/jenkins/workspace/Lucene-Solr-8.x-MacOSX/lucene/build/join/test/temp/junit4-J0-20190825_112514_06115026433016387369217.syserr
   [junit4] >>> JVM J0 emitted unexpected output (verbatim) ----
   [junit4] OpenJDK 64-Bit Server VM warning: Option UseConcMarkSweepGC was deprecated in version 9.0 and will likely be removed in a future release.
   [junit4] <<< JVM J0: EOF ----

[...truncated 3 lines...]
   [junit4] JVM J1: stderr was not empty, see: /Users/jenkins/workspace/Lucene-Solr-8.x-MacOSX/lucene/build/join/test/temp/junit4-J1-20190825_112514_0619373960995199025761.syserr
   [junit4] >>> JVM J1 emitted unexpected output (verbatim) ----
   [junit4] OpenJDK 64-Bit Server VM warning: Option UseConcMarkSweepGC was deprecated in version 9.0 and will likely be removed in a future release.
   [junit4] <<< JVM J1: EOF ----

[...truncated 302 lines...]
   [junit4] JVM J0: stderr was not empty, see: /Users/jenkins/workspace/Lucene-Solr-8.x-MacOSX/lucene/build/luke/test/temp/junit4-J0-20190825_112542_39012677465266148708234.syserr
   [junit4] >>> JVM J0 emitted unexpected output (verbatim) ----
   [junit4] OpenJDK 64-Bit Server VM warning: Option UseConcMarkSweepGC was deprecated in version 9.0 and will likely be removed in a future release.
   [junit4] <<< JVM J0: EOF ----

[...truncated 3 lines...]
   [junit4] JVM J1: stderr was not empty, see: /Users/jenkins/workspace/Lucene-Solr-8.x-MacOSX/lucene/build/luke/test/temp/junit4-J1-20190825_112542_3957429137000109774484.syserr
   [junit4] >>> JVM J1 emitted unexpected output (verbatim) ----
   [junit4] OpenJDK 64-Bit Server VM warning: Option UseConcMarkSweepGC was deprecated in version 9.0 and will likely be removed in a future release.
   [junit4] <<< JVM J1: EOF ----

[...truncated 155 lines...]
   [junit4] JVM J0: stderr was not empty, see: /Users/jenkins/workspace/Lucene-Solr-8.x-MacOSX/lucene/build/memory/test/temp/junit4-J0-20190825_112605_23916372669538924383322.syserr
   [junit4] >>> JVM J0 emitted unexpected output (verbatim) ----
   [junit4] OpenJDK 64-Bit Server VM warning: Option UseConcMarkSweepGC was deprecated in version 9.0 and will likely be removed in a future release.
   [junit4] <<< JVM J0: EOF ----

[...truncated 3 lines...]
   [junit4] JVM J1: stderr was not empty, see: /Users/jenkins/workspace/Lucene-Solr-8.x-MacOSX/lucene/build/memory/test/temp/junit4-J1-20190825_112605_2396185894325088560815.syserr
   [junit4] >>> JVM J1 emitted unexpected output (verbatim) ----
   [junit4] OpenJDK 64-Bit Server VM warning: Option UseConcMarkSweepGC was deprecated in version 9.0 and will likely be removed in a future release.
   [junit4] <<< JVM J1: EOF ----

[...truncated 193 lines...]
   [junit4] JVM J1: stderr was not empty, see: /Users/jenkins/workspace/Lucene-Solr-8.x-MacOSX/lucene/build/misc/test/temp/junit4-J1-20190825_112615_3055330265037646395844.syserr
   [junit4] >>> JVM J1 emitted unexpected output (verbatim) ----
   [junit4] OpenJDK 64-Bit Server VM warning: Option UseConcMarkSweepGC was deprecated in version 9.0 and will likely be removed in a future release.
   [junit4] <<< JVM J1: EOF ----

[...truncated 3 lines...]
   [junit4] JVM J0: stderr was not empty, see: /Users/jenkins/workspace/Lucene-Solr-8.x-MacOSX/lucene/build/misc/test/temp/junit4-J0-20190825_112615_30514989813961529974555.syserr
   [junit4] >>> JVM J0 emitted unexpected output (verbatim) ----
   [junit4] OpenJDK 64-Bit Server VM warning: Option UseConcMarkSweepGC was deprecated in version 9.0 and will likely be removed in a future release.
   [junit4] <<< JVM J0: EOF ----

[...truncated 258 lines...]
   [junit4] JVM J1: stderr was not empty, see: /Users/jenkins/workspace/Lucene-Solr-8.x-MacOSX/lucene/build/monitor/test/temp/junit4-J1-20190825_112659_16113243828770758148747.syserr
   [junit4] >>> JVM J1 emitted unexpected output (verbatim) ----
   [junit4] OpenJDK 64-Bit Server VM warning: Option UseConcMarkSweepGC was deprecated in version 9.0 and will likely be removed in a future release.
   [junit4] <<< JVM J1: EOF ----

[...truncated 3 lines...]
   [junit4] JVM J0: stderr was not empty, see: /Users/jenkins/workspace/Lucene-Solr-8.x-MacOSX/lucene/build/monitor/test/temp/junit4-J0-20190825_112659_1611824860665440283488.syserr
   [junit4] >>> JVM J0 emitted unexpected output (verbatim) ----
   [junit4] OpenJDK 64-Bit Server VM warning: Option UseConcMarkSweepGC was deprecated in version 9.0 and will likely be removed in a future release.
   [junit4] <<< JVM J0: EOF ----

[...truncated 324 lines...]
   [junit4] JVM J1: stderr was not empty, see: /Users/jenkins/workspace/Lucene-Solr-8.x-MacOSX/lucene/build/queries/test/temp/junit4-J1-20190825_112714_66816779418280979108584.syserr
   [junit4] >>> JVM J1 emitted unexpected output (verbatim) ----
   [junit4] OpenJDK 64-Bit Server VM warning: Option UseConcMarkSweepGC was deprecated in version 9.0 and will likely be removed in a future release.
   [junit4] <<< JVM J1: EOF ----

   [junit4] JVM J0: stderr was not empty, see: /Users/jenkins/workspace/Lucene-Solr-8.x-MacOSX/lucene/build/queries/test/temp/junit4-J0-20190825_112714_66810268594562737172906.syserr
   [junit4] >>> JVM J0 emitted unexpected output (verbatim) ----
   [junit4] OpenJDK 64-Bit Server VM warning: Option UseConcMarkSweepGC was deprecated in version 9.0 and will likely be removed in a future release.
   [junit4] <<< JVM J0: EOF ----

[...truncated 234 lines...]
   [junit4] JVM J1: stderr was not empty, see: /Users/jenkins/workspace/Lucene-Solr-8.x-MacOSX/lucene/build/queryparser/test/temp/junit4-J1-20190825_112730_5387541042648516468009.syserr
   [junit4] >>> JVM J1 emitted unexpected output (verbatim) ----
   [junit4] OpenJDK 64-Bit Server VM warning: Option UseConcMarkSweepGC was deprecated in version 9.0 and will likely be removed in a future release.
   [junit4] <<< JVM J1: EOF ----

   [junit4] JVM J0: stderr was not empty, see: /Users/jenkins/workspace/Lucene-Solr-8.x-MacOSX/lucene/build/queryparser/test/temp/junit4-J0-20190825_112730_5381562354200774928347.syserr
   [junit4] >>> JVM J0 emitted unexpected output (verbatim) ----
   [junit4] OpenJDK 64-Bit Server VM warning: Option UseConcMarkSweepGC was deprecated in version 9.0 and will likely be removed in a future release.
   [junit4] <<< JVM J0: EOF ----

[...truncated 196 lines...]
   [junit4] JVM J1: stderr was not empty, see: /Users/jenkins/workspace/Lucene-Solr-8.x-MacOSX/lucene/build/replicator/test/temp/junit4-J1-20190825_112746_141841836639395724297.syserr
   [junit4] >>> JVM J1 emitted unexpected output (verbatim) ----
   [junit4] OpenJDK 64-Bit Server VM warning: Option UseConcMarkSweepGC was deprecated in version 9.0 and will likely be removed in a future release.
   [junit4] <<< JVM J1: EOF ----

[...truncated 23 lines...]
   [junit4] JVM J0: stderr was not empty, see: /Users/jenkins/workspace/Lucene-Solr-8.x-MacOSX/lucene/build/replicator/test/temp/junit4-J0-20190825_112746_14016887093172626209651.syserr
   [junit4] >>> JVM J0 emitted unexpected output (verbatim) ----
   [junit4] OpenJDK 64-Bit Server VM warning: Option UseConcMarkSweepGC was deprecated in version 9.0 and will likely be removed in a future release.
   [junit4] <<< JVM J0: EOF ----

[...truncated 278 lines...]
   [junit4] JVM J1: stderr was not empty, see: /Users/jenkins/workspace/Lucene-Solr-8.x-MacOSX/lucene/build/sandbox/test/temp/junit4-J1-20190825_112803_21415493689041233689028.syserr
   [junit4] >>> JVM J1 emitted unexpected output (verbatim) ----
   [junit4] OpenJDK 64-Bit Server VM warning: Option UseConcMarkSweepGC was deprecated in version 9.0 and will likely be removed in a future release.
   [junit4] <<< JVM J1: EOF ----

[...truncated 5 lines...]
   [junit4] JVM J0: stderr was not empty, see: /Users/jenkins/workspace/Lucene-Solr-8.x-MacOSX/lucene/build/sandbox/test/temp/junit4-J0-20190825_112803_21410850225201963977550.syserr
   [junit4] >>> JVM J0 emitted unexpected output (verbatim) ----
   [junit4] OpenJDK 64-Bit Server VM warning: Option UseConcMarkSweepGC was deprecated in version 9.0 and will likely be removed in a future release.
   [junit4] <<< JVM J0: EOF ----

[...truncated 299 lines...]
   [junit4] JVM J0: stderr was not empty, see: /Users/jenkins/workspace/Lucene-Solr-8.x-MacOSX/lucene/build/spatial-extras/test/temp/junit4-J0-20190825_112909_3122284034730622226172.syserr
   [junit4] >>> JVM J0 emitted unexpected output (verbatim) ----
   [junit4] OpenJDK 64-Bit Server VM warning: Option UseConcMarkSweepGC was deprecated in version 9.0 and will likely be removed in a future release.
   [junit4] <<< JVM J0: EOF ----

[...truncated 3 lines...]
   [junit4] JVM J1: stderr was not empty, see: /Users/jenkins/workspace/Lucene-Solr-8.x-MacOSX/lucene/build/spatial-extras/test/temp/junit4-J1-20190825_112909_31212943856881420500425.syserr
   [junit4] >>> JVM J1 emitted unexpected output (verbatim) ----
   [junit4] OpenJDK 64-Bit Server VM warning: Option UseConcMarkSweepGC was deprecated in version 9.0 and will likely be removed in a future release.
   [junit4] <<< JVM J1: EOF ----

[...truncated 151 lines...]
   [junit4] JVM J0: stderr was not empty, see: /Users/jenkins/workspace/Lucene-Solr-8.x-MacOSX/lucene/build/spatial/test/temp/junit4-J0-20190825_113003_02612940254650786642992.syserr
   [junit4] >>> JVM J0 emitted unexpected output (verbatim) ----
   [junit4] OpenJDK 64-Bit Server VM warning: Option UseConcMarkSweepGC was deprecated in version 9.0 and will likely be removed in a future release.
   [junit4] <<< JVM J0: EOF ----

[...truncated 177 lines...]
   [junit4] JVM J0: stderr was not empty, see: /Users/jenkins/workspace/Lucene-Solr-8.x-MacOSX/lucene/build/spatial3d/test/temp/junit4-J0-20190825_113008_4355228086021998831214.syserr
   [junit4] >>> JVM J0 emitted unexpected output (verbatim) ----
   [junit4] OpenJDK 64-Bit Server VM warning: Option UseConcMarkSweepGC was deprecated in version 9.0 and will likely be removed in a future release.
   [junit4] <<< JVM J0: EOF ----

[...truncated 14 lines...]
   [junit4] JVM J1: stderr was not empty, see: /Users/jenkins/workspace/Lucene-Solr-8.x-MacOSX/lucene/build/spatial3d/test/temp/junit4-J1-20190825_113008_43515186887465850947480.syserr
   [junit4] >>> JVM J1 emitted unexpected output (verbatim) ----
   [junit4] OpenJDK 64-Bit Server VM warning: Option UseConcMarkSweepGC was deprecated in version 9.0 and will likely be removed in a future release.
   [junit4] <<< JVM J1: EOF ----

[...truncated 255 lines...]
   [junit4] JVM J0: stderr was not empty, see: /Users/jenkins/workspace/Lucene-Solr-8.x-MacOSX/lucene/build/suggest/test/temp/junit4-J0-20190825_113048_5091816326454326659427.syserr
   [junit4] >>> JVM J0 emitted unexpected output (verbatim) ----
   [junit4] OpenJDK 64-Bit Server VM warning: Option UseConcMarkSweepGC was deprecated in version 9.0 and will likely be removed in a future release.
   [junit4] <<< JVM J0: EOF ----

[...truncated 9 lines...]
   [junit4] JVM J1: stderr was not empty, see: /Users/jenkins/workspace/Lucene-Solr-8.x-MacOSX/lucene/build/suggest/test/temp/junit4-J1-20190825_113048_50913222051781189753507.syserr
   [junit4] >>> JVM J1 emitted unexpected output (verbatim) ----
   [junit4] OpenJDK 64-Bit Server VM warning: Option UseConcMarkSweepGC was deprecated in version 9.0 and will likely be removed in a future release.
   [junit4] <<< JVM J1: EOF ----

[...truncated 3927 lines...]
   [junit4] Suite: org.apache.solr.handler.TestContainerReqHandler
   [junit4]   2> 4563260 INFO  (TEST-TestContainerReqHandler.testSetClusterReqHandler-seed#[5D1F2F1BE0B8E2C3]) [     ] o.a.s.c.MiniSolrCloudCluster Starting cluster of 4 servers in /Users/jenkins/workspace/Lucene-Solr-8.x-MacOSX/solr/build/solr-core/test/J0/temp/solr.handler.TestContainerReqHandler_5D1F2F1BE0B8E2C3-001/tempDir-001
   [junit4]   2> 4563261 INFO  (TEST-TestContainerReqHandler.testSetClusterReqHandler-seed#[5D1F2F1BE0B8E2C3]) [     ] o.a.s.c.ZkTestServer STARTING ZK TEST SERVER
   [junit4]   2> 4563261 INFO  (ZkTestServer Run Thread) [     ] o.a.s.c.ZkTestServer client port:0.0.0.0/0.0.0.0:0
   [junit4]   2> 4563261 INFO  (ZkTestServer Run Thread) [     ] o.a.s.c.ZkTestServer Starting server
   [junit4]   2> 4563362 INFO  (TEST-TestContainerReqHandler.testSetClusterReqHandler-seed#[5D1F2F1BE0B8E2C3]) [     ] o.a.s.c.ZkTestServer start zk server on port:49965
   [junit4]   2> 4563363 INFO  (TEST-TestContainerReqHandler.testSetClusterReqHandler-seed#[5D1F2F1BE0B8E2C3]) [     ] o.a.s.c.ZkTestServer waitForServerUp: 127.0.0.1:49965
   [junit4]   2> 4563363 INFO  (TEST-TestContainerReqHandler.testSetClusterReqHandler-seed#[5D1F2F1BE0B8E2C3]) [     ] o.a.s.c.ZkTestServer parse host and port list: 127.0.0.1:49965
   [junit4]   2> 4563363 INFO  (TEST-TestContainerReqHandler.testSetClusterReqHandler-seed#[5D1F2F1BE0B8E2C3]) [     ] o.a.s.c.ZkTestServer connecting to 127.0.0.1 49965
   [junit4]   2> 4563364 INFO  (TEST-TestContainerReqHandler.testSetClusterReqHandler-seed#[5D1F2F1BE0B8E2C3]) [     ] o.a.s.c.c.ConnectionManager Waiting for client to connect to ZooKeeper
   [junit4]   2> 4563377 INFO  (zkConnectionManagerCallback-22656-thread-1) [     ] o.a.s.c.c.ConnectionManager zkClient has connected
   [junit4]   2> 4563377 INFO  (TEST-TestContainerReqHandler.testSetClusterReqHandler-seed#[5D1F2F1BE0B8E2C3]) [     ] o.a.s.c.c.ConnectionManager Client is connected to ZooKeeper
   [junit4]   2> 4563381 INFO  (TEST-TestContainerReqHandler.testSetClusterReqHandler-seed#[5D1F2F1BE0B8E2C3]) [     ] o.a.s.c.c.ConnectionManager Waiting for client to connect to ZooKeeper
   [junit4]   2> 4563383 INFO  (zkConnectionManagerCallback-22658-thread-1) [     ] o.a.s.c.c.ConnectionManager zkClient has connected
   [junit4]   2> 4563383 INFO  (TEST-TestContainerReqHandler.testSetClusterReqHandler-seed#[5D1F2F1BE0B8E2C3]) [     ] o.a.s.c.c.ConnectionManager Client is connected to ZooKeeper
   [junit4]   2> 4563384 INFO  (TEST-TestContainerReqHandler.testSetClusterReqHandler-seed#[5D1F2F1BE0B8E2C3]) [     ] o.a.s.c.c.ConnectionManager Waiting for client to connect to ZooKeeper
   [junit4]   2> 4563385 INFO  (zkConnectionManagerCallback-22660-thread-1) [     ] o.a.s.c.c.ConnectionManager zkClient has connected
   [junit4]   2> 4563385 INFO  (TEST-TestContainerReqHandler.testSetClusterReqHandler-seed#[5D1F2F1BE0B8E2C3]) [     ] o.a.s.c.c.ConnectionManager Client is connected to ZooKeeper
   [junit4]   2> 4563501 WARN  (jetty-launcher-22661-thread-1) [     ] o.e.j.s.AbstractConnector Ignoring deprecated socket close linger time
   [junit4]   2> 4563501 WARN  (jetty-launcher-22661-thread-2) [     ] o.e.j.s.AbstractConnector Ignoring deprecated socket close linger time
   [junit4]   2> 4563501 INFO  (jetty-launcher-22661-thread-1) [     ] o.a.s.c.s.e.JettySolrRunner Start Jetty (original configured port=0)
   [junit4]   2> 4563501 INFO  (jetty-launcher-22661-thread-1) [     ] o.a.s.c.s.e.JettySolrRunner Trying to start Jetty on port 0 try number 1 ...
   [junit4]   2> 4563501 INFO  (jetty-launcher-22661-thread-2) [     ] o.a.s.c.s.e.JettySolrRunner Start Jetty (original configured port=0)
   [junit4]   2> 4563501 INFO  (jetty-launcher-22661-thread-2) [     ] o.a.s.c.s.e.JettySolrRunner Trying to start Jetty on port 0 try number 1 ...
   [junit4]   2> 4563501 INFO  (jetty-launcher-22661-thread-1) [     ] o.e.j.s.Server jetty-9.4.19.v20190610; built: 2019-06-10T16:30:51.723Z; git: afcf563148970e98786327af5e07c261fda175d3; jvm 12.0.1+12
   [junit4]   2> 4563501 INFO  (jetty-launcher-22661-thread-2) [     ] o.e.j.s.Server jetty-9.4.19.v20190610; built: 2019-06-10T16:30:51.723Z; git: afcf563148970e98786327af5e07c261fda175d3; jvm 12.0.1+12
   [junit4]   2> 4563502 WARN  (jetty-launcher-22661-thread-3) [     ] o.e.j.s.AbstractConnector Ignoring deprecated socket close linger time
   [junit4]   2> 4563502 WARN  (jetty-launcher-22661-thread-4) [     ] o.e.j.s.AbstractConnector Ignoring deprecated socket close linger time
   [junit4]   2> 4563502 INFO  (jetty-launcher-22661-thread-3) [     ] o.a.s.c.s.e.JettySolrRunner Start Jetty (original configured port=0)
   [junit4]   2> 4563502 INFO  (jetty-launcher-22661-thread-3) [     ] o.a.s.c.s.e.JettySolrRunner Trying to start Jetty on port 0 try number 1 ...
   [junit4]   2> 4563502 INFO  (jetty-launcher-22661-thread-4) [     ] o.a.s.c.s.e.JettySolrRunner Start Jetty (original configured port=0)
   [junit4]   2> 4563502 INFO  (jetty-launcher-22661-thread-4) [     ] o.a.s.c.s.e.JettySolrRunner Trying to start Jetty on port 0 try number 1 ...
   [junit4]   2> 4563502 INFO  (jetty-launcher-22661-thread-3) [     ] o.e.j.s.Server jetty-9.4.19.v20190610; built: 2019-06-10T16:30:51.723Z; git: afcf563148970e98786327af5e07c261fda175d3; jvm 12.0.1+12
   [junit4]   2> 4563502 INFO  (jetty-launcher-22661-thread-4) [     ] o.e.j.s.Server jetty-9.4.19.v20190610; built: 2019-06-10T16:30:51.723Z; git: afcf563148970e98786327af5e07c261fda175d3; jvm 12.0.1+12
   [junit4]   2> 4563505 INFO  (jetty-launcher-22661-thread-4) [     ] o.e.j.s.session DefaultSessionIdManager workerName=node0
   [junit4]   2> 4563505 INFO  (jetty-launcher-22661-thread-4) [     ] o.e.j.s.session No SessionScavenger set, using defaults
   [junit4]   2> 4563505 INFO  (jetty-launcher-22661-thread-4) [     ] o.e.j.s.session node0 Scavenging every 600000ms
   [junit4]   2> 4563506 INFO  (jetty-launcher-22661-thread-4) [     ] o.e.j.s.h.ContextHandler Started o.e.j.s.ServletContextHandler@46a09bdc{/solr,null,AVAILABLE}
   [junit4]   2> 4563506 INFO  (jetty-launcher-22661-thread-3) [     ] o.e.j.s.session DefaultSessionIdManager workerName=node0
   [junit4]   2> 4563506 INFO  (jetty-launcher-22661-thread-3) [     ] o.e.j.s.session No SessionScavenger set, using defaults
   [junit4]   2> 4563506 INFO  (jetty-launcher-22661-thread-3) [     ] o.e.j.s.session node0 Scavenging every 660000ms
   [junit4]   2> 4563506 INFO  (jetty-launcher-22661-thread-4) [     ] o.e.j.s.AbstractConnector Started ServerConnector@4799e71b{HTTP/1.1,[http/1.1, h2c]}{127.0.0.1:49970}
   [junit4]   2> 4563506 INFO  (jetty-launcher-22661-thread-4) [     ] o.e.j.s.Server Started @4563560ms
   [junit4]   2> 4563506 INFO  (jetty-launcher-22661-thread-4) [     ] o.a.s.c.s.e.JettySolrRunner Jetty properties: {hostContext=/solr, hostPort=49970}
   [junit4]   2> 4563506 ERROR (jetty-launcher-22661-thread-4) [     ] o.a.s.u.StartupLoggingUtils Missing Java Option solr.log.dir. Logging may be missing or incomplete.
   [junit4]   2> 4563506 INFO  (jetty-launcher-22661-thread-4) [     ] o.a.s.s.SolrDispatchFilter Using logger factory org.apache.logging.slf4j.Log4jLoggerFactory
   [junit4]   2> 4563507 INFO  (jetty-launcher-22661-thread-4) [     ] o.a.s.s.SolrDispatchFilter  ___      _       Welcome to Apache Solr™ version 8.3.0
   [junit4]   2> 4563507 INFO  (jetty-launcher-22661-thread-4) [     ] o.a.s.s.SolrDispatchFilter / __| ___| |_ _   Starting in cloud mode on port null
   [junit4]   2> 4563507 INFO  (jetty-launcher-22661-thread-4) [     ] o.a.s.s.SolrDispatchFilter \__ \/ _ \ | '_|  Install dir: null
   [junit4]   2> 4563507 INFO  (jetty-launcher-22661-thread-4) [     ] o.a.s.s.SolrDispatchFilter |___/\___/_|_|    Start time: 2019-08-25T12:48:52.249079Z
   [junit4]   2> 4563507 INFO  (jetty-launcher-22661-thread-2) [     ] o.e.j.s.session DefaultSessionIdManager workerName=node0
   [junit4]   2> 4563507 INFO  (jetty-launcher-22661-thread-2) [     ] o.e.j.s.session No SessionScavenger set, using defaults
   [junit4]   2> 4563507 INFO  (jetty-launcher-22661-thread-2) [     ] o.e.j.s.session node0 Scavenging every 600000ms
   [junit4]   2> 4563507 INFO  (jetty-launcher-22661-thread-3) [     ] o.e.j.s.h.ContextHandler Started o.e.j.s.ServletContextHandler@3f336215{/solr,null,AVAILABLE}
   [junit4]   2> 4563507 INFO  (jetty-launcher-22661-thread-3) [     ] o.e.j.s.AbstractConnector Started ServerConnector@f19105{HTTP/1.1,[http/1.1, h2c]}{127.0.0.1:49971}
   [junit4]   2> 4563507 INFO  (jetty-launcher-22661-thread-3) [     ] o.e.j.s.Server Started @4563561ms
   [junit4]   2> 4563507 INFO  (jetty-launcher-22661-thread-3) [     ] o.a.s.c.s.e.JettySolrRunner Jetty properties: {hostContext=/solr, hostPort=49971}
   [junit4]   2> 4563507 INFO  (jetty-launcher-22661-thread-2) [     ] o.e.j.s.h.ContextHandler Started o.e.j.s.ServletContextHandler@66f6d348{/solr,null,AVAILABLE}
   [junit4]   2> 4563508 ERROR (jetty-launcher-22661-thread-3) [     ] o.a.s.u.StartupLoggingUtils Missing Java Option solr.log.dir. Logging may be missing or incomplete.
   [junit4]   2> 4563508 INFO  (jetty-launcher-22661-thread-3) [     ] o.a.s.s.SolrDispatchFilter Using logger factory org.apache.logging.slf4j.Log4jLoggerFactory
   [junit4]   2> 4563508 INFO  (jetty-launcher-22661-thread-3) [     ] o.a.s.s.SolrDispatchFilter  ___      _       Welcome to Apache Solr™ version 8.3.0
   [junit4]   2> 4563508 INFO  (jetty-launcher-22661-thread-2) [     ] o.e.j.s.AbstractConnector Started ServerConnector@cb710f8{HTTP/1.1,[http/1.1, h2c]}{127.0.0.1:49972}
   [junit4]   2> 4563508 INFO  (jetty-launcher-22661-thread-3) [     ] o.a.s.s.SolrDispatchFilter / __| ___| |_ _   Starting in cloud mode on port null
   [junit4]   2> 4563508 INFO  (jetty-launcher-22661-thread-2) [     ] o.e.j.s.Server Started @4563562ms
   [junit4]   2> 4563508 INFO  (jetty-launcher-22661-thread-3) [     ] o.a.s.s.SolrDispatchFilter \__ \/ _ \ | '_|  Install dir: null
   [junit4]   2> 4563508 INFO  (jetty-launcher-22661-thread-3) [     ] o.a.s.s.SolrDispatchFilter |___/\___/_|_|    Start time: 2019-08-25T12:48:52.250246Z
   [junit4]   2> 4563508 INFO  (jetty-launcher-22661-thread-2) [     ] o.a.s.c.s.e.JettySolrRunner Jetty properties: {hostContext=/solr, hostPort=49972}
   [junit4]   2> 4563508 ERROR (jetty-launcher-22661-thread-2) [     ] o.a.s.u.StartupLoggingUtils Missing Java Option solr.log.dir. Logging may be missing or incomplete.
   [junit4]   2> 4563508 INFO  (jetty-launcher-22661-thread-2) [     ] o.a.s.s.SolrDispatchFilter Using logger factory org.apache.logging.slf4j.Log4jLoggerFactory
   [junit4]   2> 4563508 INFO  (jetty-launcher-22661-thread-4) [     ] o.a.s.c.c.ConnectionManager Waiting for client to connect to ZooKeeper
   [junit4]   2> 4563508 INFO  (jetty-launcher-22661-thread-2) [     ] o.a.s.s.SolrDispatchFilter  ___      _       Welcome to Apache Solr™ version 8.3.0
   [junit4]   2> 4563508 INFO  (jetty-launcher-22661-thread-2) [     ] o.a.s.s.SolrDispatchFilter / __| ___| |_ _   Starting in cloud mode on port null
   [junit4]   2> 4563508 INFO  (jetty-launcher-22661-thread-2) [     ] o.a.s.s.SolrDispatchFilter \__ \/ _ \ | '_|  Install dir: null
   [junit4]   2> 4563508 INFO  (jetty-launcher-22661-thread-2) [     ] o.a.s.s.SolrDispatchFilter |___/\___/_|_|    Start time: 2019-08-25T12:48:52.250667Z
   [junit4]   2> 4563509 INFO  (jetty-launcher-22661-thread-2) [     ] o.a.s.c.c.ConnectionManager Waiting for client to connect to ZooKeeper
   [junit4]   2> 4563510 INFO  (jetty-launcher-22661-thread-3) [     ] o.a.s.c.c.ConnectionManager Waiting for client to connect to ZooKeeper
   [junit4]   2> 4563510 INFO  (jetty-launcher-22661-thread-1) [     ] o.e.j.s.session DefaultSessionIdManager workerName=node0
   [junit4]   2> 4563510 INFO  (jetty-launcher-22661-thread-1) [     ] o.e.j.s.session No SessionScavenger set, using defaults
   [junit4]   2> 4563510 INFO  (jetty-launcher-22661-thread-1) [     ] o.e.j.s.session node0 Scavenging every 660000ms
   [junit4]   2> 4563510 INFO  (jetty-launcher-22661-thread-1) [     ] o.e.j.s.h.ContextHandler Started o.e.j.s.ServletContextHandler@721d1180{/solr,null,AVAILABLE}
   [junit4]   2> 4563511 INFO  (jetty-launcher-22661-thread-1) [     ] o.e.j.s.AbstractConnector Started ServerConnector@24979e8f{HTTP/1.1,[http/1.1, h2c]}{127.0.0.1:49973}
   [junit4]   2> 4563511 INFO  (jetty-launcher-22661-thread-1) [     ] o.e.j.s.Server Started @4563564ms
   [junit4]   2> 4563511 INFO  (jetty-launcher-22661-thread-1) [     ] o.a.s.c.s.e.JettySolrRunner Jetty properties: {hostContext=/solr, hostPort=49973}
   [junit4]   2> 4563511 ERROR (jetty-launcher-22661-thread-1) [     ] o.a.s.u.StartupLoggingUtils Missing Java Option solr.log.dir. Logging may be missing or incomplete.
   [junit4]   2> 4563511 INFO  (jetty-launcher-22661-thread-1) [     ] o.a.s.s.SolrDispatchFilter Using logger factory org.apache.logging.slf4j.Log4jLoggerFactory
   [junit4]   2> 4563511 INFO  (jetty-launcher-22661-thread-1) [     ] o.a.s.s.SolrDispatchFilter  ___      _       Welcome to Apache Solr™ version 8.3.0
   [junit4]   2> 4563511 INFO  (jetty-launcher-22661-thread-1) [     ] o.a.s.s.SolrDispatchFilter / __| ___| |_ _   Starting in cloud mode on port null
   [junit4]   2> 4563511 INFO  (jetty-launcher-22661-thread-1) [     ] o.a.s.s.SolrDispatchFilter \__ \/ _ \ | '_|  Install dir: null
   [junit4]   2> 4563511 INFO  (jetty-launcher-22661-thread-1) [     ] o.a.s.s.SolrDispatchFilter |___/\___/_|_|    Start time: 2019-08-25T12:48:52.253567Z
   [junit4]   2> 4563512 INFO  (jetty-launcher-22661-thread-1) [     ] o.a.s.c.c.ConnectionManager Waiting for client to connect to ZooKeeper
   [junit4]   2> 4563513 INFO  (zkConnectionManagerCallback-22663-thread-1) [     ] o.a.s.c.c.ConnectionManager zkClient has connected
   [junit4]   2> 4563513 INFO  (jetty-launcher-22661-thread-4) [     ] o.a.s.c.c.ConnectionManager Client is connected to ZooKeeper
   [junit4]   2> 4563513 INFO  (zkConnectionManagerCallback-22665-thread-1) [     ] o.a.s.c.c.ConnectionManager zkClient has connected
   [junit4]   2> 4563513 INFO  (jetty-launcher-22661-thread-3) [     ] o.a.s.c.c.ConnectionManager Client is connected to ZooKeeper
   [junit4]   2> 4563513 INFO  (jetty-launcher-22661-thread-4) [     ] o.a.s.s.SolrDispatchFilter solr.xml found in ZooKeeper. Loading...
   [junit4]   2> 4563513 INFO  (zkConnectionManagerCallback-22667-thread-1) [     ] o.a.s.c.c.ConnectionManager zkClient has connected
   [junit4]   2> 4563513 INFO  (jetty-launcher-22661-thread-2) [     ] o.a.s.c.c.ConnectionManager Client is connected to ZooKeeper
   [junit4]   2> 4563517 INFO  (zkConnectionManagerCallback-22669-thread-1) [     ] o.a.s.c.c.ConnectionManager zkClient has connected
   [junit4]   2> 4563518 INFO  (jetty-launcher-22661-thread-3) [     ] o.a.s.s.SolrDispatchFilter solr.xml found in ZooKeeper. Loading...
   [junit4]   2> 4563518 INFO  (jetty-launcher-22661-thread-1) [     ] o.a.s.c.c.ConnectionManager Client is connected to ZooKeeper
   [junit4]   2> 4563518 INFO  (jetty-launcher-22661-thread-2) [     ] o.a.s.s.SolrDispatchFilter solr.xml found in ZooKeeper. Loading...
   [junit4]   2> 4563519 INFO  (jetty-launcher-22661-thread-1) [     ] o.a.s.s.SolrDispatchFilter solr.xml found in ZooKeeper. Loading...
   [junit4]   2> 4563833 INFO  (jetty-launcher-22661-thread-4) [     ] o.a.s.h.c.HttpShardHandlerFactory Host whitelist initialized: WhitelistHostChecker [whitelistHosts=null, whitelistHostCheckingEnabled=true]
   [junit4]   2> 4563845 WARN  (jetty-launcher-22661-thread-4) [     ] o.e.j.u.s.S.config Trusting all certificates configured for Client@50b382d4[provider=null,keyStore=null,trustStore=null]
   [junit4]   2> 4563845 WARN  (jetty-launcher-22661-thread-4) [     ] o.e.j.u.s.S.config No Client EndPointIdentificationAlgorithm configured for Client@50b382d4[provider=null,keyStore=null,trustStore=null]
   [junit4]   2> 4563847 WARN  (jetty-launcher-22661-thread-4) [     ] o.e.j.u.s.S.config Trusting all certificates configured for Client@51ad9d1e[provider=null,keyStore=null,trustStore=null]
   [junit4]   2> 4563847 WARN  (jetty-launcher-22661-thread-4) [     ] o.e.j.u.s.S.config No Client EndPointIdentificationAlgorithm configured for Client@51ad9d1e[provider=null,keyStore=null,trustStore=null]
   [junit4]   2> 4563848 INFO  (jetty-launcher-22661-thread-4) [     ] o.a.s.c.ZkContainer Zookeeper client=127.0.0.1:49965/solr
   [junit4]   2> 4563850 INFO  (zkConnectionManagerCallback-22679-thread-1) [     ] o.a.s.c.c.ConnectionManager zkClient has connected
   [junit4]   2> 4563850 INFO  (jetty-launcher-22661-thread-4) [     ] o.a.s.c.c.ConnectionManager Waiting for client to connect to ZooKeeper
   [junit4]   2> 4563850 INFO  (jetty-launcher-22661-thread-4) [     ] o.a.s.c.c.ConnectionManager Client is connected to ZooKeeper
   [junit4]   2> 4563863 INFO  (jetty-launcher-22661-thread-3) [     ] o.a.s.h.c.HttpShardHandlerFactory Host whitelist initialized: WhitelistHostChecker [whitelistHosts=null, whitelistHostCheckingEnabled=true]
   [junit4]   2> 4563863 WARN  (jetty-launcher-22661-thread-3) [     ] o.e.j.u.s.S.config Trusting all certificates configured for Client@341c47d2[provider=null,keyStore=null,trustStore=null]
   [junit4]   2> 4563863 WARN  (jetty-launcher-22661-thread-3) [     ] o.e.j.u.s.S.config No Client EndPointIdentificationAlgorithm configured for Client@341c47d2[provider=null,keyStore=null,trustStore=null]
   [junit4]   2> 4563865 WARN  (jetty-launcher-22661-thread-3) [     ] o.e.j.u.s.S.config Trusting all certificates configured for Client@1b47d4f1[provider=null,keyStore=null,trustStore=null]
   [junit4]   2> 4563865 WARN  (jetty-launcher-22661-thread-3) [     ] o.e.j.u.s.S.config No Client EndPointIdentificationAlgorithm configured for Client@1b47d4f1[provider=null,keyStore=null,trustStore=null]
   [junit4]   2> 4563866 INFO  (jetty-launcher-22661-thread-3) [     ] o.a.s.c.ZkContainer Zookeeper client=127.0.0.1:49965/solr
   [junit4]   2> 4563867 INFO  (jetty-launcher-22661-thread-3) [     ] o.a.s.c.c.ConnectionManager Waiting for client to connect to ZooKeeper
   [junit4]   2> 4563869 INFO  (zkConnectionManagerCallback-22685-thread-1) [     ] o.a.s.c.c.ConnectionManager zkClient has connected
   [junit4]   2> 4563869 INFO  (jetty-launcher-22661-thread-3) [     ] o.a.s.c.c.ConnectionManager Client is connected to ZooKeeper
   [junit4]   2> 4563917 INFO  (jetty-launcher-22661-thread-1) [     ] o.a.s.h.c.HttpShardHandlerFactory Host whitelist initialized: WhitelistHostChecker [whitelistHosts=null, whitelistHostCheckingEnabled=true]
   [junit4]   2> 4563917 WARN  (jetty-launcher-22661-thread-1) [     ] o.e.j.u.s.S.config Trusting all certificates configured for Client@2c0a7c09[provider=null,keyStore=null,trustStore=null]
   [junit4]   2> 4563917 WARN  (jetty-launcher-22661-thread-1) [     ] o.e.j.u.s.S.config No Client EndPointIdentificationAlgorithm configured for Client@2c0a7c09[provider=null,keyStore=null,trustStore=null]
   [junit4]   2> 4563926 WARN  (jetty-launcher-22661-thread-1) [     ] o.e.j.u.s.S.config Trusting all certificates configured for Client@60a9b3fd[provider=null,keyStore=null,trustStore=null]
   [junit4]   2> 4563926 WARN  (jetty-launcher-22661-thread-1) [     ] o.e.j.u.s.S.config No Client EndPointIdentificationAlgorithm configured for Client@60a9b3fd[provider=null,keyStore=null,trustStore=null]
   [junit4]   2> 4563926 INFO  (jetty-launcher-22661-thread-1) [     ] o.a.s.c.ZkContainer Zookeeper client=127.0.0.1:49965/solr
   [junit4]   2> 4563927 INFO  (jetty-launcher-22661-thread-1) [     ] o.a.s.c.c.ConnectionManager Waiting for client to connect to ZooKeeper
   [junit4]   2> 4563929 INFO  (zkConnectionManagerCallback-22691-thread-1) [     ] o.a.s.c.c.ConnectionManager zkClient has connected
   [junit4]   2> 4563929 INFO  (jetty-launcher-22661-thread-1) [     ] o.a.s.c.c.ConnectionManager Client is connected to ZooKeeper
   [junit4]   2> 4563961 INFO  (jetty-launcher-22661-thread-4) [n:127.0.0.1:49970_solr     ] o.a.s.c.c.ConnectionManager Waiting for client to connect to ZooKeeper
   [junit4]   2> 4563962 INFO  (zkConnectionManagerCallback-22693-thread-1) [     ] o.a.s.c.c.ConnectionManager zkClient has connected
   [junit4]   2> 4563962 INFO  (jetty-launcher-22661-thread-4) [n:127.0.0.1:49970_solr     ] o.a.s.c.c.ConnectionManager Client is connected to ZooKeeper
   [junit4]   2> 4563979 INFO  (jetty-launcher-22661-thread-2) [     ] o.a.s.h.c.HttpShardHandlerFactory Host whitelist initialized: WhitelistHostChecker [whitelistHosts=null, whitelistHostCheckingEnabled=true]
   [junit4]   2> 4563979 WARN  (jetty-launcher-22661-thread-2) [     ] o.e.j.u.s.S.config Trusting all certificates configured for Client@3701c4b6[provider=null,keyStore=null,trustStore=null]
   [junit4]   2> 4563979 WARN  (jetty-launcher-22661-thread-2) [     ] o.e.j.u.s.S.config No Client EndPointIdentificationAlgorithm configured for Client@3701c4b6[provider=null,keyStore=null,trustStore=null]
   [junit4]   2> 4563982 WARN  (jetty-launcher-22661-thread-2) [     ] o.e.j.u.s.S.config Trusting all certificates configured for Client@216d9bec[provider=null,keyStore=null,trustStore=null]
   [junit4]   2> 4563982 WARN  (jetty-launcher-22661-thread-2) [     ] o.e.j.u.s.S.config No Client EndPointIdentificationAlgorithm configured for Client@216d9bec[provider=null,keyStore=null,trustStore=null]
   [junit4]   2> 4563983 INFO  (jetty-launcher-22661-thread-2) [     ] o.a.s.c.ZkContainer Zookeeper client=127.0.0.1:49965/solr
   [junit4]   2> 4563984 INFO  (jetty-launcher-22661-thread-2) [     ] o.a.s.c.c.ConnectionManager Waiting for client to connect to ZooKeeper
   [junit4]   2> 4563986 INFO  (zkConnectionManagerCallback-22699-thread-1) [     ] o.a.s.c.c.ConnectionManager zkClient has connected
   [junit4]   2> 4563986 INFO  (jetty-launcher-22661-thread-2) [     ] o.a.s.c.c.ConnectionManager Client is connected to ZooKeeper
   [junit4]   2> 4564064 INFO  (jetty-launcher-22661-thread-1) [n:127.0.0.1:49973_solr     ] o.a.s.c.c.ConnectionManager Waiting for client to connect to ZooKeeper
   [junit4]   2> 4564067 INFO  (zkConnectionManagerCallback-22701-thread-1) [     ] o.a.s.c.c.ConnectionManager zkClient has connected
   [junit4]   2> 4564067 INFO  (jetty-launcher-22661-thread-1) [n:127.0.0.1:49973_solr     ] o.a.s.c.c.ConnectionManager Client is connected to ZooKeeper
   [junit4]   2> 4564071 INFO  (jetty-launcher-22661-thread-3) [n:127.0.0.1:49971_solr     ] o.a.s.c.c.ConnectionManager Waiting for client to connect to ZooKeeper
   [junit4]   2> 4564073 INFO  (zkConnectionManagerCallback-22703-thread-1) [     ] o.a.s.c.c.ConnectionManager zkClient has connected
   [junit4]   2> 4564073 INFO  (jetty-launcher-22661-thread-3) [n:127.0.0.1:49971_solr     ] o.a.s.c.c.ConnectionManager Client is connected to ZooKeeper
   [junit4]   2> 4564192 INFO  (zkConnectionManagerCallback-22709-thread-1) [     ] o.a.s.c.c.ConnectionManager zkClient has connected
   [junit4]   2> 4564192 INFO  (jetty-launcher-22661-thread-2) [n:127.0.0.1:49972_solr     ] o.a.s.c.c.ConnectionManager Waiting for client to connect to ZooKeeper
   [junit4]   2> 4564193 INFO  (jetty-launcher-22661-thread-2) [n:127.0.0.1:49972_solr     ] o.a.s.c.c.ConnectionManager Client is connected to ZooKeeper
   [junit4]   2> 4564233 DEBUG (jetty-launcher-22661-thread-2) [n:127.0.0.1:49972_solr     ] o.a.s.c.c.ZkStateReader Updating cluster state from ZooKeeper...
   [junit4]   2> 4564240 DEBUG (jetty-launcher-22661-thread-2) [n:127.0.0.1:49972_solr     ] o.a.s.c.c.ZkStateReader Loaded empty cluster properties
   [junit4]   2> 4564244 DEBUG (jetty-launcher-22661-thread-2) [n:127.0.0.1:49972_solr     ] o.a.s.c.c.ZkStateReader Updated live nodes from ZooKeeper... [] -> []
   [junit4]   2> 4564247 DEBUG (jetty-launcher-22661-thread-2) [n:127.0.0.1:49972_solr     ] o.a.s.c.c.ZkStateReader clusterStateSet: legacy [0] interesting [0] watched [0] lazy [0] total [0]
   [junit4]   2> 4564272 INFO  (jetty-launcher-22661-thread-2) [n:127.0.0.1:49972_solr     ] o.a.s.c.OverseerElectionContext I am going to be the leader 127.0.0.1:49972_solr
   [junit4]   2> 4564276 INFO  (jetty-launcher-22661-thread-2) [n:127.0.0.1:49972_solr     ] o.a.s.c.Overseer Overseer (id=72244694606807054-127.0.0.1:49972_solr-n_0000000000) starting
   [junit4]   2> 4564320 INFO  (jetty-launcher-22661-thread-2) [n:127.0.0.1:49972_solr     ] o.a.s.c.c.ConnectionManager Waiting for client to connect to ZooKeeper
   [junit4]   2> 4564322 INFO  (zkConnectionManagerCallback-22718-thread-1) [     ] o.a.s.c.c.ConnectionManager zkClient has connected
   [junit4]   2> 4564322 INFO  (jetty-launcher-22661-thread-2) [n:127.0.0.1:49972_solr     ] o.a.s.c.c.ConnectionManager Client is connected to ZooKeeper
   [junit4]   2> 4564322 DEBUG (jetty-launcher-22661-thread-2) [n:127.0.0.1:49972_solr     ] o.a.s.c.c.ZkStateReader Updating cluster state from ZooKeeper...
   [junit4]   2> 4564324 DEBUG (jetty-launcher-22661-thread-2) [n:127.0.0.1:49972_solr     ] o.a.s.c.c.ZkStateReader Loaded empty cluster properties
   [junit4]   2> 4564325 DEBUG (jetty-launcher-22661-thread-2) [n:127.0.0.1:49972_solr     ] o.a.s.c.c.ZkStateReader Updated live nodes from ZooKeeper... [] -> []
   [junit4]   2> 4564326 DEBUG (jetty-launcher-22661-thread-2) [n:127.0.0.1:49972_solr     ] o.a.s.c.c.ZkStateReader clusterStateSet: legacy [0] interesting [0] watched [0] lazy [0] total [0]
   [junit4]   2> 4564327 INFO  (jetty-launcher-22661-thread-2) [n:127.0.0.1:49972_solr     ] o.a.s.c.s.i.ZkClientClusterStateProvider Cluster at 127.0.0.1:49965/solr ready
   [junit4]   2> 4564329 INFO  (OverseerStateUpdate-72244694606807054-127.0.0.1:49972_solr-n_0000000000) [n:127.0.0.1:49972_solr     ] o.a.s.c.Overseer Starting to work on the main queue : 127.0.0.1:49972_solr
   [junit4]   2> 4564330 INFO  (jetty-launcher-22661-thread-2) [n:127.0.0.1:49972_solr     ] o.a.s.c.ZkController Register node as live in ZooKeeper:/live_nodes/127.0.0.1:49972_solr
   [junit4]   2> 4564333 DEBUG (zkCallback-22717-thread-1) [     ] o.a.s.c.c.ZkStateReader A live node change: [WatchedEvent state:SyncConnected type:NodeChildrenChanged path:/live_nodes], has occurred - updating... (live nodes size: [0])
   [junit4]   2> 4564333 DEBUG (zkCallback-22708-thread-1) [     ] o.a.s.c.c.ZkStateReader A live node change: [WatchedEvent state:SyncConnected type:NodeChildrenChanged path:/live_nodes], has occurred - updating... (live nodes size: [0])
   [junit4]   2> 4564334 INFO  (zkCallback-22717-thread-1) [     ] o.a.s.c.c.ZkStateReader Updated live nodes from ZooKeeper... (0) -> (1)
   [junit4]   2> 4564334 INFO  (OverseerStateUpdate-72244694606807054-127.0.0.1:49972_solr-n_0000000000) [n:127.0.0.1:49972_solr     ] o.a.s.c.c.ZkStateReader Updated live nodes from ZooKeeper... (0) -> (1)
   [junit4]   2> 4564334 DEBUG (zkCallback-22717-thread-1) [     ] o.a.s.c.c.ZkStateReader Updated live nodes from ZooKeeper... [] -> [127.0.0.1:49972_solr]
   [junit4]   2> 4564334 DEBUG (OverseerStateUpdate-72244694606807054-127.0.0.1:49972_solr-n_0000000000) [n:127.0.0.1:49972_solr     ] o.a.s.c.c.ZkStateReader Updated live nodes from ZooKeeper... [] -> [127.0.0.1:49972_solr]
   [junit4]   2> 4564335 DEBUG (jetty-launcher-22661-thread-4) [n:127.0.0.1:49970_solr     ] o.a.s.c.c.ZkStateReader Updating cluster state from ZooKeeper...
   [junit4]   2> 4564336 DEBUG (OverseerStateUpdate-72244694606807054-127.0.0.1:49972_solr-n_0000000000) [n:127.0.0.1:49972_solr     ] o.a.s.c.c.ZkStateReader clusterStateSet: legacy [0] interesting [0] watched [0] lazy [0] total [0]
   [junit4]   2> 4564336 DEBUG (zkCallback-22708-thread-1) [     ] o.a.s.c.c.ZkStateReader Updated live nodes from ZooKeeper... [127.0.0.1:49972_solr] -> [127.0.0.1:49972_solr]
   [junit4]   2> 4564336 DEBUG (jetty-launcher-22661-thread-4) [n:127.0.0.1:49970_solr     ] o.a.s.c.c.ZkStateReader Loaded empty cluster properties
   [junit4]   2> 4564337 INFO  (jetty-launcher-22661-thread-2) [n:127.0.0.1:49972_solr     ] o.a.s.c.PackageManager clusterprops.json changed , version -1
   [junit4]   2> 4564338 INFO  (jetty-launcher-22661-thread-4) [n:127.0.0.1:49970_solr     ] o.a.s.c.c.ZkStateReader Updated live nodes from ZooKeeper... (0) -> (1)
   [junit4]   2> 4564339 DEBUG (jetty-launcher-22661-thread-4) [n:127.0.0.1:49970_solr     ] o.a.s.c.c.ZkStateReader Updated live nodes from ZooKeeper... [] -> [127.0.0.1:49972_solr]
   [junit4]   2> 4564340 DEBUG (jetty-launcher-22661-thread-4) [n:127.0.0.1:49970_solr     ] o.a.s.c.c.ZkStateReader clusterStateSet: legacy [0] interesting [0] watched [0] lazy [0] total [0]
   [junit4]   2> 4564350 INFO  (jetty-launcher-22661-thread-4) [n:127.0.0.1:49970_solr     ] o.a.s.c.ZkController Publish node=127.0.0.1:49970_solr as DOWN
   [junit4]   2> 4564352 INFO  (jetty-launcher-22661-thread-4) [n:127.0.0.1:49970_solr     ] o.a.s.c.TransientSolrCoreCacheDefault Allocating transient cache for 2147483647 transient cores
   [junit4]   2> 4564352 INFO  (jetty-launcher-22661-thread-4) [n:127.0.0.1:49970_solr     ] o.a.s.c.ZkController Register node as live in ZooKeeper:/live_nodes/127.0.0.1:49970_solr
   [junit4]   2> 4564353 DEBUG (zkCallback-22717-thread-1) [     ] o.a.s.c.c.ZkStateReader A live node change: [WatchedEvent state:SyncConnected type:NodeChildrenChanged path:/live_nodes], has occurred - updating... (live nodes size: [1])
   [junit4]   2> 4564353 DEBUG (zkCallback-22708-thread-1) [     ] o.a.s.c.c.ZkStateReader A live node change: [WatchedEvent state:SyncConnected type:NodeChildrenChanged path:/live_nodes], has occurred - updating... (live nodes size: [1])
   [junit4]   2> 4564354 DEBUG (zkCallback-22692-thread-1) [     ] o.a.s.c.c.ZkStateReader A live node change: [WatchedEvent state:SyncConnected type:NodeChildrenChanged path:/live_nodes], has occurred - updating... (live nodes size: [1])
   [junit4]   2> 4564355 INFO  (zkCallback-22708-thread-1) [     ] o.a.s.c.c.ZkStateReader Updated live nodes from ZooKeeper... (1) -> (2)
   [junit4]   2> 4564355 INFO  (zkCallback-22717-thread-1) [     ] o.a.s.c.c.ZkStateReader Updated live nodes from ZooKeeper... (1) -> (2)
   [junit4]   2> 4564355 DEBUG (zkCallback-22717-thread-1) [     ] o.a.s.c.c.ZkStateReader Updated live nodes from ZooKeeper... [127.0.0.1:49972_solr] -> [127.0.0.1:49970_solr, 127.0.0.1:49972_solr]
   [junit4]   2> 4564355 DEBUG (zkCallback-22708-thread-1) [     ] o.a.s.c.c.ZkStateReader Updated live nodes from ZooKeeper... [127.0.0.1:49972_solr] -> [127.0.0.1:49970_solr, 127.0.0.1:49972_solr]
   [junit4]   2> 4564355 INFO  (zkCallback-22692-thread-1) [     ] o.a.s.c.c.ZkStateReader Updated live nodes from ZooKeeper... (1) -> (2)
   [junit4]   2> 4564355 DEBUG (zkCallback-22692-thread-1) [     ] o.a.s.c.c.ZkStateReader Updated live nodes from ZooKeeper... [127.0.0.1:49972_solr] -> [127.0.0.1:49970_solr, 127.0.0.1:49972_solr]
   [junit4]   2> 4564358 INFO  (jetty-launcher-22661-thread-4) [n:127.0.0.1:49970_solr     ] o.a.s.c.c.ConnectionManager Waiting for client to connect to ZooKeeper
   [junit4]   2> 4564360 INFO  (zkConnectionManagerCallback-22723-thread-1) [     ] o.a.s.c.c.ConnectionManager zkClient has connected
   [junit4]   2> 4564360 INFO  (jetty-launcher-22661-thread-4) [n:127.0.0.1:49970_solr     ] o.a.s.c.c.ConnectionManager Client is connected to ZooKeeper
   [junit4]   2> 4564361 DEBUG (jetty-launcher-22661-thread-4) [n:127.0.0.1:49970_solr     ] o.a.s.c.c.ZkStateReader Updating cluster state from ZooKeeper...
   [junit4]   2> 4564362 DEBUG (jetty-launcher-22661-thread-4) [n:127.0.0.1:49970_solr     ] o.a.s.c.c.ZkStateReader Loaded empty cluster properties
   [junit4]   2> 4564364 INFO  (jetty-launcher-22661-thread-4) [n:127.0.0.1:49970_solr     ] o.a.s.c.c.ZkStateReader Updated live nodes from ZooKeeper... (0) -> (2)
   [junit4]   2> 4564364 DEBUG (jetty-launcher-22661-thread-4) [n:127.0.0.1:49970_solr     ] o.a.s.c.c.ZkStateReader Updated live nodes from ZooKeeper... [] -> [127.0.0.1:49970_solr, 127.0.0.1:49972_solr]
   [junit4]  

[...truncated too long message...]

 h2c]}{127.0.0.1:0}
   [junit4]   2> 77193 INFO  (jetty-closer-1788-thread-3) [     ] o.e.j.s.h.ContextHandler Stopped o.e.j.s.ServletContextHandler@67e8148e{/solr,null,UNAVAILABLE}
   [junit4]   2> 77193 INFO  (jetty-closer-1788-thread-3) [     ] o.e.j.s.session node0 Stopped scavenging
   [junit4]   2> 77227 INFO  (jetty-closer-1788-thread-1) [     ] o.a.s.c.Overseer Overseer (id=72244836155260939-127.0.0.1:62214_solr-n_0000000000) closing
   [junit4]   2> 77335 INFO  (jetty-closer-1788-thread-1) [     ] o.e.j.s.AbstractConnector Stopped ServerConnector@2478f01{HTTP/1.1,[http/1.1, h2c]}{127.0.0.1:0}
   [junit4]   2> 77336 INFO  (jetty-closer-1788-thread-1) [     ] o.e.j.s.h.ContextHandler Stopped o.e.j.s.ServletContextHandler@a52971{/solr,null,UNAVAILABLE}
   [junit4]   2> 77336 INFO  (jetty-closer-1788-thread-1) [     ] o.e.j.s.session node0 Stopped scavenging
   [junit4]   2> 77434 INFO  (jetty-closer-1788-thread-4) [     ] o.e.j.s.AbstractConnector Stopped ServerConnector@8dcd919{HTTP/1.1,[http/1.1, h2c]}{127.0.0.1:0}
   [junit4]   2> 77438 INFO  (jetty-closer-1788-thread-4) [     ] o.e.j.s.h.ContextHandler Stopped o.e.j.s.ServletContextHandler@12ba424f{/solr,null,UNAVAILABLE}
   [junit4]   2> 77439 INFO  (jetty-closer-1788-thread-4) [     ] o.e.j.s.session node0 Stopped scavenging
   [junit4]   2> 77442 INFO  (jetty-closer-1788-thread-2) [     ] o.e.j.s.AbstractConnector Stopped ServerConnector@3c1d2b12{HTTP/1.1,[http/1.1, h2c]}{127.0.0.1:0}
   [junit4]   2> 77442 INFO  (jetty-closer-1788-thread-2) [     ] o.e.j.s.h.ContextHandler Stopped o.e.j.s.ServletContextHandler@59b7bac3{/solr,null,UNAVAILABLE}
   [junit4]   2> 77442 INFO  (jetty-closer-1788-thread-2) [     ] o.e.j.s.session node0 Stopped scavenging
   [junit4]   2> 77443 INFO  (TEST-TestContainerReqHandler.testPackageAPI-seed#[5D1F2F1BE0B8E2C3]) [     ] o.a.s.c.ZkTestServer Shutting down ZkTestServer.
   [junit4]   2> 77665 WARN  (ZkTestServer Run Thread) [     ] o.a.s.c.ZkTestServer Watch limit violations:
   [junit4]   2> Maximum concurrent create/delete watches above limit:
   [junit4]   2>
   [junit4]   2> 9 /solr/aliases.json
   [junit4]   2> 9 /solr/clusterprops.json
   [junit4]   2> 4 /solr/security.json
   [junit4]   2>
   [junit4]   2> Maximum concurrent data watches above limit:
   [junit4]   2>
   [junit4]   2> 36 /solr/clusterprops.json
   [junit4]   2> 9 /solr/clusterstate.json
   [junit4]   2> 2 /solr/overseer_elect/election/72244836155260939-127.0.0.1:62214_solr-n_0000000000
   [junit4]   2>
   [junit4]   2> Maximum concurrent children watches above limit:
   [junit4]   2>
   [junit4]   2> 31 /solr/live_nodes
   [junit4]   2> 9 /solr/collections
   [junit4]   2> 7 /solr/overseer/queue
   [junit4]   2>
   [junit4]   2> 77873 INFO  (TEST-TestContainerReqHandler.testPackageAPI-seed#[5D1F2F1BE0B8E2C3]) [     ] o.a.s.c.ZkTestServer waitForServerDown: 127.0.0.1:62206
   [junit4]   2> 77873 INFO  (TEST-TestContainerReqHandler.testPackageAPI-seed#[5D1F2F1BE0B8E2C3]) [     ] o.a.s.c.ZkTestServer parse host and port list: 127.0.0.1:62206
   [junit4]   2> 77873 INFO  (TEST-TestContainerReqHandler.testPackageAPI-seed#[5D1F2F1BE0B8E2C3]) [     ] o.a.s.c.ZkTestServer connecting to 127.0.0.1 62206
   [junit4]   2> 77874 INFO  (TEST-TestContainerReqHandler.testPackageAPI-seed#[5D1F2F1BE0B8E2C3]) [     ] o.e.j.s.AbstractConnector Stopped ServerConnector@6e737fe3{HTTP/1.1,[http/1.1]}{0.0.0.0:0}
   [junit4]   2> 77875 INFO  (TEST-TestContainerReqHandler.testPackageAPI-seed#[5D1F2F1BE0B8E2C3]) [     ] o.a.s.SolrTestCaseJ4 ###Ending testPackageAPI
   [junit4]   2> NOTE: reproduce with: ant test  -Dtestcase=TestContainerReqHandler -Dtests.method=testPackageAPI -Dtests.seed=5D1F2F1BE0B8E2C3 -Dtests.slow=true -Dtests.badapples=true -Dtests.locale=en-TK -Dtests.timezone=SystemV/PST8PDT -Dtests.asserts=true -Dtests.file.encoding=UTF-8
   [junit4] FAILURE 4.75s J0 | TestContainerReqHandler.testPackageAPI <<<
   [junit4]    > Throwable #1: java.lang.AssertionError: attempt: 9 Mismatch for value : '[requestHandler]' in response {
   [junit4]    >   "responseHeader":{
   [junit4]    >     "status":0,
   [junit4]    >     "QTime":0},
   [junit4]    >   "metadata":{"version":3},
   [junit4]    >   "runtimeLib":[{
   [junit4]    >       "name":"global",
   [junit4]    >       "url":"http://localhost:62205/jar3.jar",
   [junit4]    >       "60ec88c2a2e9b409f7afc309273383810a0d07a078b482434eda9674f7e25b8adafa8a67c9913c996cbfb78a7f6ad2b9db26dbd4fe0ca4068f248d5db563f922":"60ec88c2a2e9b409f7afc309273383810a0d07a078b482434eda9674f7e25b8adafa8a67c9913c996cbfb78a7f6ad2b9db26dbd4fe0ca4068f248d5db563f922",
   [junit4]    >       "znodeVersion":3}],
   [junit4]    >   "requestHandler":[{
   [junit4]    >       "name":"bar",
   [junit4]    >       "znodeVersion":3,
   [junit4]    >       "class":"org.apache.solr.core.RuntimeLibReqHandler",
   [junit4]    >       "package":"global"}]}
   [junit4]    > at __randomizedtesting.SeedInfo.seed([5D1F2F1BE0B8E2C3:2F103A554CE3B8D3]:0)
   [junit4]    > at org.apache.solr.handler.TestContainerReqHandler.assertResponseValues(TestContainerReqHandler.java:117)
   [junit4]    > at org.apache.solr.handler.TestContainerReqHandler.testPackageAPI(TestContainerReqHandler.java:232)
   [junit4]    > at java.base/jdk.internal.reflect.NativeMethodAccessorImpl.invoke0(Native Method)
   [junit4]    > at java.base/jdk.internal.reflect.NativeMethodAccessorImpl.invoke(NativeMethodAccessorImpl.java:62)
   [junit4]    > at java.base/jdk.internal.reflect.DelegatingMethodAccessorImpl.invoke(DelegatingMethodAccessorImpl.java:43)
   [junit4]    > at java.base/java.lang.reflect.Method.invoke(Method.java:567)
   [junit4]    > at java.base/java.lang.Thread.run(Thread.java:835)
   [junit4]   2> 77877 INFO  (SUITE-TestContainerReqHandler-seed#[5D1F2F1BE0B8E2C3]-worker) [     ] o.a.s.c.ZkTestServer Shutting down ZkTestServer.
   [junit4]   2> 77877 INFO  (SUITE-TestContainerReqHandler-seed#[5D1F2F1BE0B8E2C3]-worker) [     ] o.a.s.c.ZkTestServer waitForServerDown: 127.0.0.1:62206
   [junit4]   2> 77877 INFO  (SUITE-TestContainerReqHandler-seed#[5D1F2F1BE0B8E2C3]-worker) [     ] o.a.s.c.ZkTestServer parse host and port list: 127.0.0.1:62206
   [junit4]   2> 77877 INFO  (SUITE-TestContainerReqHandler-seed#[5D1F2F1BE0B8E2C3]-worker) [     ] o.a.s.c.ZkTestServer connecting to 127.0.0.1 62206
   [junit4]   2> NOTE: leaving temporary files on disk at: /Users/jenkins/workspace/Lucene-Solr-8.x-MacOSX/solr/build/solr-core/test/J0/temp/solr.handler.TestContainerReqHandler_5D1F2F1BE0B8E2C3-002
   [junit4]   2> Aug 25, 2019 1:24:56 PM com.carrotsearch.randomizedtesting.ThreadLeakControl checkThreadLeaks
   [junit4]   2> WARNING: Will linger awaiting termination of 1 leaked thread(s).
   [junit4]   2> NOTE: test params are: codec=Asserting(Lucene80): {}, docValues:{}, maxPointsInLeafNode=622, maxMBSortInHeap=6.4405784983410985, sim=Asserting(org.apache.lucene.search.similarities.AssertingSimilarity@691f8af7), locale=en-TK, timezone=SystemV/PST8PDT
   [junit4]   2> NOTE: Mac OS X 10.11.6 x86_64/AdoptOpenJDK 12.0.1 (64-bit)/cpus=3,threads=1,free=32963824,total=101388288
   [junit4]   2> NOTE: All tests run in this JVM: [TestContainerReqHandler, TestContainerReqHandler, TestContainerReqHandler]
   [junit4] Completed [5/5 (4!)] on J0 in 21.95s, 6 tests, 1 failure, 1 skipped <<< FAILURES!

[...truncated 1 lines...]
   [junit4] JVM J0: stderr was not empty, see: /Users/jenkins/workspace/Lucene-Solr-8.x-MacOSX/solr/build/solr-core/test/temp/junit4-J0-20190825_132338_57117693942664801667411.syserr
   [junit4] >>> JVM J0 emitted unexpected output (verbatim) ----
   [junit4] OpenJDK 64-Bit Server VM warning: Option UseConcMarkSweepGC was deprecated in version 9.0 and will likely be removed in a future release.
   [junit4] <<< JVM J0: EOF ----

[...truncated 12 lines...]
BUILD FAILED
/Users/jenkins/workspace/Lucene-Solr-8.x-MacOSX/lucene/common-build.xml:1572: The following error occurred while executing this line:
/Users/jenkins/workspace/Lucene-Solr-8.x-MacOSX/lucene/common-build.xml:1099: There were test failures: 5 suites, 30 tests, 4 failures, 5 ignored (5 assumptions) [seed: 5D1F2F1BE0B8E2C3]

Total time: 1 minute 22 seconds

[repro] Setting last failure code to 256

[repro] Failures:
[repro]   4/5 failed: org.apache.solr.handler.TestContainerReqHandler
[repro] Exiting with code 256
+ mv lucene/build lucene/build.repro
+ mv solr/build solr/build.repro
+ mv lucene/build.orig lucene/build
+ mv solr/build.orig solr/build
Archiving artifacts
Setting ANT_1_8_2_HOME=/Users/jenkins/tools/hudson.tasks.Ant_AntInstallation/ANT_1.8.2
[WARNINGS] Parsing warnings in console log with parser Java Compiler (javac)
Setting ANT_1_8_2_HOME=/Users/jenkins/tools/hudson.tasks.Ant_AntInstallation/ANT_1.8.2
No credentials specified
Setting ANT_1_8_2_HOME=/Users/jenkins/tools/hudson.tasks.Ant_AntInstallation/ANT_1.8.2
<Git Blamer> Using GitBlamer to create author and commit information for all warnings.
<Git Blamer> GIT_COMMIT=f41b60018aad2a356aa6661bb83589ac7c6cd6ff, workspace=/Users/jenkins/workspace/Lucene-Solr-8.x-MacOSX
[WARNINGS] Computing warning deltas based on reference build #293
Recording test results
Setting ANT_1_8_2_HOME=/Users/jenkins/tools/hudson.tasks.Ant_AntInstallation/ANT_1.8.2
Build step 'Publish JUnit test result report' changed build result to UNSTABLE
Email was triggered for: Unstable (Test Failures)
Sending email for trigger: Unstable (Test Failures)
Setting ANT_1_8_2_HOME=/Users/jenkins/tools/hudson.tasks.Ant_AntInstallation/ANT_1.8.2
Setting ANT_1_8_2_HOME=/Users/jenkins/tools/hudson.tasks.Ant_AntInstallation/ANT_1.8.2
Setting ANT_1_8_2_HOME=/Users/jenkins/tools/hudson.tasks.Ant_AntInstallation/ANT_1.8.2
Setting ANT_1_8_2_HOME=/Users/jenkins/tools/hudson.tasks.Ant_AntInstallation/ANT_1.8.2
Setting ANT_1_8_2_HOME=/Users/jenkins/tools/hudson.tasks.Ant_AntInstallation/ANT_1.8.2
Setting ANT_1_8_2_HOME=/Users/jenkins/tools/hudson.tasks.Ant_AntInstallation/ANT_1.8.2


---------------------------------------------------------------------
To unsubscribe, e-mail: [hidden email]
For additional commands, e-mail: [hidden email]