[JENKINS] Lucene-Solr-8.x-MacOSX (64bit/jdk1.8.0) - Build # 291 - Unstable!

classic Classic list List threaded Threaded
1 message Options
Reply | Threaded
Open this post in threaded view
|

[JENKINS] Lucene-Solr-8.x-MacOSX (64bit/jdk1.8.0) - Build # 291 - Unstable!

Policeman Jenkins Server-2
Build: https://jenkins.thetaphi.de/job/Lucene-Solr-8.x-MacOSX/291/
Java: 64bit/jdk1.8.0 -XX:+UseCompressedOops -XX:+UseParallelGC

5 tests failed.
FAILED:  org.apache.solr.handler.TestContainerReqHandler.testCacheLoadFromPackage

Error Message:
Error from server at http://127.0.0.1:50681/solr: Underlying core creation failed while creating collection: globalCacheColl

Stack Trace:
org.apache.solr.client.solrj.impl.HttpSolrClient$RemoteSolrException: Error from server at http://127.0.0.1:50681/solr: Underlying core creation failed while creating collection: globalCacheColl
        at __randomizedtesting.SeedInfo.seed([BEBE936614E6EEDA:729BC7F81FB15839]:0)
        at org.apache.solr.client.solrj.impl.HttpSolrClient.executeMethod(HttpSolrClient.java:656)
        at org.apache.solr.client.solrj.impl.HttpSolrClient.request(HttpSolrClient.java:262)
        at org.apache.solr.client.solrj.impl.HttpSolrClient.request(HttpSolrClient.java:245)
        at org.apache.solr.client.solrj.impl.LBSolrClient.doRequest(LBSolrClient.java:368)
        at org.apache.solr.client.solrj.impl.LBSolrClient.request(LBSolrClient.java:296)
        at org.apache.solr.client.solrj.impl.BaseCloudSolrClient.sendRequest(BaseCloudSolrClient.java:1128)
        at org.apache.solr.client.solrj.impl.BaseCloudSolrClient.requestWithRetryOnStaleState(BaseCloudSolrClient.java:897)
        at org.apache.solr.client.solrj.impl.BaseCloudSolrClient.request(BaseCloudSolrClient.java:829)
        at org.apache.solr.client.solrj.SolrRequest.process(SolrRequest.java:211)
        at org.apache.solr.client.solrj.SolrRequest.process(SolrRequest.java:228)
        at org.apache.solr.handler.TestContainerReqHandler.testCacheLoadFromPackage(TestContainerReqHandler.java:687)
        at sun.reflect.NativeMethodAccessorImpl.invoke0(Native Method)
        at sun.reflect.NativeMethodAccessorImpl.invoke(NativeMethodAccessorImpl.java:62)
        at sun.reflect.DelegatingMethodAccessorImpl.invoke(DelegatingMethodAccessorImpl.java:43)
        at java.lang.reflect.Method.invoke(Method.java:498)
        at com.carrotsearch.randomizedtesting.RandomizedRunner.invoke(RandomizedRunner.java:1750)
        at com.carrotsearch.randomizedtesting.RandomizedRunner$8.evaluate(RandomizedRunner.java:938)
        at com.carrotsearch.randomizedtesting.RandomizedRunner$9.evaluate(RandomizedRunner.java:974)
        at com.carrotsearch.randomizedtesting.RandomizedRunner$10.evaluate(RandomizedRunner.java:988)
        at com.carrotsearch.randomizedtesting.rules.SystemPropertiesRestoreRule$1.evaluate(SystemPropertiesRestoreRule.java:57)
        at org.apache.lucene.util.TestRuleSetupTeardownChained$1.evaluate(TestRuleSetupTeardownChained.java:49)
        at org.apache.lucene.util.AbstractBeforeAfterRule$1.evaluate(AbstractBeforeAfterRule.java:45)
        at org.apache.lucene.util.TestRuleThreadAndTestName$1.evaluate(TestRuleThreadAndTestName.java:48)
        at org.apache.lucene.util.TestRuleIgnoreAfterMaxFailures$1.evaluate(TestRuleIgnoreAfterMaxFailures.java:64)
        at org.apache.lucene.util.TestRuleMarkFailure$1.evaluate(TestRuleMarkFailure.java:47)
        at com.carrotsearch.randomizedtesting.rules.StatementAdapter.evaluate(StatementAdapter.java:36)
        at com.carrotsearch.randomizedtesting.ThreadLeakControl$StatementRunner.run(ThreadLeakControl.java:368)
        at com.carrotsearch.randomizedtesting.ThreadLeakControl.forkTimeoutingTask(ThreadLeakControl.java:817)
        at com.carrotsearch.randomizedtesting.ThreadLeakControl$3.evaluate(ThreadLeakControl.java:468)
        at com.carrotsearch.randomizedtesting.RandomizedRunner.runSingleTest(RandomizedRunner.java:947)
        at com.carrotsearch.randomizedtesting.RandomizedRunner$5.evaluate(RandomizedRunner.java:832)
        at com.carrotsearch.randomizedtesting.RandomizedRunner$6.evaluate(RandomizedRunner.java:883)
        at com.carrotsearch.randomizedtesting.RandomizedRunner$7.evaluate(RandomizedRunner.java:894)
        at com.carrotsearch.randomizedtesting.rules.StatementAdapter.evaluate(StatementAdapter.java:36)
        at com.carrotsearch.randomizedtesting.rules.SystemPropertiesRestoreRule$1.evaluate(SystemPropertiesRestoreRule.java:57)
        at org.apache.lucene.util.AbstractBeforeAfterRule$1.evaluate(AbstractBeforeAfterRule.java:45)
        at com.carrotsearch.randomizedtesting.rules.StatementAdapter.evaluate(StatementAdapter.java:36)
        at org.apache.lucene.util.TestRuleStoreClassName$1.evaluate(TestRuleStoreClassName.java:41)
        at com.carrotsearch.randomizedtesting.rules.NoShadowingOrOverridesOnMethodsRule$1.evaluate(NoShadowingOrOverridesOnMethodsRule.java:40)
        at com.carrotsearch.randomizedtesting.rules.NoShadowingOrOverridesOnMethodsRule$1.evaluate(NoShadowingOrOverridesOnMethodsRule.java:40)
        at com.carrotsearch.randomizedtesting.rules.StatementAdapter.evaluate(StatementAdapter.java:36)
        at com.carrotsearch.randomizedtesting.rules.StatementAdapter.evaluate(StatementAdapter.java:36)
        at com.carrotsearch.randomizedtesting.rules.StatementAdapter.evaluate(StatementAdapter.java:36)
        at org.apache.lucene.util.TestRuleAssertionsRequired$1.evaluate(TestRuleAssertionsRequired.java:53)
        at org.apache.lucene.util.TestRuleMarkFailure$1.evaluate(TestRuleMarkFailure.java:47)
        at org.apache.lucene.util.TestRuleIgnoreAfterMaxFailures$1.evaluate(TestRuleIgnoreAfterMaxFailures.java:64)
        at org.apache.lucene.util.TestRuleIgnoreTestSuites$1.evaluate(TestRuleIgnoreTestSuites.java:54)
        at com.carrotsearch.randomizedtesting.rules.StatementAdapter.evaluate(StatementAdapter.java:36)
        at com.carrotsearch.randomizedtesting.ThreadLeakControl$StatementRunner.run(ThreadLeakControl.java:368)
        at java.lang.Thread.run(Thread.java:748)


FAILED:  org.apache.solr.handler.TestContainerReqHandler.testCacheLoadFromPackage

Error Message:
Error from server at http://127.0.0.1:51232/solr: Underlying core creation failed while creating collection: globalCacheColl

Stack Trace:
org.apache.solr.client.solrj.impl.HttpSolrClient$RemoteSolrException: Error from server at http://127.0.0.1:51232/solr: Underlying core creation failed while creating collection: globalCacheColl
        at __randomizedtesting.SeedInfo.seed([BEBE936614E6EEDA:729BC7F81FB15839]:0)
        at org.apache.solr.client.solrj.impl.HttpSolrClient.executeMethod(HttpSolrClient.java:656)
        at org.apache.solr.client.solrj.impl.HttpSolrClient.request(HttpSolrClient.java:262)
        at org.apache.solr.client.solrj.impl.HttpSolrClient.request(HttpSolrClient.java:245)
        at org.apache.solr.client.solrj.impl.LBSolrClient.doRequest(LBSolrClient.java:368)
        at org.apache.solr.client.solrj.impl.LBSolrClient.request(LBSolrClient.java:296)
        at org.apache.solr.client.solrj.impl.BaseCloudSolrClient.sendRequest(BaseCloudSolrClient.java:1128)
        at org.apache.solr.client.solrj.impl.BaseCloudSolrClient.requestWithRetryOnStaleState(BaseCloudSolrClient.java:897)
        at org.apache.solr.client.solrj.impl.BaseCloudSolrClient.request(BaseCloudSolrClient.java:829)
        at org.apache.solr.client.solrj.SolrRequest.process(SolrRequest.java:211)
        at org.apache.solr.client.solrj.SolrRequest.process(SolrRequest.java:228)
        at org.apache.solr.handler.TestContainerReqHandler.testCacheLoadFromPackage(TestContainerReqHandler.java:687)
        at sun.reflect.NativeMethodAccessorImpl.invoke0(Native Method)
        at sun.reflect.NativeMethodAccessorImpl.invoke(NativeMethodAccessorImpl.java:62)
        at sun.reflect.DelegatingMethodAccessorImpl.invoke(DelegatingMethodAccessorImpl.java:43)
        at java.lang.reflect.Method.invoke(Method.java:498)
        at com.carrotsearch.randomizedtesting.RandomizedRunner.invoke(RandomizedRunner.java:1750)
        at com.carrotsearch.randomizedtesting.RandomizedRunner$8.evaluate(RandomizedRunner.java:938)
        at com.carrotsearch.randomizedtesting.RandomizedRunner$9.evaluate(RandomizedRunner.java:974)
        at com.carrotsearch.randomizedtesting.RandomizedRunner$10.evaluate(RandomizedRunner.java:988)
        at com.carrotsearch.randomizedtesting.rules.SystemPropertiesRestoreRule$1.evaluate(SystemPropertiesRestoreRule.java:57)
        at org.apache.lucene.util.TestRuleSetupTeardownChained$1.evaluate(TestRuleSetupTeardownChained.java:49)
        at org.apache.lucene.util.AbstractBeforeAfterRule$1.evaluate(AbstractBeforeAfterRule.java:45)
        at org.apache.lucene.util.TestRuleThreadAndTestName$1.evaluate(TestRuleThreadAndTestName.java:48)
        at org.apache.lucene.util.TestRuleIgnoreAfterMaxFailures$1.evaluate(TestRuleIgnoreAfterMaxFailures.java:64)
        at org.apache.lucene.util.TestRuleMarkFailure$1.evaluate(TestRuleMarkFailure.java:47)
        at com.carrotsearch.randomizedtesting.rules.StatementAdapter.evaluate(StatementAdapter.java:36)
        at com.carrotsearch.randomizedtesting.ThreadLeakControl$StatementRunner.run(ThreadLeakControl.java:368)
        at com.carrotsearch.randomizedtesting.ThreadLeakControl.forkTimeoutingTask(ThreadLeakControl.java:817)
        at com.carrotsearch.randomizedtesting.ThreadLeakControl$3.evaluate(ThreadLeakControl.java:468)
        at com.carrotsearch.randomizedtesting.RandomizedRunner.runSingleTest(RandomizedRunner.java:947)
        at com.carrotsearch.randomizedtesting.RandomizedRunner$5.evaluate(RandomizedRunner.java:832)
        at com.carrotsearch.randomizedtesting.RandomizedRunner$6.evaluate(RandomizedRunner.java:883)
        at com.carrotsearch.randomizedtesting.RandomizedRunner$7.evaluate(RandomizedRunner.java:894)
        at com.carrotsearch.randomizedtesting.rules.StatementAdapter.evaluate(StatementAdapter.java:36)
        at com.carrotsearch.randomizedtesting.rules.SystemPropertiesRestoreRule$1.evaluate(SystemPropertiesRestoreRule.java:57)
        at org.apache.lucene.util.AbstractBeforeAfterRule$1.evaluate(AbstractBeforeAfterRule.java:45)
        at com.carrotsearch.randomizedtesting.rules.StatementAdapter.evaluate(StatementAdapter.java:36)
        at org.apache.lucene.util.TestRuleStoreClassName$1.evaluate(TestRuleStoreClassName.java:41)
        at com.carrotsearch.randomizedtesting.rules.NoShadowingOrOverridesOnMethodsRule$1.evaluate(NoShadowingOrOverridesOnMethodsRule.java:40)
        at com.carrotsearch.randomizedtesting.rules.NoShadowingOrOverridesOnMethodsRule$1.evaluate(NoShadowingOrOverridesOnMethodsRule.java:40)
        at com.carrotsearch.randomizedtesting.rules.StatementAdapter.evaluate(StatementAdapter.java:36)
        at com.carrotsearch.randomizedtesting.rules.StatementAdapter.evaluate(StatementAdapter.java:36)
        at com.carrotsearch.randomizedtesting.rules.StatementAdapter.evaluate(StatementAdapter.java:36)
        at org.apache.lucene.util.TestRuleAssertionsRequired$1.evaluate(TestRuleAssertionsRequired.java:53)
        at org.apache.lucene.util.TestRuleMarkFailure$1.evaluate(TestRuleMarkFailure.java:47)
        at org.apache.lucene.util.TestRuleIgnoreAfterMaxFailures$1.evaluate(TestRuleIgnoreAfterMaxFailures.java:64)
        at org.apache.lucene.util.TestRuleIgnoreTestSuites$1.evaluate(TestRuleIgnoreTestSuites.java:54)
        at com.carrotsearch.randomizedtesting.rules.StatementAdapter.evaluate(StatementAdapter.java:36)
        at com.carrotsearch.randomizedtesting.ThreadLeakControl$StatementRunner.run(ThreadLeakControl.java:368)
        at java.lang.Thread.run(Thread.java:748)


FAILED:  org.apache.solr.handler.TestContainerReqHandler.testCacheLoadFromPackage

Error Message:
Error from server at http://127.0.0.1:51274/solr: Underlying core creation failed while creating collection: globalCacheColl

Stack Trace:
org.apache.solr.client.solrj.impl.HttpSolrClient$RemoteSolrException: Error from server at http://127.0.0.1:51274/solr: Underlying core creation failed while creating collection: globalCacheColl
        at __randomizedtesting.SeedInfo.seed([BEBE936614E6EEDA:729BC7F81FB15839]:0)
        at org.apache.solr.client.solrj.impl.HttpSolrClient.executeMethod(HttpSolrClient.java:656)
        at org.apache.solr.client.solrj.impl.HttpSolrClient.request(HttpSolrClient.java:262)
        at org.apache.solr.client.solrj.impl.HttpSolrClient.request(HttpSolrClient.java:245)
        at org.apache.solr.client.solrj.impl.LBSolrClient.doRequest(LBSolrClient.java:368)
        at org.apache.solr.client.solrj.impl.LBSolrClient.request(LBSolrClient.java:296)
        at org.apache.solr.client.solrj.impl.BaseCloudSolrClient.sendRequest(BaseCloudSolrClient.java:1128)
        at org.apache.solr.client.solrj.impl.BaseCloudSolrClient.requestWithRetryOnStaleState(BaseCloudSolrClient.java:897)
        at org.apache.solr.client.solrj.impl.BaseCloudSolrClient.request(BaseCloudSolrClient.java:829)
        at org.apache.solr.client.solrj.SolrRequest.process(SolrRequest.java:211)
        at org.apache.solr.client.solrj.SolrRequest.process(SolrRequest.java:228)
        at org.apache.solr.handler.TestContainerReqHandler.testCacheLoadFromPackage(TestContainerReqHandler.java:687)
        at sun.reflect.NativeMethodAccessorImpl.invoke0(Native Method)
        at sun.reflect.NativeMethodAccessorImpl.invoke(NativeMethodAccessorImpl.java:62)
        at sun.reflect.DelegatingMethodAccessorImpl.invoke(DelegatingMethodAccessorImpl.java:43)
        at java.lang.reflect.Method.invoke(Method.java:498)
        at com.carrotsearch.randomizedtesting.RandomizedRunner.invoke(RandomizedRunner.java:1750)
        at com.carrotsearch.randomizedtesting.RandomizedRunner$8.evaluate(RandomizedRunner.java:938)
        at com.carrotsearch.randomizedtesting.RandomizedRunner$9.evaluate(RandomizedRunner.java:974)
        at com.carrotsearch.randomizedtesting.RandomizedRunner$10.evaluate(RandomizedRunner.java:988)
        at com.carrotsearch.randomizedtesting.rules.SystemPropertiesRestoreRule$1.evaluate(SystemPropertiesRestoreRule.java:57)
        at org.apache.lucene.util.TestRuleSetupTeardownChained$1.evaluate(TestRuleSetupTeardownChained.java:49)
        at org.apache.lucene.util.AbstractBeforeAfterRule$1.evaluate(AbstractBeforeAfterRule.java:45)
        at org.apache.lucene.util.TestRuleThreadAndTestName$1.evaluate(TestRuleThreadAndTestName.java:48)
        at org.apache.lucene.util.TestRuleIgnoreAfterMaxFailures$1.evaluate(TestRuleIgnoreAfterMaxFailures.java:64)
        at org.apache.lucene.util.TestRuleMarkFailure$1.evaluate(TestRuleMarkFailure.java:47)
        at com.carrotsearch.randomizedtesting.rules.StatementAdapter.evaluate(StatementAdapter.java:36)
        at com.carrotsearch.randomizedtesting.ThreadLeakControl$StatementRunner.run(ThreadLeakControl.java:368)
        at com.carrotsearch.randomizedtesting.ThreadLeakControl.forkTimeoutingTask(ThreadLeakControl.java:817)
        at com.carrotsearch.randomizedtesting.ThreadLeakControl$3.evaluate(ThreadLeakControl.java:468)
        at com.carrotsearch.randomizedtesting.RandomizedRunner.runSingleTest(RandomizedRunner.java:947)
        at com.carrotsearch.randomizedtesting.RandomizedRunner$5.evaluate(RandomizedRunner.java:832)
        at com.carrotsearch.randomizedtesting.RandomizedRunner$6.evaluate(RandomizedRunner.java:883)
        at com.carrotsearch.randomizedtesting.RandomizedRunner$7.evaluate(RandomizedRunner.java:894)
        at com.carrotsearch.randomizedtesting.rules.StatementAdapter.evaluate(StatementAdapter.java:36)
        at com.carrotsearch.randomizedtesting.rules.SystemPropertiesRestoreRule$1.evaluate(SystemPropertiesRestoreRule.java:57)
        at org.apache.lucene.util.AbstractBeforeAfterRule$1.evaluate(AbstractBeforeAfterRule.java:45)
        at com.carrotsearch.randomizedtesting.rules.StatementAdapter.evaluate(StatementAdapter.java:36)
        at org.apache.lucene.util.TestRuleStoreClassName$1.evaluate(TestRuleStoreClassName.java:41)
        at com.carrotsearch.randomizedtesting.rules.NoShadowingOrOverridesOnMethodsRule$1.evaluate(NoShadowingOrOverridesOnMethodsRule.java:40)
        at com.carrotsearch.randomizedtesting.rules.NoShadowingOrOverridesOnMethodsRule$1.evaluate(NoShadowingOrOverridesOnMethodsRule.java:40)
        at com.carrotsearch.randomizedtesting.rules.StatementAdapter.evaluate(StatementAdapter.java:36)
        at com.carrotsearch.randomizedtesting.rules.StatementAdapter.evaluate(StatementAdapter.java:36)
        at com.carrotsearch.randomizedtesting.rules.StatementAdapter.evaluate(StatementAdapter.java:36)
        at org.apache.lucene.util.TestRuleAssertionsRequired$1.evaluate(TestRuleAssertionsRequired.java:53)
        at org.apache.lucene.util.TestRuleMarkFailure$1.evaluate(TestRuleMarkFailure.java:47)
        at org.apache.lucene.util.TestRuleIgnoreAfterMaxFailures$1.evaluate(TestRuleIgnoreAfterMaxFailures.java:64)
        at org.apache.lucene.util.TestRuleIgnoreTestSuites$1.evaluate(TestRuleIgnoreTestSuites.java:54)
        at com.carrotsearch.randomizedtesting.rules.StatementAdapter.evaluate(StatementAdapter.java:36)
        at com.carrotsearch.randomizedtesting.ThreadLeakControl$StatementRunner.run(ThreadLeakControl.java:368)
        at java.lang.Thread.run(Thread.java:748)


FAILED:  org.apache.solr.handler.TestContainerReqHandler.testCacheLoadFromPackage

Error Message:
Error from server at http://127.0.0.1:51719/solr: Underlying core creation failed while creating collection: globalCacheColl

Stack Trace:
org.apache.solr.client.solrj.impl.HttpSolrClient$RemoteSolrException: Error from server at http://127.0.0.1:51719/solr: Underlying core creation failed while creating collection: globalCacheColl
        at __randomizedtesting.SeedInfo.seed([BEBE936614E6EEDA:729BC7F81FB15839]:0)
        at org.apache.solr.client.solrj.impl.HttpSolrClient.executeMethod(HttpSolrClient.java:656)
        at org.apache.solr.client.solrj.impl.HttpSolrClient.request(HttpSolrClient.java:262)
        at org.apache.solr.client.solrj.impl.HttpSolrClient.request(HttpSolrClient.java:245)
        at org.apache.solr.client.solrj.impl.LBSolrClient.doRequest(LBSolrClient.java:368)
        at org.apache.solr.client.solrj.impl.LBSolrClient.request(LBSolrClient.java:296)
        at org.apache.solr.client.solrj.impl.BaseCloudSolrClient.sendRequest(BaseCloudSolrClient.java:1128)
        at org.apache.solr.client.solrj.impl.BaseCloudSolrClient.requestWithRetryOnStaleState(BaseCloudSolrClient.java:897)
        at org.apache.solr.client.solrj.impl.BaseCloudSolrClient.request(BaseCloudSolrClient.java:829)
        at org.apache.solr.client.solrj.SolrRequest.process(SolrRequest.java:211)
        at org.apache.solr.client.solrj.SolrRequest.process(SolrRequest.java:228)
        at org.apache.solr.handler.TestContainerReqHandler.testCacheLoadFromPackage(TestContainerReqHandler.java:687)
        at sun.reflect.NativeMethodAccessorImpl.invoke0(Native Method)
        at sun.reflect.NativeMethodAccessorImpl.invoke(NativeMethodAccessorImpl.java:62)
        at sun.reflect.DelegatingMethodAccessorImpl.invoke(DelegatingMethodAccessorImpl.java:43)
        at java.lang.reflect.Method.invoke(Method.java:498)
        at com.carrotsearch.randomizedtesting.RandomizedRunner.invoke(RandomizedRunner.java:1750)
        at com.carrotsearch.randomizedtesting.RandomizedRunner$8.evaluate(RandomizedRunner.java:938)
        at com.carrotsearch.randomizedtesting.RandomizedRunner$9.evaluate(RandomizedRunner.java:974)
        at com.carrotsearch.randomizedtesting.RandomizedRunner$10.evaluate(RandomizedRunner.java:988)
        at com.carrotsearch.randomizedtesting.rules.SystemPropertiesRestoreRule$1.evaluate(SystemPropertiesRestoreRule.java:57)
        at org.apache.lucene.util.TestRuleSetupTeardownChained$1.evaluate(TestRuleSetupTeardownChained.java:49)
        at org.apache.lucene.util.AbstractBeforeAfterRule$1.evaluate(AbstractBeforeAfterRule.java:45)
        at org.apache.lucene.util.TestRuleThreadAndTestName$1.evaluate(TestRuleThreadAndTestName.java:48)
        at org.apache.lucene.util.TestRuleIgnoreAfterMaxFailures$1.evaluate(TestRuleIgnoreAfterMaxFailures.java:64)
        at org.apache.lucene.util.TestRuleMarkFailure$1.evaluate(TestRuleMarkFailure.java:47)
        at com.carrotsearch.randomizedtesting.rules.StatementAdapter.evaluate(StatementAdapter.java:36)
        at com.carrotsearch.randomizedtesting.ThreadLeakControl$StatementRunner.run(ThreadLeakControl.java:368)
        at com.carrotsearch.randomizedtesting.ThreadLeakControl.forkTimeoutingTask(ThreadLeakControl.java:817)
        at com.carrotsearch.randomizedtesting.ThreadLeakControl$3.evaluate(ThreadLeakControl.java:468)
        at com.carrotsearch.randomizedtesting.RandomizedRunner.runSingleTest(RandomizedRunner.java:947)
        at com.carrotsearch.randomizedtesting.RandomizedRunner$5.evaluate(RandomizedRunner.java:832)
        at com.carrotsearch.randomizedtesting.RandomizedRunner$6.evaluate(RandomizedRunner.java:883)
        at com.carrotsearch.randomizedtesting.RandomizedRunner$7.evaluate(RandomizedRunner.java:894)
        at com.carrotsearch.randomizedtesting.rules.StatementAdapter.evaluate(StatementAdapter.java:36)
        at com.carrotsearch.randomizedtesting.rules.SystemPropertiesRestoreRule$1.evaluate(SystemPropertiesRestoreRule.java:57)
        at org.apache.lucene.util.AbstractBeforeAfterRule$1.evaluate(AbstractBeforeAfterRule.java:45)
        at com.carrotsearch.randomizedtesting.rules.StatementAdapter.evaluate(StatementAdapter.java:36)
        at org.apache.lucene.util.TestRuleStoreClassName$1.evaluate(TestRuleStoreClassName.java:41)
        at com.carrotsearch.randomizedtesting.rules.NoShadowingOrOverridesOnMethodsRule$1.evaluate(NoShadowingOrOverridesOnMethodsRule.java:40)
        at com.carrotsearch.randomizedtesting.rules.NoShadowingOrOverridesOnMethodsRule$1.evaluate(NoShadowingOrOverridesOnMethodsRule.java:40)
        at com.carrotsearch.randomizedtesting.rules.StatementAdapter.evaluate(StatementAdapter.java:36)
        at com.carrotsearch.randomizedtesting.rules.StatementAdapter.evaluate(StatementAdapter.java:36)
        at com.carrotsearch.randomizedtesting.rules.StatementAdapter.evaluate(StatementAdapter.java:36)
        at org.apache.lucene.util.TestRuleAssertionsRequired$1.evaluate(TestRuleAssertionsRequired.java:53)
        at org.apache.lucene.util.TestRuleMarkFailure$1.evaluate(TestRuleMarkFailure.java:47)
        at org.apache.lucene.util.TestRuleIgnoreAfterMaxFailures$1.evaluate(TestRuleIgnoreAfterMaxFailures.java:64)
        at org.apache.lucene.util.TestRuleIgnoreTestSuites$1.evaluate(TestRuleIgnoreTestSuites.java:54)
        at com.carrotsearch.randomizedtesting.rules.StatementAdapter.evaluate(StatementAdapter.java:36)
        at com.carrotsearch.randomizedtesting.ThreadLeakControl$StatementRunner.run(ThreadLeakControl.java:368)
        at java.lang.Thread.run(Thread.java:748)


FAILED:  org.apache.solr.handler.TestContainerReqHandler.testCacheLoadFromPackage

Error Message:
Error from server at http://127.0.0.1:51433/solr: Underlying core creation failed while creating collection: globalCacheColl

Stack Trace:
org.apache.solr.client.solrj.impl.HttpSolrClient$RemoteSolrException: Error from server at http://127.0.0.1:51433/solr: Underlying core creation failed while creating collection: globalCacheColl
        at __randomizedtesting.SeedInfo.seed([BEBE936614E6EEDA:729BC7F81FB15839]:0)
        at org.apache.solr.client.solrj.impl.HttpSolrClient.executeMethod(HttpSolrClient.java:656)
        at org.apache.solr.client.solrj.impl.HttpSolrClient.request(HttpSolrClient.java:262)
        at org.apache.solr.client.solrj.impl.HttpSolrClient.request(HttpSolrClient.java:245)
        at org.apache.solr.client.solrj.impl.LBSolrClient.doRequest(LBSolrClient.java:368)
        at org.apache.solr.client.solrj.impl.LBSolrClient.request(LBSolrClient.java:296)
        at org.apache.solr.client.solrj.impl.BaseCloudSolrClient.sendRequest(BaseCloudSolrClient.java:1128)
        at org.apache.solr.client.solrj.impl.BaseCloudSolrClient.requestWithRetryOnStaleState(BaseCloudSolrClient.java:897)
        at org.apache.solr.client.solrj.impl.BaseCloudSolrClient.request(BaseCloudSolrClient.java:829)
        at org.apache.solr.client.solrj.SolrRequest.process(SolrRequest.java:211)
        at org.apache.solr.client.solrj.SolrRequest.process(SolrRequest.java:228)
        at org.apache.solr.handler.TestContainerReqHandler.testCacheLoadFromPackage(TestContainerReqHandler.java:687)
        at sun.reflect.NativeMethodAccessorImpl.invoke0(Native Method)
        at sun.reflect.NativeMethodAccessorImpl.invoke(NativeMethodAccessorImpl.java:62)
        at sun.reflect.DelegatingMethodAccessorImpl.invoke(DelegatingMethodAccessorImpl.java:43)
        at java.lang.reflect.Method.invoke(Method.java:498)
        at com.carrotsearch.randomizedtesting.RandomizedRunner.invoke(RandomizedRunner.java:1750)
        at com.carrotsearch.randomizedtesting.RandomizedRunner$8.evaluate(RandomizedRunner.java:938)
        at com.carrotsearch.randomizedtesting.RandomizedRunner$9.evaluate(RandomizedRunner.java:974)
        at com.carrotsearch.randomizedtesting.RandomizedRunner$10.evaluate(RandomizedRunner.java:988)
        at com.carrotsearch.randomizedtesting.rules.SystemPropertiesRestoreRule$1.evaluate(SystemPropertiesRestoreRule.java:57)
        at org.apache.lucene.util.TestRuleSetupTeardownChained$1.evaluate(TestRuleSetupTeardownChained.java:49)
        at org.apache.lucene.util.AbstractBeforeAfterRule$1.evaluate(AbstractBeforeAfterRule.java:45)
        at org.apache.lucene.util.TestRuleThreadAndTestName$1.evaluate(TestRuleThreadAndTestName.java:48)
        at org.apache.lucene.util.TestRuleIgnoreAfterMaxFailures$1.evaluate(TestRuleIgnoreAfterMaxFailures.java:64)
        at org.apache.lucene.util.TestRuleMarkFailure$1.evaluate(TestRuleMarkFailure.java:47)
        at com.carrotsearch.randomizedtesting.rules.StatementAdapter.evaluate(StatementAdapter.java:36)
        at com.carrotsearch.randomizedtesting.ThreadLeakControl$StatementRunner.run(ThreadLeakControl.java:368)
        at com.carrotsearch.randomizedtesting.ThreadLeakControl.forkTimeoutingTask(ThreadLeakControl.java:817)
        at com.carrotsearch.randomizedtesting.ThreadLeakControl$3.evaluate(ThreadLeakControl.java:468)
        at com.carrotsearch.randomizedtesting.RandomizedRunner.runSingleTest(RandomizedRunner.java:947)
        at com.carrotsearch.randomizedtesting.RandomizedRunner$5.evaluate(RandomizedRunner.java:832)
        at com.carrotsearch.randomizedtesting.RandomizedRunner$6.evaluate(RandomizedRunner.java:883)
        at com.carrotsearch.randomizedtesting.RandomizedRunner$7.evaluate(RandomizedRunner.java:894)
        at com.carrotsearch.randomizedtesting.rules.StatementAdapter.evaluate(StatementAdapter.java:36)
        at com.carrotsearch.randomizedtesting.rules.SystemPropertiesRestoreRule$1.evaluate(SystemPropertiesRestoreRule.java:57)
        at org.apache.lucene.util.AbstractBeforeAfterRule$1.evaluate(AbstractBeforeAfterRule.java:45)
        at com.carrotsearch.randomizedtesting.rules.StatementAdapter.evaluate(StatementAdapter.java:36)
        at org.apache.lucene.util.TestRuleStoreClassName$1.evaluate(TestRuleStoreClassName.java:41)
        at com.carrotsearch.randomizedtesting.rules.NoShadowingOrOverridesOnMethodsRule$1.evaluate(NoShadowingOrOverridesOnMethodsRule.java:40)
        at com.carrotsearch.randomizedtesting.rules.NoShadowingOrOverridesOnMethodsRule$1.evaluate(NoShadowingOrOverridesOnMethodsRule.java:40)
        at com.carrotsearch.randomizedtesting.rules.StatementAdapter.evaluate(StatementAdapter.java:36)
        at com.carrotsearch.randomizedtesting.rules.StatementAdapter.evaluate(StatementAdapter.java:36)
        at com.carrotsearch.randomizedtesting.rules.StatementAdapter.evaluate(StatementAdapter.java:36)
        at org.apache.lucene.util.TestRuleAssertionsRequired$1.evaluate(TestRuleAssertionsRequired.java:53)
        at org.apache.lucene.util.TestRuleMarkFailure$1.evaluate(TestRuleMarkFailure.java:47)
        at org.apache.lucene.util.TestRuleIgnoreAfterMaxFailures$1.evaluate(TestRuleIgnoreAfterMaxFailures.java:64)
        at org.apache.lucene.util.TestRuleIgnoreTestSuites$1.evaluate(TestRuleIgnoreTestSuites.java:54)
        at com.carrotsearch.randomizedtesting.rules.StatementAdapter.evaluate(StatementAdapter.java:36)
        at com.carrotsearch.randomizedtesting.ThreadLeakControl$StatementRunner.run(ThreadLeakControl.java:368)
        at java.lang.Thread.run(Thread.java:748)




Build Log:
[...truncated 14804 lines...]
   [junit4] Suite: org.apache.solr.handler.TestContainerReqHandler
   [junit4]   2> 2621300 INFO  (SUITE-TestContainerReqHandler-seed#[BEBE936614E6EEDA]-worker) [     ] o.a.s.SolrTestCaseJ4 Created dataDir: /Users/jenkins/workspace/Lucene-Solr-8.x-MacOSX/solr/build/solr-core/test/J1/temp/solr.handler.TestContainerReqHandler_BEBE936614E6EEDA-001/data-dir-302-001
   [junit4]   2> 2621300 INFO  (SUITE-TestContainerReqHandler-seed#[BEBE936614E6EEDA]-worker) [     ] o.a.s.SolrTestCaseJ4 Using PointFields (NUMERIC_POINTS_SYSPROP=true) w/NUMERIC_DOCVALUES_SYSPROP=true
   [junit4]   2> 2621302 INFO  (SUITE-TestContainerReqHandler-seed#[BEBE936614E6EEDA]-worker) [     ] o.a.s.SolrTestCaseJ4 Randomized ssl (false) and clientAuth (false) via: @org.apache.solr.SolrTestCaseJ4$SuppressSSL(bugUrl=None) w/ MAC_OS_X supressed clientAuth
   [junit4]   2> 2621302 INFO  (SUITE-TestContainerReqHandler-seed#[BEBE936614E6EEDA]-worker) [     ] o.a.s.SolrTestCaseJ4 SecureRandom sanity checks: test.solr.allowed.securerandom=null & java.security.egd=file:/dev/./urandom
   [junit4]   2> 2621304 INFO  (TEST-TestContainerReqHandler.testSetClusterReqHandler-seed#[BEBE936614E6EEDA]) [     ] o.a.s.SolrTestCaseJ4 ###Starting testSetClusterReqHandler
   [junit4]   2> 2621305 INFO  (TEST-TestContainerReqHandler.testSetClusterReqHandler-seed#[BEBE936614E6EEDA]) [     ] o.a.s.c.MiniSolrCloudCluster Starting cluster of 4 servers in /Users/jenkins/workspace/Lucene-Solr-8.x-MacOSX/solr/build/solr-core/test/J1/temp/solr.handler.TestContainerReqHandler_BEBE936614E6EEDA-001/tempDir-001
   [junit4]   2> 2621305 INFO  (TEST-TestContainerReqHandler.testSetClusterReqHandler-seed#[BEBE936614E6EEDA]) [     ] o.a.s.c.ZkTestServer STARTING ZK TEST SERVER
   [junit4]   2> 2621306 INFO  (ZkTestServer Run Thread) [     ] o.a.s.c.ZkTestServer client port:0.0.0.0/0.0.0.0:0
   [junit4]   2> 2621306 INFO  (ZkTestServer Run Thread) [     ] o.a.s.c.ZkTestServer Starting server
   [junit4]   2> 2621409 INFO  (TEST-TestContainerReqHandler.testSetClusterReqHandler-seed#[BEBE936614E6EEDA]) [     ] o.a.s.c.ZkTestServer start zk server on port:51319
   [junit4]   2> 2621409 INFO  (TEST-TestContainerReqHandler.testSetClusterReqHandler-seed#[BEBE936614E6EEDA]) [     ] o.a.s.c.ZkTestServer waitForServerUp: 127.0.0.1:51319
   [junit4]   2> 2621409 INFO  (TEST-TestContainerReqHandler.testSetClusterReqHandler-seed#[BEBE936614E6EEDA]) [     ] o.a.s.c.ZkTestServer parse host and port list: 127.0.0.1:51319
   [junit4]   2> 2621409 INFO  (TEST-TestContainerReqHandler.testSetClusterReqHandler-seed#[BEBE936614E6EEDA]) [     ] o.a.s.c.ZkTestServer connecting to 127.0.0.1 51319
   [junit4]   2> 2621411 INFO  (TEST-TestContainerReqHandler.testSetClusterReqHandler-seed#[BEBE936614E6EEDA]) [     ] o.a.s.c.c.ConnectionManager Waiting for client to connect to ZooKeeper
   [junit4]   2> 2621424 INFO  (zkConnectionManagerCallback-17409-thread-1) [     ] o.a.s.c.c.ConnectionManager zkClient has connected
   [junit4]   2> 2621424 INFO  (TEST-TestContainerReqHandler.testSetClusterReqHandler-seed#[BEBE936614E6EEDA]) [     ] o.a.s.c.c.ConnectionManager Client is connected to ZooKeeper
   [junit4]   2> 2621428 INFO  (TEST-TestContainerReqHandler.testSetClusterReqHandler-seed#[BEBE936614E6EEDA]) [     ] o.a.s.c.c.ConnectionManager Waiting for client to connect to ZooKeeper
   [junit4]   2> 2621430 INFO  (zkConnectionManagerCallback-17411-thread-1) [     ] o.a.s.c.c.ConnectionManager zkClient has connected
   [junit4]   2> 2621430 INFO  (TEST-TestContainerReqHandler.testSetClusterReqHandler-seed#[BEBE936614E6EEDA]) [     ] o.a.s.c.c.ConnectionManager Client is connected to ZooKeeper
   [junit4]   2> 2621431 INFO  (TEST-TestContainerReqHandler.testSetClusterReqHandler-seed#[BEBE936614E6EEDA]) [     ] o.a.s.c.c.ConnectionManager Waiting for client to connect to ZooKeeper
   [junit4]   2> 2621433 INFO  (zkConnectionManagerCallback-17413-thread-1) [     ] o.a.s.c.c.ConnectionManager zkClient has connected
   [junit4]   2> 2621433 INFO  (TEST-TestContainerReqHandler.testSetClusterReqHandler-seed#[BEBE936614E6EEDA]) [     ] o.a.s.c.c.ConnectionManager Client is connected to ZooKeeper
   [junit4]   2> 2621544 WARN  (jetty-launcher-17414-thread-2) [     ] o.e.j.s.AbstractConnector Ignoring deprecated socket close linger time
   [junit4]   2> 2621544 WARN  (jetty-launcher-17414-thread-1) [     ] o.e.j.s.AbstractConnector Ignoring deprecated socket close linger time
   [junit4]   2> 2621544 INFO  (jetty-launcher-17414-thread-1) [     ] o.a.s.c.s.e.JettySolrRunner Start Jetty (original configured port=0)
   [junit4]   2> 2621544 INFO  (jetty-launcher-17414-thread-1) [     ] o.a.s.c.s.e.JettySolrRunner Trying to start Jetty on port 0 try number 1 ...
   [junit4]   2> 2621545 INFO  (jetty-launcher-17414-thread-1) [     ] o.e.j.s.Server jetty-9.4.19.v20190610; built: 2019-06-10T16:30:51.723Z; git: afcf563148970e98786327af5e07c261fda175d3; jvm 1.8.0_201-b09
   [junit4]   2> 2621545 WARN  (jetty-launcher-17414-thread-3) [     ] o.e.j.s.AbstractConnector Ignoring deprecated socket close linger time
   [junit4]   2> 2621545 INFO  (jetty-launcher-17414-thread-3) [     ] o.a.s.c.s.e.JettySolrRunner Start Jetty (original configured port=0)
   [junit4]   2> 2621545 INFO  (jetty-launcher-17414-thread-3) [     ] o.a.s.c.s.e.JettySolrRunner Trying to start Jetty on port 0 try number 1 ...
   [junit4]   2> 2621545 INFO  (jetty-launcher-17414-thread-3) [     ] o.e.j.s.Server jetty-9.4.19.v20190610; built: 2019-06-10T16:30:51.723Z; git: afcf563148970e98786327af5e07c261fda175d3; jvm 1.8.0_201-b09
   [junit4]   2> 2621545 INFO  (jetty-launcher-17414-thread-2) [     ] o.a.s.c.s.e.JettySolrRunner Start Jetty (original configured port=0)
   [junit4]   2> 2621545 INFO  (jetty-launcher-17414-thread-2) [     ] o.a.s.c.s.e.JettySolrRunner Trying to start Jetty on port 0 try number 1 ...
   [junit4]   2> 2621545 INFO  (jetty-launcher-17414-thread-2) [     ] o.e.j.s.Server jetty-9.4.19.v20190610; built: 2019-06-10T16:30:51.723Z; git: afcf563148970e98786327af5e07c261fda175d3; jvm 1.8.0_201-b09
   [junit4]   2> 2621545 WARN  (jetty-launcher-17414-thread-4) [     ] o.e.j.s.AbstractConnector Ignoring deprecated socket close linger time
   [junit4]   2> 2621545 INFO  (jetty-launcher-17414-thread-4) [     ] o.a.s.c.s.e.JettySolrRunner Start Jetty (original configured port=0)
   [junit4]   2> 2621545 INFO  (jetty-launcher-17414-thread-4) [     ] o.a.s.c.s.e.JettySolrRunner Trying to start Jetty on port 0 try number 1 ...
   [junit4]   2> 2621546 INFO  (jetty-launcher-17414-thread-4) [     ] o.e.j.s.Server jetty-9.4.19.v20190610; built: 2019-06-10T16:30:51.723Z; git: afcf563148970e98786327af5e07c261fda175d3; jvm 1.8.0_201-b09
   [junit4]   2> 2621547 INFO  (jetty-launcher-17414-thread-1) [     ] o.e.j.s.session DefaultSessionIdManager workerName=node0
   [junit4]   2> 2621547 INFO  (jetty-launcher-17414-thread-1) [     ] o.e.j.s.session No SessionScavenger set, using defaults
   [junit4]   2> 2621547 INFO  (jetty-launcher-17414-thread-1) [     ] o.e.j.s.session node0 Scavenging every 600000ms
   [junit4]   2> 2621548 INFO  (jetty-launcher-17414-thread-1) [     ] o.e.j.s.h.ContextHandler Started o.e.j.s.ServletContextHandler@38d226f0{/solr,null,AVAILABLE}
   [junit4]   2> 2621550 INFO  (jetty-launcher-17414-thread-4) [     ] o.e.j.s.session DefaultSessionIdManager workerName=node0
   [junit4]   2> 2621550 INFO  (jetty-launcher-17414-thread-4) [     ] o.e.j.s.session No SessionScavenger set, using defaults
   [junit4]   2> 2621550 INFO  (jetty-launcher-17414-thread-4) [     ] o.e.j.s.session node0 Scavenging every 660000ms
   [junit4]   2> 2621550 INFO  (jetty-launcher-17414-thread-2) [     ] o.e.j.s.session DefaultSessionIdManager workerName=node0
   [junit4]   2> 2621550 INFO  (jetty-launcher-17414-thread-2) [     ] o.e.j.s.session No SessionScavenger set, using defaults
   [junit4]   2> 2621550 INFO  (jetty-launcher-17414-thread-1) [     ] o.e.j.s.AbstractConnector Started ServerConnector@287bc883{HTTP/1.1,[http/1.1, h2c]}{127.0.0.1:51324}
   [junit4]   2> 2621550 INFO  (jetty-launcher-17414-thread-2) [     ] o.e.j.s.session node0 Scavenging every 660000ms
   [junit4]   2> 2621550 INFO  (jetty-launcher-17414-thread-1) [     ] o.e.j.s.Server Started @2621643ms
   [junit4]   2> 2621550 INFO  (jetty-launcher-17414-thread-1) [     ] o.a.s.c.s.e.JettySolrRunner Jetty properties: {hostContext=/solr, hostPort=51324}
   [junit4]   2> 2621550 ERROR (jetty-launcher-17414-thread-1) [     ] o.a.s.u.StartupLoggingUtils Missing Java Option solr.log.dir. Logging may be missing or incomplete.
   [junit4]   2> 2621550 INFO  (jetty-launcher-17414-thread-1) [     ] o.a.s.s.SolrDispatchFilter Using logger factory org.apache.logging.slf4j.Log4jLoggerFactory
   [junit4]   2> 2621551 INFO  (jetty-launcher-17414-thread-1) [     ] o.a.s.s.SolrDispatchFilter  ___      _       Welcome to Apache Solr™ version 8.3.0
   [junit4]   2> 2621551 INFO  (jetty-launcher-17414-thread-1) [     ] o.a.s.s.SolrDispatchFilter / __| ___| |_ _   Starting in cloud mode on port null
   [junit4]   2> 2621551 INFO  (jetty-launcher-17414-thread-1) [     ] o.a.s.s.SolrDispatchFilter \__ \/ _ \ | '_|  Install dir: null
   [junit4]   2> 2621551 INFO  (jetty-launcher-17414-thread-1) [     ] o.a.s.s.SolrDispatchFilter |___/\___/_|_|    Start time: 2019-08-23T23:24:43.771Z
   [junit4]   2> 2621551 INFO  (jetty-launcher-17414-thread-3) [     ] o.e.j.s.session DefaultSessionIdManager workerName=node0
   [junit4]   2> 2621551 INFO  (jetty-launcher-17414-thread-3) [     ] o.e.j.s.session No SessionScavenger set, using defaults
   [junit4]   2> 2621551 INFO  (jetty-launcher-17414-thread-3) [     ] o.e.j.s.session node0 Scavenging every 600000ms
   [junit4]   2> 2621551 INFO  (jetty-launcher-17414-thread-3) [     ] o.e.j.s.h.ContextHandler Started o.e.j.s.ServletContextHandler@3ffd97ee{/solr,null,AVAILABLE}
   [junit4]   2> 2621552 INFO  (jetty-launcher-17414-thread-2) [     ] o.e.j.s.h.ContextHandler Started o.e.j.s.ServletContextHandler@4c9752a7{/solr,null,AVAILABLE}
   [junit4]   2> 2621552 INFO  (jetty-launcher-17414-thread-4) [     ] o.e.j.s.h.ContextHandler Started o.e.j.s.ServletContextHandler@73d4698d{/solr,null,AVAILABLE}
   [junit4]   2> 2621552 INFO  (jetty-launcher-17414-thread-1) [     ] o.a.s.c.c.ConnectionManager Waiting for client to connect to ZooKeeper
   [junit4]   2> 2621552 INFO  (jetty-launcher-17414-thread-2) [     ] o.e.j.s.AbstractConnector Started ServerConnector@62c62ebf{HTTP/1.1,[http/1.1, h2c]}{127.0.0.1:51326}
   [junit4]   2> 2621552 INFO  (jetty-launcher-17414-thread-2) [     ] o.e.j.s.Server Started @2621645ms
   [junit4]   2> 2621552 INFO  (jetty-launcher-17414-thread-2) [     ] o.a.s.c.s.e.JettySolrRunner Jetty properties: {hostContext=/solr, hostPort=51326}
   [junit4]   2> 2621552 INFO  (jetty-launcher-17414-thread-3) [     ] o.e.j.s.AbstractConnector Started ServerConnector@7dd3f7f1{HTTP/1.1,[http/1.1, h2c]}{127.0.0.1:51325}
   [junit4]   2> 2621552 INFO  (jetty-launcher-17414-thread-3) [     ] o.e.j.s.Server Started @2621645ms
   [junit4]   2> 2621552 INFO  (jetty-launcher-17414-thread-3) [     ] o.a.s.c.s.e.JettySolrRunner Jetty properties: {hostContext=/solr, hostPort=51325}
   [junit4]   2> 2621553 ERROR (jetty-launcher-17414-thread-3) [     ] o.a.s.u.StartupLoggingUtils Missing Java Option solr.log.dir. Logging may be missing or incomplete.
   [junit4]   2> 2621553 INFO  (jetty-launcher-17414-thread-3) [     ] o.a.s.s.SolrDispatchFilter Using logger factory org.apache.logging.slf4j.Log4jLoggerFactory
   [junit4]   2> 2621553 ERROR (jetty-launcher-17414-thread-2) [     ] o.a.s.u.StartupLoggingUtils Missing Java Option solr.log.dir. Logging may be missing or incomplete.
   [junit4]   2> 2621553 INFO  (jetty-launcher-17414-thread-2) [     ] o.a.s.s.SolrDispatchFilter Using logger factory org.apache.logging.slf4j.Log4jLoggerFactory
   [junit4]   2> 2621553 INFO  (jetty-launcher-17414-thread-3) [     ] o.a.s.s.SolrDispatchFilter  ___      _       Welcome to Apache Solr™ version 8.3.0
   [junit4]   2> 2621553 INFO  (jetty-launcher-17414-thread-2) [     ] o.a.s.s.SolrDispatchFilter  ___      _       Welcome to Apache Solr™ version 8.3.0
   [junit4]   2> 2621553 INFO  (jetty-launcher-17414-thread-2) [     ] o.a.s.s.SolrDispatchFilter / __| ___| |_ _   Starting in cloud mode on port null
   [junit4]   2> 2621553 INFO  (jetty-launcher-17414-thread-4) [     ] o.e.j.s.AbstractConnector Started ServerConnector@7d3919e4{HTTP/1.1,[http/1.1, h2c]}{127.0.0.1:51327}
   [junit4]   2> 2621553 INFO  (jetty-launcher-17414-thread-2) [     ] o.a.s.s.SolrDispatchFilter \__ \/ _ \ | '_|  Install dir: null
   [junit4]   2> 2621553 INFO  (jetty-launcher-17414-thread-4) [     ] o.e.j.s.Server Started @2621645ms
   [junit4]   2> 2621553 INFO  (jetty-launcher-17414-thread-4) [     ] o.a.s.c.s.e.JettySolrRunner Jetty properties: {hostContext=/solr, hostPort=51327}
   [junit4]   2> 2621553 INFO  (jetty-launcher-17414-thread-2) [     ] o.a.s.s.SolrDispatchFilter |___/\___/_|_|    Start time: 2019-08-23T23:24:43.773Z
   [junit4]   2> 2621553 ERROR (jetty-launcher-17414-thread-4) [     ] o.a.s.u.StartupLoggingUtils Missing Java Option solr.log.dir. Logging may be missing or incomplete.
   [junit4]   2> 2621553 INFO  (jetty-launcher-17414-thread-4) [     ] o.a.s.s.SolrDispatchFilter Using logger factory org.apache.logging.slf4j.Log4jLoggerFactory
   [junit4]   2> 2621553 INFO  (jetty-launcher-17414-thread-4) [     ] o.a.s.s.SolrDispatchFilter  ___      _       Welcome to Apache Solr™ version 8.3.0
   [junit4]   2> 2621553 INFO  (jetty-launcher-17414-thread-4) [     ] o.a.s.s.SolrDispatchFilter / __| ___| |_ _   Starting in cloud mode on port null
   [junit4]   2> 2621553 INFO  (jetty-launcher-17414-thread-4) [     ] o.a.s.s.SolrDispatchFilter \__ \/ _ \ | '_|  Install dir: null
   [junit4]   2> 2621553 INFO  (jetty-launcher-17414-thread-3) [     ] o.a.s.s.SolrDispatchFilter / __| ___| |_ _   Starting in cloud mode on port null
   [junit4]   2> 2621553 INFO  (jetty-launcher-17414-thread-4) [     ] o.a.s.s.SolrDispatchFilter |___/\___/_|_|    Start time: 2019-08-23T23:24:43.773Z
   [junit4]   2> 2621553 INFO  (jetty-launcher-17414-thread-3) [     ] o.a.s.s.SolrDispatchFilter \__ \/ _ \ | '_|  Install dir: null
   [junit4]   2> 2621553 INFO  (jetty-launcher-17414-thread-3) [     ] o.a.s.s.SolrDispatchFilter |___/\___/_|_|    Start time: 2019-08-23T23:24:43.773Z
   [junit4]   2> 2621554 INFO  (jetty-launcher-17414-thread-2) [     ] o.a.s.c.c.ConnectionManager Waiting for client to connect to ZooKeeper
   [junit4]   2> 2621555 INFO  (jetty-launcher-17414-thread-4) [     ] o.a.s.c.c.ConnectionManager Waiting for client to connect to ZooKeeper
   [junit4]   2> 2621555 INFO  (jetty-launcher-17414-thread-3) [     ] o.a.s.c.c.ConnectionManager Waiting for client to connect to ZooKeeper
   [junit4]   2> 2621557 INFO  (zkConnectionManagerCallback-17416-thread-1) [     ] o.a.s.c.c.ConnectionManager zkClient has connected
   [junit4]   2> 2621557 INFO  (jetty-launcher-17414-thread-1) [     ] o.a.s.c.c.ConnectionManager Client is connected to ZooKeeper
   [junit4]   2> 2621558 INFO  (jetty-launcher-17414-thread-1) [     ] o.a.s.s.SolrDispatchFilter solr.xml found in ZooKeeper. Loading...
   [junit4]   2> 2621560 INFO  (zkConnectionManagerCallback-17420-thread-1) [     ] o.a.s.c.c.ConnectionManager zkClient has connected
   [junit4]   2> 2621560 INFO  (jetty-launcher-17414-thread-4) [     ] o.a.s.c.c.ConnectionManager Client is connected to ZooKeeper
   [junit4]   2> 2621560 INFO  (zkConnectionManagerCallback-17422-thread-1) [     ] o.a.s.c.c.ConnectionManager zkClient has connected
   [junit4]   2> 2621560 INFO  (jetty-launcher-17414-thread-3) [     ] o.a.s.c.c.ConnectionManager Client is connected to ZooKeeper
   [junit4]   2> 2621561 INFO  (zkConnectionManagerCallback-17418-thread-1) [     ] o.a.s.c.c.ConnectionManager zkClient has connected
   [junit4]   2> 2621561 INFO  (jetty-launcher-17414-thread-2) [     ] o.a.s.c.c.ConnectionManager Client is connected to ZooKeeper
   [junit4]   2> 2621562 INFO  (jetty-launcher-17414-thread-4) [     ] o.a.s.s.SolrDispatchFilter solr.xml found in ZooKeeper. Loading...
   [junit4]   2> 2621562 INFO  (jetty-launcher-17414-thread-3) [     ] o.a.s.s.SolrDispatchFilter solr.xml found in ZooKeeper. Loading...
   [junit4]   2> 2621562 INFO  (jetty-launcher-17414-thread-2) [     ] o.a.s.s.SolrDispatchFilter solr.xml found in ZooKeeper. Loading...
   [junit4]   2> 2621853 INFO  (jetty-launcher-17414-thread-2) [     ] o.a.s.h.c.HttpShardHandlerFactory Host whitelist initialized: WhitelistHostChecker [whitelistHosts=null, whitelistHostCheckingEnabled=true]
   [junit4]   2> 2621853 WARN  (jetty-launcher-17414-thread-2) [     ] o.e.j.u.s.S.config Trusting all certificates configured for Client@7465090a[provider=null,keyStore=null,trustStore=null]
   [junit4]   2> 2621853 WARN  (jetty-launcher-17414-thread-2) [     ] o.e.j.u.s.S.config No Client EndPointIdentificationAlgorithm configured for Client@7465090a[provider=null,keyStore=null,trustStore=null]
   [junit4]   2> 2621857 WARN  (jetty-launcher-17414-thread-2) [     ] o.e.j.u.s.S.config Trusting all certificates configured for Client@7918e4bb[provider=null,keyStore=null,trustStore=null]
   [junit4]   2> 2621857 WARN  (jetty-launcher-17414-thread-2) [     ] o.e.j.u.s.S.config No Client EndPointIdentificationAlgorithm configured for Client@7918e4bb[provider=null,keyStore=null,trustStore=null]
   [junit4]   2> 2621857 INFO  (jetty-launcher-17414-thread-2) [     ] o.a.s.c.ZkContainer Zookeeper client=127.0.0.1:51319/solr
   [junit4]   2> 2621858 INFO  (jetty-launcher-17414-thread-2) [     ] o.a.s.c.c.ConnectionManager Waiting for client to connect to ZooKeeper
   [junit4]   2> 2621860 INFO  (zkConnectionManagerCallback-17431-thread-1) [     ] o.a.s.c.c.ConnectionManager zkClient has connected
   [junit4]   2> 2621860 INFO  (jetty-launcher-17414-thread-2) [     ] o.a.s.c.c.ConnectionManager Client is connected to ZooKeeper
   [junit4]   2> 2621870 INFO  (jetty-launcher-17414-thread-3) [     ] o.a.s.h.c.HttpShardHandlerFactory Host whitelist initialized: WhitelistHostChecker [whitelistHosts=null, whitelistHostCheckingEnabled=true]
   [junit4]   2> 2621871 WARN  (jetty-launcher-17414-thread-3) [     ] o.e.j.u.s.S.config Trusting all certificates configured for Client@4ea8be0e[provider=null,keyStore=null,trustStore=null]
   [junit4]   2> 2621871 WARN  (jetty-launcher-17414-thread-3) [     ] o.e.j.u.s.S.config No Client EndPointIdentificationAlgorithm configured for Client@4ea8be0e[provider=null,keyStore=null,trustStore=null]
   [junit4]   2> 2621873 WARN  (jetty-launcher-17414-thread-3) [     ] o.e.j.u.s.S.config Trusting all certificates configured for Client@3198fff1[provider=null,keyStore=null,trustStore=null]
   [junit4]   2> 2621874 WARN  (jetty-launcher-17414-thread-3) [     ] o.e.j.u.s.S.config No Client EndPointIdentificationAlgorithm configured for Client@3198fff1[provider=null,keyStore=null,trustStore=null]
   [junit4]   2> 2621874 INFO  (jetty-launcher-17414-thread-3) [     ] o.a.s.c.ZkContainer Zookeeper client=127.0.0.1:51319/solr
   [junit4]   2> 2621875 INFO  (jetty-launcher-17414-thread-3) [     ] o.a.s.c.c.ConnectionManager Waiting for client to connect to ZooKeeper
   [junit4]   2> 2621877 INFO  (zkConnectionManagerCallback-17437-thread-1) [     ] o.a.s.c.c.ConnectionManager zkClient has connected
   [junit4]   2> 2621877 INFO  (jetty-launcher-17414-thread-3) [     ] o.a.s.c.c.ConnectionManager Client is connected to ZooKeeper
   [junit4]   2> 2621961 INFO  (jetty-launcher-17414-thread-1) [     ] o.a.s.h.c.HttpShardHandlerFactory Host whitelist initialized: WhitelistHostChecker [whitelistHosts=null, whitelistHostCheckingEnabled=true]
   [junit4]   2> 2621961 WARN  (jetty-launcher-17414-thread-1) [     ] o.e.j.u.s.S.config Trusting all certificates configured for Client@101007f4[provider=null,keyStore=null,trustStore=null]
   [junit4]   2> 2621961 WARN  (jetty-launcher-17414-thread-1) [     ] o.e.j.u.s.S.config No Client EndPointIdentificationAlgorithm configured for Client@101007f4[provider=null,keyStore=null,trustStore=null]
   [junit4]   2> 2621964 WARN  (jetty-launcher-17414-thread-1) [     ] o.e.j.u.s.S.config Trusting all certificates configured for Client@ca5ae28[provider=null,keyStore=null,trustStore=null]
   [junit4]   2> 2621964 WARN  (jetty-launcher-17414-thread-1) [     ] o.e.j.u.s.S.config No Client EndPointIdentificationAlgorithm configured for Client@ca5ae28[provider=null,keyStore=null,trustStore=null]
   [junit4]   2> 2621964 INFO  (jetty-launcher-17414-thread-1) [     ] o.a.s.c.ZkContainer Zookeeper client=127.0.0.1:51319/solr
   [junit4]   2> 2621965 INFO  (jetty-launcher-17414-thread-1) [     ] o.a.s.c.c.ConnectionManager Waiting for client to connect to ZooKeeper
   [junit4]   2> 2621967 INFO  (zkConnectionManagerCallback-17444-thread-1) [     ] o.a.s.c.c.ConnectionManager zkClient has connected
   [junit4]   2> 2621967 INFO  (jetty-launcher-17414-thread-1) [     ] o.a.s.c.c.ConnectionManager Client is connected to ZooKeeper
   [junit4]   2> 2621999 INFO  (jetty-launcher-17414-thread-3) [n:127.0.0.1:51325_solr     ] o.a.s.c.c.ConnectionManager Waiting for client to connect to ZooKeeper
   [junit4]   2> 2622002 INFO  (zkConnectionManagerCallback-17446-thread-1) [     ] o.a.s.c.c.ConnectionManager zkClient has connected
   [junit4]   2> 2622002 INFO  (jetty-launcher-17414-thread-3) [n:127.0.0.1:51325_solr     ] o.a.s.c.c.ConnectionManager Client is connected to ZooKeeper
   [junit4]   2> 2622010 INFO  (jetty-launcher-17414-thread-4) [     ] o.a.s.h.c.HttpShardHandlerFactory Host whitelist initialized: WhitelistHostChecker [whitelistHosts=null, whitelistHostCheckingEnabled=true]
   [junit4]   2> 2622011 WARN  (jetty-launcher-17414-thread-4) [     ] o.e.j.u.s.S.config Trusting all certificates configured for Client@224ea855[provider=null,keyStore=null,trustStore=null]
   [junit4]   2> 2622011 WARN  (jetty-launcher-17414-thread-4) [     ] o.e.j.u.s.S.config No Client EndPointIdentificationAlgorithm configured for Client@224ea855[provider=null,keyStore=null,trustStore=null]
   [junit4]   2> 2622013 WARN  (jetty-launcher-17414-thread-4) [     ] o.e.j.u.s.S.config Trusting all certificates configured for Client@48062c5[provider=null,keyStore=null,trustStore=null]
   [junit4]   2> 2622013 WARN  (jetty-launcher-17414-thread-4) [     ] o.e.j.u.s.S.config No Client EndPointIdentificationAlgorithm configured for Client@48062c5[provider=null,keyStore=null,trustStore=null]
   [junit4]   2> 2622014 INFO  (jetty-launcher-17414-thread-4) [     ] o.a.s.c.ZkContainer Zookeeper client=127.0.0.1:51319/solr
   [junit4]   2> 2622015 INFO  (jetty-launcher-17414-thread-4) [     ] o.a.s.c.c.ConnectionManager Waiting for client to connect to ZooKeeper
   [junit4]   2> 2622017 INFO  (zkConnectionManagerCallback-17452-thread-1) [     ] o.a.s.c.c.ConnectionManager zkClient has connected
   [junit4]   2> 2622017 INFO  (jetty-launcher-17414-thread-4) [     ] o.a.s.c.c.ConnectionManager Client is connected to ZooKeeper
   [junit4]   2> 2622110 INFO  (jetty-launcher-17414-thread-2) [n:127.0.0.1:51326_solr     ] o.a.s.c.c.ConnectionManager Waiting for client to connect to ZooKeeper
   [junit4]   2> 2622112 INFO  (zkConnectionManagerCallback-17454-thread-1) [     ] o.a.s.c.c.ConnectionManager zkClient has connected
   [junit4]   2> 2622113 INFO  (jetty-launcher-17414-thread-2) [n:127.0.0.1:51326_solr     ] o.a.s.c.c.ConnectionManager Client is connected to ZooKeeper
   [junit4]   2> 2622215 INFO  (jetty-launcher-17414-thread-1) [n:127.0.0.1:51324_solr     ] o.a.s.c.c.ConnectionManager Waiting for client to connect to ZooKeeper
   [junit4]   2> 2622217 INFO  (zkConnectionManagerCallback-17456-thread-1) [     ] o.a.s.c.c.ConnectionManager zkClient has connected
   [junit4]   2> 2622217 INFO  (jetty-launcher-17414-thread-1) [n:127.0.0.1:51324_solr     ] o.a.s.c.c.ConnectionManager Client is connected to ZooKeeper
   [junit4]   2> 2622333 INFO  (zkConnectionManagerCallback-17458-thread-1) [     ] o.a.s.c.c.ConnectionManager zkClient has connected
   [junit4]   2> 2622334 INFO  (jetty-launcher-17414-thread-4) [n:127.0.0.1:51327_solr     ] o.a.s.c.c.ConnectionManager Waiting for client to connect to ZooKeeper
   [junit4]   2> 2622334 INFO  (jetty-launcher-17414-thread-4) [n:127.0.0.1:51327_solr     ] o.a.s.c.c.ConnectionManager Client is connected to ZooKeeper
   [junit4]   2> 2622369 DEBUG (jetty-launcher-17414-thread-4) [n:127.0.0.1:51327_solr     ] o.a.s.c.c.ZkStateReader Updating cluster state from ZooKeeper...
   [junit4]   2> 2622375 DEBUG (jetty-launcher-17414-thread-4) [n:127.0.0.1:51327_solr     ] o.a.s.c.c.ZkStateReader Loaded empty cluster properties
   [junit4]   2> 2622379 DEBUG (jetty-launcher-17414-thread-4) [n:127.0.0.1:51327_solr     ] o.a.s.c.c.ZkStateReader Updated live nodes from ZooKeeper... [] -> []
   [junit4]   2> 2622386 DEBUG (jetty-launcher-17414-thread-4) [n:127.0.0.1:51327_solr     ] o.a.s.c.c.ZkStateReader clusterStateSet: legacy [0] interesting [0] watched [0] lazy [0] total [0]
   [junit4]   2> 2622407 INFO  (jetty-launcher-17414-thread-4) [n:127.0.0.1:51327_solr     ] o.a.s.c.OverseerElectionContext I am going to be the leader 127.0.0.1:51327_solr
   [junit4]   2> 2622409 INFO  (jetty-launcher-17414-thread-4) [n:127.0.0.1:51327_solr     ] o.a.s.c.Overseer Overseer (id=72235870281859086-127.0.0.1:51327_solr-n_0000000000) starting
   [junit4]   2> 2622440 INFO  (zkConnectionManagerCallback-17471-thread-1) [     ] o.a.s.c.c.ConnectionManager zkClient has connected
   [junit4]   2> 2622441 INFO  (jetty-launcher-17414-thread-4) [n:127.0.0.1:51327_solr     ] o.a.s.c.c.ConnectionManager Waiting for client to connect to ZooKeeper
   [junit4]   2> 2622441 INFO  (jetty-launcher-17414-thread-4) [n:127.0.0.1:51327_solr     ] o.a.s.c.c.ConnectionManager Client is connected to ZooKeeper
   [junit4]   2> 2622445 DEBUG (jetty-launcher-17414-thread-4) [n:127.0.0.1:51327_solr     ] o.a.s.c.c.ZkStateReader Updating cluster state from ZooKeeper...
   [junit4]   2> 2622452 DEBUG (jetty-launcher-17414-thread-4) [n:127.0.0.1:51327_solr     ] o.a.s.c.c.ZkStateReader Loaded empty cluster properties
   [junit4]   2> 2622459 DEBUG (jetty-launcher-17414-thread-4) [n:127.0.0.1:51327_solr     ] o.a.s.c.c.ZkStateReader Updated live nodes from ZooKeeper... [] -> []
   [junit4]   2> 2622464 DEBUG (jetty-launcher-17414-thread-4) [n:127.0.0.1:51327_solr     ] o.a.s.c.c.ZkStateReader clusterStateSet: legacy [0] interesting [0] watched [0] lazy [0] total [0]
   [junit4]   2> 2622469 INFO  (jetty-launcher-17414-thread-4) [n:127.0.0.1:51327_solr     ] o.a.s.c.s.i.ZkClientClusterStateProvider Cluster at 127.0.0.1:51319/solr ready
   [junit4]   2> 2622471 INFO  (OverseerStateUpdate-72235870281859086-127.0.0.1:51327_solr-n_0000000000) [n:127.0.0.1:51327_solr     ] o.a.s.c.Overseer Starting to work on the main queue : 127.0.0.1:51327_solr
   [junit4]   2> 2622474 DEBUG (OverseerStateUpdate-72235870281859086-127.0.0.1:51327_solr-n_0000000000) [n:127.0.0.1:51327_solr     ] o.a.s.c.c.ZkStateReader Updated live nodes from ZooKeeper... [] -> []
   [junit4]   2> 2622475 DEBUG (OverseerStateUpdate-72235870281859086-127.0.0.1:51327_solr-n_0000000000) [n:127.0.0.1:51327_solr     ] o.a.s.c.c.ZkStateReader clusterStateSet: legacy [0] interesting [0] watched [0] lazy [0] total [0]
   [junit4]   2> 2622485 INFO  (jetty-launcher-17414-thread-4) [n:127.0.0.1:51327_solr     ] o.a.s.c.ZkController Register node as live in ZooKeeper:/live_nodes/127.0.0.1:51327_solr
   [junit4]   2> 2622495 DEBUG (zkCallback-17470-thread-1) [     ] o.a.s.c.c.ZkStateReader A live node change: [WatchedEvent state:SyncConnected type:NodeChildrenChanged path:/live_nodes], has occurred - updating... (live nodes size: [0])
   [junit4]   2> 2622495 DEBUG (zkCallback-17457-thread-1) [     ] o.a.s.c.c.ZkStateReader A live node change: [WatchedEvent state:SyncConnected type:NodeChildrenChanged path:/live_nodes], has occurred - updating... (live nodes size: [0])
   [junit4]   2> 2622496 INFO  (zkCallback-17470-thread-1) [     ] o.a.s.c.c.ZkStateReader Updated live nodes from ZooKeeper... (0) -> (1)
   [junit4]   2> 2622496 DEBUG (zkCallback-17470-thread-1) [     ] o.a.s.c.c.ZkStateReader Updated live nodes from ZooKeeper... [] -> [127.0.0.1:51327_solr]
   [junit4]   2> 2622496 INFO  (zkCallback-17457-thread-1) [     ] o.a.s.c.c.ZkStateReader Updated live nodes from ZooKeeper... (0) -> (1)
   [junit4]   2> 2622496 DEBUG (zkCallback-17457-thread-1) [     ] o.a.s.c.c.ZkStateReader Updated live nodes from ZooKeeper... [] -> [127.0.0.1:51327_solr]
   [junit4]   2> 2622504 INFO  (jetty-launcher-17414-thread-4) [n:127.0.0.1:51327_solr     ] o.a.s.c.PackageManager clusterprops.json changed , version -1
   [junit4]   2> 2622505 DEBUG (jetty-launcher-17414-thread-2) [n:127.0.0.1:51326_solr     ] o.a.s.c.c.ZkStateReader Updating cluster state from ZooKeeper...
   [junit4]   2> 2622506 DEBUG (jetty-launcher-17414-thread-2) [n:127.0.0.1:51326_solr     ] o.a.s.c.c.ZkStateReader Loaded empty cluster properties
   [junit4]   2> 2622507 INFO  (jetty-launcher-17414-thread-2) [n:127.0.0.1:51326_solr     ] o.a.s.c.c.ZkStateReader Updated live nodes from ZooKeeper... (0) -> (1)
   [junit4]   2> 2622507 DEBUG (jetty-launcher-17414-thread-2) [n:127.0.0.1:51326_solr     ] o.a.s.c.c.ZkStateReader Updated live nodes from ZooKeeper... [] -> [127.0.0.1:51327_solr]
   [junit4]   2> 2622509 DEBUG (jetty-launcher-17414-thread-2) [n:127.0.0.1:51326_solr     ] o.a.s.c.c.ZkStateReader clusterStateSet: legacy [0] interesting [0] watched [0] lazy [0] total [0]
   [junit4]   2> 2622516 INFO  (jetty-launcher-17414-thread-2) [n:127.0.0.1:51326_solr     ] o.a.s.c.ZkController Publish node=127.0.0.1:51326_solr as DOWN
   [junit4]   2> 2622519 INFO  (jetty-launcher-17414-thread-2) [n:127.0.0.1:51326_solr     ] o.a.s.c.TransientSolrCoreCacheDefault Allocating transient cache for 2147483647 transient cores
   [junit4]   2> 2622519 INFO  (jetty-launcher-17414-thread-2) [n:127.0.0.1:51326_solr     ] o.a.s.c.ZkController Register node as live in ZooKeeper:/live_nodes/127.0.0.1:51326_solr
   [junit4]   2> 2622521 DEBUG (zkCallback-17457-thread-1) [     ] o.a.s.c.c.ZkStateReader A live node change: [WatchedEvent state:SyncConnected type:NodeChildrenChanged path:/live_nodes], has occurred - updating... (live nodes size: [1])
   [junit4]   2> 2622521 DEBUG (zkCallback-17453-thread-1) [     ] o.a.s.c.c.ZkStateReader A live node change: [WatchedEvent state:SyncConnected type:NodeChildrenChanged path:/live_nodes], has occurred - updating... (live nodes size: [1])
   [junit4]   2> 2622521 DEBUG (zkCallback-17470-thread-1) [     ] o.a.s.c.c.ZkStateReader A live node change: [WatchedEvent state:SyncConnected type:NodeChildrenChanged path:/live_nodes], has occurred - updating... (live nodes size: [1])
   [junit4]   2> 2622522 INFO  (zkCallback-17457-thread-1) [     ] o.a.s.c.c.ZkStateReader Updated live nodes from ZooKeeper... (1) -> (2)
   [junit4]   2> 2622522 DEBUG (zkCallback-17457-thread-1) [     ] o.a.s.c.c.ZkStateReader Updated live nodes from ZooKeeper... [127.0.0.1:51327_solr] -> [127.0.0.1:51326_solr, 127.0.0.1:51327_solr]
   [junit4]   2> 2622522 INFO  (zkCallback-17470-thread-1) [     ] o.a.s.c.c.ZkStateReader Updated live nodes from ZooKeeper... (1) -> (2)
   [junit4]   2> 2622522 DEBUG (zkCallback-17470-thread-1) [     ] o.a.s.c.c.ZkStateReader Updated live nodes from ZooKeeper... [127.0.0.1:51327_solr] -> [127.0.0.1:51326_solr, 127.0.0.1:51327_solr]
   [junit4]   2> 2622522 INFO  (zkCallback-17453-thread-1) [     ] o.a.s.c.c.ZkStateReader Updated live nodes from ZooKeeper... (1) -> (2)
   [junit4]   2> 2622522 DEBUG (zkCallback-17453-thread-1) [     ] o.a.s.c.c.ZkStateReader Updated live nodes from ZooKeeper... [127.0.0.1:51327_solr] -> [127.0.0.1:51326_solr, 127.0.0.1:51327_solr]
   [junit4]   2> 2622528 INFO  (jetty-launcher-17414-thread-2) [n:127.0.0.1:51326_solr     ] o.a.s.c.c.ConnectionManager Waiting for client to connect to ZooKeeper
   [junit4]   2> 2622531 INFO  (zkConnectionManagerCallback-17476-thread-1) [     ] o.a.s.c.c.ConnectionManager zkClient has connected
   [junit4]   2> 2622531 INFO  (jetty-launcher-17414-thread-2) [n:127.0.0.1:51326_solr     ] o.a.s.c.c.ConnectionManager Client is connected to ZooKeeper
   [junit4]   2> 2622532 DEBUG (jetty-launcher-17414-thread-2) [n:127.0.0.1:51326_solr     ] o.a.s.c.c.ZkStateReader Updating cluster state from ZooKeeper...
   [junit4]   2> 2622533 DEBUG (jetty-launcher-17414-thread-2) [n:127.0.0.1:51326_solr     ] o.a.s.c.c.ZkStateReader Loaded empty cluster properties
   [junit4]   2> 2622535 INFO  (jetty-launcher-17414-thread-2) [n:127.0.0.1:51326_solr     ] o.a.s.c.c.ZkStateReader Updated live nodes from ZooKeeper... (0) -> (2)
   [junit4]   2> 2622535 DEBUG (jetty-launcher-17414-thread-2) [n:127.0.0.1:51326_solr     ] o.a.s.c.c.ZkStateReader Updated live nodes from ZooKeeper... [] -> [127.0.0.1:51326_solr, 127.0.0.1:51327_solr]
   [junit4]   2> 2622537 DEBUG (jetty-launcher-17414-thread-2) [n:127.0.0.1:51326_solr     ] o.a.s.c.c.ZkStateReader clusterStateSet: legacy [0] interesting [0] watched [0] lazy [0] total [0]
   [junit4]   2> 2622538 INFO  (jetty-launcher-17414-thread-2) [n:127.0.0.1:51326_solr     ] o.a.s.c.s.i.ZkClientClusterStateProvider Cluster at 127.0.0.1:51319/solr ready
   [junit4]   2> 2622538 INFO  (jetty-launcher-17414-thread-2) [n:127.0.0.1:51326_solr     ] o.a.s.c.PackageManager clusterprops.json changed , version -1
   [junit4]   2> 2622587 DEBUG (jetty-launcher-17414-thread-3) [n:127.0.0.1:51325_solr     ] o.a.s.c.c.ZkStateReader Updating cluster state from ZooKeeper...
   [junit4]   2> 2622591 DEBUG (jetty-launcher-17414-thread-3) [n:127.0.0.1:51325_solr     ] o.a.s.c.c.ZkStateReader Loaded empty cluster properties
   [junit4]   2> 2622594 INFO  (jetty-launcher-17414-thread-3) [n:127.0.0.1:51325_solr     ] o.a.s.c.c.ZkStateReader Updated live nodes from ZooKeeper... (0) -> (2)
   [junit4]   2> 2622594 DEBUG (jetty-launcher-17414-thread-3) [n:127.0.0.1:51325_solr     ] o.a.s.c.c.ZkStateReader Updated live nodes from ZooKeeper... [] -> [127.0.0.1:51326_solr, 127.0.0.1:51327_solr]
   [junit4]   2> 2622596 DEBUG (jetty-launcher-17414-thread-3) [n:127.0.0.1:51325_solr     ] o.a.s.c.c.ZkStateReader clusterStateSet: legacy [0] interesting [0] watched [0] lazy [0] total [0]
   [junit4]   2> 2622611 INFO  (jetty-launcher-17414-thread-3) [n:127.0.0.1:51325_solr     ] o.a.s.c.ZkController Publish node=127.0.0.1:51325_solr as DOWN
   [junit4]   2> 2622613 INFO  (jetty-launcher-17414-thread-4) [n:127.0.0.1:51327_solr     ] o.a.s.h.a.MetricsHistoryHandler No .system collection, keeping metrics history in memory.
   [junit4]   2> 2622613 INFO  (jetty-launcher-17414-thread-2) [n:127.0.0.1:51326_solr     ] o.a.s.h.a.MetricsHistoryHandler No .system collection, keeping metrics history in memory.
   [junit4]   2> 2622616 INFO  (jetty-launcher-17414-thread-3) [n:127.0.0.1:51325_solr     ] o.a.s.c.TransientSolrCoreCacheDefault Allocating transient cache for 2147483647 transient cores
   [junit4]   2> 2622616 INFO  (jetty-launcher-17414-thread-3) [n:127.0.0.1:51325_solr     ] o.a.s.c.ZkController Register node as live in ZooKeeper:/live_nodes/127.0.0.1:51325_solr
   [junit4]   2> 2622619 DEBUG (zkCallback-17445-thread-1) [     ] o.a.s.c.c.ZkStateReader A live node change: [WatchedEvent state:SyncConnected type:NodeChildrenChanged path:/live_nodes], has occurred - updating... (live nodes size: [2])
   [junit4]   2> 2622620 DEBUG (zkCallback-17453-thread-1) [     ] o.a.s.c.c.ZkStateReader A live node change: [WatchedEvent state:SyncConnected type:NodeChildrenChanged path:/live_nodes], has occurred - updating... (live nodes size: [2])
   [junit4]   2> 2622621 DEBUG (zkCallback-17470-thread-1) [     ] o.a.s.c.c.ZkStateReader A live node change: [WatchedEvent state:SyncConnected type:NodeChildrenChanged path:/live_nodes], has occurred - updating... (live nodes size: [2])
   [junit4]   2> 2622621 DEBUG (zkCallback-17457-thread-1) [     ] o.a.s.c.c.ZkStateReader A live node change: [WatchedEvent state:SyncConnected type:NodeChildrenChanged path:/live_nodes], has occurred - updating... (live nodes size: [2])
   [junit4]   2> 2622621 DEBUG (zkCallback-17475-thread-1) [     ] o.a.s.c.c.ZkStateReader A live node change: [WatchedEvent state:SyncConnected type:NodeChildrenChanged path:/live_nodes], has occurred - updating... (live nodes size: [2])
   [junit4]   2> 2622622 DEBUG (jetty-launcher-17414-thread-1) [n:127.0.0.1:51324_solr     ] o.a.s.c.c.ZkStateReader Updating cluster state from ZooKeeper...
   [junit4]   2> 2622623 INFO  (zkCallback-17453-thread-1) [     ] o.a.s.c.c.ZkStateReader Updated live nodes from ZooKeeper... (2) -> (3)
   [junit4]   2> 2622623 DEBUG (zkCallback-17453-thread-1) [     ] o.a.s.c.c.ZkStateReader Updated live nodes from ZooKeeper... [127.0.0.1:51326_solr, 127.0.0.1:51327_solr] -> [127.0.0.1:51325_solr, 127.0.0.1:51326_solr, 127.0.0.1:51327_solr]
   [junit4]   2> 2622624 INFO  (zkCallback-17457-thread-1) [     ] o.a.s.c.c.ZkStateReader Updated live nodes from ZooKeeper... (2) -> (3)
   [junit4]   2> 2622624 DEBUG (zkCallback-17457-thread-1) [     ] o.a.s.c.c.ZkStateReader Updated live nodes from ZooKeeper... [127.0.0.1:51326_solr, 127.0.0.1:51327_solr] -> [127.0.0.1:51325_solr, 127.0.0.1:51326_solr, 127.0.0.1:51327_solr]
   [junit4]   2> 2622624 INFO  (zkCallback-17475-thread-1) [     ] o.a.s.c.c.ZkStateReader Updated live nodes from ZooKeeper... (2) -> (3)
   [junit4]   2> 2622624 DEBUG (zkCallback-17475-thread-1) [     ] o.a.s.c.c.ZkStateReader Updated live nodes from ZooKeeper... [127.0.0.1:51326_solr, 127.0.0.1:51327_solr] -> [127.0.0.1:51325_solr, 127.0.0.1:51326_solr, 127.0.0.1:51327_solr]
   [junit4]   2> 2622624 INFO  (zkCallback-17445-thread-1) [     ] o.a.s.c.c.ZkStateReader Updated live nodes from ZooKeeper... (2) -> (3)
   [junit4]   2> 2622624 DEBUG (zkCallback-17445-thread-1) [     ] o.a.s.c.c.ZkStateReader Updated live nodes from ZooKeeper... [127.0.0.1:51326_solr, 127.0.0.1:51327_solr] -> [127.0.0.1:51325_solr, 127.0.0.1:51326_solr, 127.0.0.1:51327_solr]
   [junit4]   2> 2622625 INFO  (zkCallback-17470-thread-1) [     ] o.a.s.c.c.ZkStateReader Updated live nodes from ZooKeeper... (2) -> (3)
   [junit4]   2> 2622625 DEBUG (zkCallback-17470-thread-1) [     ] o.a.s.c.c.ZkStateReader Updated live nodes from ZooKeeper... [127.0.0.1:51326_solr, 127.0.0.1:51327_solr] -> [127.0.0.1:51325_solr, 127.0.0.1:51326_solr, 127.0.0.1:51327_solr]
   [junit4]   2> 2622626 DEBUG (jetty-launcher-17414-thread-1) [n:127.0.0.1:51324_solr     ] o.a.s.c.c.ZkStateReader Loaded empty cluster properties
   [junit4]   2> 2622627 INFO  (jetty-launcher-17414-thread-3) [n:127.0.0.1:51325_solr     ] o.a.s.c.c.ConnectionManager Waiting for client to connect to ZooKeeper
   [junit4]   2> 2622630 INFO  (zkConnectionManagerCallback-17483-thread-1) [     ] o.a.s.c.c.ConnectionManager zkClient has connected
   [junit4]   2> 2622630 INFO  (jetty-launcher-17414-thread-3) [n:127.0.0.1:51325_solr     ] o.a.s.c.c.ConnectionManager Client is connected to ZooKeeper
   [junit4]   2> 2622631 DEBUG (jetty-launcher-17414-thread-3) [n:127.0.0.1:51325_solr     ] o.a.s.c.c.ZkStateReader Updating cluster state from ZooKeeper...
   [junit4]   2> 2622631 INFO  (jetty-launcher-17414-thread-1) [n:127.0.0.1:51324_solr     ] o.a.s.c.c.ZkStateReader Updated live nodes from ZooKeeper... (0) -> (3)
   [junit4]   2> 2622631 DEBUG (jetty-launcher-17414-thread-1) [n:127.0.0.1:51324_solr     ] o.a.s.c.c.ZkStateReader Updated live nodes from ZooKeeper... [] -> [127.0.0.1:51325_solr, 127.0.0.1:51326_solr, 127.0.0.1:51327_solr]
   [junit4]   2> 2622633 DEBUG (jetty-launcher-17414-thread-3) [n:127.0.0.1:51325_solr     ] o.a.s.c.c.ZkStateReader Loaded empty cluster properties
   [junit4]   2> 2622634 DEBUG (jetty-launcher-17414-thread-1) [n:127.0.0.1:51324_solr     ] o.a.s.c.c.ZkStateReader clusterStateSet: legacy [0] interesting [0] watched [0] lazy [0] total [0]
   [junit4]   2> 2622635 INFO  (jetty-launcher-17414-thread-3) [n:127.0.0.1:51325_solr     ] o.a.s.c.c.ZkStateReader Updated live nodes from ZooKeeper... (0) -> (3)
   [junit4]   2> 2622635 DEBUG (jetty-launcher-17414-thread-3) [n:127.0.0.1:51325_solr     ] o.a.s.c.c.ZkStateReader Updated live nodes from ZooKeeper... [] -> [127.0.0.1:51325_solr, 127.0.0.1:51326_solr, 127.0.0.1:51327_solr]
   [junit4]   2> 2622636 DEBUG (jetty-launcher-17414-thread-3) [n:127.0.0.1:51325_solr     ] o.a.s.c.c.ZkStateReader clusterStateSet: legacy [0] interesting [0] watched [0] lazy [0] total [0]
   [junit4]   2> 2622639 INFO  (jetty-launcher-17414-thread-3) [n:127.0.0.1:51325_solr     ] o.a.s.c.s.i.ZkClientClusterStateProvider Cluster at 127.0.0.1:51319/solr ready
   [junit4]   2> 2622639 INFO  (jetty-launcher-17414-thread-3) [n:127.0.0.1:51325_solr     ] o.a.s.c.PackageManager clusterprops.json changed , version -1
   [junit4]   2> 2622647 INFO  (jetty-launcher-17414-thread-1) [n:127.0.0.1:51324_solr     ] o.a.s.c.ZkController Publish node=127.0.0.1:51324_solr as DOWN
   [junit4]   2> 2622651 INFO  (jetty-launcher-17414-thread-1) [n:127.0.0.1:51324_solr     ] o.a.s.c.TransientSolrCoreCacheDefault Allocating transient cache for 2147483647 transient cores
   [junit4]   2> 2622651 INFO  (jetty-launcher-17414-thread-1) [n:127.0.0.1:51324_solr     ] o.a.s.c.ZkController Register node as live in ZooKeeper:/live_nodes/127.0.0.1:51324_solr
   [junit4]   2> 2622654 DEBUG (zkCallback-17457-thread-1) [     ] o.a.s.c.c.ZkStateReader A live node change: [WatchedEvent state:SyncConnected type:NodeChildrenChanged path:/live_nodes], has occurred - updating... (live nodes size: [3])
   [junit4]   2> 2622654 DEBUG (zkCallback-17475-thread-1) [     ] o.a.s.c.c.ZkStateReader A live node change: [WatchedEvent state:SyncConnected type:NodeChildrenChanged path:/live_nodes], has occurred - updating... (live nodes size: [3])
   [junit4]   2> 2622654 DEBUG (zkCallback-17470-thread-1) [     ] o.a.s.c.c.ZkStateReader A live node change: [WatchedEvent state:SyncConnected type:NodeChildrenChanged path:/live_nodes], has occurred - updating... (live nodes size: [3])
   [junit4]   2> 2622654 DEBUG (zkCallback-17482-thread-1) [     ] o.a.s.c.c.ZkStateReader A live node change: [WatchedEvent state:SyncConnected type:NodeChildrenChanged path:/live_nodes], has occurred - updating... (live nodes size: [3])
   [junit4]   2> 2622654 DEBUG (zkCallback-17453-thread-1) [     ] o.a.s.c.c.ZkStateReader A live node change: [WatchedEvent state:SyncConnected type:NodeChildrenChanged path:/live_nodes], has occurred - updating... (live nodes size: [3])
   [junit4]   2> 2622654 DEBUG (zkCallback-17445-thread-1) [     ] o.a.s.c.c.ZkStateReader A live node change: [WatchedEvent state:SyncConnected type:NodeChildrenChanged path:/live_nodes], has occurred - updating... (live nodes size: [3])
   [junit4]   2> 2622654 DEBUG (zkCallback-17455-thread-1) [     ] o.a.s.c.c.ZkStateReader A live node change: [WatchedEvent state:SyncConnected type:NodeChildrenChanged path:/live_nodes], has occurred - updating... (live nodes size: [3])
   [junit4]   2> 2622659 INFO  (zkCallback-17475-thread-1) [     ] o.a.s.c.c.ZkStateReader Updated live nodes from ZooKeeper... (3) -> (4)
   [junit4]   2> 2622659 INFO  (zkCallback-17482-thread-1) [     ] o.a.s.c.c.ZkStateReader Updated live nodes from ZooKeeper... (3) -> (4)
   [junit4]   2> 2622659 INFO  (zkCallback-17457-thread-1) [     ] o.a.s.c.c.ZkStateReader Updated live nodes from ZooKeeper... (3) -> (4)
   [junit4]   2> 2622659 DEBUG (zkCallback-17457-thread-1) [     ] o.a.s.c.c.ZkStateReader Updated live nodes from ZooKeeper... [127.0.0.1:51325_solr, 127.0.0.1:51326_solr, 127.0.0.1:51327_solr] -> [127.0.0.1:51324_solr, 127.0.0.1:51325_solr, 127.0.0.1:51326_solr, 127.0.0.1:51327_solr]
   [junit4]   2> 2622659 DEBUG (zkCallback-17475-thread-1) [     ] o.a.s.c.c.ZkStateReader Updated live nodes from ZooKeeper... [127.0.0.1:51325_solr, 127.0.0.1:51326_solr, 127.0.0.1:51327_solr] -> [127.0.0.1:51324_solr, 127.0.0.1:51325_solr, 127.0.0.1:51326_solr, 127.0.0.1:51327_solr]
   [junit4]   2> 2622659 DEBUG (zkCallback-17482-thread-1) [     ] o.a.s.c.c.ZkStateReader Updated live nodes from ZooKeeper... [127.0.0.1:51325_solr, 127.0.0.1:51326_solr, 127.0.0.1:51327_solr] -> [127.0.0.1:51324_solr, 127.0.0.1:51325_solr, 127.0.0.1:51326_solr, 127.0.0.1:51327_solr]
   [junit4]   2> 2622659 INFO  (zkCallback-17455-thread-1) [     ] o.a.s.c.c.ZkStateReader Updated live nodes from ZooKeeper... (3) -> (4)
   [junit4]   2> 2622659 DEBUG (zkCallback-17455-thread-1) [     ] o.a.s.c.c.ZkStateReader Updated live nodes from ZooKeeper... [127.0.0.1:51325_solr, 127.0.0.1:51326_solr, 127.0.0.1:51327_solr] -> [127.0.0.1:51324_solr, 127.0.0.1:51325_solr, 127.0.0.1:51326_solr, 127.0.0.1:51327_solr]
   [junit4]   2> 2622659 INFO  (zkCallback-17445-thread-1) [     ] o.a.s.c.c.ZkStateReader Updated live nodes from ZooKeeper... (3) -> (4)
   [junit4]   2> 2622659 DEBUG (zkCallback-17445-thread-1) [     ] o.a.s.c.c.ZkStateReader Updated live nodes from ZooKeeper... [127.0.0.1:51325_solr, 127.0.0.1:51326_solr, 127.0.0.1:51327_solr] -> [127.0.0.1:51324_solr, 127.0.0.1:51325_solr, 127.0.0.1:51326_solr, 127.0.0.1:51327_solr]
   [junit4]   2> 2622660 INFO  (zkCallback-17470-thread-1) [     ] o.a.s.c.c.ZkStateReader Updated live nodes from ZooKeeper... (3) -> (4)
   [junit4]   2> 2622660 DEBUG (zkCallback-17470-thread-1) [     ] o.a.s.c.c.ZkStateReader Updated live nodes from ZooKeeper... [127.0.0.1:51325_solr, 127.0.0.1:51326_solr, 127.0.0.1:51327_solr] -> [127.0.0.1:51324_solr, 127.0.0.1:51325_solr, 127.0.0.1:51326_solr, 127.0.0.1:51327_solr]
   [junit4]   2> 2622662 INFO  (zkCallback-17453-thread-1) [     ] o.a.s.c.c.ZkStateReader Updated live nodes from ZooKeeper... (3) -> (4)
   [junit4]   2> 2622662 DEBUG (zkCallback-17453-thread-1) [     ] o.a.s.c.c.ZkStateReader Updated live nodes from ZooKeeper... [127.0.0.1:51325_solr, 127.0.0.1:51326_solr, 127.0.0.1:51327_solr] -> [127.0.0.1:51324_solr, 127.0.0.1:51325_solr, 127.0.0.1:51326_solr, 127.0.0.1:51327_solr]
   [junit4]   2> 2622664 INFO  (jetty-launcher-17414-thread-1) [n:127.0.0.1:51324_solr     ] o.a.s.c.c.ConnectionManager Waiting for client to connect to ZooKeeper
   [junit4]   2> 2622667 INFO  (zkConnectionManagerCallback-17488-thread-1) [     ] o.a.s.c.c.ConnectionManager zkClient has connected
   [junit4]   2> 2622667 INFO  (jetty-launcher-17414-thread-1) [n:127.0.0.1:51324_solr     ] o.a.s.c.c.ConnectionManager Client is connected to ZooKeeper
   [junit4]   2> 2622667 DEBUG (jetty-launcher-17414-thread-1) [n:127.0.0.1:51324_solr     ] o.a.s.c.c.ZkStateReader Updating cluster state from ZooKeeper...
   [junit4]   2> 2622669 DEBUG (jetty-launcher-17414-thread-1) [n:127.0.0.1:51324_solr     ] o.a.s.c.c.ZkStateReader Loaded empty cluster properties
   [junit4]   2> 2622670 INFO  (jetty-launcher-17414-thread-1) [n:127.0.0.1:51324_solr     ] o.a.s.c.c.ZkStateReader Updated live nodes from ZooKeeper... (0) -> (4)
   [junit4]   2> 2622670 DEBUG (jetty-launcher-17414-thread-1) [n:127.0.0.1:51324_solr     ] o.a.s.c.c.ZkStateReader Updated live nodes from ZooKeeper... [] -> [127.0.0.1:51324_solr, 127.0.0.1:51325_solr, 127.0.0.1:51326_solr, 127.0.0.1:51327_solr]
   [junit4]   2> 2622671 DEBUG (jetty-launcher-17414-thread-1) [n:127.0.0.1:51324_solr     ] o.a.s.c.c.ZkStateReader clusterStateSet: legacy [0] interesting [0] watched [0] lazy [0] total [0]
   [junit4]   2> 2622673 INFO  (jetty-launcher-17414-thread-1) [n:127.0.0.1:51324_solr     ] o.a.s.c.s.i.ZkClientClusterStateProvider Cluster at 127.0.0.1:51319/solr ready
   [junit4]   2> 2622673 INFO  (jetty-launcher-17414-thread-1) [n:127.0.0.1:51324_solr     ] o.a.s.c.PackageManager clusterprops.json changed , version -1
   [junit4]   2> 2622708 INFO  (jetty-launcher-17414-thread-1) [n:127.0.0.1:51324_solr     ] o.a.s.h.a.MetricsHistoryHandler No .system collection, keeping metrics history in memory.
   [junit4]   2> 2622709 INFO  (jetty-launcher-17414-thread-3) [n:127.0.0.1:51325_solr     ] o.a.s.h.a.MetricsHistoryHandler No .system collection, keeping metrics history in memory.
   [junit4]   2> 2622738 INFO  (jetty-launcher-17414-thread-2) [n:127.0.0.1:51326_solr     ] o.a.s.m.r.SolrJmxReporter JMX monitoring for 'solr_51326.solr.node' (registry 'solr.node') enabled at server: com.sun.jmx.mbeanserver.JmxMBeanServer@4d05dc2
   [junit4]   2> 2622803 INFO  (jetty-launcher-17414-thread-4) [n:127.0.0.1:51327_solr     ] o.a.s.m.r.SolrJmxReporter JMX monitoring for 'solr_51327.solr.node' (registry 'solr.node') enabled at server: com.sun.jmx.mbeanserver.JmxMBeanServer@4d05dc2
   [junit4]   2> 2622835 INFO  (jetty-launcher-17414-thread-1) [n:127.0.0.1:51324_solr     ] o.a.s.m.r.SolrJmxReporter JMX monitoring for 'solr_51324.solr.node' (registry 'solr.node') enabled at server: com.sun.jmx.mbeanserver.JmxMBeanServer@4d05dc2
   [junit4]   2> 2622841 INFO  (jetty-launcher-17414-thread-2) [n:127.0.0.1:51326_solr     ] o.a.s.m.r.SolrJmxReporter JMX monitoring for 'solr_51326.solr.jvm' (registry 'solr.jvm') enabled at server: com.sun.jmx.mbeanserver.JmxMBeanServer@4d05dc2
   [junit4]   2> 2622842 INFO  (jetty-launcher-17414-thread-2) [n:127.0.0.1:51326_solr     ] o.a.s.m.r.SolrJmxReporter JMX monitoring for 'solr_51326.solr.jetty' (registry 'solr.jetty') enabled at server: com.sun.jmx.mbeanserver.JmxMBeanServer@4d05dc2
   [junit4]   2> 2622849 INFO  (jetty-launcher-17414-thread-2) [n:127.0.0.1:51326_solr     ] o.a.s.c.CorePropertiesLocator Found 0 core definitions underneath /Users/jenkins/workspace/Lucene-Solr-8.x-MacOSX/solr/build/solr-core/test/J1/temp/solr.handler.TestContainerReqHandler_BEBE936614E6EEDA-001/tempDir-001/node2/.
   [junit4]   2> 2622852 INFO  (jetty-launcher-17414-thread-3) [n:127.0.0.1:51325_solr     ] o.a.s.m.r.SolrJmxReporter JMX monitoring for 'solr_51325.solr.node' (registry 'solr.node') enabled at server: com.sun.jmx.mbeanserver.JmxMBeanServer@4d05dc2
   [junit4]   2> 2622884 INFO  (jetty-launcher-17414-thread-4) [n:127.0.0.1:51327_solr     ] o.a.s.m.r.SolrJmxReporter JMX monitoring for 'solr_51327.solr.jvm' (registry 'solr.jvm') enabled at server: com.sun.jmx.mbeanserver.JmxMBeanServer@4d05dc2
   [junit4]   2> 2622884 INFO  (jetty-launcher-17414-thread-4) [n:127.0.0.1:51327_solr     ] o.a.s.m.r.SolrJmxReporter JMX monitoring for 'solr_51327.solr.jetty' (registry 'solr.jetty') enabled at server: com.sun.jmx.mbeanserver.JmxMBeanServer@4d05dc2
   [junit4]   2> 2622889 INFO  (jetty-launcher-17414-thread-4) [n:127.0.0.1:51327_solr     ] o.a.s.c.CorePropertiesLocator Found 0 core definitions underneath /Users/jenkins/workspace/Lucene-Solr-8.x-MacOSX/solr/build/solr-core/test/J1/temp/solr.handler.TestContainerReqHandler_BEBE936614E6EEDA-001/tempDir-001/node4/.
   [junit4]   2> 2622894 INFO  (jetty-launcher-17414-thread-1) [n:127.0.0.1:51324_solr     ] o.a.s.m.r.SolrJmxReporter JMX monitoring for 'solr_51324.solr.jvm' (registry 'solr.jvm') enabled at server: com.sun.jmx.mbeanserver.JmxMBeanServer@4d05dc2
   [junit4]   2> 2622894 INFO  (jetty-launcher-17414-thread-1) [n:127.0.0.1:51324_solr     ] o.a.s.m.r.SolrJmxReporter JMX monitoring for 'solr_51324.solr.jetty' (registry 'solr.jetty') enabled at server: com.sun.jmx.mbeanserver.JmxMBeanServer@4d05dc2
   [junit4]   2> 2622895 INFO  (jetty-launcher-17414-thread-1) [n:127.0.0.1:51324_solr     ] o.a.s.c.CorePropertiesLocator Found 0 core definitions underneath /Users/jenkins/workspace/Lucene-Solr-8.x-MacOSX/solr/build/solr-core/test/J1/temp/solr.handler.TestContainerReqHandler_BEBE936614E6EEDA-001/tempDir-001/node1/.
   [junit4]   2> 2622896 INFO  (jetty-launcher-17414-thread-3) [n:127.0.0.1:51325_solr     ] o.a.s.m.r.SolrJmxReporter JMX monitoring for 'solr_51325.solr.jvm' (registry 'solr.jvm') enabled at server: com.sun.jmx.mbeanserver.JmxMBeanServer@4d05dc2
   [junit4]   2> 2622896 INFO  (jetty-launcher-17414-thread-3) [n:127.0.0.1:51325_solr     ] o.a.s.m.r.SolrJmxReporter JMX monitoring for 'solr_51325.solr.jetty' (registry 'solr.jetty') enabled at server: com.sun.jmx.mbeanserver.JmxMBeanServer@4d05dc2
   [junit4]   2> 2622897 INFO  (jetty-launcher-17414-thread-3) [n:127.0.0.1:51325_solr     ] o.a.s.c.CorePropertiesLocator Found 0 core definitions underneath /Users/jenkins/workspace/Lucene-Solr-8.x-MacOSX/solr/build/solr-core/test/J1/temp/solr.handler.TestContainerReqHandler_BEBE936614E6EEDA-001/tempDir-001/node3/.
   [junit4]   2> 2623054 INFO  (TEST-TestContainerReqHandler.testSetClusterReqHandler-seed#[BEBE936614E6EEDA]) [     ] o.a.s.c.MiniSolrCloudCluster waitForAllNodes: numServers=4
   [junit4]   2> 2623055 INFO  (TEST-TestContainerReqHandler.testSetClusterReqHandler-seed#[BEBE936614E6EEDA]) [     ] o.a.s.c.c.ConnectionManager Waiting for client to connect to ZooKeeper
   [junit4]   2> 2623058 INFO  (zkConnectionManagerCallback-17495-thread-1) [     ] o.a.s.c.c.ConnectionManager zkClient has connected
   [junit4]   2> 2623058 INFO  (TEST-TestContainerReqHandler.testSetClusterReqHandler-seed#[BEBE936614E6EEDA]) [     ] o.a.s.c.c.ConnectionManager Client is connected to ZooKeeper
   [junit4]   2> 2623058 DEBUG (TEST-TestContainerReqHandler.testSetClusterReqHandler-seed#[BEBE936614E6EEDA]) [     ] o.a.s.c.c.ZkStateReader Updating cluster state from ZooKeeper...
   [junit4]   2> 2623062 DEBUG (TEST-TestContainerReqHandler.testSetClusterReqHandler-seed#[BEBE936614E6EEDA]) [     ] o.a.s.c.c.ZkStateReader Loaded empty cluster properties
   [junit4]   2> 2623064 INFO  (TEST-TestContainerReqHandler.testSetClusterReqHandler-seed#[BEBE936614E6EEDA]) [     ] o.a.s.c.c.ZkStateReader Updated live nodes from ZooKeeper... (0) -> (4)
   [junit4]   2> 2623064 DEBUG (TEST-TestContainerReqHandler.testSetClusterReqHandler-seed#[BEBE936614E6EEDA]) [     ] o.a.s.c.c.ZkStateReader Updated live nodes from ZooKeeper... [] -> [127.0.0.1:51324_solr, 127.0.0.1:51325_solr, 127.0.0.1:51326_solr, 127.0.0.1:51327_solr]
   [junit4]   2> 2623066 DEBUG (TEST-TestContainerReqHandler.testSetClusterReqHandler-seed#[BEBE936614E6EEDA]) [     ] o.a.s.c.c.ZkStateReader clusterStateSet: legacy [0] interesting [0] watched [0] lazy [0] total [0]
   [junit4]   2> 2623067 INFO  (TEST-TestContainerReqHandler.testSetClusterReqHandler-seed#[BEBE936614E6EEDA]) [     ] o.a.s.c.s.i.ZkClientClusterStateProvider Cluster at 127.0.0.1:51319/solr ready
   [junit4]   2> 2623096 DEBUG (zkCallback-17494-thread-1) [     ] o.a.s.c.c.ZkStateReader Loaded cluster properties: {requestHandler={foo={name=foo, class=org.apache.solr.handler.DumpRequestHandler}}} to version 0
   [junit4]   2> 2623096 DEBUG (zkCallback-17470-thread-1) [     ] o.a.s.c.c.ZkStateReader Loaded cluster properties: {requestHandler={foo={name=foo, class=org.apache.solr.handler.DumpRequestHandler}}} to version 0
   [junit4]   2> 2623097 DEBUG (zkCallback-17482-thread-1) [     ] o.a.s.c.c.ZkStateReader Loaded cluster properties: {requestHandler={foo={name=foo, class=org.apache.solr.handler.DumpRequestHandler}}} to version 0
   [junit4]   2> 2623098 DEBUG (zkCallback-17455-thread-1) [     ] o.a.s.c.c.ZkStateReader Loaded cluster properties: {requestHandler={foo={name=foo, class=org.apache.solr.handler.DumpRequestHandler}}} to version 0
   [junit4]   2> 2623098 INFO  (zkCallback-17455-thread-1) [     ] o.a.s.c.PackageManager clusterprops.json changed , version 0
   [junit4]   2> 2623098 INFO  (qtp1812057423-40935) [n:127.0.0.1:51326_solr     ] o.a.s.c.PackageManager clusterprops.json changed , version -1
   [junit4]   2> 2623098 DEBUG (zkCallback-17455-thread-1) [     ] o.a.s.c.PackageManager RequestHandlers being reloaded : [foo]
   [junit4]   2> 2623098 DEBUG (qtp1812057423-40935) [n:127.0.0.1:51326_solr     ] o.a.s.c.PackageManager RequestHandlers being reloaded : [foo]
   [junit4]   2> 2623098 DEBUG (zkCallback-17475-thread-1) [     ] o.a.s.c.c.ZkStateReader Loaded cluster properties: {requestHandler={foo={name=foo, class=org.apache.solr.handler.DumpRequestHandler}}} to version 0
   [junit4]   2> 2623098 DEBUG (zkCallback-17457-thread-1) [     ] o.a.s.c.c.ZkStateReader Loaded cluster properties: {requestHandler={foo={name=foo, class=org.apache.solr.handler.DumpRequestHandler}}} to version 0
   [junit4]   2> 2623098 INFO  (zkCallback-17457-thread-1) [     ] o.a.s.c.PackageManager clusterprops.json changed , version 0
   [junit4]   2> 2623098 DEBUG (zkCallback-17457-thread-1) [     ] o.a.s.c.PackageManager RequestHandlers being reloaded : [foo]
   [junit4]   2> 2623099 DEBUG (zkCallback-17445-thread-1) [     ] o.a.s.c.c.ZkStateReader Loaded cluster properties: {requestHandler={foo={name=foo, class=org.apache.solr.handler.DumpRequestHandler}}} to version 0
   [junit4]   2> 2623099 INFO  (zkCallback-17445-thread-1) [     ] o.a.s.c.PackageManager clusterprops.json changed , version 0
   [junit4]   2> 2623099 DEBUG (zkCallback-17445-thread-1) [     ] o.a.s.c.PackageManager RequestHandlers being reloaded : [foo]
   [junit4]   2> 2623099 DEBUG (zkCallback-17487-thread-1) [     ] o.a.s.c.c.ZkStateReader Loaded cluster properties: {requestHandler={foo={name=foo, class=org.apache.solr.handler.DumpRequestHandler}}} to version 0
   [junit4]   2> 2623100 DEBUG (zkCallback-17453-thread-1) [     ] o.a.s.c.c.ZkStateReader Loaded cluster properties: {requestHandler={foo={name=foo, class=org.apache.solr.handler.DumpRequestHandler}}} to version 0
   [junit4]   2> 2623100 INFO  (zkCallback-17453-thread-1) [     ] o.a.s.c.PackageManager clusterprops.json changed , version 0
   [junit4]   2> 2623100 DEBUG (zkCallback-17453-thread-1) [     ] o.a.s.c.PackageManager RequestHandlers being reloaded : [foo]
   [junit4]   2> 2623111 DEBUG (zkCallback-17455-thread-1) [     ] o.a.s.c.PackageManager Registering request handlers [foo]
   [junit4]   2> 2623111 DEBUG (qtp1812057423-40935) [n:127.0.0.1:51326_solr     ] o.a.s.c.PackageManager Registering request handlers [foo]
   [junit4]   2> 2623111 DEBUG (zkCallback-17457-thread-1) [     ] o.a.s.c.PackageManager Registering request handlers [foo]
   [junit4]   2> 2623111 DEBUG (zkCallback-17453-thread-1) [     ] o.a.s.c.PackageManager Registering request handlers [foo]
   [junit4]   2> 2623111 DEBUG (zkCallback-17445-thread-1) [     ] o.a.s.c.PackageManager Registering request handlers [foo]
   [junit4]   2> 2623112 INFO  (qtp1812057423-40935) [n:127.0.0.1:51326_solr     ] o.a.s.h.a.CollectionHandlerApi current version of clusterprops.json is 0 , trying to get every node to update
   [junit4]   2> 2623112 DEBUG (qtp1812057423-40935) [n:127.0.0.1:51326_solr     ] o.a.s.h.a.CollectionHandlerApi The current clusterprops.json:  {requestHandler={foo={name=foo, class=org.apache.solr.handler.DumpRequestHandler}}}
   [junit4]   2> 2623116 INFO  (qtp1812057423-40935) [n:127.0.0.1:51326_solr     ] o.a.s.h.a.CollectionHandlerApi Waiting up to 30 secs for 4 nodes to update clusterprops to be of version 0
   [junit4]   2> 2623121 INFO  (solrHandlerExecutor-12788-thread-3-processing-n:127.0.0.1:51326_solr) [n:127.0.0.1:51326_solr     ] o.a.s.h.SolrConfigHandler Time elapsed : 0 secs, maxWait 30
   [junit4]   2> 2623121 INFO  (solrHandlerExecutor-12788-thread-1-processing-n:127.0.0.1:51326_solr) [n:127.0.0.1:51326_solr     ] o.a.s.h.SolrConfigHandler Time elapsed : 0 secs, maxWait 30
   [junit4]   2> 2623121 INFO  (solrHandlerExecutor-12788-thread-4-processing-n:127.0.0.1:51326_solr) [n:127.0.0.1:51326_solr     ] o.a.s.h.SolrConfigHandler Time elapsed : 0 secs, maxWait 30
   [junit4]   2> 2623121 INFO  (solrHandlerExecutor-12788-thread-2-processing-n:127.0.0.1:51326_solr) [n:127.0.0.1:51326_solr     ] o.a.s.h.SolrConfigHandler Time elapsed : 0 secs, maxWait 30
   [junit4]   2> 2623226 DEBUG (qtp1946089963-40924) [n:127.0.0.1:51327_solr     ] o.a.s.c.PackageManager expected version : 0 , my version 0
   [junit4]   2> 2623226 DEBUG (qtp1812057423-40938) [n:127.0.0.1:51326_solr     ] o.a.s.c.PackageManager expected version : 0 , my version -1
   [junit4]   2> 2623226 DEBUG (qtp1812057423-40938) [n:127.0.0.1:51326_solr     ] o.a.s.c.c.ZkStateReader Expected version of clusterprops.json is 0 , my version is 0
   [junit4]   2> 2623226 DEBUG (qtp1946089963-40924) [n:127.0.0.1:51327_solr     ] o.a.s.c.c.ZkStateReader Expected version of clusterprops.json is 0 , my version is 0
   [junit4]   2> 2623226 DEBUG (qtp1930696675-40927) [n:127.0.0.1:51325_solr     ] o.a.s.c.PackageManager expected version : 0 , my version 0
   [junit4]   2> 2623226 DEBUG (qtp1930696675-40927) [n:127.0.0.1:51325_solr     ] o.a.s.c.c.ZkStateReader Expected version of clusterprops.json is 0 , my version is 0
   [junit4]   2> 2623226 DEBUG (qtp649867812-40915) [n:127.0.0.1:51324_solr     ] o.a.s.c.PackageManager expected version : 0 , my version 0
   [junit4]   2> 2623227 INFO  (qtp1812057423-40938) [n:127.0.0.1:51326_solr     ] o.a.s.s.HttpSolrCall [admin] webapp=null path=/node/ext params={znodeVersion=0&wt=javabin&version=2} status=0 QTime=1
   [junit4]   2> 2623227 DEBUG (qtp649867812-40915) [n:127.0.0.1:51324_solr     ] o.a.s.c.c.ZkStateReader Expected version of clusterprops.json is 0 , my version is 0
   [junit4]   2> 2623227 INFO  (qtp649867812-40915) [n:127.0.0.1:51324_solr     ] o.a.s.s.HttpSolrCall [admin] webapp=null path=/node/ext params={znodeVersion=0&wt=javabin&version=2} status=0 QTime=0
   [junit4]   2> 2623227 INFO  (qtp1946089963-40924) [n:127.0.0.1:51327_solr     ] o.a.s.s.HttpSolrCall [admin] webapp=null path=/node/ext params={znodeVersion=0&wt=javabin&version=2} status=0 QTime=1
   [junit4]   2> 2623227 INFO  (qtp1930696675-40927) [n:127.0.0.1:51325_solr     ] o.a.s.s.HttpSolrCall [admin] webapp=null path=/node/ext params={znodeVersion=0&wt=javabin&version=2} status=0 QTime=1
   [junit4]   2> 2623230 INFO  (qtp1812057423-40935) [n:127.0.0.1:51326_solr     ] o.a.s.h.a.CollectionHandlerApi Took 117.0ms to update the clusterprops to be of version 0  on 4 nodes
   [junit4]   2> 2623230 INFO  (qtp1812057423-40935) [n:127.0.0.1:51326_solr     ] o.a.s.s.HttpSolrCall [admin] webapp=null path=/cluster params={wt=javabin&version=2} status=0 QTime=160
   [junit4]   2> 2623232 INFO  (qtp1946089963-40933) [n:127.0.0.1:51327_solr     ] o.a.s.s.HttpSolrCall [admin] webapp=null path=/node/ext params={wt=javabin&version=2} status=0 QTime=0
   [junit4]   2> 2623235 INFO  (qtp649867812-40919) [n:127.0.0.1:51324_solr     ] o.a.s.s.HttpSolrCall [admin] webapp=null path=/node/ext params={wt=javabin&version=2} status=0 QTime=0
   [junit4]   2> 2623237 INFO  (qtp1930696675-40942) [n:127.0.0.1:51325_solr     ] o.a.s.s.HttpSolrCall [admin] webapp=null path=/node/ext/foo params={testkey=testval&wt=javabin&version=2} status=0 QTime=0
   [junit4]   2> 2623250 INFO  (qtp1946089963-40923) [n:127.0.0.1:51327_solr     ] o.a.s.c.PackageManager clusterprops.json changed , version 0
   [junit4]   2> 2623250 DEBUG (zkCallback-17457-thread-1) [     ] o.a.s.c.c.ZkStateReader Loaded cluster properties: {requestHandler={}} to version 1
   [junit4]   2> 2623250 DEBUG (qtp1946089963-40923) [n:127.0.0.1:51327_solr     ] o.a.s.c.PackageManager RequestHandlers being reloaded : []
   [junit4]   2> 2623250 INFO  (zkCallback-17457-thread-1) [     ] o.a.s.c.PackageManager clusterprops.json changed , version 1
   [junit4]   2> 2623250 DEBUG (qtp1946089963-40923) [n:127.0.0.1:

[...truncated too long message...]

s.m.SolrMetricManager Closing metric reporters for registry=solr.cluster, tag=null
   [junit4]   2> 182217 INFO  (closeThreadPool-2219-thread-2) [     ] o.a.s.c.Overseer Overseer (id=72236169240444940-127.0.0.1:51856_solr-n_0000000000) closing
   [junit4]   2> 182217 INFO  (OverseerStateUpdate-72236169240444940-127.0.0.1:51856_solr-n_0000000000) [n:127.0.0.1:51856_solr     ] o.a.s.c.Overseer Overseer Loop exiting : 127.0.0.1:51856_solr
   [junit4]   2> 182217 INFO  (OverseerAutoScalingTriggerThread-72236169240444940-127.0.0.1:51856_solr-n_0000000000) [     ] o.a.s.c.a.OverseerTriggerThread OverseerTriggerThread woken up but we are closed, exiting.
   [junit4]   2> 182221 DEBUG (zkCallback-2163-thread-1) [     ] o.a.s.c.c.ZkStateReader A live node change: [WatchedEvent state:SyncConnected type:NodeChildrenChanged path:/live_nodes], has occurred - updating... (live nodes size: [3])
   [junit4]   2> 182221 DEBUG (zkCallback-2143-thread-2) [     ] o.a.s.c.c.ZkStateReader A live node change: [WatchedEvent state:SyncConnected type:NodeChildrenChanged path:/live_nodes], has occurred - updating... (live nodes size: [3])
   [junit4]   2> 182222 INFO  (closeThreadPool-2219-thread-1) [     ] o.a.s.c.Overseer Overseer (id=72236169240444940-127.0.0.1:51856_solr-n_0000000000) closing
   [junit4]   2> 182332 INFO  (zkCallback-2163-thread-1) [     ] o.a.s.c.c.ZkStateReader Updated live nodes from ZooKeeper... (3) -> (2)
   [junit4]   2> 182332 DEBUG (zkCallback-2163-thread-1) [     ] o.a.s.c.c.ZkStateReader Updated live nodes from ZooKeeper... [127.0.0.1:51854_solr, 127.0.0.1:51855_solr, 127.0.0.1:51856_solr] -> [127.0.0.1:51854_solr, 127.0.0.1:51855_solr]
   [junit4]   2> 182332 INFO  (zkCallback-2143-thread-2) [     ] o.a.s.c.c.ZkStateReader Updated live nodes from ZooKeeper... (3) -> (2)
   [junit4]   2> 182332 DEBUG (zkCallback-2143-thread-2) [     ] o.a.s.c.c.ZkStateReader Updated live nodes from ZooKeeper... [127.0.0.1:51854_solr, 127.0.0.1:51855_solr, 127.0.0.1:51856_solr] -> [127.0.0.1:51854_solr, 127.0.0.1:51855_solr]
   [junit4]   2> 182333 INFO  (jetty-closer-2204-thread-1) [     ] o.a.s.c.Overseer Overseer (id=72236169240444940-127.0.0.1:51856_solr-n_0000000000) closing
   [junit4]   2> 182423 INFO  (jetty-closer-2204-thread-4) [     ] o.e.j.s.AbstractConnector Stopped ServerConnector@7052aac1{HTTP/1.1,[http/1.1, h2c]}{127.0.0.1:0}
   [junit4]   2> 182424 INFO  (jetty-closer-2204-thread-4) [     ] o.e.j.s.h.ContextHandler Stopped o.e.j.s.ServletContextHandler@3a5ae571{/solr,null,UNAVAILABLE}
   [junit4]   2> 182424 INFO  (jetty-closer-2204-thread-4) [     ] o.e.j.s.session node0 Stopped scavenging
   [junit4]   2> 182541 INFO  (jetty-closer-2204-thread-2) [     ] o.e.j.s.AbstractConnector Stopped ServerConnector@53dd0427{HTTP/1.1,[http/1.1, h2c]}{127.0.0.1:0}
   [junit4]   2> 182541 INFO  (jetty-closer-2204-thread-2) [     ] o.e.j.s.h.ContextHandler Stopped o.e.j.s.ServletContextHandler@6e97d178{/solr,null,UNAVAILABLE}
   [junit4]   2> 182542 INFO  (jetty-closer-2204-thread-2) [     ] o.e.j.s.session node0 Stopped scavenging
   [junit4]   2> 182643 INFO  (jetty-closer-2204-thread-3) [     ] o.e.j.s.AbstractConnector Stopped ServerConnector@4de92fa7{HTTP/1.1,[http/1.1, h2c]}{127.0.0.1:0}
   [junit4]   2> 182643 INFO  (jetty-closer-2204-thread-1) [     ] o.e.j.s.AbstractConnector Stopped ServerConnector@490615f1{HTTP/1.1,[http/1.1, h2c]}{127.0.0.1:0}
   [junit4]   2> 182643 INFO  (jetty-closer-2204-thread-1) [     ] o.e.j.s.h.ContextHandler Stopped o.e.j.s.ServletContextHandler@7ee091b1{/solr,null,UNAVAILABLE}
   [junit4]   2> 182643 INFO  (jetty-closer-2204-thread-3) [     ] o.e.j.s.h.ContextHandler Stopped o.e.j.s.ServletContextHandler@3cb21c77{/solr,null,UNAVAILABLE}
   [junit4]   2> 182643 INFO  (jetty-closer-2204-thread-3) [     ] o.e.j.s.session node0 Stopped scavenging
   [junit4]   2> 182643 INFO  (jetty-closer-2204-thread-1) [     ] o.e.j.s.session node0 Stopped scavenging
   [junit4]   2> 182645 INFO  (TEST-TestContainerReqHandler.testPackageAPI-seed#[BEBE936614E6EEDA]) [     ] o.a.s.c.ZkTestServer Shutting down ZkTestServer.
   [junit4]   2> 182869 WARN  (ZkTestServer Run Thread) [     ] o.a.s.c.ZkTestServer Watch limit violations:
   [junit4]   2> Maximum concurrent create/delete watches above limit:
   [junit4]   2>
   [junit4]   2> 9 /solr/aliases.json
   [junit4]   2> 9 /solr/clusterprops.json
   [junit4]   2> 4 /solr/security.json
   [junit4]   2>
   [junit4]   2> Maximum concurrent data watches above limit:
   [junit4]   2>
   [junit4]   2> 45 /solr/clusterprops.json
   [junit4]   2> 9 /solr/clusterstate.json
   [junit4]   2>
   [junit4]   2> Maximum concurrent children watches above limit:
   [junit4]   2>
   [junit4]   2> 35 /solr/live_nodes
   [junit4]   2> 9 /solr/collections
   [junit4]   2> 7 /solr/overseer/queue
   [junit4]   2>
   [junit4]   2> 184391 INFO  (TEST-TestContainerReqHandler.testPackageAPI-seed#[BEBE936614E6EEDA]) [     ] o.a.s.c.ZkTestServer waitForServerDown: 127.0.0.1:51848
   [junit4]   2> 184391 INFO  (TEST-TestContainerReqHandler.testPackageAPI-seed#[BEBE936614E6EEDA]) [     ] o.a.s.c.ZkTestServer parse host and port list: 127.0.0.1:51848
   [junit4]   2> 184391 INFO  (TEST-TestContainerReqHandler.testPackageAPI-seed#[BEBE936614E6EEDA]) [     ] o.a.s.c.ZkTestServer connecting to 127.0.0.1 51848
   [junit4]   2> 184392 INFO  (TEST-TestContainerReqHandler.testPackageAPI-seed#[BEBE936614E6EEDA]) [     ] o.e.j.s.AbstractConnector Stopped ServerConnector@55ad013c{HTTP/1.1,[http/1.1]}{0.0.0.0:0}
   [junit4]   2> 184393 INFO  (TEST-TestContainerReqHandler.testPackageAPI-seed#[BEBE936614E6EEDA]) [     ] o.a.s.SolrTestCaseJ4 ###Ending testPackageAPI
   [junit4] OK      5.12s J0 | TestContainerReqHandler.testPackageAPI
   [junit4]   2> 184395 INFO  (SUITE-TestContainerReqHandler-seed#[BEBE936614E6EEDA]-worker) [     ] o.a.s.c.ZkTestServer Shutting down ZkTestServer.
   [junit4]   2> 184395 INFO  (SUITE-TestContainerReqHandler-seed#[BEBE936614E6EEDA]-worker) [     ] o.a.s.c.ZkTestServer waitForServerDown: 127.0.0.1:51848
   [junit4]   2> 184395 INFO  (SUITE-TestContainerReqHandler-seed#[BEBE936614E6EEDA]-worker) [     ] o.a.s.c.ZkTestServer parse host and port list: 127.0.0.1:51848
   [junit4]   2> 184395 INFO  (SUITE-TestContainerReqHandler-seed#[BEBE936614E6EEDA]-worker) [     ] o.a.s.c.ZkTestServer connecting to 127.0.0.1 51848
   [junit4]   2> NOTE: leaving temporary files on disk at: /Users/jenkins/workspace/Lucene-Solr-8.x-MacOSX/solr/build/solr-core/test/J0/temp/solr.handler.TestContainerReqHandler_BEBE936614E6EEDA-003
   [junit4]   2> NOTE: test params are: codec=Asserting(Lucene80), sim=Asserting(org.apache.lucene.search.similarities.AssertingSimilarity@7523d5c8), locale=es-EC, timezone=Mexico/General
   [junit4]   2> NOTE: Mac OS X 10.11.6 x86_64/Oracle Corporation 1.8.0_201 (64-bit)/cpus=3,threads=1,free=86382264,total=225968128
   [junit4]   2> NOTE: All tests run in this JVM: [TestContainerReqHandler, TestContainerReqHandler, TestContainerReqHandler]
   [junit4] Completed [5/5 (5!)] on J0 in 43.24s, 6 tests, 1 error <<< FAILURES!
   [junit4]
   [junit4]
   [junit4] Tests with failures [seed: BEBE936614E6EEDA]:
   [junit4]   - org.apache.solr.handler.TestContainerReqHandler.testCacheLoadFromPackage
   [junit4]   - org.apache.solr.handler.TestContainerReqHandler.testCacheLoadFromPackage
   [junit4]   - org.apache.solr.handler.TestContainerReqHandler.testCacheLoadFromPackage
   [junit4]   - org.apache.solr.handler.TestContainerReqHandler.testCacheLoadFromPackage
   [junit4]   - org.apache.solr.handler.TestContainerReqHandler.testCacheLoadFromPackage
   [junit4]
   [junit4]
   [junit4] JVM J0:     1.51 ..   186.41 =   184.90s
   [junit4] JVM J1:     1.51 ..   144.12 =   142.61s
   [junit4] Execution time total: 3 minutes 6 seconds
   [junit4] Tests summary: 5 suites, 30 tests, 5 errors

BUILD FAILED
/Users/jenkins/workspace/Lucene-Solr-8.x-MacOSX/lucene/common-build.xml:1572: The following error occurred while executing this line:
/Users/jenkins/workspace/Lucene-Solr-8.x-MacOSX/lucene/common-build.xml:1099: There were test failures: 5 suites, 30 tests, 5 errors [seed: BEBE936614E6EEDA]

Total time: 3 minutes 11 seconds

[repro] Setting last failure code to 256

[repro] Failures:
[repro]   5/5 failed: org.apache.solr.handler.TestContainerReqHandler
[repro] Exiting with code 256
+ mv lucene/build lucene/build.repro
+ mv solr/build solr/build.repro
+ mv lucene/build.orig lucene/build
+ mv solr/build.orig solr/build
Archiving artifacts
Setting ANT_1_8_2_HOME=/Users/jenkins/tools/hudson.tasks.Ant_AntInstallation/ANT_1.8.2
[WARNINGS] Parsing warnings in console log with parser Java Compiler (javac)
Setting ANT_1_8_2_HOME=/Users/jenkins/tools/hudson.tasks.Ant_AntInstallation/ANT_1.8.2
No credentials specified
Setting ANT_1_8_2_HOME=/Users/jenkins/tools/hudson.tasks.Ant_AntInstallation/ANT_1.8.2
<Git Blamer> Using GitBlamer to create author and commit information for all warnings.
<Git Blamer> GIT_COMMIT=035d823acf752d5794cfd07e133a918f0fb6b8c6, workspace=/Users/jenkins/workspace/Lucene-Solr-8.x-MacOSX
[WARNINGS] Computing warning deltas based on reference build #290
Recording test results
Setting ANT_1_8_2_HOME=/Users/jenkins/tools/hudson.tasks.Ant_AntInstallation/ANT_1.8.2
Build step 'Publish JUnit test result report' changed build result to UNSTABLE
Email was triggered for: Unstable (Test Failures)
Sending email for trigger: Unstable (Test Failures)
Setting ANT_1_8_2_HOME=/Users/jenkins/tools/hudson.tasks.Ant_AntInstallation/ANT_1.8.2
Setting ANT_1_8_2_HOME=/Users/jenkins/tools/hudson.tasks.Ant_AntInstallation/ANT_1.8.2
Setting ANT_1_8_2_HOME=/Users/jenkins/tools/hudson.tasks.Ant_AntInstallation/ANT_1.8.2
Setting ANT_1_8_2_HOME=/Users/jenkins/tools/hudson.tasks.Ant_AntInstallation/ANT_1.8.2
Setting ANT_1_8_2_HOME=/Users/jenkins/tools/hudson.tasks.Ant_AntInstallation/ANT_1.8.2
Setting ANT_1_8_2_HOME=/Users/jenkins/tools/hudson.tasks.Ant_AntInstallation/ANT_1.8.2


---------------------------------------------------------------------
To unsubscribe, e-mail: [hidden email]
For additional commands, e-mail: [hidden email]