[JENKINS] Lucene-Solr-8.x-MacOSX (64bit/jdk1.8.0) - Build # 297 - Unstable!

classic Classic list List threaded Threaded
1 message Options
Reply | Threaded
Open this post in threaded view
|

[JENKINS] Lucene-Solr-8.x-MacOSX (64bit/jdk1.8.0) - Build # 297 - Unstable!

Policeman Jenkins Server-2
Build: https://jenkins.thetaphi.de/job/Lucene-Solr-8.x-MacOSX/297/
Java: 64bit/jdk1.8.0 -XX:+UseCompressedOops -XX:+UseG1GC

1 tests failed.
FAILED:  org.apache.solr.client.solrj.io.stream.MathExpressionTest.testGammaDistribution

Error Message:
0.8227928778774853 0.8230402508539298

Stack Trace:
java.lang.AssertionError: 0.8227928778774853 0.8230402508539298
        at __randomizedtesting.SeedInfo.seed([E02E5EA70C3FA8F2:DD5475092F4702E5]:0)
        at org.junit.Assert.fail(Assert.java:88)
        at org.junit.Assert.assertTrue(Assert.java:41)
        at org.apache.solr.client.solrj.io.stream.MathExpressionTest.testGammaDistribution(MathExpressionTest.java:4948)
        at sun.reflect.NativeMethodAccessorImpl.invoke0(Native Method)
        at sun.reflect.NativeMethodAccessorImpl.invoke(NativeMethodAccessorImpl.java:62)
        at sun.reflect.DelegatingMethodAccessorImpl.invoke(DelegatingMethodAccessorImpl.java:43)
        at java.lang.reflect.Method.invoke(Method.java:498)
        at com.carrotsearch.randomizedtesting.RandomizedRunner.invoke(RandomizedRunner.java:1750)
        at com.carrotsearch.randomizedtesting.RandomizedRunner$8.evaluate(RandomizedRunner.java:938)
        at com.carrotsearch.randomizedtesting.RandomizedRunner$9.evaluate(RandomizedRunner.java:974)
        at com.carrotsearch.randomizedtesting.RandomizedRunner$10.evaluate(RandomizedRunner.java:988)
        at com.carrotsearch.randomizedtesting.rules.SystemPropertiesRestoreRule$1.evaluate(SystemPropertiesRestoreRule.java:57)
        at org.apache.lucene.util.TestRuleSetupTeardownChained$1.evaluate(TestRuleSetupTeardownChained.java:49)
        at org.apache.lucene.util.AbstractBeforeAfterRule$1.evaluate(AbstractBeforeAfterRule.java:45)
        at org.apache.lucene.util.TestRuleThreadAndTestName$1.evaluate(TestRuleThreadAndTestName.java:48)
        at org.apache.lucene.util.TestRuleIgnoreAfterMaxFailures$1.evaluate(TestRuleIgnoreAfterMaxFailures.java:64)
        at org.apache.lucene.util.TestRuleMarkFailure$1.evaluate(TestRuleMarkFailure.java:47)
        at com.carrotsearch.randomizedtesting.rules.StatementAdapter.evaluate(StatementAdapter.java:36)
        at com.carrotsearch.randomizedtesting.ThreadLeakControl$StatementRunner.run(ThreadLeakControl.java:368)
        at com.carrotsearch.randomizedtesting.ThreadLeakControl.forkTimeoutingTask(ThreadLeakControl.java:817)
        at com.carrotsearch.randomizedtesting.ThreadLeakControl$3.evaluate(ThreadLeakControl.java:468)
        at com.carrotsearch.randomizedtesting.RandomizedRunner.runSingleTest(RandomizedRunner.java:947)
        at com.carrotsearch.randomizedtesting.RandomizedRunner$5.evaluate(RandomizedRunner.java:832)
        at com.carrotsearch.randomizedtesting.RandomizedRunner$6.evaluate(RandomizedRunner.java:883)
        at com.carrotsearch.randomizedtesting.RandomizedRunner$7.evaluate(RandomizedRunner.java:894)
        at com.carrotsearch.randomizedtesting.rules.StatementAdapter.evaluate(StatementAdapter.java:36)
        at com.carrotsearch.randomizedtesting.rules.SystemPropertiesRestoreRule$1.evaluate(SystemPropertiesRestoreRule.java:57)
        at org.apache.lucene.util.AbstractBeforeAfterRule$1.evaluate(AbstractBeforeAfterRule.java:45)
        at com.carrotsearch.randomizedtesting.rules.StatementAdapter.evaluate(StatementAdapter.java:36)
        at org.apache.lucene.util.TestRuleStoreClassName$1.evaluate(TestRuleStoreClassName.java:41)
        at com.carrotsearch.randomizedtesting.rules.NoShadowingOrOverridesOnMethodsRule$1.evaluate(NoShadowingOrOverridesOnMethodsRule.java:40)
        at com.carrotsearch.randomizedtesting.rules.NoShadowingOrOverridesOnMethodsRule$1.evaluate(NoShadowingOrOverridesOnMethodsRule.java:40)
        at com.carrotsearch.randomizedtesting.rules.StatementAdapter.evaluate(StatementAdapter.java:36)
        at com.carrotsearch.randomizedtesting.rules.StatementAdapter.evaluate(StatementAdapter.java:36)
        at com.carrotsearch.randomizedtesting.rules.StatementAdapter.evaluate(StatementAdapter.java:36)
        at org.apache.lucene.util.TestRuleAssertionsRequired$1.evaluate(TestRuleAssertionsRequired.java:53)
        at org.apache.lucene.util.TestRuleMarkFailure$1.evaluate(TestRuleMarkFailure.java:47)
        at org.apache.lucene.util.TestRuleIgnoreAfterMaxFailures$1.evaluate(TestRuleIgnoreAfterMaxFailures.java:64)
        at org.apache.lucene.util.TestRuleIgnoreTestSuites$1.evaluate(TestRuleIgnoreTestSuites.java:54)
        at com.carrotsearch.randomizedtesting.rules.StatementAdapter.evaluate(StatementAdapter.java:36)
        at com.carrotsearch.randomizedtesting.ThreadLeakControl$StatementRunner.run(ThreadLeakControl.java:368)
        at java.lang.Thread.run(Thread.java:748)




Build Log:
[...truncated 16751 lines...]
   [junit4] Suite: org.apache.solr.client.solrj.io.stream.MathExpressionTest
   [junit4]   2> 129972 INFO  (SUITE-MathExpressionTest-seed#[E02E5EA70C3FA8F2]-worker) [     ] o.a.s.SolrTestCaseJ4 Created dataDir: /Users/jenkins/workspace/Lucene-Solr-8.x-MacOSX/solr/build/solr-solrj/test/J0/temp/solr.client.solrj.io.stream.MathExpressionTest_E02E5EA70C3FA8F2-001/data-dir-14-001
   [junit4]   2> 129972 INFO  (SUITE-MathExpressionTest-seed#[E02E5EA70C3FA8F2]-worker) [     ] o.a.s.SolrTestCaseJ4 Using PointFields (NUMERIC_POINTS_SYSPROP=true) w/NUMERIC_DOCVALUES_SYSPROP=true
   [junit4]   2> 129973 INFO  (SUITE-MathExpressionTest-seed#[E02E5EA70C3FA8F2]-worker) [     ] o.a.s.SolrTestCaseJ4 Randomized ssl (false) and clientAuth (false) via: @org.apache.solr.util.RandomizeSSL(reason=, value=NaN, ssl=NaN, clientAuth=NaN) w/ MAC_OS_X supressed clientAuth
   [junit4]   2> 129974 INFO  (SUITE-MathExpressionTest-seed#[E02E5EA70C3FA8F2]-worker) [     ] o.a.s.SolrTestCaseJ4 SecureRandom sanity checks: test.solr.allowed.securerandom=null & java.security.egd=file:/dev/./urandom
   [junit4]   2> 129975 INFO  (SUITE-MathExpressionTest-seed#[E02E5EA70C3FA8F2]-worker) [     ] o.a.s.c.MiniSolrCloudCluster Starting cluster of 4 servers in /Users/jenkins/workspace/Lucene-Solr-8.x-MacOSX/solr/build/solr-solrj/test/J0/temp/solr.client.solrj.io.stream.MathExpressionTest_E02E5EA70C3FA8F2-001/tempDir-001
   [junit4]   2> 129975 INFO  (SUITE-MathExpressionTest-seed#[E02E5EA70C3FA8F2]-worker) [     ] o.a.s.c.ZkTestServer STARTING ZK TEST SERVER
   [junit4]   2> 129976 INFO  (ZkTestServer Run Thread) [     ] o.a.s.c.ZkTestServer client port:0.0.0.0/0.0.0.0:0
   [junit4]   2> 129976 INFO  (ZkTestServer Run Thread) [     ] o.a.s.c.ZkTestServer Starting server
   [junit4]   2> 130079 INFO  (SUITE-MathExpressionTest-seed#[E02E5EA70C3FA8F2]-worker) [     ] o.a.s.c.ZkTestServer start zk server on port:63977
   [junit4]   2> 130079 INFO  (SUITE-MathExpressionTest-seed#[E02E5EA70C3FA8F2]-worker) [     ] o.a.s.c.ZkTestServer waitForServerUp: 127.0.0.1:63977
   [junit4]   2> 130079 INFO  (SUITE-MathExpressionTest-seed#[E02E5EA70C3FA8F2]-worker) [     ] o.a.s.c.ZkTestServer parse host and port list: 127.0.0.1:63977
   [junit4]   2> 130079 INFO  (SUITE-MathExpressionTest-seed#[E02E5EA70C3FA8F2]-worker) [     ] o.a.s.c.ZkTestServer connecting to 127.0.0.1 63977
   [junit4]   2> 130082 INFO  (SUITE-MathExpressionTest-seed#[E02E5EA70C3FA8F2]-worker) [     ] o.a.s.c.c.ConnectionManager Waiting for client to connect to ZooKeeper
   [junit4]   2> 130107 INFO  (zkConnectionManagerCallback-571-thread-1) [     ] o.a.s.c.c.ConnectionManager zkClient has connected
   [junit4]   2> 130107 INFO  (SUITE-MathExpressionTest-seed#[E02E5EA70C3FA8F2]-worker) [     ] o.a.s.c.c.ConnectionManager Client is connected to ZooKeeper
   [junit4]   2> 130113 INFO  (SUITE-MathExpressionTest-seed#[E02E5EA70C3FA8F2]-worker) [     ] o.a.s.c.c.ConnectionManager Waiting for client to connect to ZooKeeper
   [junit4]   2> 130116 INFO  (zkConnectionManagerCallback-573-thread-1) [     ] o.a.s.c.c.ConnectionManager zkClient has connected
   [junit4]   2> 130116 INFO  (SUITE-MathExpressionTest-seed#[E02E5EA70C3FA8F2]-worker) [     ] o.a.s.c.c.ConnectionManager Client is connected to ZooKeeper
   [junit4]   2> 130117 INFO  (SUITE-MathExpressionTest-seed#[E02E5EA70C3FA8F2]-worker) [     ] o.a.s.c.c.ConnectionManager Waiting for client to connect to ZooKeeper
   [junit4]   2> 130127 INFO  (zkConnectionManagerCallback-575-thread-1) [     ] o.a.s.c.c.ConnectionManager zkClient has connected
   [junit4]   2> 130127 INFO  (SUITE-MathExpressionTest-seed#[E02E5EA70C3FA8F2]-worker) [     ] o.a.s.c.c.ConnectionManager Client is connected to ZooKeeper
   [junit4]   2> 130249 WARN  (jetty-launcher-576-thread-4) [     ] o.e.j.s.AbstractConnector Ignoring deprecated socket close linger time
   [junit4]   2> 130249 WARN  (jetty-launcher-576-thread-1) [     ] o.e.j.s.AbstractConnector Ignoring deprecated socket close linger time
   [junit4]   2> 130249 INFO  (jetty-launcher-576-thread-4) [     ] o.a.s.c.s.e.JettySolrRunner Start Jetty (original configured port=0)
   [junit4]   2> 130250 INFO  (jetty-launcher-576-thread-4) [     ] o.a.s.c.s.e.JettySolrRunner Trying to start Jetty on port 0 try number 1 ...
   [junit4]   2> 130250 WARN  (jetty-launcher-576-thread-2) [     ] o.e.j.s.AbstractConnector Ignoring deprecated socket close linger time
   [junit4]   2> 130250 INFO  (jetty-launcher-576-thread-4) [     ] o.e.j.s.Server jetty-9.4.19.v20190610; built: 2019-06-10T16:30:51.723Z; git: afcf563148970e98786327af5e07c261fda175d3; jvm 1.8.0_201-b09
   [junit4]   2> 130250 WARN  (jetty-launcher-576-thread-3) [     ] o.e.j.s.AbstractConnector Ignoring deprecated socket close linger time
   [junit4]   2> 130250 INFO  (jetty-launcher-576-thread-2) [     ] o.a.s.c.s.e.JettySolrRunner Start Jetty (original configured port=0)
   [junit4]   2> 130250 INFO  (jetty-launcher-576-thread-2) [     ] o.a.s.c.s.e.JettySolrRunner Trying to start Jetty on port 0 try number 1 ...
   [junit4]   2> 130250 INFO  (jetty-launcher-576-thread-2) [     ] o.e.j.s.Server jetty-9.4.19.v20190610; built: 2019-06-10T16:30:51.723Z; git: afcf563148970e98786327af5e07c261fda175d3; jvm 1.8.0_201-b09
   [junit4]   2> 130249 INFO  (jetty-launcher-576-thread-1) [     ] o.a.s.c.s.e.JettySolrRunner Start Jetty (original configured port=0)
   [junit4]   2> 130250 INFO  (jetty-launcher-576-thread-1) [     ] o.a.s.c.s.e.JettySolrRunner Trying to start Jetty on port 0 try number 1 ...
   [junit4]   2> 130250 INFO  (jetty-launcher-576-thread-1) [     ] o.e.j.s.Server jetty-9.4.19.v20190610; built: 2019-06-10T16:30:51.723Z; git: afcf563148970e98786327af5e07c261fda175d3; jvm 1.8.0_201-b09
   [junit4]   2> 130250 INFO  (jetty-launcher-576-thread-3) [     ] o.a.s.c.s.e.JettySolrRunner Start Jetty (original configured port=0)
   [junit4]   2> 130250 INFO  (jetty-launcher-576-thread-3) [     ] o.a.s.c.s.e.JettySolrRunner Trying to start Jetty on port 0 try number 1 ...
   [junit4]   2> 130250 INFO  (jetty-launcher-576-thread-3) [     ] o.e.j.s.Server jetty-9.4.19.v20190610; built: 2019-06-10T16:30:51.723Z; git: afcf563148970e98786327af5e07c261fda175d3; jvm 1.8.0_201-b09
   [junit4]   2> 130253 INFO  (jetty-launcher-576-thread-1) [     ] o.e.j.s.session DefaultSessionIdManager workerName=node0
   [junit4]   2> 130254 INFO  (jetty-launcher-576-thread-1) [     ] o.e.j.s.session No SessionScavenger set, using defaults
   [junit4]   2> 130254 INFO  (jetty-launcher-576-thread-1) [     ] o.e.j.s.session node0 Scavenging every 600000ms
   [junit4]   2> 130255 INFO  (jetty-launcher-576-thread-4) [     ] o.e.j.s.session DefaultSessionIdManager workerName=node0
   [junit4]   2> 130256 INFO  (jetty-launcher-576-thread-4) [     ] o.e.j.s.session No SessionScavenger set, using defaults
   [junit4]   2> 130256 INFO  (jetty-launcher-576-thread-4) [     ] o.e.j.s.session node0 Scavenging every 600000ms
   [junit4]   2> 130257 INFO  (jetty-launcher-576-thread-4) [     ] o.e.j.s.h.ContextHandler Started o.e.j.s.ServletContextHandler@558301c8{/solr,null,AVAILABLE}
   [junit4]   2> 130257 INFO  (jetty-launcher-576-thread-1) [     ] o.e.j.s.h.ContextHandler Started o.e.j.s.ServletContextHandler@344e066f{/solr,null,AVAILABLE}
   [junit4]   2> 130259 INFO  (jetty-launcher-576-thread-2) [     ] o.e.j.s.session DefaultSessionIdManager workerName=node0
   [junit4]   2> 130259 INFO  (jetty-launcher-576-thread-2) [     ] o.e.j.s.session No SessionScavenger set, using defaults
   [junit4]   2> 130259 INFO  (jetty-launcher-576-thread-2) [     ] o.e.j.s.session node0 Scavenging every 660000ms
   [junit4]   2> 130261 INFO  (jetty-launcher-576-thread-3) [     ] o.e.j.s.session DefaultSessionIdManager workerName=node0
   [junit4]   2> 130261 INFO  (jetty-launcher-576-thread-3) [     ] o.e.j.s.session No SessionScavenger set, using defaults
   [junit4]   2> 130262 INFO  (jetty-launcher-576-thread-3) [     ] o.e.j.s.session node0 Scavenging every 660000ms
   [junit4]   2> 130265 INFO  (jetty-launcher-576-thread-3) [     ] o.e.j.s.h.ContextHandler Started o.e.j.s.ServletContextHandler@13abac1b{/solr,null,AVAILABLE}
   [junit4]   2> 130265 INFO  (jetty-launcher-576-thread-1) [     ] o.e.j.s.AbstractConnector Started ServerConnector@53c7f8fd{HTTP/1.1,[http/1.1, h2c]}{127.0.0.1:63983}
   [junit4]   2> 130265 INFO  (jetty-launcher-576-thread-1) [     ] o.e.j.s.Server Started @130596ms
   [junit4]   2> 130265 INFO  (jetty-launcher-576-thread-1) [     ] o.a.s.c.s.e.JettySolrRunner Jetty properties: {hostContext=/solr, hostPort=63983}
   [junit4]   2> 130266 INFO  (jetty-launcher-576-thread-2) [     ] o.e.j.s.h.ContextHandler Started o.e.j.s.ServletContextHandler@688285e5{/solr,null,AVAILABLE}
   [junit4]   2> 130274 INFO  (jetty-launcher-576-thread-4) [     ] o.e.j.s.AbstractConnector Started ServerConnector@986758{HTTP/1.1,[http/1.1, h2c]}{127.0.0.1:63982}
   [junit4]   2> 130274 INFO  (jetty-launcher-576-thread-4) [     ] o.e.j.s.Server Started @130605ms
   [junit4]   2> 130274 INFO  (jetty-launcher-576-thread-4) [     ] o.a.s.c.s.e.JettySolrRunner Jetty properties: {hostContext=/solr, hostPort=63982}
   [junit4]   2> 130266 ERROR (jetty-launcher-576-thread-1) [     ] o.a.s.u.StartupLoggingUtils Missing Java Option solr.log.dir. Logging may be missing or incomplete.
   [junit4]   2> 130274 INFO  (jetty-launcher-576-thread-1) [     ] o.a.s.s.SolrDispatchFilter Using logger factory org.apache.logging.slf4j.Log4jLoggerFactory
   [junit4]   2> 130275 INFO  (jetty-launcher-576-thread-1) [     ] o.a.s.s.SolrDispatchFilter  ___      _       Welcome to Apache Solr? version 8.3.0
   [junit4]   2> 130275 INFO  (jetty-launcher-576-thread-1) [     ] o.a.s.s.SolrDispatchFilter / __| ___| |_ _   Starting in cloud mode on port null
   [junit4]   2> 130275 INFO  (jetty-launcher-576-thread-1) [     ] o.a.s.s.SolrDispatchFilter \__ \/ _ \ | '_|  Install dir: null
   [junit4]   2> 130275 INFO  (jetty-launcher-576-thread-1) [     ] o.a.s.s.SolrDispatchFilter |___/\___/_|_|    Start time: 2019-08-27T01:33:27.526Z
   [junit4]   2> 130275 ERROR (jetty-launcher-576-thread-4) [     ] o.a.s.u.StartupLoggingUtils Missing Java Option solr.log.dir. Logging may be missing or incomplete.
   [junit4]   2> 130275 INFO  (jetty-launcher-576-thread-4) [     ] o.a.s.s.SolrDispatchFilter Using logger factory org.apache.logging.slf4j.Log4jLoggerFactory
   [junit4]   2> 130276 INFO  (jetty-launcher-576-thread-4) [     ] o.a.s.s.SolrDispatchFilter  ___      _       Welcome to Apache Solr? version 8.3.0
   [junit4]   2> 130276 INFO  (jetty-launcher-576-thread-4) [     ] o.a.s.s.SolrDispatchFilter / __| ___| |_ _   Starting in cloud mode on port null
   [junit4]   2> 130276 INFO  (jetty-launcher-576-thread-4) [     ] o.a.s.s.SolrDispatchFilter \__ \/ _ \ | '_|  Install dir: null
   [junit4]   2> 130276 INFO  (jetty-launcher-576-thread-4) [     ] o.a.s.s.SolrDispatchFilter |___/\___/_|_|    Start time: 2019-08-27T01:33:27.527Z
   [junit4]   2> 130278 INFO  (jetty-launcher-576-thread-2) [     ] o.e.j.s.AbstractConnector Started ServerConnector@2672079b{HTTP/1.1,[http/1.1, h2c]}{127.0.0.1:63984}
   [junit4]   2> 130278 INFO  (jetty-launcher-576-thread-2) [     ] o.e.j.s.Server Started @130609ms
   [junit4]   2> 130278 INFO  (jetty-launcher-576-thread-2) [     ] o.a.s.c.s.e.JettySolrRunner Jetty properties: {hostContext=/solr, hostPort=63984}
   [junit4]   2> 130279 ERROR (jetty-launcher-576-thread-2) [     ] o.a.s.u.StartupLoggingUtils Missing Java Option solr.log.dir. Logging may be missing or incomplete.
   [junit4]   2> 130279 INFO  (jetty-launcher-576-thread-2) [     ] o.a.s.s.SolrDispatchFilter Using logger factory org.apache.logging.slf4j.Log4jLoggerFactory
   [junit4]   2> 130279 INFO  (jetty-launcher-576-thread-2) [     ] o.a.s.s.SolrDispatchFilter  ___      _       Welcome to Apache Solr? version 8.3.0
   [junit4]   2> 130279 INFO  (jetty-launcher-576-thread-2) [     ] o.a.s.s.SolrDispatchFilter / __| ___| |_ _   Starting in cloud mode on port null
   [junit4]   2> 130279 INFO  (jetty-launcher-576-thread-2) [     ] o.a.s.s.SolrDispatchFilter \__ \/ _ \ | '_|  Install dir: null
   [junit4]   2> 130280 INFO  (jetty-launcher-576-thread-2) [     ] o.a.s.s.SolrDispatchFilter |___/\___/_|_|    Start time: 2019-08-27T01:33:27.531Z
   [junit4]   2> 130280 INFO  (jetty-launcher-576-thread-1) [     ] o.a.s.c.c.ConnectionManager Waiting for client to connect to ZooKeeper
   [junit4]   2> 130281 INFO  (jetty-launcher-576-thread-4) [     ] o.a.s.c.c.ConnectionManager Waiting for client to connect to ZooKeeper
   [junit4]   2> 130282 INFO  (jetty-launcher-576-thread-3) [     ] o.e.j.s.AbstractConnector Started ServerConnector@6ffddf9b{HTTP/1.1,[http/1.1, h2c]}{127.0.0.1:63985}
   [junit4]   2> 130282 INFO  (jetty-launcher-576-thread-3) [     ] o.e.j.s.Server Started @130614ms
   [junit4]   2> 130282 INFO  (jetty-launcher-576-thread-3) [     ] o.a.s.c.s.e.JettySolrRunner Jetty properties: {hostContext=/solr, hostPort=63985}
   [junit4]   2> 130284 ERROR (jetty-launcher-576-thread-3) [     ] o.a.s.u.StartupLoggingUtils Missing Java Option solr.log.dir. Logging may be missing or incomplete.
   [junit4]   2> 130284 INFO  (jetty-launcher-576-thread-3) [     ] o.a.s.s.SolrDispatchFilter Using logger factory org.apache.logging.slf4j.Log4jLoggerFactory
   [junit4]   2> 130284 INFO  (jetty-launcher-576-thread-3) [     ] o.a.s.s.SolrDispatchFilter  ___      _       Welcome to Apache Solr? version 8.3.0
   [junit4]   2> 130284 INFO  (jetty-launcher-576-thread-3) [     ] o.a.s.s.SolrDispatchFilter / __| ___| |_ _   Starting in cloud mode on port null
   [junit4]   2> 130284 INFO  (jetty-launcher-576-thread-3) [     ] o.a.s.s.SolrDispatchFilter \__ \/ _ \ | '_|  Install dir: null
   [junit4]   2> 130284 INFO  (jetty-launcher-576-thread-3) [     ] o.a.s.s.SolrDispatchFilter |___/\___/_|_|    Start time: 2019-08-27T01:33:27.535Z
   [junit4]   2> 130286 INFO  (jetty-launcher-576-thread-2) [     ] o.a.s.c.c.ConnectionManager Waiting for client to connect to ZooKeeper
   [junit4]   2> 130291 INFO  (jetty-launcher-576-thread-3) [     ] o.a.s.c.c.ConnectionManager Waiting for client to connect to ZooKeeper
   [junit4]   2> 130295 INFO  (zkConnectionManagerCallback-578-thread-1) [     ] o.a.s.c.c.ConnectionManager zkClient has connected
   [junit4]   2> 130296 INFO  (jetty-launcher-576-thread-1) [     ] o.a.s.c.c.ConnectionManager Client is connected to ZooKeeper
   [junit4]   2> 130299 INFO  (jetty-launcher-576-thread-1) [     ] o.a.s.s.SolrDispatchFilter solr.xml found in ZooKeeper. Loading...
   [junit4]   2> 130300 INFO  (zkConnectionManagerCallback-582-thread-1) [     ] o.a.s.c.c.ConnectionManager zkClient has connected
   [junit4]   2> 130300 INFO  (jetty-launcher-576-thread-2) [     ] o.a.s.c.c.ConnectionManager Client is connected to ZooKeeper
   [junit4]   2> 130301 INFO  (zkConnectionManagerCallback-580-thread-1) [     ] o.a.s.c.c.ConnectionManager zkClient has connected
   [junit4]   2> 130301 INFO  (jetty-launcher-576-thread-4) [     ] o.a.s.c.c.ConnectionManager Client is connected to ZooKeeper
   [junit4]   2> 130303 INFO  (jetty-launcher-576-thread-2) [     ] o.a.s.s.SolrDispatchFilter solr.xml found in ZooKeeper. Loading...
   [junit4]   2> 130305 INFO  (jetty-launcher-576-thread-4) [     ] o.a.s.s.SolrDispatchFilter solr.xml found in ZooKeeper. Loading...
   [junit4]   2> 130320 INFO  (zkConnectionManagerCallback-584-thread-1) [     ] o.a.s.c.c.ConnectionManager zkClient has connected
   [junit4]   2> 130321 INFO  (jetty-launcher-576-thread-3) [     ] o.a.s.c.c.ConnectionManager Client is connected to ZooKeeper
   [junit4]   2> 130326 INFO  (jetty-launcher-576-thread-3) [     ] o.a.s.s.SolrDispatchFilter solr.xml found in ZooKeeper. Loading...
   [junit4]   2> 130535 INFO  (jetty-launcher-576-thread-1) [     ] o.a.s.h.c.HttpShardHandlerFactory Host whitelist initialized: WhitelistHostChecker [whitelistHosts=null, whitelistHostCheckingEnabled=true]
   [junit4]   2> 130537 WARN  (jetty-launcher-576-thread-1) [     ] o.e.j.u.s.S.config Trusting all certificates configured for Client@154273d6[provider=null,keyStore=null,trustStore=null]
   [junit4]   2> 130538 WARN  (jetty-launcher-576-thread-1) [     ] o.e.j.u.s.S.config No Client EndPointIdentificationAlgorithm configured for Client@154273d6[provider=null,keyStore=null,trustStore=null]
   [junit4]   2> 130634 WARN  (jetty-launcher-576-thread-1) [     ] o.e.j.u.s.S.config Trusting all certificates configured for Client@328701f3[provider=null,keyStore=null,trustStore=null]
   [junit4]   2> 130634 WARN  (jetty-launcher-576-thread-1) [     ] o.e.j.u.s.S.config No Client EndPointIdentificationAlgorithm configured for Client@328701f3[provider=null,keyStore=null,trustStore=null]
   [junit4]   2> 130635 INFO  (jetty-launcher-576-thread-1) [     ] o.a.s.c.ZkContainer Zookeeper client=127.0.0.1:63977/solr
   [junit4]   2> 130639 INFO  (jetty-launcher-576-thread-1) [     ] o.a.s.c.c.ConnectionManager Waiting for client to connect to ZooKeeper
   [junit4]   2> 130650 INFO  (zkConnectionManagerCallback-593-thread-1) [     ] o.a.s.c.c.ConnectionManager zkClient has connected
   [junit4]   2> 130650 INFO  (jetty-launcher-576-thread-1) [     ] o.a.s.c.c.ConnectionManager Client is connected to ZooKeeper
   [junit4]   2> 130741 INFO  (jetty-launcher-576-thread-2) [     ] o.a.s.h.c.HttpShardHandlerFactory Host whitelist initialized: WhitelistHostChecker [whitelistHosts=null, whitelistHostCheckingEnabled=true]
   [junit4]   2> 130752 WARN  (jetty-launcher-576-thread-2) [     ] o.e.j.u.s.S.config Trusting all certificates configured for Client@1e00e180[provider=null,keyStore=null,trustStore=null]
   [junit4]   2> 130753 WARN  (jetty-launcher-576-thread-2) [     ] o.e.j.u.s.S.config No Client EndPointIdentificationAlgorithm configured for Client@1e00e180[provider=null,keyStore=null,trustStore=null]
   [junit4]   2> 130762 INFO  (jetty-launcher-576-thread-1) [n:127.0.0.1:63983_solr     ] o.a.s.c.c.ConnectionManager Waiting for client to connect to ZooKeeper
   [junit4]   2> 130765 INFO  (zkConnectionManagerCallback-597-thread-1) [     ] o.a.s.c.c.ConnectionManager zkClient has connected
   [junit4]   2> 130765 INFO  (jetty-launcher-576-thread-1) [n:127.0.0.1:63983_solr     ] o.a.s.c.c.ConnectionManager Client is connected to ZooKeeper
   [junit4]   2> 130779 WARN  (jetty-launcher-576-thread-2) [     ] o.e.j.u.s.S.config Trusting all certificates configured for Client@6b27b0d2[provider=null,keyStore=null,trustStore=null]
   [junit4]   2> 130779 WARN  (jetty-launcher-576-thread-2) [     ] o.e.j.u.s.S.config No Client EndPointIdentificationAlgorithm configured for Client@6b27b0d2[provider=null,keyStore=null,trustStore=null]
   [junit4]   2> 130785 INFO  (jetty-launcher-576-thread-2) [     ] o.a.s.c.ZkContainer Zookeeper client=127.0.0.1:63977/solr
   [junit4]   2> 130795 INFO  (zkConnectionManagerCallback-604-thread-1) [     ] o.a.s.c.c.ConnectionManager zkClient has connected
   [junit4]   2> 130801 INFO  (jetty-launcher-576-thread-2) [     ] o.a.s.c.c.ConnectionManager Waiting for client to connect to ZooKeeper
   [junit4]   2> 130801 INFO  (jetty-launcher-576-thread-2) [     ] o.a.s.c.c.ConnectionManager Client is connected to ZooKeeper
   [junit4]   2> 130807 WARN  (jetty-launcher-576-thread-1) [n:127.0.0.1:63983_solr     ] o.a.s.c.ZkController The _default configset could not be uploaded. Please provide 'solr.default.confdir' parameter that points to a configset intended to be the default. Current 'solr.default.confdir' value: null
   [junit4]   2> 130932 INFO  (jetty-launcher-576-thread-2) [n:127.0.0.1:63984_solr     ] o.a.s.c.c.ConnectionManager Waiting for client to connect to ZooKeeper
   [junit4]   2> 130935 INFO  (zkConnectionManagerCallback-606-thread-1) [     ] o.a.s.c.c.ConnectionManager zkClient has connected
   [junit4]   2> 130935 INFO  (jetty-launcher-576-thread-2) [n:127.0.0.1:63984_solr     ] o.a.s.c.c.ConnectionManager Client is connected to ZooKeeper
   [junit4]   2> 130940 INFO  (jetty-launcher-576-thread-1) [n:127.0.0.1:63983_solr     ] o.a.s.c.OverseerElectionContext I am going to be the leader 127.0.0.1:63983_solr
   [junit4]   2> 130942 INFO  (jetty-launcher-576-thread-1) [n:127.0.0.1:63983_solr     ] o.a.s.c.Overseer Overseer (id=72253363398639624-127.0.0.1:63983_solr-n_0000000000) starting
   [junit4]   2> 130963 WARN  (jetty-launcher-576-thread-2) [n:127.0.0.1:63984_solr     ] o.a.s.c.ZkController The _default configset could not be uploaded. Please provide 'solr.default.confdir' parameter that points to a configset intended to be the default. Current 'solr.default.confdir' value: null
   [junit4]   2> 130971 INFO  (jetty-launcher-576-thread-1) [n:127.0.0.1:63983_solr     ] o.a.s.c.c.ConnectionManager Waiting for client to connect to ZooKeeper
   [junit4]   2> 130980 INFO  (zkConnectionManagerCallback-613-thread-1) [     ] o.a.s.c.c.ConnectionManager zkClient has connected
   [junit4]   2> 130981 INFO  (jetty-launcher-576-thread-1) [n:127.0.0.1:63983_solr     ] o.a.s.c.c.ConnectionManager Client is connected to ZooKeeper
   [junit4]   2> 130991 INFO  (jetty-launcher-576-thread-1) [n:127.0.0.1:63983_solr     ] o.a.s.c.s.i.ZkClientClusterStateProvider Cluster at 127.0.0.1:63977/solr ready
   [junit4]   2> 130995 INFO  (OverseerStateUpdate-72253363398639624-127.0.0.1:63983_solr-n_0000000000) [n:127.0.0.1:63983_solr     ] o.a.s.c.Overseer Starting to work on the main queue : 127.0.0.1:63983_solr
   [junit4]   2> 131014 INFO  (jetty-launcher-576-thread-1) [n:127.0.0.1:63983_solr     ] o.a.s.c.ZkController Register node as live in ZooKeeper:/live_nodes/127.0.0.1:63983_solr
   [junit4]   2> 131029 INFO  (zkCallback-605-thread-1) [     ] o.a.s.c.c.ZkStateReader Updated live nodes from ZooKeeper... (0) -> (1)
   [junit4]   2> 131029 INFO  (zkCallback-612-thread-1) [     ] o.a.s.c.c.ZkStateReader Updated live nodes from ZooKeeper... (0) -> (1)
   [junit4]   2> 131030 INFO  (zkCallback-596-thread-1) [     ] o.a.s.c.c.ZkStateReader Updated live nodes from ZooKeeper... (0) -> (1)
   [junit4]   2> 131033 INFO  (jetty-launcher-576-thread-1) [n:127.0.0.1:63983_solr     ] o.a.s.c.PackageManager clusterprops.json changed , version -1
   [junit4]   2> 131099 INFO  (jetty-launcher-576-thread-2) [n:127.0.0.1:63984_solr     ] o.a.s.c.ZkController Publish node=127.0.0.1:63984_solr as DOWN
   [junit4]   2> 131101 INFO  (jetty-launcher-576-thread-2) [n:127.0.0.1:63984_solr     ] o.a.s.c.TransientSolrCoreCacheDefault Allocating transient cache for 2147483647 transient cores
   [junit4]   2> 131101 INFO  (jetty-launcher-576-thread-2) [n:127.0.0.1:63984_solr     ] o.a.s.c.ZkController Register node as live in ZooKeeper:/live_nodes/127.0.0.1:63984_solr
   [junit4]   2> 131104 INFO  (zkCallback-605-thread-1) [     ] o.a.s.c.c.ZkStateReader Updated live nodes from ZooKeeper... (1) -> (2)
   [junit4]   2> 131105 INFO  (zkCallback-612-thread-1) [     ] o.a.s.c.c.ZkStateReader Updated live nodes from ZooKeeper... (1) -> (2)
   [junit4]   2> 131108 INFO  (zkCallback-596-thread-1) [     ] o.a.s.c.c.ZkStateReader Updated live nodes from ZooKeeper... (1) -> (2)
   [junit4]   2> 131110 INFO  (jetty-launcher-576-thread-2) [n:127.0.0.1:63984_solr     ] o.a.s.c.c.ConnectionManager Waiting for client to connect to ZooKeeper
   [junit4]   2> 131112 INFO  (zkConnectionManagerCallback-618-thread-1) [     ] o.a.s.c.c.ConnectionManager zkClient has connected
   [junit4]   2> 131122 INFO  (jetty-launcher-576-thread-2) [n:127.0.0.1:63984_solr     ] o.a.s.c.c.ConnectionManager Client is connected to ZooKeeper
   [junit4]   2> 131128 INFO  (jetty-launcher-576-thread-2) [n:127.0.0.1:63984_solr     ] o.a.s.c.c.ZkStateReader Updated live nodes from ZooKeeper... (0) -> (2)
   [junit4]   2> 131138 INFO  (jetty-launcher-576-thread-2) [n:127.0.0.1:63984_solr     ] o.a.s.c.s.i.ZkClientClusterStateProvider Cluster at 127.0.0.1:63977/solr ready
   [junit4]   2> 131139 INFO  (jetty-launcher-576-thread-2) [n:127.0.0.1:63984_solr     ] o.a.s.c.PackageManager clusterprops.json changed , version -1
   [junit4]   2> 131245 INFO  (jetty-launcher-576-thread-4) [     ] o.a.s.h.c.HttpShardHandlerFactory Host whitelist initialized: WhitelistHostChecker [whitelistHosts=null, whitelistHostCheckingEnabled=true]
   [junit4]   2> 131288 INFO  (jetty-launcher-576-thread-2) [n:127.0.0.1:63984_solr     ] o.a.s.h.a.MetricsHistoryHandler No .system collection, keeping metrics history in memory.
   [junit4]   2> 131289 INFO  (jetty-launcher-576-thread-1) [n:127.0.0.1:63983_solr     ] o.a.s.h.a.MetricsHistoryHandler No .system collection, keeping metrics history in memory.
   [junit4]   2> 131290 WARN  (jetty-launcher-576-thread-4) [     ] o.e.j.u.s.S.config Trusting all certificates configured for Client@cfbde34[provider=null,keyStore=null,trustStore=null]
   [junit4]   2> 131290 WARN  (jetty-launcher-576-thread-4) [     ] o.e.j.u.s.S.config No Client EndPointIdentificationAlgorithm configured for Client@cfbde34[provider=null,keyStore=null,trustStore=null]
   [junit4]   2> 131328 WARN  (jetty-launcher-576-thread-4) [     ] o.e.j.u.s.S.config Trusting all certificates configured for Client@2fc2eaf7[provider=null,keyStore=null,trustStore=null]
   [junit4]   2> 131328 WARN  (jetty-launcher-576-thread-4) [     ] o.e.j.u.s.S.config No Client EndPointIdentificationAlgorithm configured for Client@2fc2eaf7[provider=null,keyStore=null,trustStore=null]
   [junit4]   2> 131331 INFO  (jetty-launcher-576-thread-4) [     ] o.a.s.c.ZkContainer Zookeeper client=127.0.0.1:63977/solr
   [junit4]   2> 131335 INFO  (jetty-launcher-576-thread-4) [     ] o.a.s.c.c.ConnectionManager Waiting for client to connect to ZooKeeper
   [junit4]   2> 131340 INFO  (zkConnectionManagerCallback-626-thread-1) [     ] o.a.s.c.c.ConnectionManager zkClient has connected
   [junit4]   2> 131341 INFO  (jetty-launcher-576-thread-4) [     ] o.a.s.c.c.ConnectionManager Client is connected to ZooKeeper
   [junit4]   2> 131431 INFO  (jetty-launcher-576-thread-1) [n:127.0.0.1:63983_solr     ] o.a.s.m.r.SolrJmxReporter JMX monitoring for 'solr_63983.solr.node' (registry 'solr.node') enabled at server: com.sun.jmx.mbeanserver.JmxMBeanServer@620aa2b5
   [junit4]   2> 131453 INFO  (jetty-launcher-576-thread-4) [n:127.0.0.1:63982_solr     ] o.a.s.c.c.ConnectionManager Waiting for client to connect to ZooKeeper
   [junit4]   2> 131461 INFO  (zkConnectionManagerCallback-628-thread-1) [     ] o.a.s.c.c.ConnectionManager zkClient has connected
   [junit4]   2> 131461 INFO  (jetty-launcher-576-thread-4) [n:127.0.0.1:63982_solr     ] o.a.s.c.c.ConnectionManager Client is connected to ZooKeeper
   [junit4]   2> 131485 WARN  (jetty-launcher-576-thread-4) [n:127.0.0.1:63982_solr     ] o.a.s.c.ZkController The _default configset could not be uploaded. Please provide 'solr.default.confdir' parameter that points to a configset intended to be the default. Current 'solr.default.confdir' value: null
   [junit4]   2> 131488 INFO  (jetty-launcher-576-thread-4) [n:127.0.0.1:63982_solr     ] o.a.s.c.c.ZkStateReader Updated live nodes from ZooKeeper... (0) -> (2)
   [junit4]   2> 131489 INFO  (jetty-launcher-576-thread-1) [n:127.0.0.1:63983_solr     ] o.a.s.m.r.SolrJmxReporter JMX monitoring for 'solr_63983.solr.jvm' (registry 'solr.jvm') enabled at server: com.sun.jmx.mbeanserver.JmxMBeanServer@620aa2b5
   [junit4]   2> 131489 INFO  (jetty-launcher-576-thread-1) [n:127.0.0.1:63983_solr     ] o.a.s.m.r.SolrJmxReporter JMX monitoring for 'solr_63983.solr.jetty' (registry 'solr.jetty') enabled at server: com.sun.jmx.mbeanserver.JmxMBeanServer@620aa2b5
   [junit4]   2> 131496 INFO  (jetty-launcher-576-thread-2) [n:127.0.0.1:63984_solr     ] o.a.s.m.r.SolrJmxReporter JMX monitoring for 'solr_63984.solr.node' (registry 'solr.node') enabled at server: com.sun.jmx.mbeanserver.JmxMBeanServer@620aa2b5
   [junit4]   2> 131501 INFO  (jetty-launcher-576-thread-1) [n:127.0.0.1:63983_solr     ] o.a.s.c.CorePropertiesLocator Found 0 core definitions underneath /Users/jenkins/workspace/Lucene-Solr-8.x-MacOSX/solr/build/solr-solrj/test/J0/temp/solr.client.solrj.io.stream.MathExpressionTest_E02E5EA70C3FA8F2-001/tempDir-001/node1/.
   [junit4]   2> 131508 INFO  (jetty-launcher-576-thread-4) [n:127.0.0.1:63982_solr     ] o.a.s.c.ZkController Publish node=127.0.0.1:63982_solr as DOWN
   [junit4]   2> 131510 INFO  (jetty-launcher-576-thread-4) [n:127.0.0.1:63982_solr     ] o.a.s.c.TransientSolrCoreCacheDefault Allocating transient cache for 2147483647 transient cores
   [junit4]   2> 131510 INFO  (jetty-launcher-576-thread-4) [n:127.0.0.1:63982_solr     ] o.a.s.c.ZkController Register node as live in ZooKeeper:/live_nodes/127.0.0.1:63982_solr
   [junit4]   2> 131515 INFO  (zkCallback-617-thread-1) [     ] o.a.s.c.c.ZkStateReader Updated live nodes from ZooKeeper... (2) -> (3)
   [junit4]   2> 131515 INFO  (zkCallback-605-thread-1) [     ] o.a.s.c.c.ZkStateReader Updated live nodes from ZooKeeper... (2) -> (3)
   [junit4]   2> 131515 INFO  (zkCallback-596-thread-1) [     ] o.a.s.c.c.ZkStateReader Updated live nodes from ZooKeeper... (2) -> (3)
   [junit4]   2> 131515 INFO  (zkCallback-612-thread-1) [     ] o.a.s.c.c.ZkStateReader Updated live nodes from ZooKeeper... (2) -> (3)
   [junit4]   2> 131515 INFO  (zkCallback-627-thread-1) [     ] o.a.s.c.c.ZkStateReader Updated live nodes from ZooKeeper... (2) -> (3)
   [junit4]   2> 131518 INFO  (jetty-launcher-576-thread-4) [n:127.0.0.1:63982_solr     ] o.a.s.c.c.ConnectionManager Waiting for client to connect to ZooKeeper
   [junit4]   2> 131528 INFO  (zkConnectionManagerCallback-635-thread-1) [     ] o.a.s.c.c.ConnectionManager zkClient has connected
   [junit4]   2> 131529 INFO  (jetty-launcher-576-thread-4) [n:127.0.0.1:63982_solr     ] o.a.s.c.c.ConnectionManager Client is connected to ZooKeeper
   [junit4]   2> 131532 INFO  (jetty-launcher-576-thread-4) [n:127.0.0.1:63982_solr     ] o.a.s.c.c.ZkStateReader Updated live nodes from ZooKeeper... (0) -> (3)
   [junit4]   2> 131535 INFO  (jetty-launcher-576-thread-4) [n:127.0.0.1:63982_solr     ] o.a.s.c.s.i.ZkClientClusterStateProvider Cluster at 127.0.0.1:63977/solr ready
   [junit4]   2> 131535 INFO  (jetty-launcher-576-thread-4) [n:127.0.0.1:63982_solr     ] o.a.s.c.PackageManager clusterprops.json changed , version -1
   [junit4]   2> 131570 INFO  (jetty-launcher-576-thread-2) [n:127.0.0.1:63984_solr     ] o.a.s.m.r.SolrJmxReporter JMX monitoring for 'solr_63984.solr.jvm' (registry 'solr.jvm') enabled at server: com.sun.jmx.mbeanserver.JmxMBeanServer@620aa2b5
   [junit4]   2> 131571 INFO  (jetty-launcher-576-thread-2) [n:127.0.0.1:63984_solr     ] o.a.s.m.r.SolrJmxReporter JMX monitoring for 'solr_63984.solr.jetty' (registry 'solr.jetty') enabled at server: com.sun.jmx.mbeanserver.JmxMBeanServer@620aa2b5
   [junit4]   2> 131572 INFO  (jetty-launcher-576-thread-2) [n:127.0.0.1:63984_solr     ] o.a.s.c.CorePropertiesLocator Found 0 core definitions underneath /Users/jenkins/workspace/Lucene-Solr-8.x-MacOSX/solr/build/solr-solrj/test/J0/temp/solr.client.solrj.io.stream.MathExpressionTest_E02E5EA70C3FA8F2-001/tempDir-001/node2/.
   [junit4]   2> 131607 INFO  (jetty-launcher-576-thread-4) [n:127.0.0.1:63982_solr     ] o.a.s.h.a.MetricsHistoryHandler No .system collection, keeping metrics history in memory.
   [junit4]   2> 131736 INFO  (jetty-launcher-576-thread-4) [n:127.0.0.1:63982_solr     ] o.a.s.m.r.SolrJmxReporter JMX monitoring for 'solr_63982.solr.node' (registry 'solr.node') enabled at server: com.sun.jmx.mbeanserver.JmxMBeanServer@620aa2b5
   [junit4]   2> 131748 INFO  (jetty-launcher-576-thread-4) [n:127.0.0.1:63982_solr     ] o.a.s.m.r.SolrJmxReporter JMX monitoring for 'solr_63982.solr.jvm' (registry 'solr.jvm') enabled at server: com.sun.jmx.mbeanserver.JmxMBeanServer@620aa2b5
   [junit4]   2> 131749 INFO  (jetty-launcher-576-thread-4) [n:127.0.0.1:63982_solr     ] o.a.s.m.r.SolrJmxReporter JMX monitoring for 'solr_63982.solr.jetty' (registry 'solr.jetty') enabled at server: com.sun.jmx.mbeanserver.JmxMBeanServer@620aa2b5
   [junit4]   2> 131750 INFO  (jetty-launcher-576-thread-4) [n:127.0.0.1:63982_solr     ] o.a.s.c.CorePropertiesLocator Found 0 core definitions underneath /Users/jenkins/workspace/Lucene-Solr-8.x-MacOSX/solr/build/solr-solrj/test/J0/temp/solr.client.solrj.io.stream.MathExpressionTest_E02E5EA70C3FA8F2-001/tempDir-001/node4/.
   [junit4]   2> 131858 INFO  (jetty-launcher-576-thread-3) [     ] o.a.s.h.c.HttpShardHandlerFactory Host whitelist initialized: WhitelistHostChecker [whitelistHosts=null, whitelistHostCheckingEnabled=true]
   [junit4]   2> 131861 WARN  (jetty-launcher-576-thread-3) [     ] o.e.j.u.s.S.config Trusting all certificates configured for Client@315fded8[provider=null,keyStore=null,trustStore=null]
   [junit4]   2> 131861 WARN  (jetty-launcher-576-thread-3) [     ] o.e.j.u.s.S.config No Client EndPointIdentificationAlgorithm configured for Client@315fded8[provider=null,keyStore=null,trustStore=null]
   [junit4]   2> 131871 WARN  (jetty-launcher-576-thread-3) [     ] o.e.j.u.s.S.config Trusting all certificates configured for Client@3f11ed01[provider=null,keyStore=null,trustStore=null]
   [junit4]   2> 131871 WARN  (jetty-launcher-576-thread-3) [     ] o.e.j.u.s.S.config No Client EndPointIdentificationAlgorithm configured for Client@3f11ed01[provider=null,keyStore=null,trustStore=null]
   [junit4]   2> 131872 INFO  (jetty-launcher-576-thread-3) [     ] o.a.s.c.ZkContainer Zookeeper client=127.0.0.1:63977/solr
   [junit4]   2> 131874 INFO  (jetty-launcher-576-thread-3) [     ] o.a.s.c.c.ConnectionManager Waiting for client to connect to ZooKeeper
   [junit4]   2> 131883 INFO  (zkConnectionManagerCallback-642-thread-1) [     ] o.a.s.c.c.ConnectionManager zkClient has connected
   [junit4]   2> 131883 INFO  (jetty-launcher-576-thread-3) [     ] o.a.s.c.c.ConnectionManager Client is connected to ZooKeeper
   [junit4]   2> 131991 INFO  (jetty-launcher-576-thread-3) [n:127.0.0.1:63985_solr     ] o.a.s.c.c.ConnectionManager Waiting for client to connect to ZooKeeper
   [junit4]   2> 132006 INFO  (zkConnectionManagerCallback-644-thread-1) [     ] o.a.s.c.c.ConnectionManager zkClient has connected
   [junit4]   2> 132007 INFO  (jetty-launcher-576-thread-3) [n:127.0.0.1:63985_solr     ] o.a.s.c.c.ConnectionManager Client is connected to ZooKeeper
   [junit4]   2> 132026 WARN  (jetty-launcher-576-thread-3) [n:127.0.0.1:63985_solr     ] o.a.s.c.ZkController The _default configset could not be uploaded. Please provide 'solr.default.confdir' parameter that points to a configset intended to be the default. Current 'solr.default.confdir' value: null
   [junit4]   2> 132031 INFO  (jetty-launcher-576-thread-3) [n:127.0.0.1:63985_solr     ] o.a.s.c.c.ZkStateReader Updated live nodes from ZooKeeper... (0) -> (3)
   [junit4]   2> 132041 INFO  (jetty-launcher-576-thread-3) [n:127.0.0.1:63985_solr     ] o.a.s.c.ZkController Publish node=127.0.0.1:63985_solr as DOWN
   [junit4]   2> 132043 INFO  (jetty-launcher-576-thread-3) [n:127.0.0.1:63985_solr     ] o.a.s.c.TransientSolrCoreCacheDefault Allocating transient cache for 2147483647 transient cores
   [junit4]   2> 132043 INFO  (jetty-launcher-576-thread-3) [n:127.0.0.1:63985_solr     ] o.a.s.c.ZkController Register node as live in ZooKeeper:/live_nodes/127.0.0.1:63985_solr
   [junit4]   2> 132069 INFO  (zkCallback-612-thread-1) [     ] o.a.s.c.c.ZkStateReader Updated live nodes from ZooKeeper... (3) -> (4)
   [junit4]   2> 132069 INFO  (zkCallback-627-thread-1) [     ] o.a.s.c.c.ZkStateReader Updated live nodes from ZooKeeper... (3) -> (4)
   [junit4]   2> 132069 INFO  (zkCallback-596-thread-1) [     ] o.a.s.c.c.ZkStateReader Updated live nodes from ZooKeeper... (3) -> (4)
   [junit4]   2> 132070 INFO  (zkCallback-605-thread-1) [     ] o.a.s.c.c.ZkStateReader Updated live nodes from ZooKeeper... (3) -> (4)
   [junit4]   2> 132070 INFO  (zkCallback-617-thread-1) [     ] o.a.s.c.c.ZkStateReader Updated live nodes from ZooKeeper... (3) -> (4)
   [junit4]   2> 132070 INFO  (zkCallback-643-thread-1) [     ] o.a.s.c.c.ZkStateReader Updated live nodes from ZooKeeper... (3) -> (4)
   [junit4]   2> 132070 INFO  (zkCallback-634-thread-1) [     ] o.a.s.c.c.ZkStateReader Updated live nodes from ZooKeeper... (3) -> (4)
   [junit4]   2> 132073 INFO  (jetty-launcher-576-thread-3) [n:127.0.0.1:63985_solr     ] o.a.s.c.c.ConnectionManager Waiting for client to connect to ZooKeeper
   [junit4]   2> 132079 INFO  (zkConnectionManagerCallback-651-thread-1) [     ] o.a.s.c.c.ConnectionManager zkClient has connected
   [junit4]   2> 132079 INFO  (jetty-launcher-576-thread-3) [n:127.0.0.1:63985_solr     ] o.a.s.c.c.ConnectionManager Client is connected to ZooKeeper
   [junit4]   2> 132086 INFO  (jetty-launcher-576-thread-3) [n:127.0.0.1:63985_solr     ] o.a.s.c.c.ZkStateReader Updated live nodes from ZooKeeper... (0) -> (4)
   [junit4]   2> 132090 INFO  (jetty-launcher-576-thread-3) [n:127.0.0.1:63985_solr     ] o.a.s.c.s.i.ZkClientClusterStateProvider Cluster at 127.0.0.1:63977/solr ready
   [junit4]   2> 132090 INFO  (jetty-launcher-576-thread-3) [n:127.0.0.1:63985_solr     ] o.a.s.c.PackageManager clusterprops.json changed , version -1
   [junit4]   2> 132215 INFO  (jetty-launcher-576-thread-3) [n:127.0.0.1:63985_solr     ] o.a.s.h.a.MetricsHistoryHandler No .system collection, keeping metrics history in memory.
   [junit4]   2> 132262 INFO  (jetty-launcher-576-thread-3) [n:127.0.0.1:63985_solr     ] o.a.s.m.r.SolrJmxReporter JMX monitoring for 'solr_63985.solr.node' (registry 'solr.node') enabled at server: com.sun.jmx.mbeanserver.JmxMBeanServer@620aa2b5
   [junit4]   2> 132275 INFO  (jetty-launcher-576-thread-3) [n:127.0.0.1:63985_solr     ] o.a.s.m.r.SolrJmxReporter JMX monitoring for 'solr_63985.solr.jvm' (registry 'solr.jvm') enabled at server: com.sun.jmx.mbeanserver.JmxMBeanServer@620aa2b5
   [junit4]   2> 132275 INFO  (jetty-launcher-576-thread-3) [n:127.0.0.1:63985_solr     ] o.a.s.m.r.SolrJmxReporter JMX monitoring for 'solr_63985.solr.jetty' (registry 'solr.jetty') enabled at server: com.sun.jmx.mbeanserver.JmxMBeanServer@620aa2b5
   [junit4]   2> 132277 INFO  (jetty-launcher-576-thread-3) [n:127.0.0.1:63985_solr     ] o.a.s.c.CorePropertiesLocator Found 0 core definitions underneath /Users/jenkins/workspace/Lucene-Solr-8.x-MacOSX/solr/build/solr-solrj/test/J0/temp/solr.client.solrj.io.stream.MathExpressionTest_E02E5EA70C3FA8F2-001/tempDir-001/node3/.
   [junit4]   2> 132367 INFO  (SUITE-MathExpressionTest-seed#[E02E5EA70C3FA8F2]-worker) [     ] o.a.s.c.MiniSolrCloudCluster waitForAllNodes: numServers=4
   [junit4]   2> 132368 INFO  (SUITE-MathExpressionTest-seed#[E02E5EA70C3FA8F2]-worker) [     ] o.a.s.c.c.ConnectionManager Waiting for client to connect to ZooKeeper
   [junit4]   2> 132373 INFO  (zkConnectionManagerCallback-657-thread-1) [     ] o.a.s.c.c.ConnectionManager zkClient has connected
   [junit4]   2> 132373 INFO  (SUITE-MathExpressionTest-seed#[E02E5EA70C3FA8F2]-worker) [     ] o.a.s.c.c.ConnectionManager Client is connected to ZooKeeper
   [junit4]   2> 132376 INFO  (SUITE-MathExpressionTest-seed#[E02E5EA70C3FA8F2]-worker) [     ] o.a.s.c.c.ZkStateReader Updated live nodes from ZooKeeper... (0) -> (4)
   [junit4]   2> 132379 INFO  (SUITE-MathExpressionTest-seed#[E02E5EA70C3FA8F2]-worker) [     ] o.a.s.c.s.i.ZkClientClusterStateProvider Cluster at 127.0.0.1:63977/solr ready
   [junit4]   2> 132396 INFO  (qtp1560284461-1111) [n:127.0.0.1:63983_solr     ] o.a.s.h.a.CollectionsHandler Invoked Collection Action :create with params collection.configName=conf&name=collection1&nrtReplicas=1&action=CREATE&numShards=2&wt=javabin&version=2 and sendToOCPQueue=true
   [junit4]   2> 132406 INFO  (OverseerThreadFactory-191-thread-1-processing-n:127.0.0.1:63983_solr) [n:127.0.0.1:63983_solr     ] o.a.s.c.a.c.CreateCollectionCmd Create collection collection1
   [junit4]   2> 132536 INFO  (OverseerStateUpdate-72253363398639624-127.0.0.1:63983_solr-n_0000000000) [n:127.0.0.1:63983_solr     ] o.a.s.c.o.SliceMutator createReplica() {
   [junit4]   2>   "operation":"ADDREPLICA",
   [junit4]   2>   "collection":"collection1",
   [junit4]   2>   "shard":"shard1",
   [junit4]   2>   "core":"collection1_shard1_replica_n1",
   [junit4]   2>   "state":"down",
   [junit4]   2>   "base_url":"http://127.0.0.1:63983/solr",
   [junit4]   2>   "type":"NRT",
   [junit4]   2>   "waitForFinalState":"false"}
   [junit4]   2> 132541 INFO  (OverseerStateUpdate-72253363398639624-127.0.0.1:63983_solr-n_0000000000) [n:127.0.0.1:63983_solr     ] o.a.s.c.o.SliceMutator createReplica() {
   [junit4]   2>   "operation":"ADDREPLICA",
   [junit4]   2>   "collection":"collection1",
   [junit4]   2>   "shard":"shard2",
   [junit4]   2>   "core":"collection1_shard2_replica_n2",
   [junit4]   2>   "state":"down",
   [junit4]   2>   "base_url":"http://127.0.0.1:63985/solr",
   [junit4]   2>   "type":"NRT",
   [junit4]   2>   "waitForFinalState":"false"}
   [junit4]   2> 132764 INFO  (qtp1560284461-1118) [n:127.0.0.1:63983_solr    x:collection1_shard1_replica_n1 ] o.a.s.h.a.CoreAdminOperation core create command qt=/admin/cores&coreNodeName=core_node3&collection.configName=conf&newCollection=true&name=collection1_shard1_replica_n1&action=CREATE&numShards=2&collection=collection1&shard=shard1&wt=javabin&version=2&replicaType=NRT
   [junit4]   2> 132766 INFO  (qtp1560284461-1118) [n:127.0.0.1:63983_solr    x:collection1_shard1_replica_n1 ] o.a.s.c.TransientSolrCoreCacheDefault Allocating transient cache for 2147483647 transient cores
   [junit4]   2> 132776 INFO  (qtp1631206860-1127) [n:127.0.0.1:63985_solr    x:collection1_shard2_replica_n2 ] o.a.s.h.a.CoreAdminOperation core create command qt=/admin/cores&coreNodeName=core_node4&collection.configName=conf&newCollection=true&name=collection1_shard2_replica_n2&action=CREATE&numShards=2&collection=collection1&shard=shard2&wt=javabin&version=2&replicaType=NRT
   [junit4]   2> 133836 INFO  (qtp1631206860-1127) [n:127.0.0.1:63985_solr c:collection1 s:shard2 r:core_node4 x:collection1_shard2_replica_n2 ] o.a.s.c.SolrConfig Using Lucene MatchVersion: 8.3.0
   [junit4]   2> 133844 INFO  (qtp1560284461-1118) [n:127.0.0.1:63983_solr c:collection1 s:shard1 r:core_node3 x:collection1_shard1_replica_n1 ] o.a.s.c.SolrConfig Using Lucene MatchVersion: 8.3.0
   [junit4]   2> 133855 INFO  (qtp1631206860-1127) [n:127.0.0.1:63985_solr c:collection1 s:shard2 r:core_node4 x:collection1_shard2_replica_n2 ] o.a.s.s.IndexSchema [collection1_shard2_replica_n2] Schema name=test
   [junit4]   2> 133868 INFO  (qtp1560284461-1118) [n:127.0.0.1:63983_solr c:collection1 s:shard1 r:core_node3 x:collection1_shard1_replica_n1 ] o.a.s.s.IndexSchema [collection1_shard1_replica_n1] Schema name=test
   [junit4]   2> 133998 WARN  (qtp1631206860-1127) [n:127.0.0.1:63985_solr c:collection1 s:shard2 r:core_node4 x:collection1_shard2_replica_n2 ] o.a.s.s.IndexSchema Field lowerfilt1and2 is not multivalued and destination for multiple copyFields (2)
   [junit4]   2> 134002 WARN  (qtp1631206860-1127) [n:127.0.0.1:63985_solr c:collection1 s:shard2 r:core_node4 x:collection1_shard2_replica_n2 ] o.a.s.s.IndexSchema Field text is not multivalued and destination for multiple copyFields (3)
   [junit4]   2> 134003 INFO  (qtp1631206860-1127) [n:127.0.0.1:63985_solr c:collection1 s:shard2 r:core_node4 x:collection1_shard2_replica_n2 ] o.a.s.s.IndexSchema Loaded schema test/1.6 with uniqueid field id
   [junit4]   2> 134003 INFO  (qtp1631206860-1127) [n:127.0.0.1:63985_solr c:collection1 s:shard2 r:core_node4 x:collection1_shard2_replica_n2 ] o.a.s.c.CoreContainer Creating SolrCore 'collection1_shard2_replica_n2' using configuration from collection collection1, trusted=true
   [junit4]   2> 134004 INFO  (qtp1631206860-1127) [n:127.0.0.1:63985_solr c:collection1 s:shard2 r:core_node4 x:collection1_shard2_replica_n2 ] o.a.s.m.r.SolrJmxReporter JMX monitoring for 'solr_63985.solr.core.collection1.shard2.replica_n2' (registry 'solr.core.collection1.shard2.replica_n2') enabled at server: com.sun.jmx.mbeanserver.JmxMBeanServer@620aa2b5
   [junit4]   2> 134004 INFO  (qtp1631206860-1127) [n:127.0.0.1:63985_solr c:collection1 s:shard2 r:core_node4 x:collection1_shard2_replica_n2 ] o.a.s.c.SolrCore [[collection1_shard2_replica_n2] ] Opening new SolrCore at [/Users/jenkins/workspace/Lucene-Solr-8.x-MacOSX/solr/build/solr-solrj/test/J0/temp/solr.client.solrj.io.stream.MathExpressionTest_E02E5EA70C3FA8F2-001/tempDir-001/node3/collection1_shard2_replica_n2], dataDir=[/Users/jenkins/workspace/Lucene-Solr-8.x-MacOSX/solr/build/solr-solrj/test/J0/temp/solr.client.solrj.io.stream.MathExpressionTest_E02E5EA70C3FA8F2-001/tempDir-001/node3/./collection1_shard2_replica_n2/data/]
   [junit4]   2> 134009 WARN  (qtp1560284461-1118) [n:127.0.0.1:63983_solr c:collection1 s:shard1 r:core_node3 x:collection1_shard1_replica_n1 ] o.a.s.s.IndexSchema Field lowerfilt1and2 is not multivalued and destination for multiple copyFields (2)
   [junit4]   2> 134009 WARN  (qtp1560284461-1118) [n:127.0.0.1:63983_solr c:collection1 s:shard1 r:core_node3 x:collection1_shard1_replica_n1 ] o.a.s.s.IndexSchema Field text is not multivalued and destination for multiple copyFields (3)
   [junit4]   2> 134009 INFO  (qtp1560284461-1118) [n:127.0.0.1:63983_solr c:collection1 s:shard1 r:core_node3 x:collection1_shard1_replica_n1 ] o.a.s.s.IndexSchema Loaded schema test/1.6 with uniqueid field id
   [junit4]   2> 134010 INFO  (qtp1560284461-1118) [n:127.0.0.1:63983_solr c:collection1 s:shard1 r:core_node3 x:collection1_shard1_replica_n1 ] o.a.s.c.CoreContainer Creating SolrCore 'collection1_shard1_replica_n1' using configuration from collection collection1, trusted=true
   [junit4]   2> 134010 INFO  (qtp1560284461-1118) [n:127.0.0.1:63983_solr c:collection1 s:shard1 r:core_node3 x:collection1_shard1_replica_n1 ] o.a.s.m.r.SolrJmxReporter JMX monitoring for 'solr_63983.solr.core.collection1.shard1.replica_n1' (registry 'solr.core.collection1.shard1.replica_n1') enabled at server: com.sun.jmx.mbeanserver.JmxMBeanServer@620aa2b5
   [junit4]   2> 134010 INFO  (qtp1560284461-1118) [n:127.0.0.1:63983_solr c:collection1 s:shard1 r:core_node3 x:collection1_shard1_replica_n1 ] o.a.s.c.SolrCore [[collection1_shard1_replica_n1] ] Opening new SolrCore at [/Users/jenkins/workspace/Lucene-Solr-8.x-MacOSX/solr/build/solr-solrj/test/J0/temp/solr.client.solrj.io.stream.MathExpressionTest_E02E5EA70C3FA8F2-001/tempDir-001/node1/collection1_shard1_replica_n1], dataDir=[/Users/jenkins/workspace/Lucene-Solr-8.x-MacOSX/solr/build/solr-solrj/test/J0/temp/solr.client.solrj.io.stream.MathExpressionTest_E02E5EA70C3FA8F2-001/tempDir-001/node1/./collection1_shard1_replica_n1/data/]
   [junit4]   2> 134146 INFO  (qtp1560284461-1118) [n:127.0.0.1:63983_solr c:collection1 s:shard1 r:core_node3 x:collection1_shard1_replica_n1 ] o.a.s.u.UpdateHandler Using UpdateLog implementation: org.apache.solr.update.UpdateLog
   [junit4]   2> 134146 INFO  (qtp1560284461-1118) [n:127.0.0.1:63983_solr c:collection1 s:shard1 r:core_node3 x:collection1_shard1_replica_n1 ] o.a.s.u.UpdateLog Initializing UpdateLog: dataDir= defaultSyncLevel=FLUSH numRecordsToKeep=100 maxNumLogsToKeep=10 numVersionBuckets=65536
   [junit4]   2> 134148 INFO  (qtp1560284461-1118) [n:127.0.0.1:63983_solr c:collection1 s:shard1 r:core_node3 x:collection1_shard1_replica_n1 ] o.a.s.u.CommitTracker Hard AutoCommit: disabled
   [junit4]   2> 134148 INFO  (qtp1560284461-1118) [n:127.0.0.1:63983_solr c:collection1 s:shard1 r:core_node3 x:collection1_shard1_replica_n1 ] o.a.s.u.CommitTracker Soft AutoCommit: disabled
   [junit4]   2> 134155 INFO  (qtp1631206860-1127) [n:127.0.0.1:63985_solr c:collection1 s:shard2 r:core_node4 x:collection1_shard2_replica_n2 ] o.a.s.u.UpdateHandler Using UpdateLog implementation: org.apache.solr.update.UpdateLog
   [junit4]   2> 134155 INFO  (qtp1631206860-1127) [n:127.0.0.1:63985_solr c:collection1 s:shard2 r:core_node4 x:collection1_shard2_replica_n2 ] o.a.s.u.UpdateLog Initializing UpdateLog: dataDir= defaultSyncLevel=FLUSH numRecordsToKeep=100 maxNumLogsToKeep=10 numVersionBuckets=65536
   [junit4]   2> 134157 INFO  (qtp1631206860-1127) [n:127.0.0.1:63985_solr c:collection1 s:shard2 r:core_node4 x:collection1_shard2_replica_n2 ] o.a.s.u.CommitTracker Hard AutoCommit: disabled
   [junit4]   2> 134157 INFO  (qtp1631206860-1127) [n:127.0.0.1:63985_solr c:collection1 s:shard2 r:core_node4 x:collection1_shard2_replica_n2 ] o.a.s.u.CommitTracker Soft AutoCommit: disabled
   [junit4]   2> 134159 INFO  (qtp1560284461-1118) [n:127.0.0.1:63983_solr c:collection1 s:shard1 r:core_node3 x:collection1_shard1_replica_n1 ] o.a.s.s.SolrIndexSearcher Opening [Searcher@2a029e6d[collection1_shard1_replica_n1] main]
   [junit4]   2> 134162 INFO  (qtp1631206860-1127) [n:127.0.0.1:63985_solr c:collection1 s:shard2 r:core_node4 x:collection1_shard2_replica_n2 ] o.a.s.s.SolrIndexSearcher Opening [Searcher@1c91b527[collection1_shard2_replica_n2] main]
   [junit4]   2> 134163 INFO  (qtp1560284461-1118) [n:127.0.0.1:63983_solr c:collection1 s:shard1 r:core_node3 x:collection1_shard1_replica_n1 ] o.a.s.r.ManagedResourceStorage Configured ZooKeeperStorageIO with znodeBase: /configs/conf
   [junit4]   2> 134164 INFO  (qtp1560284461-1118) [n:127.0.0.1:63983_solr c:collection1 s:shard1 r:core_node3 x:collection1_shard1_replica_n1 ] o.a.s.r.ManagedResourceStorage Loaded null at path _rest_managed.json using ZooKeeperStorageIO:path=/configs/conf
   [junit4]   2> 134165 INFO  (qtp1631206860-1127) [n:127.0.0.1:63985_solr c:collection1 s:shard2 r:core_node4 x:collection1_shard2_replica_n2 ] o.a.s.r.ManagedResourceStorage Configured ZooKeeperStorageIO with znodeBase: /configs/conf
   [junit4]   2> 134166 INFO  (qtp1631206860-1127) [n:127.0.0.1:63985_solr c:collection1 s:shard2 r:core_node4 x:collection1_shard2_replica_n2 ] o.a.s.r.ManagedResourceStorage Loaded null at path _rest_managed.json using ZooKeeperStorageIO:path=/configs/conf
   [junit4]   2> 134166 INFO  (qtp1560284461-1118) [n:127.0.0.1:63983_solr c:collection1 s:shard1 r:core_node3 x:collection1_shard1_replica_n1 ] o.a.s.h.ReplicationHandler Commits will be reserved for 10000ms.
   [junit4]   2> 134166 INFO  (qtp1631206860-1127) [n:127.0.0.1:63985_solr c:collection1 s:shard2 r:core_node4 x:collection1_shard2_replica_n2 ] o.a.s.h.ReplicationHandler Commits will be reserved for 10000ms.
   [junit4]   2> 134166 INFO  (qtp1631206860-1127) [n:127.0.0.1:63985_solr c:collection1 s:shard2 r:core_node4 x:collection1_shard2_replica_n2 ] o.a.s.u.UpdateLog Could not find max version in index or recent updates, using new clock 1642981869661192192
   [junit4]   2> 134167 INFO  (qtp1560284461-1118) [n:127.0.0.1:63983_solr c:collection1 s:shard1 r:core_node3 x:collection1_shard1_replica_n1 ] o.a.s.u.UpdateLog Could not find max version in index or recent updates, using new clock 1642981869661192192
   [junit4]   2> 134171 INFO  (searcherExecutor-214-thread-1-processing-n:127.0.0.1:63985_solr x:collection1_shard2_replica_n2 c:collection1 s:shard2 r:core_node4) [n:127.0.0.1:63985_solr c:collection1 s:shard2 r:core_node4 x:collection1_shard2_replica_n2 ] o.a.s.c.SolrCore [collection1_shard2_replica_n2] Registered new searcher Searcher@1c91b527[collection1_shard2_replica_n2] main{ExitableDirectoryReader(UninvertingDirectoryReader())}
   [junit4]   2> 134175 INFO  (searcherExecutor-215-thread-1-processing-n:127.0.0.1:63983_solr x:collection1_shard1_replica_n1 c:collection1 s:shard1 r:core_node3) [n:127.0.0.1:63983_solr c:collection1 s:shard1 r:core_node3 x:collection1_shard1_replica_n1 ] o.a.s.c.SolrCore [collection1_shard1_replica_n1] Registered new searcher Searcher@2a029e6d[collection1_shard1_replica_n1] main{ExitableDirectoryReader(UninvertingDirectoryReader())}
   [junit4]   2> 134181 INFO  (qtp1560284461-1118) [n:127.0.0.1:63983_solr c:collection1 s:shard1 r:core_node3 x:collection1_shard1_replica_n1 ] o.a.s.c.ZkShardTerms Successful update of terms at /collections/collection1/terms/shard1 to Terms{values={core_node3=0}, version=0}
   [junit4]   2> 134181 INFO  (qtp1560284461-1118) [n:127.0.0.1:63983_solr c:collection1 s:shard1 r:core_node3 x:collection1_shard1_replica_n1 ] o.a.s.c.ShardLeaderElectionContextBase make sure parent is created /collections/collection1/leaders/shard1
   [junit4]   2> 134185 INFO  (qtp1631206860-1127) [n:127.0.0.1:63985_solr c:collection1 s:shard2 r:core_node4 x:collection1_shard2_replica_n2 ] o.a.s.c.ZkShardTerms Successful update of terms at /collections/collection1/terms/shard2 to Terms{values={core_node4=0}, version=0}
   [junit4]   2> 134185 INFO  (qtp1631206860-1127) [n:127.0.0.1:63985_solr c:collection1 s:shard2 r:core_node4 x:collection1_shard2_replica_n2 ] o.a.s.c.ShardLeaderElectionContextBase make sure parent is created /collections/collection1/leaders/shard2
   [junit4]   2> 134194 INFO  (qtp1631206860-1127) [n:127.0.0.1:63985_solr c:collection1 s:shard2 r:core_node4 x:collection1_shard2_replica_n2 ] o.a.s.c.ShardLeaderElectionContext Enough replicas found to continue.
   [junit4]   2> 134194 INFO  (qtp1631206860-1127) [n:127.0.0.1:63985_solr c:collection1 s:shard2 r:core_node4 x:collection1_shard2_replica_n2 ] o.a.s.c.ShardLeaderElectionContext I may be the new leader - try and sync
   [junit4]   2> 134194 INFO  (qtp1631206860-1127) [n:127.0.0.1:63985_solr c:collection1 s:shard2 r:core_node4 x:collection1_shard2_replica_n2 ] o.a.s.c.SyncStrategy Sync replicas to http://127.0.0.1:63985/solr/collection1_shard2_replica_n2/
   [junit4]   2> 134194 INFO  (qtp1631206860-1127) [n:127.0.0.1:63985_solr c:collection1 s:shard2 r:core_node4 x:collection1_shard2_replica_n2 ] o.a.s.c.SyncStrategy Sync Success - now sync replicas to me
   [junit4]   2> 134195 INFO  (qtp1631206860-1127) [n:127.0.0.1:63985_solr c:collection1 s:shard2 r:core_node4 x:collection1_shard2_replica_n2 ] o.a.s.c.SyncStrategy http://127.0.0.1:63985/solr/collection1_shard2_replica_n2/ has no replicas
   [junit4]   2> 134195 INFO  (qtp1631206860-1127) [n:127.0.0.1:63985_solr c:collection1 s:shard2 r:core_node4 x:collection1_shard2_replica_n2 ] o.a.s.c.ShardLeaderElectionContextBase Creating leader registration node /collections/collection1/leaders/shard2/leader after winning as /collections/collection1/leader_elect/shard2/election/72253363398639633-core_node4-n_0000000000
   [junit4]   2> 134198 INFO  (qtp1560284461-1118) [n:127.0.0.1:63983_solr c:collection1 s:shard1 r:core_node3 x:collection1_shard1_replica_n1 ] o.a.s.c.ShardLeaderElectionContext Enough replicas found to continue.
   [junit4]   2> 134198 INFO  (qtp1560284461-1118) [n:127.0.0.1:63983_solr c:collection1 s:shard1 r:core_node3 x:collection1_shard1_replica_n1 ] o.a.s.c.ShardLeaderElectionContext I may be the new leader - try and sync
   [junit4]   2> 134198 INFO  (qtp1560284461-1118) [n:127.0.0.1:63983_solr c:collection1 s:shard1 r:core_node3 x:collection1_shard1_replica_n1 ] o.a.s.c.SyncStrategy Sync replicas to http://127.0.0.1:63983/solr/collection1_shard1_replica_n1/
   [junit4]   2> 134199 INFO  (qtp1560284461-1118) [n:127.0.0.1:63983_solr c:collection1 s:shard1 r:core_node3 x:collection1_shard1_replica_n1 ] o.a.s.c.SyncStrategy Sync Success - now sync replicas to me
   [junit4]   2> 134199 INFO  (qtp1631206860-1127) [n:127.0.0.1:63985_solr c:collection1 s:shard2 r:core_node4 x:collection1_shard2_replica_n2 ] o.a.s.c.ShardLeaderElectionContext I am the new leader: http://127.0.0.1:63985/solr/collection1_shard2_replica_n2/ shard2
   [junit4]   2> 134201 INFO  (qtp1560284461-1118) [n:127.0.0.1:63983_solr c:collection1 s:shard1 r:core_node3 x:collection1_shard1_replica_n1 ] o.a.s.c.SyncStrategy http://127.0.0.1:63983/solr/collection1_shard1_replica_n1/ has no replicas
   [junit4]   2> 134201 INFO  (qtp1560284461-1118) [n:127.0.0.1:63983_solr c:collection1 s:shard1 r:core_node3 x:collection1_shard1_replica_n1 ] o.a.s.c.ShardLeaderElectionContextBase Creating leader registration node /collections/collection1/leaders/shard1/leader after winning as /collections/collection1/leader_elect/shard1/election/72253363398639624-core_node3-n_0000000000
   [junit4]   2> 134205 INFO  (qtp1560284461-1118) [n:127.0.0.1:63983_solr c:collection1 s:shard1 r:core_node3 x:collection1_shard1_replica_n1 ] o.a.s.c.ShardLeaderElectionContext I am the new leader: http://127.0.0.1:63983/solr/collection1_shard1_replica_n1/ shard1
   [junit4]   2> 134327 INFO  (zkCallback-643-thread-1) [     ] o.a.s.c.c.ZkStateReader A cluster state change: [WatchedEvent state:SyncConnected type:NodeDataChanged path:/collections/collection1/state.json] for collection [collection1] has occurred - updating... (live nodes size: [4])
   [junit4]   2> 134327 INFO  (zkCallback-596-thread-1) [     ] o.a.s.c.c.ZkStateReader A cluster state change: [WatchedEvent state:SyncConnected type:NodeDataChanged path:/collections/collection1/state.json] for collection [collection1] has occurred - updating... (live nodes size: [4])
   [junit4]   2> 134327 INFO  (zkCallback-596-thread-2) [     ] o.a.s.c.c.ZkStateReader A cluster state change: [WatchedEvent state:SyncConnected type:NodeDataChanged path:/collections/collection1/state.json] for collection [collection1] has occurred - updating... (live nodes size: [4])
   [junit4]   2> 134327 INFO  (zkCallback-643-thread-2) [     ] o.a.s.c.c.ZkStateReader A cluster state change: [WatchedEvent state:SyncConnected type:NodeDataChanged path:/collections/collection1/state.json] for collection [collection1] has occurred - updating... (live nodes size: [4])
   [junit4]   2> 134335 INFO  (qtp1631206860-1127) [n:127.0.0.1:63985_solr c:collection1 s:shard2 r:core_node4 x:collection1_shard2_replica_n2 ] o.a.s.c.ZkController I am the leader, no recovery necessary
   [junit4]   2> 134335 INFO  (qtp1560284461-1118) [n:127.0.0.1:63983_solr c:collection1 s:shard1 r:core_node3 x:collection1_shard1_replica_n1 ] o.a.s.c.ZkController I am the leader, no recovery necessary
   [junit4]   2> 134385 INFO  (qtp1560284461-1118) [n:127.0.0.1:63983_solr c:collection1 s:shard1 r:core_node3 x:collection1_shard1_replica_n1 ] o.a.s.s.HttpSolrCall [admin] webapp=null path=/admin/cores params={qt=/admin/cores&coreNodeName=core_node3&collection.configName=conf&newCollection=true&name=collection1_shard1_replica_n1&action=CREATE&numShards=2&collection=collection1&shard=shard1&wt=javabin&version=2&replicaType=NRT} status=0 QTime=1621
   [junit4]   2> 134387 INFO  (qtp1631206860-1127) [n:127.0.0.1:63985_solr c:collection1 s:shard2 r:core_node4 x:collection1_shard2_replica_n2 ] o.a.s.s.HttpSolrCall [admin] webapp=null path=/admin/cores params={qt=/admin/cores&coreNodeName=core_node4&collection.configName=conf&newCollection=true&name=collection1_shard2_replica_n2&action=CREATE&numShards=2&collection=collection1&shard=shard2&wt=javabin&version=2&replicaType=NRT} status=0 QTime=1620
   [junit4]   2> 134403 INFO  (qtp1560284461-1111) [n:127.0.0.1:63983_solr     ] o.a.s.h.a.CollectionsHandler Wait for new collection to be active for at most 45 seconds. Check all shard replicas
   [junit4]   2> 134414 INFO  (OverseerCollectionConfigSetProcessor-72253363398639624-127.0.0.1:63983_solr-n_0000000000) [n:127.0.0.1:63983_solr     ] o.a.s.c.OverseerTaskQueue Response ZK path: /overseer/collection-queue-work/qnr-0000000000 doesn't exist.  Requestor may have disconnected from ZooKeeper
   [junit4]   2> 134446 INFO  (zkCallback-643-thread-2) [     ] o.a.s.c.c.ZkStateReader A cluster state change: [WatchedEvent state:SyncConnected type:NodeDataChanged path:/collections/collection1/state.json] for collection [collection1] has occurred - updating... (live nodes size: [4])
   [junit4]   2> 134446 INFO  (zkCallback-643-thread-1) [     ] o.a.s.c.c.ZkStateReader A cluster state change: [WatchedEvent state:SyncConnected type:NodeDataChanged path:/collections/collection1/state.json] for collection [collection1] has occurred - updating... (live nodes size: [4])
   [junit4]   2> 134446 INFO  (zkCallback-596-thread-2) [     ] o.a.s.c.c.ZkStateReader A cluster state change: [WatchedEvent state:SyncConnected type:NodeDataChanged path:/collections/collection1/state.json] for collection [collection1] has occurred - updating... (live nodes size: [4])
   [junit4]   2> 134446 INFO  (zkCallback-596-thread-1) [     ] o.a.s.c.c.ZkStateReader A cluster state change: [WatchedEvent state:SyncConnected type:NodeDataChanged path:/collections/collection1/state.json] for collection [collection1] has occurred - updating... (live nodes size: [4])
   [junit4]   2> 134447 INFO  (zkCallback-643-thread-3) [     ] o.a.s.c.c.ZkStateReader A cluster state change: [WatchedEvent state:SyncConnected type:NodeDataChanged path:/collections/collection1/state.json] for collection [collection1] has occurred - updating... (live nodes size: [4])
   [junit4]   2> 134447 INFO  (zkCallback-596-thread-3) [     ] o.a.s.c.c.ZkStateReader A cluster state change: [WatchedEvent state:SyncConnected type:NodeDataChanged path:/collections/collection1/state.json] for collection [collection1] has occurred - updating... (live nodes size: [4])
   [junit4]   2> 134448 INFO  (qtp1560284461-1111) [n:127.0.0.1:63983_solr     ] o.a.s.s.HttpSolrCall [admin] webapp=null path=/admin/collections params={collection.configName=conf&name=collection1&nrtReplicas=1&action=CREATE&numShards=2&wt=javabin&version=2} status=0 QTime=2052
   [junit4]   2> 134487 INFO  (SUITE-MathExpressionTest-seed#[E02E5EA70C3FA8F2]-worker) [     ] o.a.s.c.AbstractDistribZkTestBase Wait for recoveries to finish - collection: collection1 failOnTimeout:true timeout (sec):45
   [junit4]   2> 134495 INFO  (SUITE-MathExpressionTest-seed#[E02E5EA70C3FA8F2]-worker) [     ] o.a.s.c.AbstractDistribZkTestBase Recoveries finished - collection: collection1
   [junit4]   2> 134596 INFO  (TEST-MathExpressionTest.testSumSq-seed#[E02E5EA70C3FA8F2]) [     ] o.a.s.SolrTestCaseJ4 ###Starting testSumSq
   [junit4]   2> 135446 INFO  (qtp1560284461-1109) [n:127.0.0.1:63983_solr c:collection1 s:shard1 r:core_node3 x:collection1_shard1_replica_n1 ] o.a.s.c.ZkShardTerms Successful update of terms at /collections/collection1/terms/shard1 to Terms{values={core_node3=1}, version=1}
   [junit4]   2> 135446 INFO  (qtp1560284461-1109) [n:127.0.0.1:63983_solr c:collection1 s:shard1 r:core_node3 x:collection1_shard1_replica_n1 ] o.a.s.u.p.LogUpdateProcessorFactory [collection1_shard1_replica_n1]  webapp=/solr path=/update params={update.distrib=TOLEADER&distrib.from=http://127.0.0.1:63985/solr/collection1_shard2_replica_n2/&wt=javabin&version=2}{deleteByQuery=*:* (-1642981870994980864)} 0 11
   [junit4]   2> 135495 INFO  (qtp1560284461-1117) [n:127.0.0.1:63983_solr c:collection1 s:shard1 r:core_node3 x:collection1_shard1_replica_n1 ] o.a.s.u.DirectUpdateHandler2 start commit{_version_=1642981871054749696,optimize=false,openSearcher=true,waitSearcher=true,expungeDeletes=false,softCommit=false,prepareCommit=false}
   [junit4]   2> 135495 INFO  (qtp1560284461-1117) [n:127.0.0.1:63983_solr c:collection1 s:shard1 r:core_node3 x:collection1_shard1_replica_n1 ] o.a.s.u.DirectUpdateHandler2 No uncommitted changes. Skipping IW.commit.
   [junit4]   2> 135509 INFO  (qtp1560284461-1117) [n:127.0.0.1:63983_solr c:collection1 s:shard1 r:core_node3 x:collection1_shard1_replica_n1 ] o.a.s.u.DirectUpdateHandler2 end_commit_flush
   [junit4]   2> 135509 INFO  (qtp1560284461-1117) [n:127.0.0.1:63983_solr c:collection1 s:shard1 r:core_node3 x:collection1_shard1_replica_n1 ] o.a.s.u.p.LogUpdateProcessorFactory [collection1_shard1_replica_n1]  webapp=/solr path=/update params={update.distrib=TOLEADER&waitSearcher=true&openSearcher=true&commit=true&softCommit=false&distrib.from=http://127.0.0.1:63985/solr/collection1_shard2_replica_n2/&commit_end_point=leaders&wt=javabin&version=2&expungeDeletes=false}{commit=} 0 16
   [junit4]   2> 135514 INFO  (qtp1631206860-1136) [n:127.0.0.1:63985_solr c:collection1 s:shard2 r:core_node4 x:collection1_shard2_replica_n2 ] o.a.s.u.DirectUpdateHandler2 start commit{_version_=1642981871074672640,optimize=false,openSearcher=true,waitSearcher=true,expungeDeletes=false,softCommit=false,prepareCommit=false}
   [junit4]   2> 135514 INFO  (qtp1631206860-1136) [n:127.0.0.1:63985_solr c:collection1 s:shard2 r:core_node4 x:collection1_shard2_replica_n2 ] o.a.s.u.DirectUpdateHandler2 No uncommitted changes. Skipping IW.commit.
   [junit4]   2> 135525 INFO  (qtp1631206860-1136) [n:127.0.0.1:63985_solr c:collection1 s:shard2 r:core_node4 x:collection1_shard2_replica_n2 ] o.a.s.u.DirectUpdateHandler2 end_commit_flush
   [junit4]   2> 135528 INFO  (qtp1631206860-1136) [n:127.0.0.1:63985_solr c:collection1 s:shard2 r:core_node4 x:collection1_shard2_replica_n2 ] o.a.s.c.ZkShardTerms Successful update of terms at /collections/collection1/terms/shard2 to Terms{values={core_node4=1}, version=1}
   [junit4]   2> 135528 INFO  (qtp1631206860-1136) [n:127.0.0.1:63985_solr c:collection1 s:shard2 r:core_node4 x:collection1_shard2_replica_n2 ] o.a.s.u.p.LogUpdateProcessorFactory [collection1_shard2_replica_n2]  webapp=/solr path=/update params={_stateVer_=collection1:4&commit=true&wt=javabin&version=2}{deleteByQuery=*:* (-1642981870161362944),commit=} 0 928
   [junit4]   2> 135544 INFO  (qtp1560284461-1111) [n:127.0.0.1:63983_solr c:collection1 s:shard1 r:core_node3 x:collection1_shard1_replica_n1 ] o.a.s.c.S.Request [collection1_shard1_replica_n1]  webapp=/solr path=/stream params={indent=off&expr=sumSq(array(-3,-2.5,+10))&wt=json&version=2.2} status=0 QTime=1
   [junit4]   2> 135744 INFO  (TEST-MathExpressionTest.testSumSq-seed#[E02E5EA70C3FA8F2]) [     ] o.a.s.SolrTestCaseJ4 ###Ending testSumSq
   [junit4]   2> 135831 INFO  (TEST-MathExpressionTest.testLetWithNumericVariables-seed#[E02E5EA70C3FA8F2]) [     ] o.a.s.SolrTestCaseJ4 ###Starting testLetWithNumericVariables
   [junit4]   2> 135873 INFO  (qtp1560284461-1109) [n:127.0.0.1:63983_solr c:collection1 s:shard1 r:core_node3 x:collection1_shard1_replica_n1 ] o.a.s.u.p.LogUpdateProcessorFactory [collection1_shard1_replica_n1]  webapp=/solr path=/update params={update.distrib=TOLEADER&distrib.from=http://127.0.0.1:63985/solr/collection1_shard2_replica_n2/&wt=javabin&version=2}{deleteByQuery=*:* (-1642981871439577088)} 0 11
   [junit4]   2> 135879 INFO  (qtp1560284461-1117) [n:127.0.0.1:63983_solr c:collection1 s:shard1 r:core_node3 x:collection1_shard1_replica_n1 ] o.a.s.u.DirectUpdateHandler2 start commit{_version_=1642981871457402880,optimize=false,openSearcher=true,waitSearcher=true,expungeDeletes=false,softCommit=false,prepareCommit=false}
   [junit4]   2> 135879 INFO  (qtp1560284461-1117) [n:127.0.0.1:63983_solr c:collection1 s:shard1 r:core_node3 x:collection1_shard1_replica_n1 ] o.a.s.u.DirectUpdateHandler2 No uncommitted changes. Skipping IW.commit.
   [junit4]   2> 135880 INFO  (qtp1560284461-1117) [n:127.0.0.1:63983_solr c:collection1 s:shard1 r:core_node3 x:collection1_shard1_replica_n1 ] o.a.s.u.DirectUpdateHandler2 end_commit_flush
   [junit4]   2> 135880 INFO  (qtp1560284461-1117) [n:127.0.0.1:63983_solr c:collection1 s:shard1 r:core_node3 x:collection1_shard1_replica_n1 ] o.a.s.u.p.LogUpdateProcessorFactory [collection1_shard1_replica_n1]  webapp=/solr path=/update params={update.distrib=TOLEADER&waitSearcher=true&openSearcher=true&commit=true&softCommit=false&distrib.from=http://127.0.0.1:63985/solr/collection1_shard2_replica_n2/&commit_end_point=leaders&wt=javabin&version=2&expungeDeletes=false}{commit=} 0 1
   [junit4]   2> 135882 INFO  (qtp1631206860-1137) [n:127.0.0.1:63985_solr c:collection1 s:shard2 r:core_node4 x:collection1_shard2_replica_n2 ] o.a.s.u.DirectUpdateHandler2 start commit{_version_=1642981871460548608,optimize=false,openSearcher=true,waitSearcher=true,expungeDeletes=false,softCommit=false,prepareCommit=false}
   [junit4]   2> 135883 INFO  (qtp1631206860-1137) [n:127.0.0.1:63985_solr c:collection1 s:shard2 r:core_node4 x:collection1_shard2_replica_n2 ] o.a.s.u.DirectUpdateHandler2 No uncommitted changes. Skipping IW.commit.
   [junit4]   2> 135883 INFO  (qtp1631206860-1137) [n:127.0.0.1:63985_solr c:collection1 s:shard2 r:core_node4 x:collection1_shard2_replica_n2 ] o.a.s.u.DirectUpdateHandler2 end_commit_flush
   [junit4]   2> 135884 INFO  (qtp1631206860-1137) [n:127.0.0.1:63985_solr c:collection1 s:shard2 r:core_node4 x:collection1_shard2_replica_n2 ] o.a.s.u.p.LogUpdateProcessorFactory [collection1_shard2_replica_n2]  webapp=/solr path=/update params={_stateVer_=collection1:4&commit=true&wt=javabin&version=2}{deleteByQuery=*:* (-1642981871428042752),commit=} 0 49
   [junit4]   2> 135891 INFO  (qtp1560284461-1111) [n:127.0.0.1:63983_solr c:collection1 s:shard1 r:core_node3 x:collection1_shard1_replica_n1 ] o.a.s.c.S.Request [collection1_shard1_replica_n1]  webapp=/solr path=/stream params={indent=off&expr=let(echo%3Dtrue,+a%3D1.88888,+b%3D8888888888.98)&wt=json&version=2.2} status=0 QTime=1
   [junit4]   2> 135893 INFO  (TEST-MathExpressionTest.testLetWithNumericVariables-seed#[E02E5EA70C3FA8F2]) [     ] o.a.s.SolrTestCaseJ4 ###Ending testLetWithNumericVariables
   [junit4]   2> 136026 INFO  (TEST-MathExpressionTest.testVarianceAndStandardDeviation-seed#[E02E5EA70C3FA8F2]) [     ] o.a.s.SolrTestCaseJ4 ###Starting testVarianceAndStandardDeviation
   [junit4]   2> 136039 INFO  (qtp1560284461-1109) [n:127.0.0.1:63983_solr c:collection1 s:shard1 r:core_node3 x:collection1_shard1_replica_n1 ] o.a.s.u.p.LogUpdateProcessorFactory [collection1_shard1_replica_n1]  webapp=/solr path=/update params={update.distrib=TOLEADER&distrib.from=http://127.0.0.1:63985/solr/collection1_shard2_replica_n2/&wt=javabin&version=2}{deleteByQuery=*:* (-1642981871623077888)} 0 2
   [junit4]   2> 136052 INFO  (qtp1560284461-1117) [n:127.0.0.1:63983_solr c:collection1 s:shard1 r:core_node3 x:collection1_shard1_replica_n1 ] o.a.s.u.DirectUpdateHandler2 start commit{_version_=1642981871638806528,optimize=false,openSearcher=true,waitSearcher=true,expungeDeletes=false,softCommit=false,prepareCommit=false}
   [junit4]   2> 136052 INFO  (qtp1560284461-1117) [n:127.0.0.1:63983_solr c:collection1 s:shard1 r:core_node3 x:collection1_shard1_replica_n1 ] o.a.s.u.DirectUpdateHandler2 No uncommitted changes. Skipping IW.commit.
   [junit4]   2> 136052 INFO  (qtp1560284461-1117) [n:127.0.0.1:63983_solr c:collection1 s:shard1 r:core_node3 x:collection1_shard1_replica_n1 ] o.a.s.u.DirectUpdateHandler2 end_commit_flush
   [junit4]   2> 136052 INFO  (qtp1560284461-1117) [n:127.0.0.1:63983_solr c:collection1 s:shard1 r:core_node3 x:collection1_shard1_replica_n1 ] o.a.s.u.p.LogUpdateProcessorFactory [collection1_shard1_replica_n1]  webapp=/solr path=/update params={update.distrib=TOLEADER&waitSearcher=true&openSearcher=true&commit=true&softCommit=false&distrib.from=http://127.0.0.1:63985/solr/collection1_shard2_replica_n2/&commit_end_point=leaders&wt=javabin&version=2&expungeDeletes=false}{commit=} 0 0
   [junit4]   2> 136053 INFO  (qtp1631206860-1135) [n:127.0.0.1:63985_solr c:collection1 s:shard2 r:core_node4 x:collection1_shard2_replica_n2 ] o.a.s.u.DirectUpdateHandler2 start commit{_version_=1642981871639855104,optimize=false,openSearcher=true,waitSearcher=true,expungeDeletes=false,softCommit=false,prepareCommit=false}
   [junit4]   2> 136053 INFO  (qtp1631206860-1135) [n:127.0.0.1:63985_solr c:collection1 s:shard2 r:core_node4 x:collection1_shard2_replica_n2 ] o.a.s.u.DirectUpdateHandler2 No uncommitted changes. Skipping IW.commit.
   [junit4]   2> 136054 INFO  (qtp1631206860-1135) [n:127.0.0.1:63985_solr c:collection1 s:shard2 r:core_node4 x:collection1_shard2_replica_n2 ] o.a.s.u.DirectUpdateHandler2 end_commit_flush
   [junit4]   2> 136054 INFO  (qtp1631206860-1135) [n:127.0.0.1:63985_solr c:collection1 s:shard2 r:core_node4 x:collection1_shard2_replica_n2 ] o.a.s.u.p.LogUpdateProcessorFactory [collection1_shard2_replica_n2]  webapp=/solr path=/update params={_stateVer_=collection1:4&commit=true&wt=javabin&version=2}{deleteByQuery=*:* (-1642981871613640704),commit=} 0 26
   [junit4]   2> 136065 INFO  (qtp1560284461-1122) [n:127.0.0.1:63983_solr c:collection1 s:shard1 r:core_node3 x:collection1_shard1_replica_n1 ] o.a.s.c.S.Request [collection1_shard1_replica_n1]  webapp=/solr path=/stream params={indent=off&expr=let(echo%3Dtrue,a%3Dvar(array(1,2,3,4,5)),b%3Dstddev(array(2,2,2,2)))&wt=json&version=2.2} status=0 QTime=1
   [junit4]   2> 136067 INFO  (TEST-MathExpressionTest.testVarianceAndStandardDeviation-seed#[E02E5EA70C3FA8F2]) [     ] o.a.s.SolrTestCaseJ4 ###Ending testVarianceAndStandardDeviation
   [junit4]   2> 136168 INFO  (TEST-MathExpressionTest.testAnova-seed#[E02E5EA70C3FA8F2]) [     ] o.a.s.SolrTestCaseJ4 ###Starting testAnova
   [junit4]   2> 136190 INFO  (qtp1560284461-1109) [n:127.0.0.1:63983_solr c:collection1 s:shard1 r:core_node3 x:collection1_shard1_replica_n1 ] o.a.s.u.p.LogUpdateProcessorFactory [collection1_shard1_replica_n1]  webapp=/solr path=/update params={update.distrib=TOLEADER&distrib.from=http://127.0.0.1:63985/solr/collection1_shard2_replica_n2/&wt=javabin&version=2}{deleteByQuery=*:* (-1642981871775121408)} 0 8
   [junit4]   2> 136195 INFO  (qtp1560284461-1117) [n:127.0.0.1:63983_solr c:collection1 s:shard1 r:core_node3 x:collection1_shard1_replica_n1 ] o.a.s.u.DirectUpdateHandler2 start commit{_version_=1642981871788752896,optimize=false,openSearcher=true,waitSearcher=true,expungeDeletes=false,softCommit=false,prepareCommit=false}
   [junit4]   2> 136195 INFO  (qtp1560284461-1117) [n:127.0.0.1:63983_solr c:collection1 s:shard1 r:core_node3 x:collection1_shard1_replica_n1 ] o.a.s.u.DirectUpdateHandler2 No uncommitted changes. Skipping IW.commit.
   [junit4]   2> 136198 INFO  (qtp1560284461-1117) [n:127.0.0.1:63983_solr c:collection1 s:shard1 r:core_node3 x:collection1_shard1_replica_n1 ] o.a.s.u.DirectUpdateHandler2 end_commit_flush
   [junit4]   2> 136198 INFO  (qtp1560284461-1117) [n:127.0.0.1:63983_solr c:collection1 s:shard1 r:core_node3 x:collection1_shard1_replica_n1 ] o.a.s.u.p.LogUpdateProcessorFactory [collection1_shard1_replica_n1]  webapp=/solr path=/update params={update.distrib=TOLEADER&waitSearcher=true&openSearcher=true&commit=true&softCommit=false&distrib.from=http://127.0.0.1:63985/solr/collection1_shard2_replica_n2/&commit_end_point=leaders&wt=javabin&version=2&expungeDeletes=false}{commit=} 0 3
   [junit4]   2> 136206 INFO  (qtp1631206860-1119) [n:127.0.0.1:63985_solr c:collection1 s:shard2 r:core_node4 x:collection1_shard2_replica_n2 ] o.a.s.u.DirectUpdateHandler2 start commit{_version_=1642981871800287232,optimize=false,openSearcher=true,waitSearcher=true,expungeDeletes=false,softCommit=false,prepareCommit=false}
   [junit4]   2> 136206 INFO  (qtp1631206860-1119) [n:127.0.0.1:63985_solr c:collection1 s:shard2 r:core_node4 x:collection1_shard2_replica_n2 ] o.a.s.u.DirectUpdateHandler2 No uncommitted changes. Skipping IW.commit.
   [junit4]   2> 136206 INFO  (qtp1631206860-1119) [n:127.0.0.1:63985_solr c:collection1 s:shard2 r:core_node4 x:collection1_shard2_replica_n2 ] o.a.s.u.DirectUpdateHandler2 end_commit_flush
   [junit4]   2> 136206 INFO  (qtp1631206860-1119) [n:127.0.0.1:63985_solr c:collection1 s:shard2 r:core_node4 x:collection1_shard2_replica_n2 ] o.a.s.u.p.LogUpdateProcessorFactory [collection1_shard2_replica_n2]  webapp=/solr path=/update params={_stateVer_=collection1:4&commit=true&wt=javabin&version=2}{deleteByQuery=*:* (-1642981871762538496),commit=} 0 36
   [junit4]   2> 136215 INFO  (qtp1560284461-1122) [n:127.0.0.1:63983_solr c:collection1 s:shard1 r:core_node3 x:collection1_shard1_replica_n1 ] o.a.s.c.S.Request [collection1_shard1_replica_n1]  webapp=/solr path=/stream params={indent=off&expr=anova(array(1,2,3,5,4,6),+array(5,2,3,5,4,6),+array(1,2,7,5,4,6))&wt=json&version=2.2} status=0 QTime=1
   [junit4]   2> 136485 INFO  (TEST-MathExpressionTest.testAnova-seed#[E02E5EA70C3FA8F2]) [     ] o.a.s.SolrTestCaseJ4 ###Ending testAnova
   [junit4]   2> 136602 INFO  (TEST-MathExpressionTest.testConvexHull-seed#[E02E5EA70C3FA8F2]) [     ] o.a.s.SolrTestCaseJ4 ###Starting testConvexHull
   [junit4]   2> 136614 INFO  (qtp1560284461-1111) [n:127.0.0.1:63983_solr c:collection1 s:shard1 r:core_node3 x:collection1_shard1_replica_n1 ] o.a.s.u.p.LogUpdateProcessorFactory [collection1_shard1_replica_n1]  webapp=/solr path=/update params={update.distrib=TOLEADER&distrib.from=http://127.0.0.1:63985/solr/collection1_shard2_replica_n2/&wt=javabin&version=2}{deleteByQuery=*:* (-1642981872221814784)} 0 6
   [junit4]   2> 136619 INFO  (qtp1560284461-1109) [n:127.0.0.1:63983_solr c:collection1 s:shard1 r:core_node3 x:collection1_shard1_replica_n1 ] o.a.s.u.DirectUpdateHandler2 start commit{_version_=1642981872233349120,optimize=false,openSearcher=true,waitSearcher=true,expungeDeletes=false,softCommit=false,prepareCommit=false}
   [junit4]   2> 136621 INFO  (qtp1560284461-1109) [n:127.0.0.1:63983_solr c:collection1 s:shard1 r:core_node3 x:collection1_shard1_replica_n1 ] o.a.s.u.DirectUpdateHandler2 No uncommitted changes. Skipping IW.commit.
   [junit4]   2> 136621 INFO  (qtp1560284461-1109) [n:127.0.0.1:63983_solr c:collection1 s:shard1 r:core_node3 x:collection1_shard1_replica_n1 ] o.a.s.u.DirectUpdateHandler2 end_commit_flush
   [junit4]   2> 136622 INFO  (qtp1560284461-1109) [n:127.0.0.1:63983_solr c:collection1 s:shard1 r:core_node3 x:collection1_shard1_replica_n1 ] o.a.s.u.p.LogUpdateProcessorFactory [collection1_shard1_replica_n1]  webapp=/solr path=/update params={update.distrib=TOLEADER&waitSearcher=true&openSearcher=true&commit=true&softCommit=false&distrib.from=http://127.0.0.1:63985/solr/collection1_shard2_replica_n2/&commit_end_point=leaders&wt=javabin&version=2&expungeDeletes=false}{commit=} 0 3
   [junit4]   2> 136623 INFO  (qtp1631206860-1127) [n:127.0.0.1:63985_solr c:collection1 s:shard2 r:core_node4 x:collection1_shard2_replica_n2 ] o.a.s.u.DirectUpdateHandler2 start commit{_version_=1642981872237543424,optimize=false,openSearcher=true,waitSearcher=true,expungeDeletes=false,softCommit=false,prepareCommit=false}
   [junit4]   2> 136623 INFO  (qtp1631206860-1127) [n:127.0.0.1:63985_solr c:collection1 s:shard2 r:core_node4 x:collection1_shard2_replica_n2 ] o.a.s.u.DirectUpdateHandler2 No uncommitted changes. Skipping IW.commit.
   [junit4]   2> 136624 INFO  (qtp1631206860-1127) [n:127.0.0.1:63985_solr c:collection1 s:shard2 r:core_node4 x:collection1_shard2_replica_n2 ] o.a.s.u.DirectUpdateHandler2 end_commit_flush
   [junit4]   2> 136624 INFO  (qtp1631206860-1127) [n:127.0.0.1:63985_solr c:collection1 s:shard2 r:core_node4 x:collection1_shard2_replica_n2 ] o.a.s.u.p.LogUpdateProcessorFactory [collection1_shard2_replica_n2]  webapp=/solr path=/update params={_stateVer_=collection1:4&commit=true&wt=javabin&version=2}{deleteByQuery=*:* (-1642981872217620480),commit=} 0 20
   [junit4]   2> 136649 INFO  (qtp1560284461-1118) [n:127.0.0.1:63983_solr c:collection1 s:shard1 r:core_node3 x:collection1_shard1_replica_n1 ] o.a.s.c.S.Request [collection1_shard1_replica_n1]  webapp=/solr path=/stream params={indent=off&expr=let(echo%3Dtrue,++++++++++++++x%3Darray(96.42894739701268,+99.11076410926444,+95.71563821370013,101.4356840561301,+96.17912865782684,+113.430677406492,+109.5927785287056,+87.26561260238425,+103.3122002816537,+100.4959815617706,+92.78972440872515,+92.98815024042877,+89.1448359089767,+104.9410622701036,+106.5546761317927,+102.0132643274808,+119.6726096270366,+97.61388415294184,+106.7928221374049,+94.31369945729962,+87.37098859879977,+82.8015657665458,+88.84342877874248,+94.58797342988339,+92.38720473619748),++++++++++++++y%3Darray(97.43395922838836,+109.5441846957560,+78.82698890096127,+96.67181538737611,95.52423701473863,+85.3391529394878,+87.01956497912255,+111.5289690656729,86.41034184809114,+84.11696923489203,+109.3874354244069,+102.3391063812790,109.0604436531823,102.7957014900897,114.4376483055848,107.4387578165579,106.2490201384653,103.4490197583837,93.8201540211101,101.6060721649409,+115.3512636715722,119.1046170610335,99.74910277836263,104.2116724112481,+86.02222520549304),++++++++++++++c%3Dtranspose(matrix(x,+y)),++++++++++++++d%3DconvexHull(c),++++++++++++++e%3DgetVertices(d),++++++++++++++f%3DgetArea(d),++++++++++++++g%3DgetBoundarySize(d),++++++++++++++h%3DgetBaryCenter(d),++++++++++++++i%3DprojectToBorder(d,+matrix(array(99.11076410926444,+109.5441846957560))))&wt=json&version=2.2} status=0 QTime=16
   [junit4]   2> 137496 INFO  (TEST-MathExpressionTest.testConvexHull-seed#[E02E5EA70C3FA8F2]) [     ] o.a.s.SolrTestCaseJ4 ###Ending testConvexHull
   [junit4]   2> 137597 INFO  (TEST-MathExpressionTest.testRankTransform-seed#[E02E5EA70C3FA8F2]) [     ] o.a.s.SolrTestCaseJ4 ###Starting testRankTransform
   [junit4]   2> 137606 INFO  (qtp1560284461-1122) [n:127.0.0.1:63983_solr c:collection1 s:shard1 r:core_node3 x:collection1_shard1_replica_n1 ] o.a.s.u.p.LogUpdateProcessorFactory [collection1_shard1_replica_n1]  webapp=/solr path=/update params={update.distrib=TOLEADER&distrib.from=http://127.0.0.1:63985/solr/collection1_shard2_replica_n2/&wt=javabin&version=2}{deleteByQuery=*:* (-1642981873265147904)} 0 3
   [junit4]   2> 137611 INFO  (qtp1560284461-1111) [n:127.0.0.1:63983_solr c:collection1 s:shard1 r:core_node3 x:collection1_shard1_replica_n1 ] o.a.s.u.DirectUpdateHandler2 start commit{_version_=1642981873273536512,optimize=false,openSearcher=true,waitSearcher=true,expungeDeletes=false,softCommit=false,prepareCommit=false}
   [junit4]   2> 137612 INFO  (qtp1560284461-1111) [n:127.0.0.1:63983_solr c:collection1 s:shard1 r:core_node3 x:collection1_shard1_replica_n1 ] o.a.s.u.DirectUpdateHandler2 No uncommitted changes. Skipping IW.commit.
   [junit4]   2> 137612 INFO  (qtp1560284461-1111) [n:127.0.0.1:63983_solr c:collection1 s:shard1 r:core_node3 x:collection1_shard1_replica_n1 ] o.a.s.u.DirectUpdateHandler2 end_commit_flush
   [junit4]   2> 137613 INFO  (qtp1560284461-1111) [n:127.0.0.1:63983_solr c:collection1 s:shard1 r:core_node3 x:collection1_shard1_replica_n1 ] o.a.s.u.p.LogUpdateProcessorFactory [collection1_shard1_replica_n1]  webapp=/solr path=/update params={update.distrib=TOLEADER&waitSearcher=true&openSearcher=true&commit=true&softCommit=false&distrib.from=http://127.0.0.1:63985/solr/collection1_shard2_replica_n2/&commit_end_point=leaders&wt=javabin&version=2&expungeDeletes=false}{commit=} 0 2
   [junit4]   2> 137614 INFO  (qtp1631206860-1134) [n:127.0.0.1:63985_solr c:collection1 s:shard2 r:core_node4 x:collection1_shard2_replica_n2 ] o.a.s.u.DirectUpdateHandler2 start commit{_version_=1642981873276682240,optimize=false,openSearcher=true,waitSearcher=true,expungeDeletes=false,softCommit=false,prepareCommit=false}
   [junit4]   2> 137614 INFO  (qtp1631206860-1134) [n:127.0.0.1:63985_solr c:collection1 s:shard2 r:core_node4 x:collection1_shard2_replica_n2 ] o.a.s.u.DirectUpdateHandler2 No uncommitted changes. Skipping IW.commit.
   [junit4]   2> 137615 INFO  (qtp1631206860-1134) [n:127.0.0.1:63985_solr c:collection1 s:shard2 r:core_node4 x:collection1_shard2_replica_n2 ] o.a.s.u.DirectUpdateHandler2 end_commit_flush
   [junit4]   2> 137615 INFO  (qtp1631206860-1134) [n:127.0.0.1:63985_solr c:collection1 s:shard2 r:core_node4 x:collection1_shard2_replica_n2 ] o.a.s.u.p.LogUpdateProcessorFactory [collection1_shard2_replica_n2]  webapp=/solr path=/update params={_stateVer_=collection1:4&commit=true&wt=javabin&version=2}{deleteByQuery=*:* (-1642981873260953600),commit=} 0 17
   [junit4]   2> 137671 INFO  (qtp1560284461-1109) [n:127.0.0.1:63983_solr c:collection1 s:shard1 r:core_node3 x:collection1_shard1_replica_n1 ] o.a.s.u.p.LogUpdateProcessorFactory [collection1_shard1_replica_n1]  webapp=/solr path=/update params={_stateVer_=collection1:4&wt=javabin&version=2}{add=[id_2 (1642981873285070848), id_10 (1642981873299750912), id_13 (1642981873300799488), id_14 (1642981873300799489), id_16 (1642981873300799490), id_17 (1642981873301848064), id_18 (1642981873301848065), id_21 (1642981873301848066), id_22 (1642981873301848067), id_23 (1642981873302896640), ... (125 adds)]} 0 48
   [junit4]   2> 137699 INFO  (qtp1631206860-1136) [n:127.0.0.1:63985_solr c:collection1 s:shard2 r:core_node4 x:collection1_shard2_replica_n2 ] o.a.s.u.p.LogUpdateProcessorFactory [collection1_shard2_replica_n2]  webapp=/solr path=/update params={_stateVer_=collection1:4&wt=javabin&version=2}{add=[id_1 (1642981873284022272), id_3 (1642981873304993792), id_4 (1642981873304993793), id_5 (1642981873304993794), id_6 (1642981873306042368), id_7 (1642981873306042369), id_8 (1642981873306042370), id_9 (1642981873306042371), id_11 (1642981873306042372), id_12 (1642981873306042373), ... (125 adds)]} 0 80
   [junit4]   2> 137707 INFO  (qtp1560284461-1117) [n:127.0.0.1:63983_solr c:collection1 s:shard1 r:core_node3 x:collection1_shard1_replica_n1 ] o.a.s.u.DirectUpdateHandler2 start commit{_version_=1642981873374199808,optimize=false,openSearcher=true,waitSearcher=true,expungeDeletes=false,softCommit=false,prepareCommit=false}
   [junit4]   2> 137707 INFO  (qtp1560284461-1117) [n:127.0.0.1:63983_solr c:collection1 s:shard1 r:core_node3 x:collection1_shard1_replica_n1 ] o.a.s.u.SolrIndexWriter Calling setCommitData with IW:org.apache.solr.update.SolrIndexWriter@7d7158f6 commitCommandVersion:1642981873374199808
   [junit4]   2> 137842 INFO  (qtp1560284461-1117) [n:127.0.0.1:63983_solr c:collection1 s:shard1 r:core_node3 x:collection1_shard1_replica_n1 ] o.a.s.s.SolrIndexSearcher Opening [Searcher@725f9978[collection1_shard1_replica_n1] main]
   [junit4]   2> 137844 INFO  (searcher

[...truncated too long message...]

onTest.testStandardize
   [junit4] OK      0.06s J0 | MathExpressionTest.testMonteCarloWithVariables
   [junit4] OK      0.07s J0 | MathExpressionTest.testTimeDifferencingDefaultLag
   [junit4] OK      0.06s J0 | MathExpressionTest.testPlot
   [junit4] OK      0.18s J0 | MathExpressionTest.testConvolution
   [junit4] OK      0.07s J0 | MathExpressionTest.testAscend
   [junit4] OK      0.07s J0 | MathExpressionTest.testMatrixMult
   [junit4] OK      0.08s J0 | MathExpressionTest.testUniformIntegerDistribution
   [junit4] OK      0.09s J0 | MathExpressionTest.testMultiVariateNormalDistribution
   [junit4] OK      0.07s J0 | MathExpressionTest.testMean
   [junit4] OK      0.24s J0 | MathExpressionTest.testWeibullDistribution
   [junit4] OK      0.06s J0 | MathExpressionTest.testUpperLowerArray
   [junit4] OK      0.06s J0 | MathExpressionTest.testUnitize
   [junit4] OK      0.06s J0 | MathExpressionTest.testOnes
   [junit4] OK      0.06s J0 | MathExpressionTest.testChiSquareDataSet
   [junit4] OK      0.06s J0 | MathExpressionTest.testArray
   [junit4] OK      0.06s J0 | MathExpressionTest.testSpline
   [junit4] OK      0.07s J0 | MathExpressionTest.testPrecision
   [junit4] OK      0.06s J0 | MathExpressionTest.testOscillate
   [junit4] OK      0.06s J0 | MathExpressionTest.testOlsRegress
   [junit4] OK      0.06s J0 | MathExpressionTest.testMatrix
   [junit4] OK      0.11s J0 | MathExpressionTest.testCopyOfRange
   [junit4] OK      0.08s J0 | MathExpressionTest.testConcat
   [junit4] OK      0.08s J0 | MathExpressionTest.testZipFDistribution
   [junit4] OK      0.07s J0 | MathExpressionTest.testGeometricDistribution
   [junit4] OK      0.07s J0 | MathExpressionTest.testDateTime
   [junit4] OK      0.10s J0 | MathExpressionTest.testTermVectors
   [junit4] OK      0.07s J0 | MathExpressionTest.testGaussfit
   [junit4] OK      0.07s J0 | MathExpressionTest.testLerp
   [junit4] OK      0.07s J0 | MathExpressionTest.testAkima
   [junit4] OK      0.07s J0 | MathExpressionTest.testEnumeratedDistribution
   [junit4] OK      0.08s J0 | MathExpressionTest.testExponentialMovingAverage
   [junit4] OK      0.10s J0 | MathExpressionTest.testAnalyzeEvaluator
   [junit4] OK      0.06s J0 | MathExpressionTest.testPolyfit
   [junit4] OK      0.06s J0 | MathExpressionTest.testNotNullHaving
   [junit4] OK      0.07s J0 | MathExpressionTest.testTimeDifferencingDefinedLag
   [junit4] OK      0.08s J0 | MathExpressionTest.testCache
   [junit4] OK      0.06s J0 | MathExpressionTest.testTranspose
   [junit4] OK      0.10s J0 | MathExpressionTest.testLength
   [junit4] OK      0.10s J0 | MathExpressionTest.testDescribe
   [junit4] OK      0.09s J0 | MathExpressionTest.testKnnRegress
   [junit4] OK      0.08s J0 | MathExpressionTest.testPivot
   [junit4] OK      0.07s J0 | MathExpressionTest.testEnclosingDisk
   [junit4] OK      0.06s J0 | MathExpressionTest.testMemset
   [junit4] OK      0.06s J0 | MathExpressionTest.testCosineSimilarity
   [junit4] OK      0.07s J0 | MathExpressionTest.testNatural
   [junit4] OK      0.06s J0 | MathExpressionTest.testLog10
   [junit4] OK      0.06s J0 | MathExpressionTest.testBicubicSpline
   [junit4] OK      0.06s J0 | MathExpressionTest.testIntegrate
   [junit4] OK      0.06s J0 | MathExpressionTest.testKnn
   [junit4] OK      0.07s J0 | MathExpressionTest.testMemsetSize
   [junit4] OK      0.10s J0 | MathExpressionTest.testTriangularDistribution
   [junit4] OK      0.06s J0 | MathExpressionTest.testMovingAverage
   [junit4] OK      0.06s J0 | MathExpressionTest.testMonteCarlo
   [junit4] Completed [5/5] on J0 in 15.74s, 132 tests
   [junit4]
   [junit4] JVM J0:     1.56 ..   103.04 =   101.47s
   [junit4] JVM J1:     1.57 ..    87.11 =    85.55s
   [junit4] Execution time total: 1 minute 43 seconds
   [junit4] Tests summary: 5 suites, 660 tests
   [junit4] Could not remove temporary path: /Users/jenkins/workspace/Lucene-Solr-8.x-MacOSX/solr/build/solr-solrj/test/J1 (java.nio.file.DirectoryNotEmptyException: Remaining files: [/Users/jenkins/workspace/Lucene-Solr-8.x-MacOSX/solr/build/solr-solrj/test/J1/temp])
   [junit4] Could not remove temporary path: /Users/jenkins/workspace/Lucene-Solr-8.x-MacOSX/solr/build/solr-solrj/test/J0 (java.nio.file.DirectoryNotEmptyException: Remaining files: [/Users/jenkins/workspace/Lucene-Solr-8.x-MacOSX/solr/build/solr-solrj/test/J0/temp])
     [echo] 5 slowest tests:
[junit4:tophints]  99.42s | org.apache.solr.client.solrj.impl.CloudSolrClientTest
[junit4:tophints]  97.25s | org.apache.solr.client.solrj.impl.CloudHttp2SolrClientTest
[junit4:tophints]  92.84s | org.apache.solr.client.solrj.io.stream.StreamDecoratorTest
[junit4:tophints]  79.41s | org.apache.solr.common.cloud.TestCollectionStateWatchers
[junit4:tophints]  60.31s | org.apache.solr.client.solrj.io.stream.StreamExpressionTest

-check-totals:

test-nocompile:

BUILD SUCCESSFUL
Total time: 1 minute 46 seconds
[repro] Failures:
[repro]   0/5 failed: org.apache.solr.client.solrj.io.stream.MathExpressionTest
[repro] Exiting with code 0
+ mv lucene/build lucene/build.repro
+ mv solr/build solr/build.repro
+ mv lucene/build.orig lucene/build
+ mv solr/build.orig solr/build
Archiving artifacts
Setting ANT_1_8_2_HOME=/Users/jenkins/tools/hudson.tasks.Ant_AntInstallation/ANT_1.8.2
java.lang.InterruptedException: no matches found within 10000
        at hudson.FilePath$ValidateAntFileMask.hasMatch(FilePath.java:2805)
        at hudson.FilePath$ValidateAntFileMask.invoke(FilePath.java:2684)
        at hudson.FilePath$ValidateAntFileMask.invoke(FilePath.java:2665)
        at hudson.FilePath$FileCallableWrapper.call(FilePath.java:3052)
Also:   hudson.remoting.Channel$CallSiteStackTrace: Remote call to MacOSX VBOX
                at hudson.remoting.Channel.attachCallSiteStackTrace(Channel.java:1743)
                at hudson.remoting.UserRequest$ExceptionResponse.retrieve(UserRequest.java:357)
                at hudson.remoting.Channel.call(Channel.java:957)
                at hudson.FilePath.act(FilePath.java:1072)
                at hudson.FilePath.act(FilePath.java:1061)
                at hudson.FilePath.validateAntFileMask(FilePath.java:2663)
                at hudson.tasks.ArtifactArchiver.perform(ArtifactArchiver.java:248)
                at hudson.tasks.BuildStepCompatibilityLayer.perform(BuildStepCompatibilityLayer.java:79)
                at hudson.tasks.BuildStepMonitor$1.perform(BuildStepMonitor.java:20)
                at hudson.model.AbstractBuild$AbstractBuildExecution.perform(AbstractBuild.java:741)
                at hudson.model.AbstractBuild$AbstractBuildExecution.performAllBuildSteps(AbstractBuild.java:690)
                at hudson.model.Build$BuildExecution.post2(Build.java:186)
                at hudson.model.AbstractBuild$AbstractBuildExecution.post(AbstractBuild.java:635)
                at hudson.model.Run.execute(Run.java:1840)
                at hudson.model.FreeStyleBuild.run(FreeStyleBuild.java:43)
                at hudson.model.ResourceController.execute(ResourceController.java:97)
                at hudson.model.Executor.run(Executor.java:429)
Caused: hudson.FilePath$TunneledInterruptedException
        at hudson.FilePath$FileCallableWrapper.call(FilePath.java:3054)
        at hudson.remoting.UserRequest.perform(UserRequest.java:212)
        at hudson.remoting.UserRequest.perform(UserRequest.java:54)
        at hudson.remoting.Request$2.run(Request.java:369)
        at hudson.remoting.InterceptingExecutorService$1.call(InterceptingExecutorService.java:72)
        at java.util.concurrent.FutureTask.run(FutureTask.java:266)
        at java.util.concurrent.ThreadPoolExecutor.runWorker(ThreadPoolExecutor.java:1149)
        at java.util.concurrent.ThreadPoolExecutor$Worker.run(ThreadPoolExecutor.java:624)
        at java.lang.Thread.run(Thread.java:748)
Caused: java.lang.InterruptedException: java.lang.InterruptedException: no matches found within 10000
        at hudson.FilePath.act(FilePath.java:1074)
        at hudson.FilePath.act(FilePath.java:1061)
        at hudson.FilePath.validateAntFileMask(FilePath.java:2663)
        at hudson.tasks.ArtifactArchiver.perform(ArtifactArchiver.java:248)
        at hudson.tasks.BuildStepCompatibilityLayer.perform(BuildStepCompatibilityLayer.java:79)
        at hudson.tasks.BuildStepMonitor$1.perform(BuildStepMonitor.java:20)
        at hudson.model.AbstractBuild$AbstractBuildExecution.perform(AbstractBuild.java:741)
        at hudson.model.AbstractBuild$AbstractBuildExecution.performAllBuildSteps(AbstractBuild.java:690)
        at hudson.model.Build$BuildExecution.post2(Build.java:186)
        at hudson.model.AbstractBuild$AbstractBuildExecution.post(AbstractBuild.java:635)
        at hudson.model.Run.execute(Run.java:1840)
        at hudson.model.FreeStyleBuild.run(FreeStyleBuild.java:43)
        at hudson.model.ResourceController.execute(ResourceController.java:97)
        at hudson.model.Executor.run(Executor.java:429)
No artifacts found that match the file pattern "**/*.events,heapdumps/**,**/*_pid*.log". Configuration error?
[WARNINGS] Parsing warnings in console log with parser Java Compiler (javac)
Setting ANT_1_8_2_HOME=/Users/jenkins/tools/hudson.tasks.Ant_AntInstallation/ANT_1.8.2
No credentials specified
Setting ANT_1_8_2_HOME=/Users/jenkins/tools/hudson.tasks.Ant_AntInstallation/ANT_1.8.2
<Git Blamer> Using GitBlamer to create author and commit information for all warnings.
<Git Blamer> GIT_COMMIT=d0ea612d4eafece77db76c12437978032fcd90e3, workspace=/Users/jenkins/workspace/Lucene-Solr-8.x-MacOSX
[WARNINGS] Computing warning deltas based on reference build #296
Recording test results
Setting ANT_1_8_2_HOME=/Users/jenkins/tools/hudson.tasks.Ant_AntInstallation/ANT_1.8.2
Build step 'Publish JUnit test result report' changed build result to UNSTABLE
Email was triggered for: Unstable (Test Failures)
Sending email for trigger: Unstable (Test Failures)
Setting ANT_1_8_2_HOME=/Users/jenkins/tools/hudson.tasks.Ant_AntInstallation/ANT_1.8.2
Setting ANT_1_8_2_HOME=/Users/jenkins/tools/hudson.tasks.Ant_AntInstallation/ANT_1.8.2
Setting ANT_1_8_2_HOME=/Users/jenkins/tools/hudson.tasks.Ant_AntInstallation/ANT_1.8.2
Setting ANT_1_8_2_HOME=/Users/jenkins/tools/hudson.tasks.Ant_AntInstallation/ANT_1.8.2
Setting ANT_1_8_2_HOME=/Users/jenkins/tools/hudson.tasks.Ant_AntInstallation/ANT_1.8.2
Setting ANT_1_8_2_HOME=/Users/jenkins/tools/hudson.tasks.Ant_AntInstallation/ANT_1.8.2


---------------------------------------------------------------------
To unsubscribe, e-mail: [hidden email]
For additional commands, e-mail: [hidden email]