[JENKINS] Lucene-Solr-8.x-Solaris (64bit/jdk1.8.0) - Build # 263 - Failure!

classic Classic list List threaded Threaded
4 messages Options
Reply | Threaded
Open this post in threaded view
|

[JENKINS] Lucene-Solr-8.x-Solaris (64bit/jdk1.8.0) - Build # 263 - Failure!

Policeman Jenkins Server-2
Build: https://jenkins.thetaphi.de/job/Lucene-Solr-8.x-Solaris/263/
Java: 64bit/jdk1.8.0 -XX:+UseCompressedOops -XX:+UseParallelGC

All tests passed

Build Log:
[...truncated 12278 lines...]
BUILD FAILED
/export/home/jenkins/workspace/Lucene-Solr-8.x-Solaris/build.xml:634: The following error occurred while executing this line:
/export/home/jenkins/workspace/Lucene-Solr-8.x-Solaris/build.xml:578: The following error occurred while executing this line:
/export/home/jenkins/workspace/Lucene-Solr-8.x-Solaris/build.xml:59: The following error occurred while executing this line:
/export/home/jenkins/workspace/Lucene-Solr-8.x-Solaris/solr/build.xml:231: The following error occurred while executing this line:
/export/home/jenkins/workspace/Lucene-Solr-8.x-Solaris/solr/common-build.xml:558: The following error occurred while executing this line:
/export/home/jenkins/workspace/Lucene-Solr-8.x-Solaris/solr/common-build.xml:506: The following error occurred while executing this line:
/export/home/jenkins/workspace/Lucene-Solr-8.x-Solaris/solr/common-build.xml:401: The following error occurred while executing this line:
/export/home/jenkins/workspace/Lucene-Solr-8.x-Solaris/lucene/common-build.xml:558: The following error occurred while executing this line:
/export/home/jenkins/workspace/Lucene-Solr-8.x-Solaris/lucene/common-build.xml:2056: Error starting modern compiler

Total time: 26 minutes 27 seconds
Build step 'Invoke Ant' marked build as failure
Archiving artifacts
Setting ANT_1_8_2_HOME=/export/home/jenkins/tools/hudson.tasks.Ant_AntInstallation/ANT_1.8.2
[WARNINGS] Skipping publisher since build result is FAILURE
Recording test results
Setting ANT_1_8_2_HOME=/export/home/jenkins/tools/hudson.tasks.Ant_AntInstallation/ANT_1.8.2
Email was triggered for: Failure - Any
Sending email for trigger: Failure - Any
Setting ANT_1_8_2_HOME=/export/home/jenkins/tools/hudson.tasks.Ant_AntInstallation/ANT_1.8.2
Setting ANT_1_8_2_HOME=/export/home/jenkins/tools/hudson.tasks.Ant_AntInstallation/ANT_1.8.2
Setting ANT_1_8_2_HOME=/export/home/jenkins/tools/hudson.tasks.Ant_AntInstallation/ANT_1.8.2
Setting ANT_1_8_2_HOME=/export/home/jenkins/tools/hudson.tasks.Ant_AntInstallation/ANT_1.8.2
Setting ANT_1_8_2_HOME=/export/home/jenkins/tools/hudson.tasks.Ant_AntInstallation/ANT_1.8.2
Setting ANT_1_8_2_HOME=/export/home/jenkins/tools/hudson.tasks.Ant_AntInstallation/ANT_1.8.2


---------------------------------------------------------------------
To unsubscribe, e-mail: [hidden email]
For additional commands, e-mail: [hidden email]
Reply | Threaded
Open this post in threaded view
|

[JENKINS] Lucene-Solr-8.x-Solaris (64bit/jdk1.8.0) - Build # 264 - Still Failing!

Policeman Jenkins Server-2
Build: https://jenkins.thetaphi.de/job/Lucene-Solr-8.x-Solaris/264/
Java: 64bit/jdk1.8.0 -XX:+UseCompressedOops -XX:+UseSerialGC

All tests passed

Build Log:
[...truncated 12276 lines...]
BUILD FAILED
/export/home/jenkins/workspace/Lucene-Solr-8.x-Solaris/build.xml:634: The following error occurred while executing this line:
/export/home/jenkins/workspace/Lucene-Solr-8.x-Solaris/build.xml:578: The following error occurred while executing this line:
/export/home/jenkins/workspace/Lucene-Solr-8.x-Solaris/build.xml:59: The following error occurred while executing this line:
/export/home/jenkins/workspace/Lucene-Solr-8.x-Solaris/solr/build.xml:231: The following error occurred while executing this line:
/export/home/jenkins/workspace/Lucene-Solr-8.x-Solaris/solr/common-build.xml:558: The following error occurred while executing this line:
/export/home/jenkins/workspace/Lucene-Solr-8.x-Solaris/solr/common-build.xml:506: The following error occurred while executing this line:
/export/home/jenkins/workspace/Lucene-Solr-8.x-Solaris/solr/common-build.xml:401: The following error occurred while executing this line:
/export/home/jenkins/workspace/Lucene-Solr-8.x-Solaris/lucene/common-build.xml:558: The following error occurred while executing this line:
/export/home/jenkins/workspace/Lucene-Solr-8.x-Solaris/lucene/common-build.xml:2056: Error starting modern compiler

Total time: 18 minutes 40 seconds
Build step 'Invoke Ant' marked build as failure
Archiving artifacts
Setting ANT_1_8_2_HOME=/export/home/jenkins/tools/hudson.tasks.Ant_AntInstallation/ANT_1.8.2
[WARNINGS] Skipping publisher since build result is FAILURE
Recording test results
Setting ANT_1_8_2_HOME=/export/home/jenkins/tools/hudson.tasks.Ant_AntInstallation/ANT_1.8.2
Email was triggered for: Failure - Any
Sending email for trigger: Failure - Any
Setting ANT_1_8_2_HOME=/export/home/jenkins/tools/hudson.tasks.Ant_AntInstallation/ANT_1.8.2
Setting ANT_1_8_2_HOME=/export/home/jenkins/tools/hudson.tasks.Ant_AntInstallation/ANT_1.8.2
Setting ANT_1_8_2_HOME=/export/home/jenkins/tools/hudson.tasks.Ant_AntInstallation/ANT_1.8.2
Setting ANT_1_8_2_HOME=/export/home/jenkins/tools/hudson.tasks.Ant_AntInstallation/ANT_1.8.2
Setting ANT_1_8_2_HOME=/export/home/jenkins/tools/hudson.tasks.Ant_AntInstallation/ANT_1.8.2
Setting ANT_1_8_2_HOME=/export/home/jenkins/tools/hudson.tasks.Ant_AntInstallation/ANT_1.8.2


---------------------------------------------------------------------
To unsubscribe, e-mail: [hidden email]
For additional commands, e-mail: [hidden email]
Reply | Threaded
Open this post in threaded view
|

[JENKINS] Lucene-Solr-8.x-Solaris (64bit/jdk1.8.0) - Build # 265 - Unstable!

Policeman Jenkins Server-2
Build: https://jenkins.thetaphi.de/job/Lucene-Solr-8.x-Solaris/265/
Java: 64bit/jdk1.8.0 -XX:+UseCompressedOops -XX:+UseConcMarkSweepGC

1 tests failed.
FAILED:  org.apache.lucene.index.TestIndexWriterWithThreads.testIOExceptionDuringAbortWithThreads

Error Message:
MockDirectoryWrapper: cannot close: there are still 4 open files: {_0.cfs=1, _2.cfs=1, _1.cfs=1, _3.cfs=1}

Stack Trace:
java.lang.RuntimeException: MockDirectoryWrapper: cannot close: there are still 4 open files: {_0.cfs=1, _2.cfs=1, _1.cfs=1, _3.cfs=1}
        at __randomizedtesting.SeedInfo.seed([8A4C77E7CC808387:EBE17F6810AE003B]:0)
        at org.apache.lucene.store.MockDirectoryWrapper.close(MockDirectoryWrapper.java:838)
        at org.apache.lucene.index.TestIndexWriterWithThreads._testMultipleThreadsFailure(TestIndexWriterWithThreads.java:341)
        at org.apache.lucene.index.TestIndexWriterWithThreads.testIOExceptionDuringAbortWithThreads(TestIndexWriterWithThreads.java:458)
        at sun.reflect.NativeMethodAccessorImpl.invoke0(Native Method)
        at sun.reflect.NativeMethodAccessorImpl.invoke(NativeMethodAccessorImpl.java:62)
        at sun.reflect.DelegatingMethodAccessorImpl.invoke(DelegatingMethodAccessorImpl.java:43)
        at java.lang.reflect.Method.invoke(Method.java:498)
        at com.carrotsearch.randomizedtesting.RandomizedRunner.invoke(RandomizedRunner.java:1750)
        at com.carrotsearch.randomizedtesting.RandomizedRunner$8.evaluate(RandomizedRunner.java:938)
        at com.carrotsearch.randomizedtesting.RandomizedRunner$9.evaluate(RandomizedRunner.java:974)
        at com.carrotsearch.randomizedtesting.RandomizedRunner$10.evaluate(RandomizedRunner.java:988)
        at org.apache.lucene.util.TestRuleSetupTeardownChained$1.evaluate(TestRuleSetupTeardownChained.java:49)
        at org.apache.lucene.util.AbstractBeforeAfterRule$1.evaluate(AbstractBeforeAfterRule.java:45)
        at org.apache.lucene.util.TestRuleThreadAndTestName$1.evaluate(TestRuleThreadAndTestName.java:48)
        at org.apache.lucene.util.TestRuleIgnoreAfterMaxFailures$1.evaluate(TestRuleIgnoreAfterMaxFailures.java:64)
        at org.apache.lucene.util.TestRuleMarkFailure$1.evaluate(TestRuleMarkFailure.java:47)
        at com.carrotsearch.randomizedtesting.rules.StatementAdapter.evaluate(StatementAdapter.java:36)
        at com.carrotsearch.randomizedtesting.ThreadLeakControl$StatementRunner.run(ThreadLeakControl.java:368)
        at com.carrotsearch.randomizedtesting.ThreadLeakControl.forkTimeoutingTask(ThreadLeakControl.java:817)
        at com.carrotsearch.randomizedtesting.ThreadLeakControl$3.evaluate(ThreadLeakControl.java:468)
        at com.carrotsearch.randomizedtesting.RandomizedRunner.runSingleTest(RandomizedRunner.java:947)
        at com.carrotsearch.randomizedtesting.RandomizedRunner$5.evaluate(RandomizedRunner.java:832)
        at com.carrotsearch.randomizedtesting.RandomizedRunner$6.evaluate(RandomizedRunner.java:883)
        at com.carrotsearch.randomizedtesting.RandomizedRunner$7.evaluate(RandomizedRunner.java:894)
        at org.apache.lucene.util.AbstractBeforeAfterRule$1.evaluate(AbstractBeforeAfterRule.java:45)
        at com.carrotsearch.randomizedtesting.rules.StatementAdapter.evaluate(StatementAdapter.java:36)
        at org.apache.lucene.util.TestRuleStoreClassName$1.evaluate(TestRuleStoreClassName.java:41)
        at com.carrotsearch.randomizedtesting.rules.NoShadowingOrOverridesOnMethodsRule$1.evaluate(NoShadowingOrOverridesOnMethodsRule.java:40)
        at com.carrotsearch.randomizedtesting.rules.NoShadowingOrOverridesOnMethodsRule$1.evaluate(NoShadowingOrOverridesOnMethodsRule.java:40)
        at com.carrotsearch.randomizedtesting.rules.StatementAdapter.evaluate(StatementAdapter.java:36)
        at com.carrotsearch.randomizedtesting.rules.StatementAdapter.evaluate(StatementAdapter.java:36)
        at com.carrotsearch.randomizedtesting.rules.StatementAdapter.evaluate(StatementAdapter.java:36)
        at org.apache.lucene.util.TestRuleAssertionsRequired$1.evaluate(TestRuleAssertionsRequired.java:53)
        at org.apache.lucene.util.TestRuleMarkFailure$1.evaluate(TestRuleMarkFailure.java:47)
        at org.apache.lucene.util.TestRuleIgnoreAfterMaxFailures$1.evaluate(TestRuleIgnoreAfterMaxFailures.java:64)
        at org.apache.lucene.util.TestRuleIgnoreTestSuites$1.evaluate(TestRuleIgnoreTestSuites.java:54)
        at com.carrotsearch.randomizedtesting.rules.StatementAdapter.evaluate(StatementAdapter.java:36)
        at com.carrotsearch.randomizedtesting.ThreadLeakControl$StatementRunner.run(ThreadLeakControl.java:368)
        at java.lang.Thread.run(Thread.java:748)
Caused by: java.lang.RuntimeException: unclosed IndexInput: _3.cfs
        at org.apache.lucene.store.MockDirectoryWrapper.addFileHandle(MockDirectoryWrapper.java:730)
        at org.apache.lucene.store.MockDirectoryWrapper.openInput(MockDirectoryWrapper.java:773)
        at org.apache.lucene.codecs.lucene50.Lucene50CompoundReader.<init>(Lucene50CompoundReader.java:79)
        at org.apache.lucene.codecs.lucene50.Lucene50CompoundFormat.getCompoundReader(Lucene50CompoundFormat.java:70)
        at org.apache.lucene.index.SegmentCoreReaders.<init>(SegmentCoreReaders.java:101)
        at org.apache.lucene.index.SegmentReader.<init>(SegmentReader.java:84)
        at org.apache.lucene.index.ReadersAndUpdates.getReader(ReadersAndUpdates.java:177)
        at org.apache.lucene.index.BufferedUpdatesStream$SegmentState.<init>(BufferedUpdatesStream.java:271)
        at org.apache.lucene.index.FrozenBufferedUpdates.openSegmentStates(FrozenBufferedUpdates.java:328)
        at org.apache.lucene.index.FrozenBufferedUpdates.forceApply(FrozenBufferedUpdates.java:221)
        at org.apache.lucene.index.FrozenBufferedUpdates.tryApply(FrozenBufferedUpdates.java:159)
        at org.apache.lucene.index.IndexWriter.lambda$publishFrozenUpdates$3(IndexWriter.java:2592)
        at org.apache.lucene.index.IndexWriter.processEvents(IndexWriter.java:5116)
        at org.apache.lucene.index.IndexWriter.updateDocument(IndexWriter.java:1597)
        at org.apache.lucene.index.IndexWriter.updateDocument(IndexWriter.java:1586)
        at org.apache.lucene.index.TestIndexWriterWithThreads$IndexerThread.run(TestIndexWriterWithThreads.java:96)




Build Log:
[...truncated 512 lines...]
   [junit4] Suite: org.apache.lucene.index.TestIndexWriterWithThreads
   [junit4]   2> NOTE: reproduce with: ant test  -Dtestcase=TestIndexWriterWithThreads -Dtests.method=testIOExceptionDuringAbortWithThreads -Dtests.seed=8A4C77E7CC808387 -Dtests.slow=true -Dtests.locale=und -Dtests.timezone=Asia/Karachi -Dtests.asserts=true -Dtests.file.encoding=UTF-8
   [junit4] ERROR   0.11s J1 | TestIndexWriterWithThreads.testIOExceptionDuringAbortWithThreads <<<
   [junit4]    > Throwable #1: java.lang.RuntimeException: MockDirectoryWrapper: cannot close: there are still 4 open files: {_0.cfs=1, _2.cfs=1, _1.cfs=1, _3.cfs=1}
   [junit4]    > at __randomizedtesting.SeedInfo.seed([8A4C77E7CC808387:EBE17F6810AE003B]:0)
   [junit4]    > at org.apache.lucene.store.MockDirectoryWrapper.close(MockDirectoryWrapper.java:838)
   [junit4]    > at org.apache.lucene.index.TestIndexWriterWithThreads._testMultipleThreadsFailure(TestIndexWriterWithThreads.java:341)
   [junit4]    > at org.apache.lucene.index.TestIndexWriterWithThreads.testIOExceptionDuringAbortWithThreads(TestIndexWriterWithThreads.java:458)
   [junit4]    > at java.lang.Thread.run(Thread.java:748)
   [junit4]    > Caused by: java.lang.RuntimeException: unclosed IndexInput: _3.cfs
   [junit4]    > at org.apache.lucene.store.MockDirectoryWrapper.addFileHandle(MockDirectoryWrapper.java:730)
   [junit4]    > at org.apache.lucene.store.MockDirectoryWrapper.openInput(MockDirectoryWrapper.java:773)
   [junit4]    > at org.apache.lucene.codecs.lucene50.Lucene50CompoundReader.<init>(Lucene50CompoundReader.java:79)
   [junit4]    > at org.apache.lucene.codecs.lucene50.Lucene50CompoundFormat.getCompoundReader(Lucene50CompoundFormat.java:70)
   [junit4]    > at org.apache.lucene.index.SegmentCoreReaders.<init>(SegmentCoreReaders.java:101)
   [junit4]    > at org.apache.lucene.index.SegmentReader.<init>(SegmentReader.java:84)
   [junit4]    > at org.apache.lucene.index.ReadersAndUpdates.getReader(ReadersAndUpdates.java:177)
   [junit4]    > at org.apache.lucene.index.BufferedUpdatesStream$SegmentState.<init>(BufferedUpdatesStream.java:271)
   [junit4]    > at org.apache.lucene.index.FrozenBufferedUpdates.openSegmentStates(FrozenBufferedUpdates.java:328)
   [junit4]    > at org.apache.lucene.index.FrozenBufferedUpdates.forceApply(FrozenBufferedUpdates.java:221)
   [junit4]    > at org.apache.lucene.index.FrozenBufferedUpdates.tryApply(FrozenBufferedUpdates.java:159)
   [junit4]    > at org.apache.lucene.index.IndexWriter.lambda$publishFrozenUpdates$3(IndexWriter.java:2592)
   [junit4]    > at org.apache.lucene.index.IndexWriter.processEvents(IndexWriter.java:5116)
   [junit4]    > at org.apache.lucene.index.IndexWriter.updateDocument(IndexWriter.java:1597)
   [junit4]    > at org.apache.lucene.index.IndexWriter.updateDocument(IndexWriter.java:1586)
   [junit4]    > at org.apache.lucene.index.TestIndexWriterWithThreads$IndexerThread.run(TestIndexWriterWithThreads.java:96)
   [junit4]   2> NOTE: test params are: codec=Asserting(Lucene80): {date=PostingsFormat(name=LuceneVarGapDocFreqInterval), field=PostingsFormat(name=LuceneVarGapDocFreqInterval), docid=Lucene50(blocksize=128), titleTokenized=Lucene50(blocksize=128), id=Lucene50(blocksize=128), body=PostingsFormat(name=LuceneVarGapDocFreqInterval), title=TestBloomFilteredLucenePostings(BloomFilteringPostingsFormat(Lucene50(blocksize=128)))}, docValues:{date=DocValuesFormat(name=Asserting), dv=DocValuesFormat(name=Asserting), docid_intDV=DocValuesFormat(name=Lucene80), docid_int=DocValuesFormat(name=Lucene80), field=DocValuesFormat(name=Asserting), docid=DocValuesFormat(name=Lucene80), titleTokenized=DocValuesFormat(name=Lucene80), id=DocValuesFormat(name=Lucene80), title=DocValuesFormat(name=Direct), body=DocValuesFormat(name=Asserting), ___soft_deletes=DocValuesFormat(name=Asserting), titleDV=DocValuesFormat(name=Direct)}, maxPointsInLeafNode=788, maxMBSortInHeap=7.166579146822819, sim=Asserting(org.apache.lucene.search.similarities.AssertingSimilarity@6f3b2efa), locale=und, timezone=Asia/Karachi
   [junit4]   2> NOTE: SunOS 5.11 amd64/Oracle Corporation 1.8.0_221 (64-bit)/cpus=3,threads=1,free=68179288,total=188592128
   [junit4]   2> NOTE: All tests run in this JVM: [TestIndexWriterExceptions, TestBagOfPostings, TestLongValuesSource, TestSpanContainQuery, TestSimpleFSLockFactory, TestPolygon, LimitedFiniteStringsIteratorTest, TestTermRangeQuery, TestLazyProxSkipping, TestAxiomaticF1LOG, TestLucene60PointsFormat, TestApproximationSearchEquivalence, TestIndexWriterThreadsToSegments, TestPrefixInBooleanQuery, TestDeterminism, TestSloppyPhraseQuery2, TestStressAdvance, TestAutomatonQueryUnicode, TestFloatRangeFieldQueries, TestSwappedIndexFiles, TestTransactions, TestIndexWriterWithThreads]
   [junit4] Completed [47/525 (1!)] on J1 in 3.96s, 14 tests, 1 error <<< FAILURES!

[...truncated 67411 lines...]
[asciidoctor:convert] asciidoctor: ERROR: about-this-guide.adoc: line 1: invalid part, must have at least one section (e.g., chapter, appendix, etc.)
[asciidoctor:convert] asciidoctor: ERROR: solr-glossary.adoc: line 1: invalid part, must have at least one section (e.g., chapter, appendix, etc.)
     [java] Processed 2593 links (2119 relative) to 3410 anchors in 259 files
     [echo] Validated Links & Anchors via: /export/home/jenkins/workspace/Lucene-Solr-8.x-Solaris/solr/build/solr-ref-guide/bare-bones-html/

-documentation-lint:
    [jtidy] Checking for broken html (such as invalid tags)...
   [delete] Deleting directory /export/home/jenkins/workspace/Lucene-Solr-8.x-Solaris/lucene/build/jtidy_tmp
     [echo] Checking for broken links...
     [exec]
     [exec] Crawl/parse...
     [exec]
     [exec] Verify...
     [echo] Checking for malformed docs...

jar-checksums:

resolve:

ivy-availability-check:
[loadresource] Do not set property disallowed.ivy.jars.list as its length is 0.

-ivy-fail-disallowed-ivy-version:

ivy-fail:

ivy-configure:
[ivy:configure] :: loading settings :: file = /export/home/jenkins/workspace/Lucene-Solr-8.x-Solaris/lucene/top-level-ivy-settings.xml

resolve:

ivy-availability-check:
[loadresource] Do not set property disallowed.ivy.jars.list as its length is 0.

-ivy-fail-disallowed-ivy-version:

ivy-fail:

ivy-configure:
[ivy:configure] :: loading settings :: file = /export/home/jenkins/workspace/Lucene-Solr-8.x-Solaris/lucene/top-level-ivy-settings.xml

resolve:

resolve:

ivy-availability-check:
[loadresource] Do not set property disallowed.ivy.jars.list as its length is 0.

-ivy-fail-disallowed-ivy-version:

ivy-fail:

ivy-configure:
[ivy:configure] :: loading settings :: file = /export/home/jenkins/workspace/Lucene-Solr-8.x-Solaris/lucene/top-level-ivy-settings.xml

resolve:

ivy-availability-check:
[loadresource] Do not set property disallowed.ivy.jars.list as its length is 0.

-ivy-fail-disallowed-ivy-version:

ivy-fail:

ivy-configure:
[ivy:configure] :: loading settings :: file = /export/home/jenkins/workspace/Lucene-Solr-8.x-Solaris/lucene/top-level-ivy-settings.xml

resolve:

ivy-availability-check:
[loadresource] Do not set property disallowed.ivy.jars.list as its length is 0.

-ivy-fail-disallowed-ivy-version:

ivy-fail:

ivy-configure:
[ivy:configure] :: loading settings :: file = /export/home/jenkins/workspace/Lucene-Solr-8.x-Solaris/lucene/top-level-ivy-settings.xml

resolve:

ivy-availability-check:
[loadresource] Do not set property disallowed.ivy.jars.list as its length is 0.

-ivy-fail-disallowed-ivy-version:

ivy-fail:

ivy-configure:
[ivy:configure] :: loading settings :: file = /export/home/jenkins/workspace/Lucene-Solr-8.x-Solaris/lucene/top-level-ivy-settings.xml

resolve:

ivy-availability-check:
[loadresource] Do not set property disallowed.ivy.jars.list as its length is 0.

-ivy-fail-disallowed-ivy-version:

ivy-fail:

ivy-configure:
[ivy:configure] :: loading settings :: file = /export/home/jenkins/workspace/Lucene-Solr-8.x-Solaris/lucene/top-level-ivy-settings.xml

resolve:

ivy-availability-check:
[loadresource] Do not set property disallowed.ivy.jars.list as its length is 0.

-ivy-fail-disallowed-ivy-version:

ivy-fail:

ivy-configure:
[ivy:configure] :: loading settings :: file = /export/home/jenkins/workspace/Lucene-Solr-8.x-Solaris/lucene/top-level-ivy-settings.xml

resolve:

ivy-availability-check:
[loadresource] Do not set property disallowed.ivy.jars.list as its length is 0.

-ivy-fail-disallowed-ivy-version:

ivy-fail:

ivy-configure:
[ivy:configure] :: loading settings :: file = /export/home/jenkins/workspace/Lucene-Solr-8.x-Solaris/lucene/top-level-ivy-settings.xml

resolve:

ivy-availability-check:
[loadresource] Do not set property disallowed.ivy.jars.list as its length is 0.

-ivy-fail-disallowed-ivy-version:

ivy-fail:

ivy-configure:
[ivy:configure] :: loading settings :: file = /export/home/jenkins/workspace/Lucene-Solr-8.x-Solaris/lucene/top-level-ivy-settings.xml

resolve:

ivy-availability-check:
[loadresource] Do not set property disallowed.ivy.jars.list as its length is 0.

-ivy-fail-disallowed-ivy-version:

ivy-fail:

ivy-configure:
[ivy:configure] :: loading settings :: file = /export/home/jenkins/workspace/Lucene-Solr-8.x-Solaris/lucene/top-level-ivy-settings.xml

resolve:

ivy-availability-check:
[loadresource] Do not set property disallowed.ivy.jars.list as its length is 0.

-ivy-fail-disallowed-ivy-version:

ivy-fail:

ivy-configure:
[ivy:configure] :: loading settings :: file = /export/home/jenkins/workspace/Lucene-Solr-8.x-Solaris/lucene/top-level-ivy-settings.xml

resolve:

ivy-availability-check:
[loadresource] Do not set property disallowed.ivy.jars.list as its length is 0.

-ivy-fail-disallowed-ivy-version:

ivy-fail:

ivy-configure:
[ivy:configure] :: loading settings :: file = /export/home/jenkins/workspace/Lucene-Solr-8.x-Solaris/lucene/top-level-ivy-settings.xml

resolve:

ivy-availability-check:
[loadresource] Do not set property disallowed.ivy.jars.list as its length is 0.

-ivy-fail-disallowed-ivy-version:

ivy-fail:

ivy-configure:
[ivy:configure] :: loading settings :: file = /export/home/jenkins/workspace/Lucene-Solr-8.x-Solaris/lucene/top-level-ivy-settings.xml

resolve:

ivy-availability-check:
[loadresource] Do not set property disallowed.ivy.jars.list as its length is 0.

-ivy-fail-disallowed-ivy-version:

ivy-fail:

ivy-configure:
[ivy:configure] :: loading settings :: file = /export/home/jenkins/workspace/Lucene-Solr-8.x-Solaris/lucene/top-level-ivy-settings.xml

resolve:

ivy-availability-check:
[loadresource] Do not set property disallowed.ivy.jars.list as its length is 0.

-ivy-fail-disallowed-ivy-version:

ivy-fail:

ivy-configure:
[ivy:configure] :: loading settings :: file = /export/home/jenkins/workspace/Lucene-Solr-8.x-Solaris/lucene/top-level-ivy-settings.xml

resolve:

ivy-availability-check:
[loadresource] Do not set property disallowed.ivy.jars.list as its length is 0.

-ivy-fail-disallowed-ivy-version:

ivy-fail:

ivy-configure:
[ivy:configure] :: loading settings :: file = /export/home/jenkins/workspace/Lucene-Solr-8.x-Solaris/lucene/top-level-ivy-settings.xml

resolve:

ivy-availability-check:
[loadresource] Do not set property disallowed.ivy.jars.list as its length is 0.

-ivy-fail-disallowed-ivy-version:

ivy-fail:

ivy-configure:
[ivy:configure] :: loading settings :: file = /export/home/jenkins/workspace/Lucene-Solr-8.x-Solaris/lucene/top-level-ivy-settings.xml

resolve:

ivy-availability-check:
[loadresource] Do not set property disallowed.ivy.jars.list as its length is 0.

-ivy-fail-disallowed-ivy-version:

ivy-fail:

ivy-configure:
[ivy:configure] :: loading settings :: file = /export/home/jenkins/workspace/Lucene-Solr-8.x-Solaris/lucene/top-level-ivy-settings.xml

resolve:

ivy-availability-check:
[loadresource] Do not set property disallowed.ivy.jars.list as its length is 0.

-ivy-fail-disallowed-ivy-version:

ivy-fail:

ivy-configure:
[ivy:configure] :: loading settings :: file = /export/home/jenkins/workspace/Lucene-Solr-8.x-Solaris/lucene/top-level-ivy-settings.xml

resolve:

ivy-availability-check:
[loadresource] Do not set property disallowed.ivy.jars.list as its length is 0.

-ivy-fail-disallowed-ivy-version:

ivy-fail:

ivy-configure:
[ivy:configure] :: loading settings :: file = /export/home/jenkins/workspace/Lucene-Solr-8.x-Solaris/lucene/top-level-ivy-settings.xml

resolve:

ivy-availability-check:
[loadresource] Do not set property disallowed.ivy.jars.list as its length is 0.

-ivy-fail-disallowed-ivy-version:

ivy-fail:

ivy-configure:
[ivy:configure] :: loading settings :: file = /export/home/jenkins/workspace/Lucene-Solr-8.x-Solaris/lucene/top-level-ivy-settings.xml

resolve:

ivy-availability-check:
[loadresource] Do not set property disallowed.ivy.jars.list as its length is 0.

-ivy-fail-disallowed-ivy-version:

ivy-fail:

ivy-configure:
[ivy:configure] :: loading settings :: file = /export/home/jenkins/workspace/Lucene-Solr-8.x-Solaris/lucene/top-level-ivy-settings.xml

resolve:

ivy-availability-check:
[loadresource] Do not set property disallowed.ivy.jars.list as its length is 0.

-ivy-fail-disallowed-ivy-version:

ivy-fail:

ivy-configure:
[ivy:configure] :: loading settings :: file = /export/home/jenkins/workspace/Lucene-Solr-8.x-Solaris/lucene/top-level-ivy-settings.xml

resolve:

ivy-availability-check:
[loadresource] Do not set property disallowed.ivy.jars.list as its length is 0.

-ivy-fail-disallowed-ivy-version:

ivy-fail:

ivy-configure:
[ivy:configure] :: loading settings :: file = /export/home/jenkins/workspace/Lucene-Solr-8.x-Solaris/lucene/top-level-ivy-settings.xml

resolve:

ivy-availability-check:
[loadresource] Do not set property disallowed.ivy.jars.list as its length is 0.

-ivy-fail-disallowed-ivy-version:

ivy-fail:

ivy-configure:
[ivy:configure] :: loading settings :: file = /export/home/jenkins/workspace/Lucene-Solr-8.x-Solaris/lucene/top-level-ivy-settings.xml

resolve:

ivy-availability-check:
[loadresource] Do not set property disallowed.ivy.jars.list as its length is 0.

-ivy-fail-disallowed-ivy-version:

ivy-fail:

ivy-configure:
[ivy:configure] :: loading settings :: file = /export/home/jenkins/workspace/Lucene-Solr-8.x-Solaris/lucene/top-level-ivy-settings.xml

resolve:

ivy-availability-check:
[loadresource] Do not set property disallowed.ivy.jars.list as its length is 0.

-ivy-fail-disallowed-ivy-version:

ivy-fail:

ivy-configure:
[ivy:configure] :: loading settings :: file = /export/home/jenkins/workspace/Lucene-Solr-8.x-Solaris/lucene/top-level-ivy-settings.xml

common.resolve:

resolve:

ivy-availability-check:
[loadresource] Do not set property disallowed.ivy.jars.list as its length is 0.

-ivy-fail-disallowed-ivy-version:

ivy-fail:

ivy-configure:
[ivy:configure] :: loading settings :: file = /export/home/jenkins/workspace/Lucene-Solr-8.x-Solaris/lucene/top-level-ivy-settings.xml

resolve:

ivy-availability-check:
[loadresource] Do not set property disallowed.ivy.jars.list as its length is 0.

-ivy-fail-disallowed-ivy-version:

ivy-fail:

ivy-configure:
[ivy:configure] :: loading settings :: file = /export/home/jenkins/workspace/Lucene-Solr-8.x-Solaris/lucene/top-level-ivy-settings.xml

resolve:

ivy-availability-check:
[loadresource] Do not set property disallowed.ivy.jars.list as its length is 0.

-ivy-fail-disallowed-ivy-version:

ivy-fail:

ivy-configure:
[ivy:configure] :: loading settings :: file = /export/home/jenkins/workspace/Lucene-Solr-8.x-Solaris/lucene/top-level-ivy-settings.xml

resolve:

ivy-availability-check:
[loadresource] Do not set property disallowed.ivy.jars.list as its length is 0.

-ivy-fail-disallowed-ivy-version:

ivy-fail:

ivy-configure:
[ivy:configure] :: loading settings :: file = /export/home/jenkins/workspace/Lucene-Solr-8.x-Solaris/lucene/top-level-ivy-settings.xml

resolve:

ivy-availability-check:
[loadresource] Do not set property disallowed.ivy.jars.list as its length is 0.

-ivy-fail-disallowed-ivy-version:

ivy-fail:

ivy-configure:
[ivy:configure] :: loading settings :: file = /export/home/jenkins/workspace/Lucene-Solr-8.x-Solaris/lucene/top-level-ivy-settings.xml

resolve:

jar-checksums:
    [mkdir] Created dir: /export/home/jenkins/workspace/Lucene-Solr-8.x-Solaris/lucene/null2127496566
     [copy] Copying 38 files to /export/home/jenkins/workspace/Lucene-Solr-8.x-Solaris/lucene/null2127496566
   [delete] Deleting directory /export/home/jenkins/workspace/Lucene-Solr-8.x-Solaris/lucene/null2127496566

resolve-example:

ivy-availability-check:
[loadresource] Do not set property disallowed.ivy.jars.list as its length is 0.

-ivy-fail-disallowed-ivy-version:

ivy-fail:

ivy-configure:
[ivy:configure] :: loading settings :: file = /export/home/jenkins/workspace/Lucene-Solr-8.x-Solaris/lucene/top-level-ivy-settings.xml

resolve:

resolve-server:

ivy-availability-check:
[loadresource] Do not set property disallowed.ivy.jars.list as its length is 0.

-ivy-fail-disallowed-ivy-version:

ivy-fail:

ivy-fail:

ivy-configure:
[ivy:configure] :: loading settings :: file = /export/home/jenkins/workspace/Lucene-Solr-8.x-Solaris/lucene/top-level-ivy-settings.xml

resolve:

resolve:

ivy-availability-check:
[loadresource] Do not set property disallowed.ivy.jars.list as its length is 0.

-ivy-fail-disallowed-ivy-version:

ivy-fail:

ivy-fail:

ivy-configure:
[ivy:configure] :: loading settings :: file = /export/home/jenkins/workspace/Lucene-Solr-8.x-Solaris/lucene/top-level-ivy-settings.xml

resolve:

ivy-availability-check:
[loadresource] Do not set property disallowed.ivy.jars.list as its length is 0.

-ivy-fail-disallowed-ivy-version:

ivy-fail:

ivy-fail:

ivy-configure:
[ivy:configure] :: loading settings :: file = /export/home/jenkins/workspace/Lucene-Solr-8.x-Solaris/lucene/top-level-ivy-settings.xml

resolve:

ivy-availability-check:
[loadresource] Do not set property disallowed.ivy.jars.list as its length is 0.

-ivy-fail-disallowed-ivy-version:

ivy-fail:

ivy-configure:
[ivy:configure] :: loading settings :: file = /export/home/jenkins/workspace/Lucene-Solr-8.x-Solaris/lucene/top-level-ivy-settings.xml

resolve:

ivy-availability-check:
[loadresource] Do not set property disallowed.ivy.jars.list as its length is 0.

-ivy-fail-disallowed-ivy-version:

ivy-fail:

ivy-fail:

ivy-configure:
[ivy:configure] :: loading settings :: file = /export/home/jenkins/workspace/Lucene-Solr-8.x-Solaris/lucene/top-level-ivy-settings.xml

resolve:

ivy-availability-check:
[loadresource] Do not set property disallowed.ivy.jars.list as its length is 0.

-ivy-fail-disallowed-ivy-version:

ivy-fail:

ivy-configure:
[ivy:configure] :: loading settings :: file = /export/home/jenkins/workspace/Lucene-Solr-8.x-Solaris/lucene/top-level-ivy-settings.xml

resolve:

ivy-availability-check:
[loadresource] Do not set property disallowed.ivy.jars.list as its length is 0.

-ivy-fail-disallowed-ivy-version:

ivy-fail:

ivy-fail:

ivy-configure:
[ivy:configure] :: loading settings :: file = /export/home/jenkins/workspace/Lucene-Solr-8.x-Solaris/lucene/top-level-ivy-settings.xml

resolve:

ivy-availability-check:
[loadresource] Do not set property disallowed.ivy.jars.list as its length is 0.

-ivy-fail-disallowed-ivy-version:

ivy-fail:

ivy-fail:

ivy-configure:
[ivy:configure] :: loading settings :: file = /export/home/jenkins/workspace/Lucene-Solr-8.x-Solaris/lucene/top-level-ivy-settings.xml

resolve:

ivy-availability-check:
[loadresource] Do not set property disallowed.ivy.jars.list as its length is 0.

-ivy-fail-disallowed-ivy-version:

ivy-fail:

ivy-fail:

ivy-configure:
[ivy:configure] :: loading settings :: file = /export/home/jenkins/workspace/Lucene-Solr-8.x-Solaris/lucene/top-level-ivy-settings.xml

resolve:

ivy-availability-check:
[loadresource] Do not set property disallowed.ivy.jars.list as its length is 0.

-ivy-fail-disallowed-ivy-version:

ivy-fail:

ivy-fail:

ivy-configure:
[ivy:configure] :: loading settings :: file = /export/home/jenkins/workspace/Lucene-Solr-8.x-Solaris/lucene/top-level-ivy-settings.xml

resolve:

ivy-availability-check:
[loadresource] Do not set property disallowed.ivy.jars.list as its length is 0.

-ivy-fail-disallowed-ivy-version:

ivy-fail:

ivy-fail:

ivy-configure:
[ivy:configure] :: loading settings :: file = /export/home/jenkins/workspace/Lucene-Solr-8.x-Solaris/lucene/top-level-ivy-settings.xml

resolve:

ivy-availability-check:
[loadresource] Do not set property disallowed.ivy.jars.list as its length is 0.

-ivy-fail-disallowed-ivy-version:

ivy-fail:

ivy-fail:

ivy-configure:
[ivy:configure] :: loading settings :: file = /export/home/jenkins/workspace/Lucene-Solr-8.x-Solaris/lucene/top-level-ivy-settings.xml

resolve:

ivy-availability-check:
[loadresource] Do not set property disallowed.ivy.jars.list as its length is 0.

-ivy-fail-disallowed-ivy-version:

ivy-fail:

ivy-fail:

ivy-configure:
[ivy:configure] :: loading settings :: file = /export/home/jenkins/workspace/Lucene-Solr-8.x-Solaris/lucene/top-level-ivy-settings.xml

resolve:

ivy-availability-check:
[loadresource] Do not set property disallowed.ivy.jars.list as its length is 0.

-ivy-fail-disallowed-ivy-version:

ivy-fail:

ivy-fail:

ivy-configure:
[ivy:configure] :: loading settings :: file = /export/home/jenkins/workspace/Lucene-Solr-8.x-Solaris/lucene/top-level-ivy-settings.xml

resolve:

ivy-availability-check:
[loadresource] Do not set property disallowed.ivy.jars.list as its length is 0.

-ivy-fail-disallowed-ivy-version:

ivy-fail:

ivy-fail:

ivy-configure:
[ivy:configure] :: loading settings :: file = /export/home/jenkins/workspace/Lucene-Solr-8.x-Solaris/lucene/top-level-ivy-settings.xml

resolve:

ivy-availability-check:
[loadresource] Do not set property disallowed.ivy.jars.list as its length is 0.

-ivy-fail-disallowed-ivy-version:

ivy-fail:

ivy-fail:

ivy-configure:
[ivy:configure] :: loading settings :: file = /export/home/jenkins/workspace/Lucene-Solr-8.x-Solaris/lucene/top-level-ivy-settings.xml

resolve:

ivy-availability-check:
[loadresource] Do not set property disallowed.ivy.jars.list as its length is 0.

-ivy-fail-disallowed-ivy-version:

ivy-fail:

ivy-fail:

ivy-configure:
[ivy:configure] :: loading settings :: file = /export/home/jenkins/workspace/Lucene-Solr-8.x-Solaris/lucene/top-level-ivy-settings.xml

resolve:

jar-checksums:
    [mkdir] Created dir: /export/home/jenkins/workspace/Lucene-Solr-8.x-Solaris/solr/null374782087
     [copy] Copying 249 files to /export/home/jenkins/workspace/Lucene-Solr-8.x-Solaris/solr/null374782087
   [delete] Deleting directory /export/home/jenkins/workspace/Lucene-Solr-8.x-Solaris/solr/null374782087

check-working-copy:
[ivy:cachepath] :: resolving dependencies :: #;working@serv1-vm3
[ivy:cachepath] confs: [default]
[ivy:cachepath] found org.eclipse.jgit#org.eclipse.jgit;5.3.0.201903130848-r in public
[ivy:cachepath] found com.jcraft#jsch;0.1.54 in public
[ivy:cachepath] found com.jcraft#jzlib;1.1.1 in public
[ivy:cachepath] found com.googlecode.javaewah#JavaEWAH;1.1.6 in public
[ivy:cachepath] found org.slf4j#slf4j-api;1.7.2 in public
[ivy:cachepath] found org.bouncycastle#bcpg-jdk15on;1.60 in public
[ivy:cachepath] found org.bouncycastle#bcprov-jdk15on;1.60 in public
[ivy:cachepath] found org.bouncycastle#bcpkix-jdk15on;1.60 in public
[ivy:cachepath] found org.slf4j#slf4j-nop;1.7.2 in public
[ivy:cachepath] :: resolution report :: resolve 30ms :: artifacts dl 3ms
        ---------------------------------------------------------------------
        |                  |            modules            ||   artifacts   |
        |       conf       | number| search|dwnlded|evicted|| number|dwnlded|
        ---------------------------------------------------------------------
        |      default     |   9   |   0   |   0   |   0   ||   9   |   0   |
        ---------------------------------------------------------------------
[wc-checker] Initializing working copy...
[wc-checker] Checking working copy status...

-jenkins-base:

BUILD SUCCESSFUL
Total time: 132 minutes 59 seconds
Setting ANT_1_8_2_HOME=/export/home/jenkins/tools/hudson.tasks.Ant_AntInstallation/ANT_1.8.2
[Lucene-Solr-8.x-Solaris] $ /bin/sh -xe /var/tmp/jenkins5507424362739443266.sh
+ mv lucene/build lucene/build.orig
+ mv solr/build solr/build.orig
+ ANT_HOME=/export/home/jenkins/tools/hudson.tasks.Ant_AntInstallation/ANT_1.8.2
+ export ANT_HOME
+ PATH=/export/home/jenkins/tools/hudson.tasks.Ant_AntInstallation/ANT_1.8.2/bin:/export/home/jenkins/tools/java/64bit/jdk1.8.0/bin:/usr/bin:/usr/sbin
+ export PATH
+ python3.4 -u dev-tools/scripts/reproduceJenkinsFailures.py --no-git https://jenkins.thetaphi.de/job/Lucene-Solr-8.x-Solaris/265/consoleText
[repro] Jenkins log URL: https://jenkins.thetaphi.de/job/Lucene-Solr-8.x-Solaris/265/consoleText

[repro] Revision: 0106b74badb98473e1e4464b8e2b37d7bebdc1a4

[repro] Ant options: "-Dargs=-XX:+UseCompressedOops -XX:+UseConcMarkSweepGC"
[repro] Repro line:  ant test  -Dtestcase=TestIndexWriterWithThreads -Dtests.method=testIOExceptionDuringAbortWithThreads -Dtests.seed=8A4C77E7CC808387 -Dtests.slow=true -Dtests.locale=und -Dtests.timezone=Asia/Karachi -Dtests.asserts=true -Dtests.file.encoding=UTF-8

[repro] ant clean
Buildfile: /export/home/jenkins/workspace/Lucene-Solr-8.x-Solaris/build.xml

clean:

clean:

clean:

BUILD SUCCESSFUL
Total time: 0 seconds
[repro] Test suites by module:
[repro]    lucene/core
[repro]       TestIndexWriterWithThreads
[repro] ant compile-test
Buildfile: /export/home/jenkins/workspace/Lucene-Solr-8.x-Solaris/lucene/core/build.xml

-check-git-state:

-git-cleanroot:

-copy-git-state:
    [mkdir] Created dir: /export/home/jenkins/workspace/Lucene-Solr-8.x-Solaris/lucene/build
     [copy] Copying 1 file to /export/home/jenkins/workspace/Lucene-Solr-8.x-Solaris/lucene/build

git-autoclean:

ivy-availability-check:
[loadresource] Do not set property disallowed.ivy.jars.list as its length is 0.

-ivy-fail-disallowed-ivy-version:

ivy-fail:

ivy-configure:
[ivy:configure] :: Apache Ivy 2.4.0 - 20141213170938 :: http://ant.apache.org/ivy/ ::
[ivy:configure] :: loading settings :: file = /export/home/jenkins/workspace/Lucene-Solr-8.x-Solaris/lucene/top-level-ivy-settings.xml

resolve:

init:

-clover.disable:

-clover.load:

-clover.classpath:

-clover.setup:

clover:

compile-core:
    [mkdir] Created dir: /export/home/jenkins/workspace/Lucene-Solr-8.x-Solaris/lucene/build/core/classes/java
    [javac] Compiling 883 source files to /export/home/jenkins/workspace/Lucene-Solr-8.x-Solaris/lucene/build/core/classes/java
    [javac] Note: Some input files use or override a deprecated API.
    [javac] Note: Recompile with -Xlint:deprecation for details.
    [javac] Creating empty /export/home/jenkins/workspace/Lucene-Solr-8.x-Solaris/lucene/build/core/classes/java/org/apache/lucene/util/graph/package-info.class
    [javac] Creating empty /export/home/jenkins/workspace/Lucene-Solr-8.x-Solaris/lucene/build/core/classes/java/org/apache/lucene/document/package-info.class
    [javac] Creating empty /export/home/jenkins/workspace/Lucene-Solr-8.x-Solaris/lucene/build/core/classes/java/org/apache/lucene/package-info.class
    [javac] Creating empty /export/home/jenkins/workspace/Lucene-Solr-8.x-Solaris/lucene/build/core/classes/java/org/apache/lucene/util/bkd/package-info.class
    [javac] Creating empty /export/home/jenkins/workspace/Lucene-Solr-8.x-Solaris/lucene/build/core/classes/java/org/apache/lucene/codecs/compressing/package-info.class
    [javac] Creating empty /export/home/jenkins/workspace/Lucene-Solr-8.x-Solaris/lucene/build/core/classes/java/org/apache/lucene/codecs/lucene60/package-info.class
    [javac] Creating empty /export/home/jenkins/workspace/Lucene-Solr-8.x-Solaris/lucene/build/core/classes/java/org/apache/lucene/codecs/package-info.class
    [javac] Creating empty /export/home/jenkins/workspace/Lucene-Solr-8.x-Solaris/lucene/build/core/classes/java/org/apache/lucene/codecs/lucene80/package-info.class
    [javac] Creating empty /export/home/jenkins/workspace/Lucene-Solr-8.x-Solaris/lucene/build/core/classes/java/org/apache/lucene/util/package-info.class
    [javac] Creating empty /export/home/jenkins/workspace/Lucene-Solr-8.x-Solaris/lucene/build/core/classes/java/org/apache/lucene/index/package-info.class
    [javac] Creating empty /export/home/jenkins/workspace/Lucene-Solr-8.x-Solaris/lucene/build/core/classes/java/org/apache/lucene/util/fst/package-info.class
    [javac] Creating empty /export/home/jenkins/workspace/Lucene-Solr-8.x-Solaris/lucene/build/core/classes/java/org/apache/lucene/analysis/tokenattributes/package-info.class
    [javac] Creating empty /export/home/jenkins/workspace/Lucene-Solr-8.x-Solaris/lucene/build/core/classes/java/org/apache/lucene/search/package-info.class
    [javac] Creating empty /export/home/jenkins/workspace/Lucene-Solr-8.x-Solaris/lucene/build/core/classes/java/org/apache/lucene/util/packed/package-info.class
    [javac] Creating empty /export/home/jenkins/workspace/Lucene-Solr-8.x-Solaris/lucene/build/core/classes/java/org/apache/lucene/util/mutable/package-info.class
    [javac] Creating empty /export/home/jenkins/workspace/Lucene-Solr-8.x-Solaris/lucene/build/core/classes/java/org/apache/lucene/codecs/lucene70/package-info.class
    [javac] Creating empty /export/home/jenkins/workspace/Lucene-Solr-8.x-Solaris/lucene/build/core/classes/java/org/apache/lucene/codecs/perfield/package-info.class
    [javac] Creating empty /export/home/jenkins/workspace/Lucene-Solr-8.x-Solaris/lucene/build/core/classes/java/org/apache/lucene/analysis/package-info.class
    [javac] Creating empty /export/home/jenkins/workspace/Lucene-Solr-8.x-Solaris/lucene/build/core/classes/java/org/apache/lucene/analysis/standard/package-info.class
    [javac] Creating empty /export/home/jenkins/workspace/Lucene-Solr-8.x-Solaris/lucene/build/core/classes/java/org/apache/lucene/store/package-info.class
    [javac] Creating empty /export/home/jenkins/workspace/Lucene-Solr-8.x-Solaris/lucene/build/core/classes/java/org/apache/lucene/codecs/blocktree/package-info.class
    [javac] Creating empty /export/home/jenkins/workspace/Lucene-Solr-8.x-Solaris/lucene/build/core/classes/java/org/apache/lucene/search/spans/package-info.class
    [javac] Creating empty /export/home/jenkins/workspace/Lucene-Solr-8.x-Solaris/lucene/build/core/classes/java/org/apache/lucene/search/similarities/package-info.class
    [javac] Creating empty /export/home/jenkins/workspace/Lucene-Solr-8.x-Solaris/lucene/build/core/classes/java/org/apache/lucene/util/automaton/package-info.class
    [javac] Creating empty /export/home/jenkins/workspace/Lucene-Solr-8.x-Solaris/lucene/build/core/classes/java/org/apache/lucene/codecs/lucene50/package-info.class
    [javac] Creating empty /export/home/jenkins/workspace/Lucene-Solr-8.x-Solaris/lucene/build/core/classes/java/org/apache/lucene/geo/package-info.class
     [copy] Copying 3 files to /export/home/jenkins/workspace/Lucene-Solr-8.x-Solaris/lucene/build/core/classes/java

compile-test-framework:

-check-git-state:

-git-cleanroot:

-copy-git-state:

git-autoclean:

ivy-availability-check:
[loadresource] Do not set property disallowed.ivy.jars.list as its length is 0.

-ivy-fail-disallowed-ivy-version:

ivy-fail:

ivy-configure:
[ivy:configure] :: loading settings :: file = /export/home/jenkins/workspace/Lucene-Solr-8.x-Solaris/lucene/top-level-ivy-settings.xml

resolve:

init:

compile-lucene-core:

-check-git-state:

-git-cleanroot:

-copy-git-state:

git-autoclean:

ivy-availability-check:
[loadresource] Do not set property disallowed.ivy.jars.list as its length is 0.

-ivy-fail-disallowed-ivy-version:

ivy-fail:

ivy-configure:
[ivy:configure] :: loading settings :: file = /export/home/jenkins/workspace/Lucene-Solr-8.x-Solaris/lucene/top-level-ivy-settings.xml

resolve:

init:

-clover.disable:

-clover.load:

-clover.classpath:

-clover.setup:

clover:

compile-core:

compile-codecs:

-check-git-state:

-git-cleanroot:

-copy-git-state:

git-autoclean:

ivy-availability-check:
[loadresource] Do not set property disallowed.ivy.jars.list as its length is 0.

-ivy-fail-disallowed-ivy-version:

ivy-fail:

ivy-configure:
[ivy:configure] :: loading settings :: file = /export/home/jenkins/workspace/Lucene-Solr-8.x-Solaris/lucene/top-level-ivy-settings.xml

resolve:

common.init:

compile-lucene-core:

init:

-clover.disable:

-clover.load:

-clover.classpath:

-clover.setup:

clover:

compile-core:
    [mkdir] Created dir: /export/home/jenkins/workspace/Lucene-Solr-8.x-Solaris/lucene/build/codecs/classes/java
    [javac] Compiling 74 source files to /export/home/jenkins/workspace/Lucene-Solr-8.x-Solaris/lucene/build/codecs/classes/java
    [javac] Note: Some input files use or override a deprecated API.
    [javac] Note: Recompile with -Xlint:deprecation for details.
    [javac] Creating empty /export/home/jenkins/workspace/Lucene-Solr-8.x-Solaris/lucene/build/codecs/classes/java/org/apache/lucene/codecs/bloom/package-info.class
    [javac] Creating empty /export/home/jenkins/workspace/Lucene-Solr-8.x-Solaris/lucene/build/codecs/classes/java/org/apache/lucene/codecs/memory/package-info.class
    [javac] Creating empty /export/home/jenkins/workspace/Lucene-Solr-8.x-Solaris/lucene/build/codecs/classes/java/org/apache/lucene/codecs/simpletext/package-info.class
    [javac] Creating empty /export/home/jenkins/workspace/Lucene-Solr-8.x-Solaris/lucene/build/codecs/classes/java/org/apache/lucene/codecs/blockterms/package-info.class
    [javac] Creating empty /export/home/jenkins/workspace/Lucene-Solr-8.x-Solaris/lucene/build/codecs/classes/java/org/apache/lucene/codecs/blocktreeords/package-info.class
     [copy] Copying 3 files to /export/home/jenkins/workspace/Lucene-Solr-8.x-Solaris/lucene/build/codecs/classes/java

-clover.disable:

-clover.load:

-clover.classpath:

-clover.setup:

clover:

common.compile-core:
    [mkdir] Created dir: /export/home/jenkins/workspace/Lucene-Solr-8.x-Solaris/lucene/build/test-framework/classes/java
    [javac] Compiling 198 source files to /export/home/jenkins/workspace/Lucene-Solr-8.x-Solaris/lucene/build/test-framework/classes/java
    [javac] /export/home/jenkins/workspace/Lucene-Solr-8.x-Solaris/lucene/test-framework/src/java/org/apache/lucene/store/BaseDirectoryTestCase.java:416: warning: [try] auto-closeable resource output is never referenced in body of corresponding try statement
    [javac]             try (IndexOutput output = dir.createOutput(fileName, newIOContext(random()))) {
    [javac]                              ^
    [javac] /export/home/jenkins/workspace/Lucene-Solr-8.x-Solaris/lucene/test-framework/src/java/org/apache/lucene/store/BaseDirectoryTestCase.java:440: warning: [try] auto-closeable resource input is never referenced in body of corresponding try statement
    [javac]                 try (IndexInput input = dir.openInput(file, newIOContext(random()))) {
    [javac]                                 ^
    [javac] /export/home/jenkins/workspace/Lucene-Solr-8.x-Solaris/lucene/test-framework/src/java/org/apache/lucene/store/BaseDirectoryTestCase.java:1051: warning: [try] auto-closeable resource out is never referenced in body of corresponding try statement
    [javac]       try (IndexOutput out = dir.createOutput(name, IOContext.DEFAULT)) {
    [javac]                        ^
    [javac] /export/home/jenkins/workspace/Lucene-Solr-8.x-Solaris/lucene/test-framework/src/java/org/apache/lucene/store/BaseDirectoryTestCase.java:1056: warning: [try] auto-closeable resource out is never referenced in body of corresponding try statement
    [javac]         try (IndexOutput out = dir.createOutput(name, IOContext.DEFAULT)) {
    [javac]                          ^
    [javac] Note: Some input files use or override a deprecated API.
    [javac] Note: Recompile with -Xlint:deprecation for details.
    [javac] 4 warnings
    [javac] Creating empty /export/home/jenkins/workspace/Lucene-Solr-8.x-Solaris/lucene/build/test-framework/classes/java/org/apache/lucene/codecs/asserting/package-info.class
    [javac] Creating empty /export/home/jenkins/workspace/Lucene-Solr-8.x-Solaris/lucene/build/test-framework/classes/java/org/apache/lucene/codecs/ramonly/package-info.class
    [javac] Creating empty /export/home/jenkins/workspace/Lucene-Solr-8.x-Solaris/lucene/build/test-framework/classes/java/org/apache/lucene/mockfile/package-info.class
    [javac] Creating empty /export/home/jenkins/workspace/Lucene-Solr-8.x-Solaris/lucene/build/test-framework/classes/java/org/apache/lucene/codecs/cheapbastard/package-info.class
    [javac] Creating empty /export/home/jenkins/workspace/Lucene-Solr-8.x-Solaris/lucene/build/test-framework/classes/java/org/apache/lucene/codecs/mockrandom/package-info.class
    [javac] Creating empty /export/home/jenkins/workspace/Lucene-Solr-8.x-Solaris/lucene/build/test-framework/classes/java/org/apache/lucene/codecs/cranky/package-info.class
    [javac] Creating empty /export/home/jenkins/workspace/Lucene-Solr-8.x-Solaris/lucene/build/test-framework/classes/java/org/apache/lucene/codecs/compressing/dummy/package-info.class
     [copy] Copying 4 files to /export/home/jenkins/workspace/Lucene-Solr-8.x-Solaris/lucene/build/test-framework/classes/java

compile-core:

compile-test:
    [mkdir] Created dir: /export/home/jenkins/workspace/Lucene-Solr-8.x-Solaris/lucene/build/core/classes/test
    [javac] Compiling 536 source files to /export/home/jenkins/workspace/Lucene-Solr-8.x-Solaris/lucene/build/core/classes/test
    [javac] /export/home/jenkins/workspace/Lucene-Solr-8.x-Solaris/lucene/core/src/test/org/apache/lucene/analysis/TestAnalyzerWrapper.java:52: warning: [try] auto-closeable resource ts is never referenced in body of corresponding try statement
    [javac]     try (TokenStream ts = wrapped.tokenStream("", "text")) {
    [javac]                      ^
    [javac] /export/home/jenkins/workspace/Lucene-Solr-8.x-Solaris/lucene/core/src/test/org/apache/lucene/index/TestFieldUpdatesBuffer.java:158: warning: [unchecked] unchecked cast
    [javac]       return (T) (rarely() ? value.prepareForApply(random().nextInt(100)) : value);
    [javac]                  ^
    [javac]   required: T
    [javac]   found:    BinaryDocValuesUpdate
    [javac]   where T is a type-variable:
    [javac]     T extends DocValuesUpdate declared in method <T>getRandomUpdate(boolean)
    [javac] /export/home/jenkins/workspace/Lucene-Solr-8.x-Solaris/lucene/core/src/test/org/apache/lucene/index/TestFieldUpdatesBuffer.java:163: warning: [unchecked] unchecked cast
    [javac]       return (T) (rarely() ? value.prepareForApply(random().nextInt(100)) : value);
    [javac]                  ^
    [javac]   required: T
    [javac]   found:    NumericDocValuesUpdate
    [javac]   where T is a type-variable:
    [javac]     T extends DocValuesUpdate declared in method <T>getRandomUpdate(boolean)
    [javac] /export/home/jenkins/workspace/Lucene-Solr-8.x-Solaris/lucene/core/src/test/org/apache/lucene/index/TestIndexWriter.java:2688: warning: [try] auto-closeable resource closeable is never referenced in body of corresponding try statement
    [javac]          Closeable closeable = () -> IOUtils.close(toClose)) {
    [javac]                    ^
    [javac] /export/home/jenkins/workspace/Lucene-Solr-8.x-Solaris/lucene/core/src/test/org/apache/lucene/index/TestIndexWriter.java:3686: warning: [try] auto-closeable resource w is never referenced in body of corresponding try statement
    [javac]             try (IndexWriter w = new IndexWriter(dir, newIndexWriterConfig().setIndexCreatedVersionMajor(previousMajor))) {}
    [javac]                              ^
    [javac] /export/home/jenkins/workspace/Lucene-Solr-8.x-Solaris/lucene/core/src/test/org/apache/lucene/index/TestIndexWriter.java:3689: warning: [try] auto-closeable resource w is never referenced in body of corresponding try statement
    [javac]             try (IndexWriter w = new IndexWriter(dir, newIndexWriterConfig().setOpenMode(openMode).setIndexCreatedVersionMajor(newMajor))) {}
    [javac]                              ^
    [javac] /export/home/jenkins/workspace/Lucene-Solr-8.x-Solaris/lucene/core/src/test/org/apache/lucene/search/TestConstantScoreScorer.java:67: warning: [try] auto-closeable resource TestConstantScoreScorerIndex has a member method close() that could throw InterruptedException
    [javac]     try (TestConstantScoreScorerIndex index = new TestConstantScoreScorerIndex()) {
    [javac]                                       ^
    [javac] /export/home/jenkins/workspace/Lucene-Solr-8.x-Solaris/lucene/core/src/test/org/apache/lucene/search/TestConstantScoreScorer.java:103: warning: [try] auto-closeable resource TestConstantScoreScorerIndex has a member method close() that could throw InterruptedException
    [javac]     try (TestConstantScoreScorerIndex index = new TestConstantScoreScorerIndex()) {
    [javac]                                       ^
    [javac] /export/home/jenkins/workspace/Lucene-Solr-8.x-Solaris/lucene/core/src/test/org/apache/lucene/search/TestConstantScoreScorer.java:131: warning: [try] auto-closeable resource TestConstantScoreScorerIndex has a member method close() that could throw InterruptedException
    [javac]     try (TestConstantScoreScorerIndex index = new TestConstantScoreScorerIndex()) {
    [javac]                                       ^
    [javac] /export/home/jenkins/workspace/Lucene-Solr-8.x-Solaris/lucene/core/src/test/org/apache/lucene/search/TestConstantScoreScorer.java:159: warning: [try] auto-closeable resource TestConstantScoreScorerIndex has a member method close() that could throw InterruptedException
    [javac]     try (TestConstantScoreScorerIndex index = new TestConstantScoreScorerIndex()) {
    [javac]                                       ^
    [javac] /export/home/jenkins/workspace/Lucene-Solr-8.x-Solaris/lucene/core/src/test/org/apache/lucene/search/TestConstantScoreScorer.java:178: warning: [try] auto-closeable resource TestConstantScoreScorerIndex has a member method close() that could throw InterruptedException
    [javac]   static class TestConstantScoreScorerIndex implements AutoCloseable {
    [javac]          ^
    [javac] /export/home/jenkins/workspace/Lucene-Solr-8.x-Solaris/lucene/core/src/test/org/apache/lucene/search/TestSearchAfter.java:220: warning: [rawtypes] found raw type: TopDocsCollector
    [javac]     final TopDocsCollector allCollector;
    [javac]           ^
    [javac]   missing type arguments for generic class TopDocsCollector<T>
    [javac]   where T is a type-variable:
    [javac]     T extends ScoreDoc declared in class TopDocsCollector
    [javac] /export/home/jenkins/workspace/Lucene-Solr-8.x-Solaris/lucene/core/src/test/org/apache/lucene/search/TestSearchAfter.java:248: warning: [rawtypes] found raw type: TopDocsCollector
    [javac]       final TopDocsCollector pagedCollector;
    [javac]             ^
    [javac]   missing type arguments for generic class TopDocsCollector<T>
    [javac]   where T is a type-variable:
    [javac]     T extends ScoreDoc declared in class TopDocsCollector
    [javac] /export/home/jenkins/workspace/Lucene-Solr-8.x-Solaris/lucene/core/src/test/org/apache/lucene/store/TestFileSwitchDirectory.java:179: warning: [try] auto-closeable resource indexInput is never referenced in body of corresponding try statement
    [javac]       try (IndexInput indexInput = dir.openInput("foo.tim", IOContext.DEFAULT)) {
    [javac]                       ^
    [javac] Note: Some input files use or override a deprecated API.
    [javac] Note: Recompile with -Xlint:deprecation for details.
    [javac] 14 warnings
     [copy] Copying 3 files to /export/home/jenkins/workspace/Lucene-Solr-8.x-Solaris/lucene/build/core/classes/test

BUILD SUCCESSFUL
Total time: 12 seconds
[repro] ant test-nocompile -Dtests.dups=5 -Dtests.maxfailures=5 -Dtests.class="*.TestIndexWriterWithThreads" -Dtests.showOutput=onerror "-Dargs=-XX:+UseCompressedOops -XX:+UseConcMarkSweepGC" -Dtests.seed=8A4C77E7CC808387 -Dtests.slow=true -Dtests.locale=und -Dtests.timezone=Asia/Karachi -Dtests.asserts=true -Dtests.file.encoding=UTF-8
Buildfile: /export/home/jenkins/workspace/Lucene-Solr-8.x-Solaris/lucene/core/build.xml

-clover.disable:

ivy-configure:
[ivy:configure] :: Apache Ivy 2.4.0 - 20141213170938 :: http://ant.apache.org/ivy/ ::
[ivy:configure] :: loading settings :: file = /export/home/jenkins/workspace/Lucene-Solr-8.x-Solaris/lucene/top-level-ivy-settings.xml

install-junit4-taskdef:

ivy-availability-check:
[loadresource] Do not set property disallowed.ivy.jars.list as its length is 0.

-ivy-fail-disallowed-ivy-version:

ivy-fail:

resolve-groovy:
[ivy:cachepath] :: resolving dependencies :: org.codehaus.groovy#groovy-all-caller;working
[ivy:cachepath] confs: [default]
[ivy:cachepath] found org.codehaus.groovy#groovy-all;2.4.16 in public
[ivy:cachepath] :: resolution report :: resolve 13ms :: artifacts dl 0ms
        ---------------------------------------------------------------------
        |                  |            modules            ||   artifacts   |
        |       conf       | number| search|dwnlded|evicted|| number|dwnlded|
        ---------------------------------------------------------------------
        |      default     |   1   |   0   |   0   |   0   ||   1   |   0   |
        ---------------------------------------------------------------------

-init-totals:

-test:
    [mkdir] Created dir: /export/home/jenkins/workspace/Lucene-Solr-8.x-Solaris/lucene/build/core/test
[junit4:pickseed] Seed property 'tests.seed' already defined: 8A4C77E7CC808387
    [mkdir] Created dir: /export/home/jenkins/workspace/Lucene-Solr-8.x-Solaris/lucene/build/core/test/temp
   [junit4] <JUnit4> says ┬íHola! Master seed: 8A4C77E7CC808387
   [junit4] Executing 5 suites with 2 JVMs.
   [junit4]
   [junit4] Started J1 PID(1356@serv1-vm3).
   [junit4] Started J0 PID(1355@serv1-vm3).
   [junit4] Suite: org.apache.lucene.index.TestIndexWriterWithThreads
   [junit4] OK      0.39s J0 | TestIndexWriterWithThreads.testIOExceptionDuringWriteSegmentWithThreadsOnlyOnce
   [junit4] OK      0.14s J0 | TestIndexWriterWithThreads.testImmediateDiskFullWithThreads
   [junit4] OK      0.06s J0 | TestIndexWriterWithThreads.testIOExceptionDuringAbortWithThreadsOnlyOnce
   [junit4] OK      1.12s J0 | TestIndexWriterWithThreads.testSoftUpdateSingleDocWithThreads
   [junit4] OK      0.01s J0 | TestIndexWriterWithThreads.testIOExceptionDuringWriteSegmentOnlyOnce
   [junit4] OK      0.01s J0 | TestIndexWriterWithThreads.testIOExceptionDuringWriteSegment
   [junit4] OK      0.02s J0 | TestIndexWriterWithThreads.testOpenTwoIndexWritersOnDifferentThreads
   [junit4] OK      1.41s J0 | TestIndexWriterWithThreads.testCloseWithThreads
   [junit4] OK      0.04s J0 | TestIndexWriterWithThreads.testIOExceptionDuringWriteSegmentWithThreads
   [junit4] OK      0.04s J0 | TestIndexWriterWithThreads.testIOExceptionDuringAbortWithThreads
   [junit4] OK      0.02s J0 | TestIndexWriterWithThreads.testIOExceptionDuringAbort
   [junit4] OK      0.01s J0 | TestIndexWriterWithThreads.testIOExceptionDuringAbortOnlyOnce
   [junit4] OK      0.57s J0 | TestIndexWriterWithThreads.testUpdateSingleDocWithThreads
   [junit4] OK      1.45s J0 | TestIndexWriterWithThreads.testRollbackAndCommitWithThreads
   [junit4] Completed [1/5] on J0 in 5.94s, 14 tests
   [junit4]
   [junit4] Suite: org.apache.lucene.index.TestIndexWriterWithThreads
   [junit4] OK      0.52s J1 | TestIndexWriterWithThreads.testIOExceptionDuringWriteSegmentWithThreadsOnlyOnce
   [junit4] OK      0.07s J1 | TestIndexWriterWithThreads.testImmediateDiskFullWithThreads
   [junit4] OK      0.11s J1 | TestIndexWriterWithThreads.testIOExceptionDuringAbortWithThreadsOnlyOnce
   [junit4] OK      0.91s J1 | TestIndexWriterWithThreads.testSoftUpdateSingleDocWithThreads
   [junit4] OK      0.02s J1 | TestIndexWriterWithThreads.testIOExceptionDuringWriteSegmentOnlyOnce
   [junit4] OK      0.04s J1 | TestIndexWriterWithThreads.testIOExceptionDuringWriteSegment
   [junit4] OK      0.03s J1 | TestIndexWriterWithThreads.testOpenTwoIndexWritersOnDifferentThreads
   [junit4] OK      2.25s J1 | TestIndexWriterWithThreads.testCloseWithThreads
   [junit4] OK      0.04s J1 | TestIndexWriterWithThreads.testIOExceptionDuringWriteSegmentWithThreads
   [junit4] OK      0.02s J1 | TestIndexWriterWithThreads.testIOExceptionDuringAbortWithThreads
   [junit4] OK      0.01s J1 | TestIndexWriterWithThreads.testIOExceptionDuringAbort
   [junit4] OK      0.01s J1 | TestIndexWriterWithThreads.testIOExceptionDuringAbortOnlyOnce
   [junit4] OK      1.94s J1 | TestIndexWriterWithThreads.testUpdateSingleDocWithThreads
   [junit4] OK      1.63s J1 | TestIndexWriterWithThreads.testRollbackAndCommitWithThreads
   [junit4] Completed [2/5] on J1 in 8.14s, 14 tests
   [junit4]
   [junit4] Suite: org.apache.lucene.index.TestIndexWriterWithThreads
   [junit4] OK      0.02s J0 | TestIndexWriterWithThreads.testIOExceptionDuringWriteSegmentWithThreadsOnlyOnce
   [junit4] OK      0.05s J0 | TestIndexWriterWithThreads.testImmediateDiskFullWithThreads
   [junit4] OK      0.05s J0 | TestIndexWriterWithThreads.testIOExceptionDuringAbortWithThreadsOnlyOnce
   [junit4] OK      0.52s J0 | TestIndexWriterWithThreads.testSoftUpdateSingleDocWithThreads
   [junit4] OK      0.01s J0 | TestIndexWriterWithThreads.testIOExceptionDuringWriteSegmentOnlyOnce
   [junit4] OK      0.03s J0 | TestIndexWriterWithThreads.testIOExceptionDuringWriteSegment
   [junit4] OK      0.01s J0 | TestIndexWriterWithThreads.testOpenTwoIndexWritersOnDifferentThreads
   [junit4] OK      2.59s J0 | TestIndexWriterWithThreads.testCloseWithThreads
   [junit4] OK      0.02s J0 | TestIndexWriterWithThreads.testIOExceptionDuringWriteSegmentWithThreads
   [junit4] OK      0.02s J0 | TestIndexWriterWithThreads.testIOExceptionDuringAbortWithThreads
   [junit4] OK      0.01s J0 | TestIndexWriterWithThreads.testIOExceptionDuringAbort
   [junit4] OK      0.03s J0 | TestIndexWriterWithThreads.testIOExceptionDuringAbortOnlyOnce
   [junit4] OK      0.53s J0 | TestIndexWriterWithThreads.testUpdateSingleDocWithThreads
   [junit4] OK      1.41s J0 | TestIndexWriterWithThreads.testRollbackAndCommitWithThreads
   [junit4] Completed [3/5] on J0 in 5.35s, 14 tests
   [junit4]
   [junit4] Suite: org.apache.lucene.index.TestIndexWriterWithThreads
   [junit4] OK      0.02s J1 | TestIndexWriterWithThreads.testIOExceptionDuringWriteSegmentWithThreadsOnlyOnce
   [junit4] OK      0.02s J1 | TestIndexWriterWithThreads.testImmediateDiskFullWithThreads
   [junit4] OK      0.02s J1 | TestIndexWriterWithThreads.testIOExceptionDuringAbortWithThreadsOnlyOnce
   [junit4] OK      0.58s J1 | TestIndexWriterWithThreads.testSoftUpdateSingleDocWithThreads
   [junit4] OK      0.03s J1 | TestIndexWriterWithThreads.testIOExceptionDuringWriteSegmentOnlyOnce
   [junit4] OK      0.04s J1 | TestIndexWriterWithThreads.testIOExceptionDuringWriteSegment
   [junit4] OK      0.01s J1 | TestIndexWriterWithThreads.testOpenTwoIndexWritersOnDifferentThreads
   [junit4] OK      2.58s J1 | TestIndexWriterWithThreads.testCloseWithThreads
   [junit4] OK      0.04s J1 | TestIndexWriterWithThreads.testIOExceptionDuringWriteSegmentWithThreads
   [junit4] OK      0.05s J1 | TestIndexWriterWithThreads.testIOExceptionDuringAbortWithThreads
   [junit4] OK      0.01s J1 | TestIndexWriterWithThreads.testIOExceptionDuringAbort
   [junit4] OK      0.03s J1 | TestIndexWriterWithThreads.testIOExceptionDuringAbortOnlyOnce
   [junit4] OK      0.74s J1 | TestIndexWriterWithThreads.testUpdateSingleDocWithThreads
   [junit4] OK      0.76s J1 | TestIndexWriterWithThreads.testRollbackAndCommitWithThreads
   [junit4] Completed [4/5] on J1 in 5.13s, 14 tests
   [junit4]
   [junit4] Suite: org.apache.lucene.index.TestIndexWriterWithThreads
   [junit4] OK      0.02s J0 | TestIndexWriterWithThreads.testIOExceptionDuringWriteSegmentWithThreadsOnlyOnce
   [junit4] OK      0.03s J0 | TestIndexWriterWithThreads.testImmediateDiskFullWithThreads
   [junit4] OK      0.01s J0 | TestIndexWriterWithThreads.testIOExceptionDuringAbortWithThreadsOnlyOnce
   [junit4] OK      0.69s J0 | TestIndexWriterWithThreads.testSoftUpdateSingleDocWithThreads
   [junit4] OK      0.15s J0 | TestIndexWriterWithThreads.testIOExceptionDuringWriteSegmentOnlyOnce
   [junit4] OK      0.01s J0 | TestIndexWriterWithThreads.testIOExceptionDuringWriteSegment
   [junit4] OK      0.01s J0 | TestIndexWriterWithThreads.testOpenTwoIndexWritersOnDifferentThreads
   [junit4] OK      1.08s J0 | TestIndexWriterWithThreads.testCloseWithThreads
   [junit4] OK      0.06s J0 | TestIndexWriterWithThreads.testIOExceptionDuringWriteSegmentWithThreads
   [junit4] OK      0.02s J0 | TestIndexWriterWithThreads.testIOExceptionDuringAbortWithThreads
   [junit4] OK      0.01s J0 | TestIndexWriterWithThreads.testIOExceptionDuringAbort
   [junit4] OK      0.01s J0 | TestIndexWriterWithThreads.testIOExceptionDuringAbortOnlyOnce
   [junit4] OK      0.32s J0 | TestIndexWriterWithThreads.testUpdateSingleDocWithThreads
   [junit4] OK      0.26s J0 | TestIndexWriterWithThreads.testRollbackAndCommitWithThreads
   [junit4] Completed [5/5] on J0 in 2.84s, 14 tests
   [junit4]
   [junit4] JVM J0:     0.41 ..    15.45 =    15.04s
   [junit4] JVM J1:     0.41 ..    14.57 =    14.16s
   [junit4] Execution time total: 15 seconds
   [junit4] Tests summary: 5 suites, 70 tests
   [junit4] Could not remove temporary path: /export/home/jenkins/workspace/Lucene-Solr-8.x-Solaris/lucene/build/core/test/J0 (java.nio.file.DirectoryNotEmptyException: Remaining files: [/export/home/jenkins/workspace/Lucene-Solr-8.x-Solaris/lucene/build/core/test/J0/temp])
   [junit4] Could not remove temporary path: /export/home/jenkins/workspace/Lucene-Solr-8.x-Solaris/lucene/build/core/test/J1 (java.nio.file.DirectoryNotEmptyException: Remaining files: [/export/home/jenkins/workspace/Lucene-Solr-8.x-Solaris/lucene/build/core/test/J1/temp])
     [echo] 5 slowest tests:
[junit4:tophints] 116.00s | org.apache.lucene.codecs.lucene80.TestLucene80DocValuesFormat
[junit4:tophints]  49.98s | org.apache.lucene.index.TestSegmentMerger
[junit4:tophints]  24.24s | org.apache.lucene.search.TestLatLonPointQueries
[junit4:tophints]  20.47s | org.apache.lucene.util.TestTimSorterWorstCase
[junit4:tophints]  20.36s | org.apache.lucene.index.TestIndexingSequenceNumbers

-check-totals:

test-nocompile:

BUILD SUCCESSFUL
Total time: 17 seconds
[repro] Failures:
[repro]   0/5 failed: org.apache.lucene.index.TestIndexWriterWithThreads
[repro] Exiting with code 0
+ mv lucene/build lucene/build.repro
+ mv solr/build solr/build.repro
mv: cannot access solr/build
+ true
+ mv lucene/build.orig lucene/build
+ mv solr/build.orig solr/build
Archiving artifacts
Setting ANT_1_8_2_HOME=/export/home/jenkins/tools/hudson.tasks.Ant_AntInstallation/ANT_1.8.2
java.lang.InterruptedException: no matches found within 10000
        at hudson.FilePath$ValidateAntFileMask.hasMatch(FilePath.java:2805)
        at hudson.FilePath$ValidateAntFileMask.invoke(FilePath.java:2684)
        at hudson.FilePath$ValidateAntFileMask.invoke(FilePath.java:2665)
        at hudson.FilePath$FileCallableWrapper.call(FilePath.java:3052)
Also:   hudson.remoting.Channel$CallSiteStackTrace: Remote call to Solaris VBOX
                at hudson.remoting.Channel.attachCallSiteStackTrace(Channel.java:1743)
                at hudson.remoting.UserRequest$ExceptionResponse.retrieve(UserRequest.java:357)
                at hudson.remoting.Channel.call(Channel.java:957)
                at hudson.FilePath.act(FilePath.java:1072)
                at hudson.FilePath.act(FilePath.java:1061)
                at hudson.FilePath.validateAntFileMask(FilePath.java:2663)
                at hudson.tasks.ArtifactArchiver.perform(ArtifactArchiver.java:248)
                at hudson.tasks.BuildStepCompatibilityLayer.perform(BuildStepCompatibilityLayer.java:79)
                at hudson.tasks.BuildStepMonitor$1.perform(BuildStepMonitor.java:20)
                at hudson.model.AbstractBuild$AbstractBuildExecution.perform(AbstractBuild.java:741)
                at hudson.model.AbstractBuild$AbstractBuildExecution.performAllBuildSteps(AbstractBuild.java:690)
                at hudson.model.Build$BuildExecution.post2(Build.java:186)
                at hudson.model.AbstractBuild$AbstractBuildExecution.post(AbstractBuild.java:635)
                at hudson.model.Run.execute(Run.java:1840)
                at hudson.model.FreeStyleBuild.run(FreeStyleBuild.java:43)
                at hudson.model.ResourceController.execute(ResourceController.java:97)
                at hudson.model.Executor.run(Executor.java:429)
Caused: hudson.FilePath$TunneledInterruptedException
        at hudson.FilePath$FileCallableWrapper.call(FilePath.java:3054)
        at hudson.remoting.UserRequest.perform(UserRequest.java:212)
        at hudson.remoting.UserRequest.perform(UserRequest.java:54)
        at hudson.remoting.Request$2.run(Request.java:369)
        at hudson.remoting.InterceptingExecutorService$1.call(InterceptingExecutorService.java:72)
        at java.util.concurrent.FutureTask.run(FutureTask.java:266)
        at java.util.concurrent.ThreadPoolExecutor.runWorker(ThreadPoolExecutor.java:1149)
        at java.util.concurrent.ThreadPoolExecutor$Worker.run(ThreadPoolExecutor.java:624)
        at java.lang.Thread.run(Thread.java:748)
Caused: java.lang.InterruptedException: java.lang.InterruptedException: no matches found within 10000
        at hudson.FilePath.act(FilePath.java:1074)
        at hudson.FilePath.act(FilePath.java:1061)
        at hudson.FilePath.validateAntFileMask(FilePath.java:2663)
        at hudson.tasks.ArtifactArchiver.perform(ArtifactArchiver.java:248)
        at hudson.tasks.BuildStepCompatibilityLayer.perform(BuildStepCompatibilityLayer.java:79)
        at hudson.tasks.BuildStepMonitor$1.perform(BuildStepMonitor.java:20)
        at hudson.model.AbstractBuild$AbstractBuildExecution.perform(AbstractBuild.java:741)
        at hudson.model.AbstractBuild$AbstractBuildExecution.performAllBuildSteps(AbstractBuild.java:690)
        at hudson.model.Build$BuildExecution.post2(Build.java:186)
        at hudson.model.AbstractBuild$AbstractBuildExecution.post(AbstractBuild.java:635)
        at hudson.model.Run.execute(Run.java:1840)
        at hudson.model.FreeStyleBuild.run(FreeStyleBuild.java:43)
        at hudson.model.ResourceController.execute(ResourceController.java:97)
        at hudson.model.Executor.run(Executor.java:429)
No artifacts found that match the file pattern "**/*.events,heapdumps/**,**/*_pid*.log". Configuration error?
[WARNINGS] Parsing warnings in console log with parser Java Compiler (javac)
Setting ANT_1_8_2_HOME=/export/home/jenkins/tools/hudson.tasks.Ant_AntInstallation/ANT_1.8.2
No credentials specified
Setting ANT_1_8_2_HOME=/export/home/jenkins/tools/hudson.tasks.Ant_AntInstallation/ANT_1.8.2
<Git Blamer> Using GitBlamer to create author and commit information for all warnings.
<Git Blamer> GIT_COMMIT=0106b74badb98473e1e4464b8e2b37d7bebdc1a4, workspace=/export/home/jenkins/workspace/Lucene-Solr-8.x-Solaris
[WARNINGS] Computing warning deltas based on reference build #262
Recording test results
Setting ANT_1_8_2_HOME=/export/home/jenkins/tools/hudson.tasks.Ant_AntInstallation/ANT_1.8.2
Build step 'Publish JUnit test result report' changed build result to UNSTABLE
Email was triggered for: Unstable (Test Failures)
Sending email for trigger: Unstable (Test Failures)
Setting ANT_1_8_2_HOME=/export/home/jenkins/tools/hudson.tasks.Ant_AntInstallation/ANT_1.8.2
Setting ANT_1_8_2_HOME=/export/home/jenkins/tools/hudson.tasks.Ant_AntInstallation/ANT_1.8.2
Setting ANT_1_8_2_HOME=/export/home/jenkins/tools/hudson.tasks.Ant_AntInstallation/ANT_1.8.2
Setting ANT_1_8_2_HOME=/export/home/jenkins/tools/hudson.tasks.Ant_AntInstallation/ANT_1.8.2
Setting ANT_1_8_2_HOME=/export/home/jenkins/tools/hudson.tasks.Ant_AntInstallation/ANT_1.8.2
Setting ANT_1_8_2_HOME=/export/home/jenkins/tools/hudson.tasks.Ant_AntInstallation/ANT_1.8.2


---------------------------------------------------------------------
To unsubscribe, e-mail: [hidden email]
For additional commands, e-mail: [hidden email]
Reply | Threaded
Open this post in threaded view
|

[JENKINS] Lucene-Solr-8.x-Solaris (64bit/jdk1.8.0) - Build # 266 - Still Unstable!

Policeman Jenkins Server-2
Build: https://jenkins.thetaphi.de/job/Lucene-Solr-8.x-Solaris/266/
Java: 64bit/jdk1.8.0 -XX:+UseCompressedOops -XX:+UseParallelGC

1 tests failed.
FAILED:  org.apache.solr.cloud.TestSolrCloudWithDelegationTokens.testDelegationTokenRenew

Error Message:
expected:<200> but was:<403>

Stack Trace:
java.lang.AssertionError: expected:<200> but was:<403>
        at __randomizedtesting.SeedInfo.seed([61EB2273E740ABB5:5670D66DDF8C7611]:0)
        at org.junit.Assert.fail(Assert.java:88)
        at org.junit.Assert.failNotEquals(Assert.java:834)
        at org.junit.Assert.assertEquals(Assert.java:645)
        at org.junit.Assert.assertEquals(Assert.java:631)
        at org.apache.solr.cloud.TestSolrCloudWithDelegationTokens.renewDelegationToken(TestSolrCloudWithDelegationTokens.java:135)
        at org.apache.solr.cloud.TestSolrCloudWithDelegationTokens.verifyDelegationTokenRenew(TestSolrCloudWithDelegationTokens.java:320)
        at org.apache.solr.cloud.TestSolrCloudWithDelegationTokens.testDelegationTokenRenew(TestSolrCloudWithDelegationTokens.java:338)
        at sun.reflect.NativeMethodAccessorImpl.invoke0(Native Method)
        at sun.reflect.NativeMethodAccessorImpl.invoke(NativeMethodAccessorImpl.java:62)
        at sun.reflect.DelegatingMethodAccessorImpl.invoke(DelegatingMethodAccessorImpl.java:43)
        at java.lang.reflect.Method.invoke(Method.java:498)
        at com.carrotsearch.randomizedtesting.RandomizedRunner.invoke(RandomizedRunner.java:1750)
        at com.carrotsearch.randomizedtesting.RandomizedRunner$8.evaluate(RandomizedRunner.java:938)
        at com.carrotsearch.randomizedtesting.RandomizedRunner$9.evaluate(RandomizedRunner.java:974)
        at com.carrotsearch.randomizedtesting.RandomizedRunner$10.evaluate(RandomizedRunner.java:988)
        at com.carrotsearch.randomizedtesting.rules.SystemPropertiesRestoreRule$1.evaluate(SystemPropertiesRestoreRule.java:57)
        at org.apache.lucene.util.TestRuleSetupTeardownChained$1.evaluate(TestRuleSetupTeardownChained.java:49)
        at org.apache.lucene.util.AbstractBeforeAfterRule$1.evaluate(AbstractBeforeAfterRule.java:45)
        at org.apache.lucene.util.TestRuleThreadAndTestName$1.evaluate(TestRuleThreadAndTestName.java:48)
        at org.apache.lucene.util.TestRuleIgnoreAfterMaxFailures$1.evaluate(TestRuleIgnoreAfterMaxFailures.java:64)
        at org.apache.lucene.util.TestRuleMarkFailure$1.evaluate(TestRuleMarkFailure.java:47)
        at com.carrotsearch.randomizedtesting.rules.StatementAdapter.evaluate(StatementAdapter.java:36)
        at com.carrotsearch.randomizedtesting.ThreadLeakControl$StatementRunner.run(ThreadLeakControl.java:368)
        at com.carrotsearch.randomizedtesting.ThreadLeakControl.forkTimeoutingTask(ThreadLeakControl.java:817)
        at com.carrotsearch.randomizedtesting.ThreadLeakControl$3.evaluate(ThreadLeakControl.java:468)
        at com.carrotsearch.randomizedtesting.RandomizedRunner.runSingleTest(RandomizedRunner.java:947)
        at com.carrotsearch.randomizedtesting.RandomizedRunner$5.evaluate(RandomizedRunner.java:832)
        at com.carrotsearch.randomizedtesting.RandomizedRunner$6.evaluate(RandomizedRunner.java:883)
        at com.carrotsearch.randomizedtesting.RandomizedRunner$7.evaluate(RandomizedRunner.java:894)
        at com.carrotsearch.randomizedtesting.rules.StatementAdapter.evaluate(StatementAdapter.java:36)
        at com.carrotsearch.randomizedtesting.rules.SystemPropertiesRestoreRule$1.evaluate(SystemPropertiesRestoreRule.java:57)
        at org.apache.lucene.util.AbstractBeforeAfterRule$1.evaluate(AbstractBeforeAfterRule.java:45)
        at com.carrotsearch.randomizedtesting.rules.StatementAdapter.evaluate(StatementAdapter.java:36)
        at org.apache.lucene.util.TestRuleStoreClassName$1.evaluate(TestRuleStoreClassName.java:41)
        at com.carrotsearch.randomizedtesting.rules.NoShadowingOrOverridesOnMethodsRule$1.evaluate(NoShadowingOrOverridesOnMethodsRule.java:40)
        at com.carrotsearch.randomizedtesting.rules.NoShadowingOrOverridesOnMethodsRule$1.evaluate(NoShadowingOrOverridesOnMethodsRule.java:40)
        at com.carrotsearch.randomizedtesting.rules.StatementAdapter.evaluate(StatementAdapter.java:36)
        at com.carrotsearch.randomizedtesting.rules.StatementAdapter.evaluate(StatementAdapter.java:36)
        at com.carrotsearch.randomizedtesting.rules.StatementAdapter.evaluate(StatementAdapter.java:36)
        at org.apache.lucene.util.TestRuleAssertionsRequired$1.evaluate(TestRuleAssertionsRequired.java:53)
        at org.apache.lucene.util.TestRuleMarkFailure$1.evaluate(TestRuleMarkFailure.java:47)
        at org.apache.lucene.util.TestRuleIgnoreAfterMaxFailures$1.evaluate(TestRuleIgnoreAfterMaxFailures.java:64)
        at org.apache.lucene.util.TestRuleIgnoreTestSuites$1.evaluate(TestRuleIgnoreTestSuites.java:54)
        at com.carrotsearch.randomizedtesting.rules.StatementAdapter.evaluate(StatementAdapter.java:36)
        at com.carrotsearch.randomizedtesting.ThreadLeakControl$StatementRunner.run(ThreadLeakControl.java:368)
        at java.lang.Thread.run(Thread.java:748)




Build Log:
[...truncated 14097 lines...]
   [junit4] Suite: org.apache.solr.cloud.TestSolrCloudWithDelegationTokens
   [junit4]   2> 1500400 INFO  (SUITE-TestSolrCloudWithDelegationTokens-seed#[61EB2273E740ABB5]-worker) [     ] o.a.s.SolrTestCaseJ4 Created dataDir: /export/home/jenkins/workspace/Lucene-Solr-8.x-Solaris/solr/build/solr-core/test/J1/temp/solr.cloud.TestSolrCloudWithDelegationTokens_61EB2273E740ABB5-001/data-dir-163-001
   [junit4]   2> 1500400 WARN  (SUITE-TestSolrCloudWithDelegationTokens-seed#[61EB2273E740ABB5]-worker) [     ] o.a.s.SolrTestCaseJ4 startTrackingSearchers: numOpens=4 numCloses=4
   [junit4]   2> 1500400 INFO  (SUITE-TestSolrCloudWithDelegationTokens-seed#[61EB2273E740ABB5]-worker) [     ] o.a.s.SolrTestCaseJ4 Using PointFields (NUMERIC_POINTS_SYSPROP=true) w/NUMERIC_DOCVALUES_SYSPROP=true
   [junit4]   2> 1500402 INFO  (SUITE-TestSolrCloudWithDelegationTokens-seed#[61EB2273E740ABB5]-worker) [     ] o.a.s.SolrTestCaseJ4 Randomized ssl (true) and clientAuth (false) via: @org.apache.solr.util.RandomizeSSL(reason=, value=NaN, ssl=NaN, clientAuth=NaN)
   [junit4]   2> 1500403 INFO  (SUITE-TestSolrCloudWithDelegationTokens-seed#[61EB2273E740ABB5]-worker) [     ] o.a.s.SolrTestCaseJ4 SecureRandom sanity checks: test.solr.allowed.securerandom=null & java.security.egd=file:/dev/./urandom
   [junit4]   2> 1500414 INFO  (SUITE-TestSolrCloudWithDelegationTokens-seed#[61EB2273E740ABB5]-worker) [     ] o.a.s.c.MiniSolrCloudCluster Starting cluster of 2 servers in /export/home/jenkins/workspace/Lucene-Solr-8.x-Solaris/solr/build/solr-core/test/J1/temp/solr.cloud.TestSolrCloudWithDelegationTokens_61EB2273E740ABB5-001/tempDir-001
   [junit4]   2> 1500415 INFO  (SUITE-TestSolrCloudWithDelegationTokens-seed#[61EB2273E740ABB5]-worker) [     ] o.a.s.c.ZkTestServer STARTING ZK TEST SERVER
   [junit4]   2> 1500415 INFO  (ZkTestServer Run Thread) [     ] o.a.s.c.ZkTestServer client port:0.0.0.0/0.0.0.0:0
   [junit4]   2> 1500415 INFO  (ZkTestServer Run Thread) [     ] o.a.s.c.ZkTestServer Starting server
   [junit4]   2> 1500516 INFO  (SUITE-TestSolrCloudWithDelegationTokens-seed#[61EB2273E740ABB5]-worker) [     ] o.a.s.c.ZkTestServer start zk server on port:48714
   [junit4]   2> 1500516 INFO  (SUITE-TestSolrCloudWithDelegationTokens-seed#[61EB2273E740ABB5]-worker) [     ] o.a.s.c.ZkTestServer parse host and port list: 127.0.0.1:48714
   [junit4]   2> 1500516 INFO  (SUITE-TestSolrCloudWithDelegationTokens-seed#[61EB2273E740ABB5]-worker) [     ] o.a.s.c.ZkTestServer connecting to 127.0.0.1 48714
   [junit4]   2> 1500525 INFO  (SUITE-TestSolrCloudWithDelegationTokens-seed#[61EB2273E740ABB5]-worker) [     ] o.a.s.c.c.ConnectionManager Waiting for client to connect to ZooKeeper
   [junit4]   2> 1500528 INFO  (zkConnectionManagerCallback-8502-thread-1) [     ] o.a.s.c.c.ConnectionManager zkClient has connected
   [junit4]   2> 1500528 INFO  (SUITE-TestSolrCloudWithDelegationTokens-seed#[61EB2273E740ABB5]-worker) [     ] o.a.s.c.c.ConnectionManager Client is connected to ZooKeeper
   [junit4]   2> 1500532 INFO  (SUITE-TestSolrCloudWithDelegationTokens-seed#[61EB2273E740ABB5]-worker) [     ] o.a.s.c.c.ConnectionManager Waiting for client to connect to ZooKeeper
   [junit4]   2> 1500534 INFO  (zkConnectionManagerCallback-8504-thread-1) [     ] o.a.s.c.c.ConnectionManager zkClient has connected
   [junit4]   2> 1500534 INFO  (SUITE-TestSolrCloudWithDelegationTokens-seed#[61EB2273E740ABB5]-worker) [     ] o.a.s.c.c.ConnectionManager Client is connected to ZooKeeper
   [junit4]   2> 1500535 INFO  (SUITE-TestSolrCloudWithDelegationTokens-seed#[61EB2273E740ABB5]-worker) [     ] o.a.s.c.c.ConnectionManager Waiting for client to connect to ZooKeeper
   [junit4]   2> 1500537 INFO  (zkConnectionManagerCallback-8506-thread-1) [     ] o.a.s.c.c.ConnectionManager zkClient has connected
   [junit4]   2> 1500537 INFO  (SUITE-TestSolrCloudWithDelegationTokens-seed#[61EB2273E740ABB5]-worker) [     ] o.a.s.c.c.ConnectionManager Client is connected to ZooKeeper
   [junit4]   2> 1500642 WARN  (jetty-launcher-8507-thread-1) [     ] o.e.j.s.AbstractConnector Ignoring deprecated socket close linger time
   [junit4]   2> 1500642 INFO  (jetty-launcher-8507-thread-1) [     ] o.a.s.c.s.e.JettySolrRunner Start Jetty (original configured port=0)
   [junit4]   2> 1500642 INFO  (jetty-launcher-8507-thread-1) [     ] o.a.s.c.s.e.JettySolrRunner Trying to start Jetty on port 0 try number 1 ...
   [junit4]   2> 1500642 INFO  (jetty-launcher-8507-thread-1) [     ] o.e.j.s.Server jetty-9.4.19.v20190610; built: 2019-06-10T16:30:51.723Z; git: afcf563148970e98786327af5e07c261fda175d3; jvm 1.8.0_221-b11
   [junit4]   2> 1500643 INFO  (jetty-launcher-8507-thread-1) [     ] o.e.j.s.session DefaultSessionIdManager workerName=node0
   [junit4]   2> 1500643 INFO  (jetty-launcher-8507-thread-1) [     ] o.e.j.s.session No SessionScavenger set, using defaults
   [junit4]   2> 1500643 INFO  (jetty-launcher-8507-thread-1) [     ] o.e.j.s.session node0 Scavenging every 660000ms
   [junit4]   2> 1500643 INFO  (jetty-launcher-8507-thread-1) [     ] o.e.j.s.h.ContextHandler Started o.e.j.s.ServletContextHandler@601c1319{/solr,null,AVAILABLE}
   [junit4]   2> 1500645 INFO  (jetty-launcher-8507-thread-1) [     ] o.e.j.s.AbstractConnector Started ServerConnector@76c6c5b6{SSL,[ssl, http/1.1]}{127.0.0.1:60462}
   [junit4]   2> 1500645 INFO  (jetty-launcher-8507-thread-1) [     ] o.e.j.s.Server Started @1501322ms
   [junit4]   2> 1500645 INFO  (jetty-launcher-8507-thread-1) [     ] o.a.s.c.s.e.JettySolrRunner Jetty properties: {hostContext=/solr, hostPort=60462}
   [junit4]   2> 1500645 ERROR (jetty-launcher-8507-thread-1) [     ] o.a.s.u.StartupLoggingUtils Missing Java Option solr.log.dir. Logging may be missing or incomplete.
   [junit4]   2> 1500645 INFO  (jetty-launcher-8507-thread-1) [     ] o.a.s.s.SolrDispatchFilter Using logger factory org.apache.logging.slf4j.Log4jLoggerFactory
   [junit4]   2> 1500645 INFO  (jetty-launcher-8507-thread-1) [     ] o.a.s.s.SolrDispatchFilter  ___      _       Welcome to Apache Solr? version 8.3.0
   [junit4]   2> 1500645 INFO  (jetty-launcher-8507-thread-1) [     ] o.a.s.s.SolrDispatchFilter / __| ___| |_ _   Starting in cloud mode on port null
   [junit4]   2> 1500645 INFO  (jetty-launcher-8507-thread-1) [     ] o.a.s.s.SolrDispatchFilter \__ \/ _ \ | '_|  Install dir: null
   [junit4]   2> 1500645 INFO  (jetty-launcher-8507-thread-1) [     ] o.a.s.s.SolrDispatchFilter |___/\___/_|_|    Start time: 2019-08-14T16:48:29.344Z
   [junit4]   2> 1500647 INFO  (jetty-launcher-8507-thread-1) [     ] o.a.s.c.c.ConnectionManager Waiting for client to connect to ZooKeeper
   [junit4]   2> 1500647 WARN  (jetty-launcher-8507-thread-2) [     ] o.e.j.s.AbstractConnector Ignoring deprecated socket close linger time
   [junit4]   2> 1500647 INFO  (jetty-launcher-8507-thread-2) [     ] o.a.s.c.s.e.JettySolrRunner Start Jetty (original configured port=0)
   [junit4]   2> 1500648 INFO  (jetty-launcher-8507-thread-2) [     ] o.a.s.c.s.e.JettySolrRunner Trying to start Jetty on port 0 try number 1 ...
   [junit4]   2> 1500648 INFO  (jetty-launcher-8507-thread-2) [     ] o.e.j.s.Server jetty-9.4.19.v20190610; built: 2019-06-10T16:30:51.723Z; git: afcf563148970e98786327af5e07c261fda175d3; jvm 1.8.0_221-b11
   [junit4]   2> 1500649 INFO  (jetty-launcher-8507-thread-2) [     ] o.e.j.s.session DefaultSessionIdManager workerName=node0
   [junit4]   2> 1500649 INFO  (jetty-launcher-8507-thread-2) [     ] o.e.j.s.session No SessionScavenger set, using defaults
   [junit4]   2> 1500649 INFO  (jetty-launcher-8507-thread-2) [     ] o.e.j.s.session node0 Scavenging every 660000ms
   [junit4]   2> 1500649 INFO  (jetty-launcher-8507-thread-2) [     ] o.e.j.s.h.ContextHandler Started o.e.j.s.ServletContextHandler@537e1f6f{/solr,null,AVAILABLE}
   [junit4]   2> 1500650 INFO  (jetty-launcher-8507-thread-2) [     ] o.e.j.s.AbstractConnector Started ServerConnector@1aa1c4f3{SSL,[ssl, http/1.1]}{127.0.0.1:48839}
   [junit4]   2> 1500650 INFO  (jetty-launcher-8507-thread-2) [     ] o.e.j.s.Server Started @1501327ms
   [junit4]   2> 1500650 INFO  (jetty-launcher-8507-thread-2) [     ] o.a.s.c.s.e.JettySolrRunner Jetty properties: {hostContext=/solr, hostPort=48839}
   [junit4]   2> 1500650 INFO  (zkConnectionManagerCallback-8509-thread-1) [     ] o.a.s.c.c.ConnectionManager zkClient has connected
   [junit4]   2> 1500650 INFO  (jetty-launcher-8507-thread-1) [     ] o.a.s.c.c.ConnectionManager Client is connected to ZooKeeper
   [junit4]   2> 1500650 ERROR (jetty-launcher-8507-thread-2) [     ] o.a.s.u.StartupLoggingUtils Missing Java Option solr.log.dir. Logging may be missing or incomplete.
   [junit4]   2> 1500650 INFO  (jetty-launcher-8507-thread-2) [     ] o.a.s.s.SolrDispatchFilter Using logger factory org.apache.logging.slf4j.Log4jLoggerFactory
   [junit4]   2> 1500650 INFO  (jetty-launcher-8507-thread-2) [     ] o.a.s.s.SolrDispatchFilter  ___      _       Welcome to Apache Solr? version 8.3.0
   [junit4]   2> 1500650 INFO  (jetty-launcher-8507-thread-2) [     ] o.a.s.s.SolrDispatchFilter / __| ___| |_ _   Starting in cloud mode on port null
   [junit4]   2> 1500650 INFO  (jetty-launcher-8507-thread-2) [     ] o.a.s.s.SolrDispatchFilter \__ \/ _ \ | '_|  Install dir: null
   [junit4]   2> 1500650 INFO  (jetty-launcher-8507-thread-2) [     ] o.a.s.s.SolrDispatchFilter |___/\___/_|_|    Start time: 2019-08-14T16:48:29.349Z
   [junit4]   2> 1500652 INFO  (jetty-launcher-8507-thread-2) [     ] o.a.s.c.c.ConnectionManager Waiting for client to connect to ZooKeeper
   [junit4]   2> 1500652 INFO  (jetty-launcher-8507-thread-1) [     ] o.a.s.s.SolrDispatchFilter solr.xml found in ZooKeeper. Loading...
   [junit4]   2> 1500659 INFO  (zkConnectionManagerCallback-8511-thread-1) [     ] o.a.s.c.c.ConnectionManager zkClient has connected
   [junit4]   2> 1500659 INFO  (jetty-launcher-8507-thread-2) [     ] o.a.s.c.c.ConnectionManager Client is connected to ZooKeeper
   [junit4]   2> 1500759 INFO  (jetty-launcher-8507-thread-2) [     ] o.a.s.s.SolrDispatchFilter solr.xml found in ZooKeeper. Loading...
   [junit4]   2> 1502027 INFO  (jetty-launcher-8507-thread-1) [     ] o.a.s.h.c.HttpShardHandlerFactory Host whitelist initialized: WhitelistHostChecker [whitelistHosts=null, whitelistHostCheckingEnabled=true]
   [junit4]   2> 1502028 WARN  (jetty-launcher-8507-thread-1) [     ] o.a.s.c.s.i.Http2SolrClient Create Http2SolrClient with HTTP/1.1 transport since Java 8 or lower versions does not support SSL + HTTP/2
   [junit4]   2> 1502028 WARN  (jetty-launcher-8507-thread-1) [     ] o.e.j.u.s.S.config Trusting all certificates configured for Client@18f9498e[provider=null,keyStore=null,trustStore=null]
   [junit4]   2> 1502029 WARN  (jetty-launcher-8507-thread-1) [     ] o.e.j.u.s.S.config No Client EndPointIdentificationAlgorithm configured for Client@18f9498e[provider=null,keyStore=null,trustStore=null]
   [junit4]   2> 1502031 WARN  (jetty-launcher-8507-thread-1) [     ] o.a.s.c.s.i.Http2SolrClient Create Http2SolrClient with HTTP/1.1 transport since Java 8 or lower versions does not support SSL + HTTP/2
   [junit4]   2> 1502032 WARN  (jetty-launcher-8507-thread-1) [     ] o.e.j.u.s.S.config Trusting all certificates configured for Client@1d670ee5[provider=null,keyStore=null,trustStore=null]
   [junit4]   2> 1502032 WARN  (jetty-launcher-8507-thread-1) [     ] o.e.j.u.s.S.config No Client EndPointIdentificationAlgorithm configured for Client@1d670ee5[provider=null,keyStore=null,trustStore=null]
   [junit4]   2> 1502032 INFO  (jetty-launcher-8507-thread-1) [     ] o.a.s.c.ZkContainer Zookeeper client=127.0.0.1:48714/solr
   [junit4]   2> 1502033 INFO  (jetty-launcher-8507-thread-1) [     ] o.a.s.c.c.ConnectionManager Waiting for client to connect to ZooKeeper
   [junit4]   2> 1502035 INFO  (zkConnectionManagerCallback-8519-thread-1) [     ] o.a.s.c.c.ConnectionManager zkClient has connected
   [junit4]   2> 1502035 INFO  (jetty-launcher-8507-thread-1) [     ] o.a.s.c.c.ConnectionManager Client is connected to ZooKeeper
   [junit4]   2> 1502150 INFO  (jetty-launcher-8507-thread-1) [n:127.0.0.1:60462_solr     ] o.a.s.c.c.ConnectionManager Waiting for client to connect to ZooKeeper
   [junit4]   2> 1502152 INFO  (zkConnectionManagerCallback-8521-thread-1) [     ] o.a.s.c.c.ConnectionManager zkClient has connected
   [junit4]   2> 1502152 INFO  (jetty-launcher-8507-thread-1) [n:127.0.0.1:60462_solr     ] o.a.s.c.c.ConnectionManager Client is connected to ZooKeeper
   [junit4]   2> 1502282 INFO  (jetty-launcher-8507-thread-1) [n:127.0.0.1:60462_solr     ] o.a.s.c.OverseerElectionContext I am going to be the leader 127.0.0.1:60462_solr
   [junit4]   2> 1502284 INFO  (jetty-launcher-8507-thread-1) [n:127.0.0.1:60462_solr     ] o.a.s.c.Overseer Overseer (id=72118983452459014-127.0.0.1:60462_solr-n_0000000000) starting
   [junit4]   2> 1502294 INFO  (jetty-launcher-8507-thread-1) [n:127.0.0.1:60462_solr     ] o.a.s.c.c.ConnectionManager Waiting for client to connect to ZooKeeper
   [junit4]   2> 1502297 INFO  (zkConnectionManagerCallback-8528-thread-1) [     ] o.a.s.c.c.ConnectionManager zkClient has connected
   [junit4]   2> 1502297 INFO  (jetty-launcher-8507-thread-1) [n:127.0.0.1:60462_solr     ] o.a.s.c.c.ConnectionManager Client is connected to ZooKeeper
   [junit4]   2> 1502302 INFO  (jetty-launcher-8507-thread-1) [n:127.0.0.1:60462_solr     ] o.a.s.c.s.i.ZkClientClusterStateProvider Cluster at 127.0.0.1:48714/solr ready
   [junit4]   2> 1502304 INFO  (OverseerStateUpdate-72118983452459014-127.0.0.1:60462_solr-n_0000000000) [n:127.0.0.1:60462_solr     ] o.a.s.c.Overseer Starting to work on the main queue : 127.0.0.1:60462_solr
   [junit4]   2> 1502307 INFO  (jetty-launcher-8507-thread-1) [n:127.0.0.1:60462_solr     ] o.a.s.c.ZkController Register node as live in ZooKeeper:/live_nodes/127.0.0.1:60462_solr
   [junit4]   2> 1502310 INFO  (jetty-launcher-8507-thread-1) [n:127.0.0.1:60462_solr     ] o.a.s.c.LibListener clusterprops.json changed , version 0
   [junit4]   2> 1502310 INFO  (jetty-launcher-8507-thread-1) [n:127.0.0.1:60462_solr     ] o.a.s.c.CoreContainer Initializing authentication plugin: org.apache.solr.security.HttpParamDelegationTokenPlugin
   [junit4]   2> 1502333 WARN  (jetty-launcher-8507-thread-1) [n:127.0.0.1:60462_solr     ] o.a.s.c.s.i.Krb5HttpClientBuilder org.apache.solr.client.solrj.impl.Krb5HttpClientBuilder is configured without specifying system property 'java.security.auth.login.config'
   [junit4]   2> 1502334 INFO  (zkCallback-8520-thread-1) [     ] o.a.s.c.c.ZkStateReader Updated live nodes from ZooKeeper... (0) -> (1)
   [junit4]   2> 1502342 INFO  (zkCallback-8527-thread-1) [     ] o.a.s.c.c.ZkStateReader Updated live nodes from ZooKeeper... (0) -> (1)
   [junit4]   2> 1502347 INFO  (jetty-launcher-8507-thread-1) [n:127.0.0.1:60462_solr     ] o.a.s.s.KerberosPlugin Params: {token.valid=30, delegation-token.token-kind=solr-dt, cookie.domain=127.0.0.1, cookie.path=/, zk-dt-secret-manager.znodeWorkingPath=solr/security/zkdtsm, token.validity=36000, signer.secret.provider.zookeeper.path=/token, type=kerberos, zk-dt-secret-manager.enable=true, kerberos.name.rules=DEFAULT, signer.secret.provider=zookeeper, delegation-token.json-mapper.AUTO_CLOSE_TARGET=false}
   [junit4]   2> 1502752 INFO  (jetty-launcher-8507-thread-1) [n:127.0.0.1:60462_solr     ] o.a.c.f.i.CuratorFrameworkImpl Starting
   [junit4]   2> 1502788 INFO  (jetty-launcher-8507-thread-2) [     ] o.a.s.h.c.HttpShardHandlerFactory Host whitelist initialized: WhitelistHostChecker [whitelistHosts=null, whitelistHostCheckingEnabled=true]
   [junit4]   2> 1502788 WARN  (jetty-launcher-8507-thread-2) [     ] o.a.s.c.s.i.Http2SolrClient Create Http2SolrClient with HTTP/1.1 transport since Java 8 or lower versions does not support SSL + HTTP/2
   [junit4]   2> 1502832 INFO  (jetty-launcher-8507-thread-1-EventThread) [     ] o.a.c.f.s.ConnectionStateManager State change: CONNECTED
   [junit4]   2> 1502922 WARN  (jetty-launcher-8507-thread-2) [     ] o.e.j.u.s.S.config Trusting all certificates configured for Client@56ad0a1f[provider=null,keyStore=null,trustStore=null]
   [junit4]   2> 1502922 WARN  (jetty-launcher-8507-thread-2) [     ] o.e.j.u.s.S.config No Client EndPointIdentificationAlgorithm configured for Client@56ad0a1f[provider=null,keyStore=null,trustStore=null]
   [junit4]   2> 1502925 WARN  (jetty-launcher-8507-thread-2) [     ] o.a.s.c.s.i.Http2SolrClient Create Http2SolrClient with HTTP/1.1 transport since Java 8 or lower versions does not support SSL + HTTP/2
   [junit4]   2> 1502926 WARN  (jetty-launcher-8507-thread-2) [     ] o.e.j.u.s.S.config Trusting all certificates configured for Client@2fef2ed1[provider=null,keyStore=null,trustStore=null]
   [junit4]   2> 1502927 WARN  (jetty-launcher-8507-thread-2) [     ] o.e.j.u.s.S.config No Client EndPointIdentificationAlgorithm configured for Client@2fef2ed1[provider=null,keyStore=null,trustStore=null]
   [junit4]   2> 1502928 INFO  (jetty-launcher-8507-thread-2) [     ] o.a.s.c.ZkContainer Zookeeper client=127.0.0.1:48714/solr
   [junit4]   2> 1502929 INFO  (jetty-launcher-8507-thread-2) [     ] o.a.s.c.c.ConnectionManager Waiting for client to connect to ZooKeeper
   [junit4]   2> 1502932 INFO  (zkConnectionManagerCallback-8534-thread-1) [     ] o.a.s.c.c.ConnectionManager zkClient has connected
   [junit4]   2> 1502932 INFO  (jetty-launcher-8507-thread-2) [     ] o.a.s.c.c.ConnectionManager Client is connected to ZooKeeper
   [junit4]   2> 1503056 INFO  (jetty-launcher-8507-thread-2) [n:127.0.0.1:48839_solr     ] o.a.s.c.c.ConnectionManager Waiting for client to connect to ZooKeeper
   [junit4]   2> 1503059 INFO  (zkConnectionManagerCallback-8536-thread-1) [     ] o.a.s.c.c.ConnectionManager zkClient has connected
   [junit4]   2> 1503059 INFO  (jetty-launcher-8507-thread-2) [n:127.0.0.1:48839_solr     ] o.a.s.c.c.ConnectionManager Client is connected to ZooKeeper
   [junit4]   2> 1503069 INFO  (jetty-launcher-8507-thread-2) [n:127.0.0.1:48839_solr     ] o.a.s.c.c.ZkStateReader Updated live nodes from ZooKeeper... (0) -> (1)
   [junit4]   2> 1503077 INFO  (jetty-launcher-8507-thread-2) [n:127.0.0.1:48839_solr     ] o.a.s.c.ZkController Publish node=127.0.0.1:48839_solr as DOWN
   [junit4]   2> 1503079 INFO  (jetty-launcher-8507-thread-2) [n:127.0.0.1:48839_solr     ] o.a.s.c.TransientSolrCoreCacheDefault Allocating transient cache for 2147483647 transient cores
   [junit4]   2> 1503080 INFO  (jetty-launcher-8507-thread-2) [n:127.0.0.1:48839_solr     ] o.a.s.c.ZkController Register node as live in ZooKeeper:/live_nodes/127.0.0.1:48839_solr
   [junit4]   2> 1503084 INFO  (zkCallback-8527-thread-1) [     ] o.a.s.c.c.ZkStateReader Updated live nodes from ZooKeeper... (1) -> (2)
   [junit4]   2> 1503085 INFO  (zkCallback-8520-thread-2) [     ] o.a.s.c.c.ZkStateReader Updated live nodes from ZooKeeper... (1) -> (2)
   [junit4]   2> 1503086 INFO  (jetty-launcher-8507-thread-2) [n:127.0.0.1:48839_solr     ] o.a.s.c.c.ConnectionManager Waiting for client to connect to ZooKeeper
   [junit4]   2> 1503088 INFO  (zkCallback-8535-thread-1) [     ] o.a.s.c.c.ZkStateReader Updated live nodes from ZooKeeper... (1) -> (2)
   [junit4]   2> 1503089 INFO  (zkConnectionManagerCallback-8543-thread-1) [     ] o.a.s.c.c.ConnectionManager zkClient has connected
   [junit4]   2> 1503089 INFO  (jetty-launcher-8507-thread-2) [n:127.0.0.1:48839_solr     ] o.a.s.c.c.ConnectionManager Client is connected to ZooKeeper
   [junit4]   2> 1503091 INFO  (jetty-launcher-8507-thread-2) [n:127.0.0.1:48839_solr     ] o.a.s.c.c.ZkStateReader Updated live nodes from ZooKeeper... (0) -> (2)
   [junit4]   2> 1503093 INFO  (jetty-launcher-8507-thread-2) [n:127.0.0.1:48839_solr     ] o.a.s.c.s.i.ZkClientClusterStateProvider Cluster at 127.0.0.1:48714/solr ready
   [junit4]   2> 1503093 INFO  (jetty-launcher-8507-thread-2) [n:127.0.0.1:48839_solr     ] o.a.s.c.LibListener clusterprops.json changed , version 0
   [junit4]   2> 1503094 INFO  (jetty-launcher-8507-thread-2) [n:127.0.0.1:48839_solr     ] o.a.s.c.CoreContainer Initializing authentication plugin: org.apache.solr.security.HttpParamDelegationTokenPlugin
   [junit4]   2> 1503094 WARN  (jetty-launcher-8507-thread-2) [n:127.0.0.1:48839_solr     ] o.a.s.c.s.i.Krb5HttpClientBuilder org.apache.solr.client.solrj.impl.Krb5HttpClientBuilder is configured without specifying system property 'java.security.auth.login.config'
   [junit4]   2> 1503094 INFO  (jetty-launcher-8507-thread-2) [n:127.0.0.1:48839_solr     ] o.a.s.s.KerberosPlugin Params: {token.valid=30, delegation-token.token-kind=solr-dt, cookie.domain=127.0.0.1, cookie.path=/, zk-dt-secret-manager.znodeWorkingPath=solr/security/zkdtsm, token.validity=36000, signer.secret.provider.zookeeper.path=/token, type=kerberos, zk-dt-secret-manager.enable=true, kerberos.name.rules=DEFAULT, signer.secret.provider=zookeeper, delegation-token.json-mapper.AUTO_CLOSE_TARGET=false}
   [junit4]   2> 1503095 INFO  (jetty-launcher-8507-thread-2) [n:127.0.0.1:48839_solr     ] o.a.c.f.i.CuratorFrameworkImpl Starting
   [junit4]   2> 1503104 INFO  (jetty-launcher-8507-thread-2-EventThread) [     ] o.a.c.f.s.ConnectionStateManager State change: CONNECTED
   [junit4]   2> 1503230 WARN  (jetty-launcher-8507-thread-2) [n:127.0.0.1:48839_solr     ] o.a.s.c.s.i.Krb5HttpClientBuilder org.apache.solr.client.solrj.impl.Krb5HttpClientBuilder is configured without specifying system property 'java.security.auth.login.config'
   [junit4]   2> 1503232 WARN  (jetty-launcher-8507-thread-1) [n:127.0.0.1:60462_solr     ] o.a.s.c.s.i.Krb5HttpClientBuilder org.apache.solr.client.solrj.impl.Krb5HttpClientBuilder is configured without specifying system property 'java.security.auth.login.config'
   [junit4]   2> 1503272 INFO  (jetty-launcher-8507-thread-1) [n:127.0.0.1:60462_solr     ] o.a.s.h.a.MetricsHistoryHandler No .system collection, keeping metrics history in memory.
   [junit4]   2> 1503306 INFO  (jetty-launcher-8507-thread-2) [n:127.0.0.1:48839_solr     ] o.a.s.h.a.MetricsHistoryHandler No .system collection, keeping metrics history in memory.
   [junit4]   2> 1503323 INFO  (jetty-launcher-8507-thread-1) [n:127.0.0.1:60462_solr     ] o.a.s.m.r.SolrJmxReporter JMX monitoring for 'solr_60462.solr.node' (registry 'solr.node') enabled at server: com.sun.jmx.mbeanserver.JmxMBeanServer@5aba394a
   [junit4]   2> 1503337 INFO  (jetty-launcher-8507-thread-2) [n:127.0.0.1:48839_solr     ] o.a.s.m.r.SolrJmxReporter JMX monitoring for 'solr_48839.solr.node' (registry 'solr.node') enabled at server: com.sun.jmx.mbeanserver.JmxMBeanServer@5aba394a
   [junit4]   2> 1503342 INFO  (jetty-launcher-8507-thread-1) [n:127.0.0.1:60462_solr     ] o.a.s.m.r.SolrJmxReporter JMX monitoring for 'solr_60462.solr.jvm' (registry 'solr.jvm') enabled at server: com.sun.jmx.mbeanserver.JmxMBeanServer@5aba394a
   [junit4]   2> 1503342 INFO  (jetty-launcher-8507-thread-1) [n:127.0.0.1:60462_solr     ] o.a.s.m.r.SolrJmxReporter JMX monitoring for 'solr_60462.solr.jetty' (registry 'solr.jetty') enabled at server: com.sun.jmx.mbeanserver.JmxMBeanServer@5aba394a
   [junit4]   2> 1503344 INFO  (jetty-launcher-8507-thread-1) [n:127.0.0.1:60462_solr     ] o.a.s.c.CorePropertiesLocator Found 0 core definitions underneath /export/home/jenkins/workspace/Lucene-Solr-8.x-Solaris/solr/build/solr-core/test/J1/temp/solr.cloud.TestSolrCloudWithDelegationTokens_61EB2273E740ABB5-001/tempDir-001/node1/.
   [junit4]   2> 1503347 INFO  (jetty-launcher-8507-thread-2) [n:127.0.0.1:48839_solr     ] o.a.s.m.r.SolrJmxReporter JMX monitoring for 'solr_48839.solr.jvm' (registry 'solr.jvm') enabled at server: com.sun.jmx.mbeanserver.JmxMBeanServer@5aba394a
   [junit4]   2> 1503347 INFO  (jetty-launcher-8507-thread-2) [n:127.0.0.1:48839_solr     ] o.a.s.m.r.SolrJmxReporter JMX monitoring for 'solr_48839.solr.jetty' (registry 'solr.jetty') enabled at server: com.sun.jmx.mbeanserver.JmxMBeanServer@5aba394a
   [junit4]   2> 1503348 INFO  (jetty-launcher-8507-thread-2) [n:127.0.0.1:48839_solr     ] o.a.s.c.CorePropertiesLocator Found 0 core definitions underneath /export/home/jenkins/workspace/Lucene-Solr-8.x-Solaris/solr/build/solr-core/test/J1/temp/solr.cloud.TestSolrCloudWithDelegationTokens_61EB2273E740ABB5-001/tempDir-001/node2/.
   [junit4]   2> 1503410 INFO  (SUITE-TestSolrCloudWithDelegationTokens-seed#[61EB2273E740ABB5]-worker) [     ] o.a.s.c.c.ConnectionManager Waiting for client to connect to ZooKeeper
   [junit4]   2> 1503412 INFO  (zkConnectionManagerCallback-8550-thread-1) [     ] o.a.s.c.c.ConnectionManager zkClient has connected
   [junit4]   2> 1503412 INFO  (SUITE-TestSolrCloudWithDelegationTokens-seed#[61EB2273E740ABB5]-worker) [     ] o.a.s.c.c.ConnectionManager Client is connected to ZooKeeper
   [junit4]   2> 1503414 INFO  (SUITE-TestSolrCloudWithDelegationTokens-seed#[61EB2273E740ABB5]-worker) [     ] o.a.s.c.c.ZkStateReader Updated live nodes from ZooKeeper... (0) -> (2)
   [junit4]   2> 1503416 INFO  (SUITE-TestSolrCloudWithDelegationTokens-seed#[61EB2273E740ABB5]-worker) [     ] o.a.s.c.s.i.ZkClientClusterStateProvider Cluster at 127.0.0.1:48714/solr ready
   [junit4]   2> 1503459 INFO  (TEST-TestSolrCloudWithDelegationTokens.testDelegationOtherOp-seed#[61EB2273E740ABB5]) [     ] o.a.s.SolrTestCaseJ4 ###Starting testDelegationOtherOp
   [junit4]   2> 1503500 INFO  (qtp2084482758-25700) [n:127.0.0.1:60462_solr     ] o.a.s.h.a.CollectionsHandler Invoked Collection Action :list with params op=someSolrOperation&action=LIST&wt=javabin&version=2 and sendToOCPQueue=true
   [junit4]   2> 1503500 INFO  (qtp2084482758-25700) [n:127.0.0.1:60462_solr     ] o.a.s.s.HttpSolrCall [admin] webapp=null path=/admin/collections params={op=someSolrOperation&action=LIST&wt=javabin&version=2} status=0 QTime=0
   [junit4]   2> 1503505 INFO  (TEST-TestSolrCloudWithDelegationTokens.testDelegationOtherOp-seed#[61EB2273E740ABB5]) [     ] o.a.s.SolrTestCaseJ4 ###Ending testDelegationOtherOp
   [junit4]   2> 1503549 INFO  (TEST-TestSolrCloudWithDelegationTokens.testDelegationTokenVerify-seed#[61EB2273E740ABB5]) [     ] o.a.s.SolrTestCaseJ4 ###Starting testDelegationTokenVerify
   [junit4]   2> 1503573 INFO  (TEST-TestSolrCloudWithDelegationTokens.testDelegationTokenVerify-seed#[61EB2273E740ABB5]) [     ] o.a.s.c.c.ConnectionManager Waiting for client to connect to ZooKeeper
   [junit4]   2> 1503575 INFO  (zkConnectionManagerCallback-8555-thread-1) [     ] o.a.s.c.c.ConnectionManager zkClient has connected
   [junit4]   2> 1503575 INFO  (TEST-TestSolrCloudWithDelegationTokens.testDelegationTokenVerify-seed#[61EB2273E740ABB5]) [     ] o.a.s.c.c.ConnectionManager Client is connected to ZooKeeper
   [junit4]   2> 1503577 INFO  (TEST-TestSolrCloudWithDelegationTokens.testDelegationTokenVerify-seed#[61EB2273E740ABB5]) [     ] o.a.s.c.c.ZkStateReader Updated live nodes from ZooKeeper... (0) -> (2)
   [junit4]   2> 1503580 INFO  (TEST-TestSolrCloudWithDelegationTokens.testDelegationTokenVerify-seed#[61EB2273E740ABB5]) [     ] o.a.s.c.s.i.ZkClientClusterStateProvider Cluster at 127.0.0.1:48714/solr ready
   [junit4]   2> 1503588 INFO  (qtp2084482758-25695) [n:127.0.0.1:60462_solr     ] o.a.s.h.a.CollectionsHandler Invoked Collection Action :list with params action=LIST&delegation=GgADYmFyA2JhcgCKAWyRB_ADigFstRR0AwEEFCQQddkVq77tN-ZPSopWq3JRYM2UB3NvbHItZHQA&wt=javabin&version=2 and sendToOCPQueue=true
   [junit4]   2> 1503588 INFO  (qtp2084482758-25695) [n:127.0.0.1:60462_solr     ] o.a.s.s.HttpSolrCall [admin] webapp=null path=/admin/collections params={action=LIST&delegation=GgADYmFyA2JhcgCKAWyRB_ADigFstRR0AwEEFCQQddkVq77tN-ZPSopWq3JRYM2UB3NvbHItZHQA&wt=javabin&version=2} status=0 QTime=0
   [junit4]   2> 1503715 INFO  (qtp274313091-25713) [n:127.0.0.1:48839_solr     ] o.a.s.h.a.CollectionsHandler Invoked Collection Action :list with params action=LIST&delegation=GgADYmFyA2JhcgCKAWyRB_ADigFstRR0AwEEFCQQddkVq77tN-ZPSopWq3JRYM2UB3NvbHItZHQA&wt=javabin&version=2 and sendToOCPQueue=true
   [junit4]   2> 1503715 INFO  (qtp274313091-25713) [n:127.0.0.1:48839_solr     ] o.a.s.s.HttpSolrCall [admin] webapp=null path=/admin/collections params={action=LIST&delegation=GgADYmFyA2JhcgCKAWyRB_ADigFstRR0AwEEFCQQddkVq77tN-ZPSopWq3JRYM2UB3NvbHItZHQA&wt=javabin&version=2} status=0 QTime=0
   [junit4]   2> 1503717 INFO  (TEST-TestSolrCloudWithDelegationTokens.testDelegationTokenVerify-seed#[61EB2273E740ABB5]) [     ] o.a.s.c.c.ConnectionManager Waiting for client to connect to ZooKeeper
   [junit4]   2> 1503720 INFO  (zkConnectionManagerCallback-8560-thread-1) [     ] o.a.s.c.c.ConnectionManager zkClient has connected
   [junit4]   2> 1503720 INFO  (TEST-TestSolrCloudWithDelegationTokens.testDelegationTokenVerify-seed#[61EB2273E740ABB5]) [     ] o.a.s.c.c.ConnectionManager Client is connected to ZooKeeper
   [junit4]   2> 1503722 INFO  (TEST-TestSolrCloudWithDelegationTokens.testDelegationTokenVerify-seed#[61EB2273E740ABB5]) [     ] o.a.s.c.c.ZkStateReader Updated live nodes from ZooKeeper... (0) -> (2)
   [junit4]   2> 1503724 INFO  (TEST-TestSolrCloudWithDelegationTokens.testDelegationTokenVerify-seed#[61EB2273E740ABB5]) [     ] o.a.s.c.s.i.ZkClientClusterStateProvider Cluster at 127.0.0.1:48714/solr ready
   [junit4]   2> 1503831 INFO  (TEST-TestSolrCloudWithDelegationTokens.testDelegationTokenVerify-seed#[61EB2273E740ABB5]) [     ] o.a.s.SolrTestCaseJ4 ###Ending testDelegationTokenVerify
   [junit4]   2> 1503909 INFO  (TEST-TestSolrCloudWithDelegationTokens.testDelegationTokenCancelFail-seed#[61EB2273E740ABB5]) [     ] o.a.s.SolrTestCaseJ4 ###Starting testDelegationTokenCancelFail
   [junit4]   2> 1503981 ERROR (qtp274313091-25711) [     ] o.a.h.s.t.d.ZKDelegationTokenSecretManager No node in path [/ZKDTSMTokensRoot/DT_2]
   [junit4]   2> 1503990 ERROR (qtp2084482758-25700) [n:127.0.0.1:60462_solr     ] o.a.h.s.t.d.ZKDelegationTokenSecretManager No node in path [/ZKDTSMTokensRoot/DT_2]
   [junit4]   2> 1504004 ERROR (qtp274313091-25708) [     ] o.a.h.s.t.d.ZKDelegationTokenSecretManager No node in path [/ZKDTSMTokensRoot/DT_3]
   [junit4]   2> 1504006 ERROR (qtp2084482758-25701) [     ] o.a.h.s.t.d.ZKDelegationTokenSecretManager No node in path [/ZKDTSMTokensRoot/DT_3]
   [junit4]   2> 1504007 INFO  (TEST-TestSolrCloudWithDelegationTokens.testDelegationTokenCancelFail-seed#[61EB2273E740ABB5]) [     ] o.a.s.SolrTestCaseJ4 ###Ending testDelegationTokenCancelFail
   [junit4]   2> 1504085 INFO  (TEST-TestSolrCloudWithDelegationTokens.testDelegationTokenSolrClient-seed#[61EB2273E740ABB5]) [     ] o.a.s.SolrTestCaseJ4 ###Starting testDelegationTokenSolrClient
   [junit4]   2> 1504102 INFO  (qtp2084482758-25695) [n:127.0.0.1:60462_solr     ] o.a.s.h.a.CollectionsHandler Invoked Collection Action :list with params action=LIST&delegation=GgADYmFyA2JhcgCKAWyRB_IRigFstRR2EQQEFNpeUv9kk2vJV_EpUIKO8irf6oLWB3NvbHItZHQA&wt=javabin&version=2 and sendToOCPQueue=true
   [junit4]   2> 1504102 INFO  (qtp2084482758-25695) [n:127.0.0.1:60462_solr     ] o.a.s.s.HttpSolrCall [admin] webapp=null path=/admin/collections params={action=LIST&delegation=GgADYmFyA2JhcgCKAWyRB_IRigFstRR2EQQEFNpeUv9kk2vJV_EpUIKO8irf6oLWB3NvbHItZHQA&wt=javabin&version=2} status=0 QTime=0
   [junit4]   2> 1504105 INFO  (TEST-TestSolrCloudWithDelegationTokens.testDelegationTokenSolrClient-seed#[61EB2273E740ABB5]) [     ] o.a.s.SolrTestCaseJ4 ###Ending testDelegationTokenSolrClient
   [junit4]   2> 1504189 INFO  (TEST-TestSolrCloudWithDelegationTokens.testDelegationTokenRenewFail-seed#[61EB2273E740ABB5]) [     ] o.a.s.SolrTestCaseJ4 ###Starting testDelegationTokenRenewFail
   [junit4]   2> 1504201 WARN  (qtp2084482758-25699) [     ] o.a.h.s.a.s.AuthenticationFilter Authentication exception: org.apache.hadoop.security.AccessControlException: foo tries to renew a token (solr-dt owner=bar, renewer=bar, realUser=, issueDate=1565801312890, maxDate=1566406112890, sequenceNumber=5, masterKeyId=4) with non-matching renewer bar
   [junit4]   2> 1504201 WARN  (qtp2084482758-25699) [     ] o.a.s.s.KerberosPlugin Could not find org.apache.solr.security.authentication.requestcontinues
   [junit4]   2> 1504204 WARN  (qtp274313091-25712) [     ] o.a.h.s.a.s.AuthenticationFilter Authentication exception: org.apache.hadoop.security.AccessControlException: foo tries to renew a token (solr-dt owner=bar, renewer=bar, realUser=, issueDate=1565801312890, maxDate=1566406112890, sequenceNumber=5, masterKeyId=4) with non-matching renewer bar
   [junit4]   2> 1504204 WARN  (qtp274313091-25712) [     ] o.a.s.s.KerberosPlugin Could not find org.apache.solr.security.authentication.requestcontinues
   [junit4]   2> 1504249 WARN  (qtp2084482758-25700) [n:127.0.0.1:60462_solr     ] o.a.h.s.a.s.AuthenticationFilter AuthenticationToken ignored: Unauthorized access
   [junit4]   2> 1504257 WARN  (qtp2084482758-25695) [n:127.0.0.1:60462_solr     ] o.a.h.s.a.s.AuthenticationFilter AuthenticationToken ignored: Unauthorized access
   [junit4]   2> 1504257 WARN  (qtp2084482758-25695) [n:127.0.0.1:60462_solr     ] o.a.h.s.a.s.AuthenticationFilter Authentication exception: org.apache.hadoop.security.AccessControlException: notRenewUser tries to renew a token (solr-dt owner=bar, renewer=renewUser, realUser=, issueDate=1565801312949, maxDate=1566406112949, sequenceNumber=6, masterKeyId=4) with non-matching renewer renewUser
   [junit4]   2> 1504257 WARN  (qtp2084482758-25695) [n:127.0.0.1:60462_solr     ] o.a.s.s.KerberosPlugin Could not find org.apache.solr.security.authentication.requestcontinues
   [junit4]   2> 1504258 WARN  (qtp274313091-25709) [     ] o.a.h.s.a.s.AuthenticationFilter AuthenticationToken ignored: Unauthorized access
   [junit4]   2> 1504258 WARN  (qtp274313091-25709) [     ] o.a.h.s.a.s.AuthenticationFilter Authentication exception: org.apache.hadoop.security.AccessControlException: notRenewUser tries to renew a token (solr-dt owner=bar, renewer=renewUser, realUser=, issueDate=1565801312949, maxDate=1566406112949, sequenceNumber=6, masterKeyId=4) with non-matching renewer renewUser
   [junit4]   2> 1504258 WARN  (qtp274313091-25709) [     ] o.a.s.s.KerberosPlugin Could not find org.apache.solr.security.authentication.requestcontinues
   [junit4]   2> 1504259 INFO  (TEST-TestSolrCloudWithDelegationTokens.testDelegationTokenRenewFail-seed#[61EB2273E740ABB5]) [     ] o.a.s.SolrTestCaseJ4 ###Ending testDelegationTokenRenewFail
   [junit4]   2> 1504317 INFO  (TEST-TestSolrCloudWithDelegationTokens.testDelegationTokenRenew-seed#[61EB2273E740ABB5]) [     ] o.a.s.SolrTestCaseJ4 ###Starting testDelegationTokenRenew
   [junit4]   2> 1504318 WARN  (qtp2084482758-25701) [     ] o.a.h.s.a.s.AuthenticationFilter AuthenticationToken ignored: Unauthorized access
   [junit4]   2> 1504324 WARN  (qtp2084482758-25697) [     ] o.a.h.s.a.s.AuthenticationFilter AuthenticationToken ignored: Unauthorized access
   [junit4]   2> 1504325 WARN  (qtp2084482758-25697) [     ] o.a.h.s.a.s.AuthenticationFilter Authentication exception: org.apache.hadoop.security.AccessControlException: bar is trying to renew a token (solr-dt owner=bar, renewer=bar, realUser=, issueDate=1565801313017, maxDate=1566406113017, sequenceNumber=7, masterKeyId=4) with wrong password
   [junit4]   2> 1504325 WARN  (qtp2084482758-25697) [     ] o.a.s.s.KerberosPlugin Could not find org.apache.solr.security.authentication.requestcontinues
   [junit4]   2> 1504326 INFO  (TEST-TestSolrCloudWithDelegationTokens.testDelegationTokenRenew-seed#[61EB2273E740ABB5]) [     ] o.a.s.SolrTestCaseJ4 ###Ending testDelegationTokenRenew
   [junit4]   2> NOTE: reproduce with: ant test  -Dtestcase=TestSolrCloudWithDelegationTokens -Dtests.method=testDelegationTokenRenew -Dtests.seed=61EB2273E740ABB5 -Dtests.slow=true -Dtests.locale=es-CO -Dtests.timezone=Europe/Ljubljana -Dtests.asserts=true -Dtests.file.encoding=ISO-8859-1
   [junit4] FAILURE 0.08s J1 | TestSolrCloudWithDelegationTokens.testDelegationTokenRenew <<<
   [junit4]    > Throwable #1: java.lang.AssertionError: expected:<200> but was:<403>
   [junit4]    > at __randomizedtesting.SeedInfo.seed([61EB2273E740ABB5:5670D66DDF8C7611]:0)
   [junit4]    > at org.apache.solr.cloud.TestSolrCloudWithDelegationTokens.renewDelegationToken(TestSolrCloudWithDelegationTokens.java:135)
   [junit4]    > at org.apache.solr.cloud.TestSolrCloudWithDelegationTokens.verifyDelegationTokenRenew(TestSolrCloudWithDelegationTokens.java:320)
   [junit4]    > at org.apache.solr.cloud.TestSolrCloudWithDelegationTokens.testDelegationTokenRenew(TestSolrCloudWithDelegationTokens.java:338)
   [junit4]    > at java.lang.Thread.run(Thread.java:748)
   [junit4]   2> 1504399 INFO  (TEST-TestSolrCloudWithDelegationTokens.testDelegationTokenCancel-seed#[61EB2273E740ABB5]) [     ] o.a.s.SolrTestCaseJ4 ###Starting testDelegationTokenCancel
   [junit4]   2> 1504400 WARN  (qtp2084482758-25698) [     ] o.a.h.s.a.s.AuthenticationFilter AuthenticationToken ignored: Unauthorized access
   [junit4]   2> 1504403 WARN  (qtp2084482758-25699) [     ] o.a.h.s.a.s.AuthenticationFilter AuthenticationToken ignored: Unauthorized access
   [junit4]   2> 1504415 ERROR (qtp2084482758-25698) [     ] o.a.h.s.t.d.ZKDelegationTokenSecretManager No node in path [/ZKDTSMTokensRoot/DT_8]
   [junit4]   2> 1504451 WARN  (qtp2084482758-25695) [n:127.0.0.1:60462_solr     ] o.a.h.s.a.s.AuthenticationFilter AuthenticationToken ignored: Unauthorized access
   [junit4]   2> 1504455 WARN  (qtp274313091-25708) [     ] o.a.h.s.a.s.AuthenticationFilter AuthenticationToken ignored: Unauthorized access
   [junit4]   2> 1504462 INFO  (TEST-TestSolrCloudWithDelegationTokens.testDelegationTokenCancel-seed#[61EB2273E740ABB5]) [     ] o.a.s.c.c.ConnectionManager Waiting for client to connect to ZooKeeper
   [junit4]   2> 1504465 INFO  (zkConnectionManagerCallback-8565-thread-1) [     ] o.a.s.c.c.ConnectionManager zkClient has connected
   [junit4]   2> 1504465 INFO  (TEST-TestSolrCloudWithDelegationTokens.testDelegationTokenCancel-seed#[61EB2273E740ABB5]) [     ] o.a.s.c.c.ConnectionManager Client is connected to ZooKeeper
   [junit4]   2> 1504466 INFO  (TEST-TestSolrCloudWithDelegationTokens.testDelegationTokenCancel-seed#[61EB2273E740ABB5]) [     ] o.a.s.c.c.ZkStateReader Updated live nodes from ZooKeeper... (0) -> (2)
   [junit4]   2> 1504468 INFO  (TEST-TestSolrCloudWithDelegationTokens.testDelegationTokenCancel-seed#[61EB2273E740ABB5]) [     ] o.a.s.c.s.i.ZkClientClusterStateProvider Cluster at 127.0.0.1:48714/solr ready
   [junit4]   2> 1504473 ERROR (qtp2084482758-25699) [     ] o.a.h.s.t.d.ZKDelegationTokenSecretManager No node in path [/ZKDTSMTokensRoot/DT_9]
   [junit4]   2> 1504580 INFO  (TEST-TestSolrCloudWithDelegationTokens.testDelegationTokenCancel-seed#[61EB2273E740ABB5]) [     ] o.a.s.c.c.ConnectionManager Waiting for client to connect to ZooKeeper
   [junit4]   2> 1504582 INFO  (zkConnectionManagerCallback-8570-thread-1) [     ] o.a.s.c.c.ConnectionManager zkClient has connected
   [junit4]   2> 1504582 INFO  (TEST-TestSolrCloudWithDelegationTokens.testDelegationTokenCancel-seed#[61EB2273E740ABB5]) [     ] o.a.s.c.c.ConnectionManager Client is connected to ZooKeeper
   [junit4]   2> 1504584 INFO  (TEST-TestSolrCloudWithDelegationTokens.testDelegationTokenCancel-seed#[61EB2273E740ABB5]) [     ] o.a.s.c.c.ZkStateReader Updated live nodes from ZooKeeper... (0) -> (2)
   [junit4]   2> 1504585 INFO  (TEST-TestSolrCloudWithDelegationTokens.testDelegationTokenCancel-seed#[61EB2273E740ABB5]) [     ] o.a.s.c.s.i.ZkClientClusterStateProvider Cluster at 127.0.0.1:48714/solr ready
   [junit4]   2> 1504694 INFO  (TEST-TestSolrCloudWithDelegationTokens.testDelegationTokenCancel-seed#[61EB2273E740ABB5]) [     ] o.a.s.SolrTestCaseJ4 ###Ending testDelegationTokenCancel
   [junit4]   2> 1504719 INFO  (TEST-TestSolrCloudWithDelegationTokens.testZNodePaths-seed#[61EB2273E740ABB5]) [     ] o.a.s.SolrTestCaseJ4 ###Starting testZNodePaths
   [junit4]   2> 1504720 WARN  (qtp2084482758-25695) [n:127.0.0.1:60462_solr     ] o.a.h.s.a.s.AuthenticationFilter AuthenticationToken ignored: Unauthorized access
   [junit4]   2> 1504726 INFO  (TEST-TestSolrCloudWithDelegationTokens.testZNodePaths-seed#[61EB2273E740ABB5]) [     ] o.a.s.c.c.ConnectionManager Waiting for client to connect to ZooKeeper
   [junit4]   2> 1504730 INFO  (zkConnectionManagerCallback-8572-thread-1) [     ] o.a.s.c.c.ConnectionManager zkClient has connected
   [junit4]   2> 1504730 INFO  (TEST-TestSolrCloudWithDelegationTokens.testZNodePaths-seed#[61EB2273E740ABB5]) [     ] o.a.s.c.c.ConnectionManager Client is connected to ZooKeeper
   [junit4]   2> 1504835 INFO  (TEST-TestSolrCloudWithDelegationTokens.testZNodePaths-seed#[61EB2273E740ABB5]) [     ] o.a.s.SolrTestCaseJ4 ###Ending testZNodePaths
   [junit4]   2> 1504940 INFO  (jetty-closer-8573-thread-1) [     ] o.a.s.c.CoreContainer Shutting down CoreContainer instance=1577914184
   [junit4]   2> 1504940 INFO  (jetty-closer-8573-thread-1) [     ] o.a.s.c.ZkController Remove node as live in ZooKeeper:/live_nodes/127.0.0.1:60462_solr
   [junit4]   2> 1504941 INFO  (jetty-closer-8573-thread-1) [     ] o.a.s.c.ZkController Publish this node as DOWN...
   [junit4]   2> 1504941 INFO  (jetty-closer-8573-thread-1) [     ] o.a.s.c.ZkController Publish node=127.0.0.1:60462_solr as DOWN
   [junit4]   2> 1504941 INFO  (jetty-closer-8573-thread-2) [     ] o.a.s.c.CoreContainer Shutting down CoreContainer instance=390287425
   [junit4]   2> 1504941 INFO  (jetty-closer-8573-thread-2) [     ] o.a.s.c.ZkController Remove node as live in ZooKeeper:/live_nodes/127.0.0.1:48839_solr
   [junit4]   2> 1504942 INFO  (jetty-closer-8573-thread-2) [     ] o.a.s.c.ZkController Publish this node as DOWN...
   [junit4]   2> 1504943 INFO  (jetty-closer-8573-thread-2) [     ] o.a.s.c.ZkController Publish node=127.0.0.1:48839_solr as DOWN
   [junit4]   2> 1504945 INFO  (jetty-closer-8573-thread-1) [     ] o.a.s.c.TransientSolrCoreCacheDefault Allocating transient cache for 2147483647 transient cores
   [junit4]   2> 1504945 INFO  (jetty-closer-8573-thread-1) [     ] o.a.s.m.SolrMetricManager Closing metric reporters for registry=solr.node, tag=null
   [junit4]   2> 1504945 INFO  (jetty-closer-8573-thread-1) [     ] o.a.s.m.r.SolrJmxReporter Closing reporter [org.apache.solr.metrics.reporters.SolrJmxReporter@14e7d4b4: rootName = solr_60462, domain = solr.node, service url = null, agent id = null] for registry solr.node / com.codahale.metrics.MetricRegistry@550cf8c0
   [junit4]   2> 1504947 INFO  (jetty-closer-8573-thread-2) [     ] o.a.s.m.SolrMetricManager Closing metric reporters for registry=solr.node, tag=null
   [junit4]   2> 1504947 INFO  (jetty-closer-8573-thread-2) [     ] o.a.s.m.r.SolrJmxReporter Closing reporter [org.apache.solr.metrics.reporters.SolrJmxReporter@1c36fc5d: rootName = solr_48839, domain = solr.node, service url = null, agent id = null] for registry solr.node / com.codahale.metrics.MetricRegistry@1225af1e
   [junit4]   2> 1504973 INFO  (jetty-closer-8573-thread-1) [     ] o.a.s.m.SolrMetricManager Closing metric reporters for registry=solr.jvm, tag=null
   [junit4]   2> 1504973 INFO  (jetty-closer-8573-thread-1) [     ] o.a.s.m.r.SolrJmxReporter Closing reporter [org.apache.solr.metrics.reporters.SolrJmxReporter@fc901b5: rootName = solr_60462, domain = solr.jvm, service url = null, agent id = null] for registry solr.jvm / com.codahale.metrics.MetricRegistry@194dd8b3
   [junit4]   2> 1504979 INFO  (jetty-closer-8573-thread-2) [     ] o.a.s.m.SolrMetricManager Closing metric reporters for registry=solr.jvm, tag=null
   [junit4]   2> 1504979 INFO  (jetty-closer-8573-thread-2) [     ] o.a.s.m.r.SolrJmxReporter Closing reporter [org.apache.solr.metrics.reporters.SolrJmxReporter@5c92a9ac: rootName = solr_48839, domain = solr.jvm, service url = null, agent id = null] for registry solr.jvm / com.codahale.metrics.MetricRegistry@194dd8b3
   [junit4]   2> 1504980 INFO  (jetty-closer-8573-thread-1) [     ] o.a.s.m.SolrMetricManager Closing metric reporters for registry=solr.jetty, tag=null
   [junit4]   2> 1504980 INFO  (jetty-closer-8573-thread-1) [     ] o.a.s.m.r.SolrJmxReporter Closing reporter [org.apache.solr.metrics.reporters.SolrJmxReporter@4327d7ce: rootName = solr_60462, domain = solr.jetty, service url = null, agent id = null] for registry solr.jetty / com.codahale.metrics.MetricRegistry@76c65e3
   [junit4]   2> 1504981 INFO  (jetty-closer-8573-thread-1) [     ] o.a.s.m.SolrMetricManager Closing metric reporters for registry=solr.cluster, tag=null
   [junit4]   2> 1504982 INFO  (jetty-closer-8573-thread-2) [     ] o.a.s.m.SolrMetricManager Closing metric reporters for registry=solr.jetty, tag=null
   [junit4]   2> 1504982 INFO  (jetty-closer-8573-thread-2) [     ] o.a.s.m.r.SolrJmxReporter Closing reporter [org.apache.solr.metrics.reporters.SolrJmxReporter@63274e10: rootName = solr_48839, domain = solr.jetty, service url = null, agent id = null] for registry solr.jetty / com.codahale.metrics.MetricRegistry@76c65e3
   [junit4]   2> 1504983 INFO  (jetty-closer-8573-thread-2) [     ] o.a.s.m.SolrMetricManager Closing metric reporters for registry=solr.cluster, tag=null
   [junit4]   2> 1504985 INFO  (closeThreadPool-8580-thread-2) [     ] o.a.s.c.Overseer Overseer (id=72118983452459014-127.0.0.1:60462_solr-n_0000000000) closing
   [junit4]   2> 1504985 INFO  (OverseerStateUpdate-72118983452459014-127.0.0.1:60462_solr-n_0000000000) [n:127.0.0.1:60462_solr     ] o.a.s.c.Overseer Overseer Loop exiting : 127.0.0.1:60462_solr
   [junit4]   2> 1504985 INFO  (OverseerAutoScalingTriggerThread-72118983452459014-127.0.0.1:60462_solr-n_0000000000) [     ] o.a.s.c.a.OverseerTriggerThread OverseerTriggerThread woken up but we are closed, exiting.
   [junit4]   2> 1504990 INFO  (closeThreadPool-8580-thread-1) [     ] o.a.s.c.Overseer Overseer (id=72118983452459014-127.0.0.1:60462_solr-n_0000000000) closing
   [junit4]   2> 1504991 INFO  (zkCallback-8535-thread-1) [     ] o.a.s.c.c.ZkStateReader Updated live nodes from ZooKeeper... (2) -> (1)
   [junit4]   2> 1504991 INFO  (zkCallback-8542-thread-1) [     ] o.a.s.c.c.ZkStateReader Updated live nodes from ZooKeeper... (2) -> (1)
   [junit4]   2> 1505191 INFO  (jetty-closer-8573-thread-1) [     ] o.a.s.c.Overseer Overseer (id=72118983452459014-127.0.0.1:60462_solr-n_0000000000) closing
   [junit4]   2> 1505193 ERROR (Thread[Thread-5388,5,TGRP-TestSolrCloudWithDelegationTokens]) [     ] o.a.h.s.t.d.AbstractDelegationTokenSecretManager ExpiredTokenRemover received java.lang.InterruptedException: sleep interrupted
   [junit4]   2> 1505202 INFO  (Curator-Framework-0) [     ] o.a.c.f.i.CuratorFrameworkImpl backgroundOperationsLoop exiting
   [junit4]   2> 1505395 WARN  (NIOWorkerThread-4) [     ] o.a.z.s.NIOServerCnxn Unable to read additional data from client sessionid 0x10037d5563f0008, likely client has closed socket
   [junit4]   2> 1505397 ERROR (Thread[Thread-5386,5,TGRP-TestSolrCloudWithDelegationTokens]) [     ] o.a.h.s.t.d.AbstractDelegationTokenSecretManager ExpiredTokenRemover received java.lang.InterruptedException: sleep interrupted
   [junit4]   2> 1505399 INFO  (Curator-Framework-0) [     ] o.a.c.f.i.CuratorFrameworkImpl backgroundOperationsLoop exiting
   [junit4]   2> 1505497 INFO  (jetty-closer-8573-thread-1) [     ] o.e.j.s.AbstractConnector Stopped ServerConnector@76c6c5b6{SSL,[ssl, http/1.1]}{127.0.0.1:0}
   [junit4]   2> 1505498 INFO  (jetty-closer-8573-thread-1) [     ] o.e.j.s.h.ContextHandler Stopped o.e.j.s.ServletContextHandler@601c1319{/solr,null,UNAVAILABLE}
   [junit4]   2> 1505504 INFO  (jetty-closer-8573-thread-1) [     ] o.e.j.s.session node0 Stopped scavenging
   [junit4]   2> 1505598 INFO  (jetty-closer-8573-thread-2) [     ] o.e.j.s.AbstractConnector Stopped ServerConnector@1aa1c4f3{SSL,[ssl, http/1.1]}{127.0.0.1:0}
   [junit4]   2> 1505598 INFO  (jetty-closer-8573-thread-2) [     ] o.e.j.s.h.ContextHandler Stopped o.e.j.s.ServletContextHandler@537e1f6f{/solr,null,UNAVAILABLE}
   [junit4]   2> 1505598 INFO  (jetty-closer-8573-thread-2) [     ] o.e.j.s.session node0 Stopped scavenging
   [junit4]   2> 1505601 INFO  (SUITE-TestSolrCloudWithDelegationTokens-seed#[61EB2273E740ABB5]-worker) [     ] o.a.s.c.ZkTestServer Shutting down ZkTestServer.
   [junit4]   2> 1505808 WARN  (ZkTestServer Run Thread) [     ] o.a.s.c.ZkTestServer Watch limit violations:
   [junit4]   2> Maximum concurrent create/delete watches above limit:
   [junit4]   2>
   [junit4]   2> 9 /solr/aliases.json
   [junit4]   2> 2 /solr/security.json
   [junit4]   2>
   [junit4]   2> Maximum concurrent data watches above limit:
   [junit4]   2>
   [junit4]   2> 22 /solr/security/zkdtsm/ZKDTSMRoot/ZKDTSMSeqNumRoot
   [junit4]   2> 10 /solr/security/zkdtsm/ZKDTSMRoot/ZKDTSMKeyIdRoot
   [junit4]   2> 9 /solr/clusterprops.json
   [junit4]   2> 9 /solr/clusterstate.json
   [junit4]   2> 4 /solr/security/zkdtsm/ZKDTSMRoot/ZKDTSMMasterKeyRoot/DK_1
   [junit4]   2> 2 /solr/security/zkdtsm/ZKDTSMRoot/ZKDTSMTokensRoot/DT_7
   [junit4]   2> 2 /solr/security/zkdtsm/ZKDTSMRoot/ZKDTSMTokensRoot/DT_6
   [junit4]   2> 2 /solr/security/zkdtsm/ZKDTSMRoot/ZKDTSMTokensRoot/DT_8
   [junit4]   2> 2 /solr/security/zkdtsm/ZKDTSMRoot/ZKDTSMTokensRoot/DT_1
   [junit4]   2> 2 /solr/security/zkdtsm/ZKDTSMRoot/ZKDTSMTokensRoot/DT_3
   [junit4]   2> 2 /solr/security/zkdtsm/ZKDTSMRoot/ZKDTSMMasterKeyRoot/DK_2
   [junit4]   2> 2 /solr/security/zkdtsm/ZKDTSMRoot/ZKDTSMTokensRoot/DT_2
   [junit4]   2> 2 /solr/security/zkdtsm/ZKDTSMRoot/ZKDTSMTokensRoot/DT_5
   [junit4]   2> 2 /solr/security/zkdtsm/ZKDTSMRoot/ZKDTSMMasterKeyRoot/DK_4
   [junit4]   2> 2 /solr/security/zkdtsm/ZKDTSMRoot/ZKDTSMTokensRoot/DT_4
   [junit4]   2> 2 /solr/security/zkdtsm/ZKDTSMRoot/ZKDTSMTokensRoot/DT_10
   [junit4]   2>
   [junit4]   2> Maximum concurrent children watches above limit:
   [junit4]   2>
   [junit4]   2> 29 /solr/security/zkdtsm/ZKDTSMRoot/ZKDTSMTokensRoot
   [junit4]   2> 16 /solr/live_nodes
   [junit4]   2> 9 /solr/collections
   [junit4]   2> 8 /solr/security/zkdtsm/ZKDTSMRoot/ZKDTSMMasterKeyRoot
   [junit4]   2> 5 /solr/overseer/queue
   [junit4]   2>
   [junit4]   2> 1505811 INFO  (SUITE-TestSolrCloudWithDelegationTokens-seed#[61EB2273E740ABB5]-worker) [     ] o.a.s.c.ZkTestServer parse host and port list: 127.0.0.1:48714
   [junit4]   2> 1505811 INFO  (SUITE-TestSolrCloudWithDelegationTokens-seed#[61EB2273E740ABB5]-worker) [     ] o.a.s.c.ZkTestServer connecting to 127.0.0.1 48714
   [junit4]   2> NOTE: leaving temporary files on disk at: /export/home/jenkins/workspace/Lucene-Solr-8.x-Solaris/solr/build/solr-core/test/J1/temp/solr.cloud.TestSolrCloudWithDelegationTokens_61EB2273E740ABB5-001
   [junit4]   2> Aug 14, 2019 4:48:34 PM com.carrotsearch.randomizedtesting.ThreadLeakControl checkThreadLeaks
   [junit4]   2> WARNING: Will linger awaiting termination of 1 leaked thread(s).
   [junit4]   2> NOTE: test params are: codec=Asserting(Lucene80): {}, docValues:{}, maxPointsInLeafNode=349, maxMBSortInHeap=7.601870118317427, sim=Asserting(org.apache.lucene.search.similarities.AssertingSimilarity@20be84cc), locale=es-CO, timezone=Europe/Ljubljana
   [junit4]   2> NOTE: SunOS 5.11 amd64/Oracle Corporation 1.8.0_221 (64-bit)/cpus=3,threads=1,free=156236624,total=522190848
   [junit4]   2> NOTE: All tests run in this JVM: [TestManagedSchemaAPI, TestPerFieldSimilarity, TestTlogReplica, TestLegacyTerms, NestedAtomicUpdateTest, TestSimExecutePlanAction, DeleteLastCustomShardedReplicaTest, TestJsonFacetsWithNestedObjects, TestCustomStream, TolerantUpdateProcessorTest, EnumFieldTest, ZkStateReaderTest, RecoveryAfterSoftCommitTest, TestScoreJoinQPNoScore, TestHighlightDedupGrouping, RandomizedTaggerTest, TestSort, HdfsTlogReplayBufferedWhileIndexingTest, PingRequestHandlerTest, TestSchemaManager, DistributedIntervalFacetingTest, TestReqParamsAPI, TestManagedSynonymGraphFilterFactory, SolrTestCaseJ4Test, TestIntervalFaceting, TestJsonRequest, BlobRepositoryCloudTest, TestSortableTextField, TestFieldCacheSort, TestBulkSchemaAPI, DebugComponentTest, ReplaceNodeNoTargetTest, LeaderElectionTest, MultiDestinationAuditLoggerTest, ResponseBuilderTest, TestSha256AuthenticationProvider, SpellCheckCollatorWithCollapseTest, TestPartialUpdateDeduplication, TestEmbeddedSolrServerSchemaAPI, ChangedSchemaMergeTest, TriggerCooldownIntegrationTest, TestLMDirichletSimilarityFactory, TestReload, TestDownShardTolerantSearch, SpatialRPTFieldTypeTest, TestEmbeddedSolrServerAdminHandler, TestInitQParser, TestHdfsBackupRestoreCore, TestLeaderElectionZkExpiry, DistribDocExpirationUpdateProcessorTest, SolrMetricReporterTest, V2StandaloneTest, TestDynamicURP, TestLegacyFieldReuse, CollectionStateFormat2Test, TestReloadAndDeleteDocs, TestSolrCLIRunExample, DateMathParserTest, IndexBasedSpellCheckerTest, CloneFieldUpdateProcessorFactoryTest, BlockJoinFacetDistribTest, TestHdfsUpdateLog, TestCloudDeleteByQuery, TestInPlaceUpdatesStandalone, TestRandomRequestDistribution, TestSimpleTrackingShardHandler, SuggesterTSTTest, TestPayloadCheckQParserPlugin, QueryElevationComponentTest, PreAnalyzedUpdateProcessorTest, DistributedSuggestComponentTest, AddReplicaTest, QueryEqualityTest, TestApiFramework, ManagedSchemaRoundRobinCloudTest, RootFieldTest, TestStressVersions, TestPushWriter, ConfigureRecoveryStrategyTest, TestJsonFacets, AutoscalingHistoryHandlerTest, TestCloudManagedSchema, SimplePostToolTest, MultiThreadedOCPTest, TestConfig, TestCloudPhrasesIdentificationComponent, TestSizeLimitedDistributedMap, HLLSerializationTest, TestFacetMethods, TestRTimerTree, AutoAddReplicasPlanActionTest, TestPseudoReturnFields, TestSolrCloudSnapshots, TestSimDistribStateManager, TestRawTransformer, TestBinaryField, HighlighterTest, AtomicUpdateRemovalJavabinTest, TestDeprecatedFilters, AddSchemaFieldsUpdateProcessorFactoryTest, TestJavabinTupleStreamParser, CheckHdfsIndexTest, SmileWriterTest, SyncSliceTest, DistanceFunctionTest, TestReversedWildcardFilterFactory, NumericFieldsTest, CreateRoutedAliasTest, TestSolr4Spatial, DirectUpdateHandlerTest, BigEndianAscendingWordSerializerTest, CloudExitableDirectoryReaderTest, TestNumericRangeQuery32, TestZkChroot, TestContainerReqHandler, TestMiniSolrCloudClusterSSL, TestSimPolicyCloud, CategoryRoutedAliasUpdateProcessorTest, TestSolrJ, TestClusterProperties, OverseerTest, TestInPlaceUpdatesDistrib, DocValuesNotIndexedTest, HdfsBasicDistributedZk2Test, MoveReplicaHDFSFailoverTest, TestHttpShardHandlerFactory, ByteBuffersDirectoryFactoryTest, LukeRequestHandlerTest, TestCloudNestedDocsSort, TestSnapshotCloudManager, TestSolrCloudWithDelegationTokens]
   [junit4] Completed [288/874 (1!)] on J1 in 6.05s, 8 tests, 1 failure <<< FAILURES!

[...truncated 53859 lines...]
[asciidoctor:convert] asciidoctor: ERROR: about-this-guide.adoc: line 1: invalid part, must have at least one section (e.g., chapter, appendix, etc.)
[asciidoctor:convert] asciidoctor: ERROR: solr-glossary.adoc: line 1: invalid part, must have at least one section (e.g., chapter, appendix, etc.)
     [java] Processed 2594 links (2120 relative) to 3410 anchors in 259 files
     [echo] Validated Links & Anchors via: /export/home/jenkins/workspace/Lucene-Solr-8.x-Solaris/solr/build/solr-ref-guide/bare-bones-html/

-documentation-lint:
    [jtidy] Checking for broken html (such as invalid tags)...
   [delete] Deleting directory /export/home/jenkins/workspace/Lucene-Solr-8.x-Solaris/lucene/build/jtidy_tmp
     [echo] Checking for broken links...
     [exec]
     [exec] Crawl/parse...
     [exec]
     [exec] Verify...
     [echo] Checking for malformed docs...

jar-checksums:

resolve:

ivy-availability-check:
[loadresource] Do not set property disallowed.ivy.jars.list as its length is 0.

-ivy-fail-disallowed-ivy-version:

ivy-fail:

ivy-configure:
[ivy:configure] :: loading settings :: file = /export/home/jenkins/workspace/Lucene-Solr-8.x-Solaris/lucene/top-level-ivy-settings.xml

resolve:

ivy-availability-check:
[loadresource] Do not set property disallowed.ivy.jars.list as its length is 0.

-ivy-fail-disallowed-ivy-version:

ivy-fail:

ivy-configure:
[ivy:configure] :: loading settings :: file = /export/home/jenkins/workspace/Lucene-Solr-8.x-Solaris/lucene/top-level-ivy-settings.xml

resolve:

resolve:

ivy-availability-check:
[loadresource] Do not set property disallowed.ivy.jars.list as its length is 0.

-ivy-fail-disallowed-ivy-version:

ivy-fail:

ivy-configure:
[ivy:configure] :: loading settings :: file = /export/home/jenkins/workspace/Lucene-Solr-8.x-Solaris/lucene/top-level-ivy-settings.xml

resolve:

ivy-availability-check:
[loadresource] Do not set property disallowed.ivy.jars.list as its length is 0.

-ivy-fail-disallowed-ivy-version:

ivy-fail:

ivy-configure:
[ivy:configure] :: loading settings :: file = /export/home/jenkins/workspace/Lucene-Solr-8.x-Solaris/lucene/top-level-ivy-settings.xml

resolve:

ivy-availability-check:
[loadresource] Do not set property disallowed.ivy.jars.list as its length is 0.

-ivy-fail-disallowed-ivy-version:

ivy-fail:

ivy-configure:
[ivy:configure] :: loading settings :: file = /export/home/jenkins/workspace/Lucene-Solr-8.x-Solaris/lucene/top-level-ivy-settings.xml

resolve:

ivy-availability-check:
[loadresource] Do not set property disallowed.ivy.jars.list as its length is 0.

-ivy-fail-disallowed-ivy-version:

ivy-fail:

ivy-configure:
[ivy:configure] :: loading settings :: file = /export/home/jenkins/workspace/Lucene-Solr-8.x-Solaris/lucene/top-level-ivy-settings.xml

resolve:

ivy-availability-check:
[loadresource] Do not set property disallowed.ivy.jars.list as its length is 0.

-ivy-fail-disallowed-ivy-version:

ivy-fail:

ivy-configure:
[ivy:configure] :: loading settings :: file = /export/home/jenkins/workspace/Lucene-Solr-8.x-Solaris/lucene/top-level-ivy-settings.xml

resolve:

ivy-availability-check:
[loadresource] Do not set property disallowed.ivy.jars.list as its length is 0.

-ivy-fail-disallowed-ivy-version:

ivy-fail:

ivy-configure:
[ivy:configure] :: loading settings :: file = /export/home/jenkins/workspace/Lucene-Solr-8.x-Solaris/lucene/top-level-ivy-settings.xml

resolve:

ivy-availability-check:
[loadresource] Do not set property disallowed.ivy.jars.list as its length is 0.

-ivy-fail-disallowed-ivy-version:

ivy-fail:

ivy-configure:
[ivy:configure] :: loading settings :: file = /export/home/jenkins/workspace/Lucene-Solr-8.x-Solaris/lucene/top-level-ivy-settings.xml

resolve:

ivy-availability-check:
[loadresource] Do not set property disallowed.ivy.jars.list as its length is 0.

-ivy-fail-disallowed-ivy-version:

ivy-fail:

ivy-configure:
[ivy:configure] :: loading settings :: file = /export/home/jenkins/workspace/Lucene-Solr-8.x-Solaris/lucene/top-level-ivy-settings.xml

resolve:

ivy-availability-check:
[loadresource] Do not set property disallowed.ivy.jars.list as its length is 0.

-ivy-fail-disallowed-ivy-version:

ivy-fail:

ivy-configure:
[ivy:configure] :: loading settings :: file = /export/home/jenkins/workspace/Lucene-Solr-8.x-Solaris/lucene/top-level-ivy-settings.xml

resolve:

ivy-availability-check:
[loadresource] Do not set property disallowed.ivy.jars.list as its length is 0.

-ivy-fail-disallowed-ivy-version:

ivy-fail:

ivy-configure:
[ivy:configure] :: loading settings :: file = /export/home/jenkins/workspace/Lucene-Solr-8.x-Solaris/lucene/top-level-ivy-settings.xml

resolve:

ivy-availability-check:
[loadresource] Do not set property disallowed.ivy.jars.list as its length is 0.

-ivy-fail-disallowed-ivy-version:

ivy-fail:

ivy-configure:
[ivy:configure] :: loading settings :: file = /export/home/jenkins/workspace/Lucene-Solr-8.x-Solaris/lucene/top-level-ivy-settings.xml

resolve:

ivy-availability-check:
[loadresource] Do not set property disallowed.ivy.jars.list as its length is 0.

-ivy-fail-disallowed-ivy-version:

ivy-fail:

ivy-configure:
[ivy:configure] :: loading settings :: file = /export/home/jenkins/workspace/Lucene-Solr-8.x-Solaris/lucene/top-level-ivy-settings.xml

resolve:

ivy-availability-check:
[loadresource] Do not set property disallowed.ivy.jars.list as its length is 0.

-ivy-fail-disallowed-ivy-version:

ivy-fail:

ivy-configure:
[ivy:configure] :: loading settings :: file = /export/home/jenkins/workspace/Lucene-Solr-8.x-Solaris/lucene/top-level-ivy-settings.xml

resolve:

ivy-availability-check:
[loadresource] Do not set property disallowed.ivy.jars.list as its length is 0.

-ivy-fail-disallowed-ivy-version:

ivy-fail:

ivy-configure:
[ivy:configure] :: loading settings :: file = /export/home/jenkins/workspace/Lucene-Solr-8.x-Solaris/lucene/top-level-ivy-settings.xml

resolve:

ivy-availability-check:
[loadresource] Do not set property disallowed.ivy.jars.list as its length is 0.

-ivy-fail-disallowed-ivy-version:

ivy-fail:

ivy-configure:
[ivy:configure] :: loading settings :: file = /export/home/jenkins/workspace/Lucene-Solr-8.x-Solaris/lucene/top-level-ivy-settings.xml

resolve:

ivy-availability-check:
[loadresource] Do not set property disallowed.ivy.jars.list as its length is 0.

-ivy-fail-disallowed-ivy-version:

ivy-fail:

ivy-configure:
[ivy:configure] :: loading settings :: file = /export/home/jenkins/workspace/Lucene-Solr-8.x-Solaris/lucene/top-level-ivy-settings.xml

resolve:

ivy-availability-check:
[loadresource] Do not set property disallowed.ivy.jars.list as its length is 0.

-ivy-fail-disallowed-ivy-version:

ivy-fail:

ivy-configure:
[ivy:configure] :: loading settings :: file = /export/home/jenkins/workspace/Lucene-Solr-8.x-Solaris/lucene/top-level-ivy-settings.xml

resolve:

ivy-availability-check:
[loadresource] Do not set property disallowed.ivy.jars.list as its length is 0.

-ivy-fail-disallowed-ivy-version:

ivy-fail:

ivy-configure:
[ivy:configure] :: loading settings :: file = /export/home/jenkins/workspace/Lucene-Solr-8.x-Solaris/lucene/top-level-ivy-settings.xml

resolve:

ivy-availability-check:
[loadresource] Do not set property disallowed.ivy.jars.list as its length is 0.

-ivy-fail-disallowed-ivy-version:

ivy-fail:

ivy-configure:
[ivy:configure] :: loading settings :: file = /export/home/jenkins/workspace/Lucene-Solr-8.x-Solaris/lucene/top-level-ivy-settings.xml

resolve:

ivy-availability-check:
[loadresource] Do not set property disallowed.ivy.jars.list as its length is 0.

-ivy-fail-disallowed-ivy-version:

ivy-fail:

ivy-configure:
[ivy:configure] :: loading settings :: file = /export/home/jenkins/workspace/Lucene-Solr-8.x-Solaris/lucene/top-level-ivy-settings.xml

resolve:

ivy-availability-check:
[loadresource] Do not set property disallowed.ivy.jars.list as its length is 0.

-ivy-fail-disallowed-ivy-version:

ivy-fail:

ivy-configure:
[ivy:configure] :: loading settings :: file = /export/home/jenkins/workspace/Lucene-Solr-8.x-Solaris/lucene/top-level-ivy-settings.xml

resolve:

ivy-availability-check:
[loadresource] Do not set property disallowed.ivy.jars.list as its length is 0.

-ivy-fail-disallowed-ivy-version:

ivy-fail:

ivy-configure:
[ivy:configure] :: loading settings :: file = /export/home/jenkins/workspace/Lucene-Solr-8.x-Solaris/lucene/top-level-ivy-settings.xml

resolve:

ivy-availability-check:
[loadresource] Do not set property disallowed.ivy.jars.list as its length is 0.

-ivy-fail-disallowed-ivy-version:

ivy-fail:

ivy-configure:
[ivy:configure] :: loading settings :: file = /export/home/jenkins/workspace/Lucene-Solr-8.x-Solaris/lucene/top-level-ivy-settings.xml

resolve:

ivy-availability-check:
[loadresource] Do not set property disallowed.ivy.jars.list as its length is 0.

-ivy-fail-disallowed-ivy-version:

ivy-fail:

ivy-configure:
[ivy:configure] :: loading settings :: file = /export/home/jenkins/workspace/Lucene-Solr-8.x-Solaris/lucene/top-level-ivy-settings.xml

resolve:

ivy-availability-check:
[loadresource] Do not set property disallowed.ivy.jars.list as its length is 0.

-ivy-fail-disallowed-ivy-version:

ivy-fail:

ivy-configure:
[ivy:configure] :: loading settings :: file = /export/home/jenkins/workspace/Lucene-Solr-8.x-Solaris/lucene/top-level-ivy-settings.xml

resolve:

ivy-availability-check:
[loadresource] Do not set property disallowed.ivy.jars.list as its length is 0.

-ivy-fail-disallowed-ivy-version:

ivy-fail:

ivy-configure:
[ivy:configure] :: loading settings :: file = /export/home/jenkins/workspace/Lucene-Solr-8.x-Solaris/lucene/top-level-ivy-settings.xml

common.resolve:

resolve:

ivy-availability-check:
[loadresource] Do not set property disallowed.ivy.jars.list as its length is 0.

-ivy-fail-disallowed-ivy-version:

ivy-fail:

ivy-configure:
[ivy:configure] :: loading settings :: file = /export/home/jenkins/workspace/Lucene-Solr-8.x-Solaris/lucene/top-level-ivy-settings.xml

resolve:

ivy-availability-check:
[loadresource] Do not set property disallowed.ivy.jars.list as its length is 0.

-ivy-fail-disallowed-ivy-version:

ivy-fail:

ivy-configure:
[ivy:configure] :: loading settings :: file = /export/home/jenkins/workspace/Lucene-Solr-8.x-Solaris/lucene/top-level-ivy-settings.xml

resolve:

ivy-availability-check:
[loadresource] Do not set property disallowed.ivy.jars.list as its length is 0.

-ivy-fail-disallowed-ivy-version:

ivy-fail:

ivy-configure:
[ivy:configure] :: loading settings :: file = /export/home/jenkins/workspace/Lucene-Solr-8.x-Solaris/lucene/top-level-ivy-settings.xml

resolve:

ivy-availability-check:
[loadresource] Do not set property disallowed.ivy.jars.list as its length is 0.

-ivy-fail-disallowed-ivy-version:

ivy-fail:

ivy-configure:
[ivy:configure] :: loading settings :: file = /export/home/jenkins/workspace/Lucene-Solr-8.x-Solaris/lucene/top-level-ivy-settings.xml

resolve:

ivy-availability-check:
[loadresource] Do not set property disallowed.ivy.jars.list as its length is 0.

-ivy-fail-disallowed-ivy-version:

ivy-fail:

ivy-configure:
[ivy:configure] :: loading settings :: file = /export/home/jenkins/workspace/Lucene-Solr-8.x-Solaris/lucene/top-level-ivy-settings.xml

resolve:

jar-checksums:
    [mkdir] Created dir: /export/home/jenkins/workspace/Lucene-Solr-8.x-Solaris/lucene/null1481263184
     [copy] Copying 38 files to /export/home/jenkins/workspace/Lucene-Solr-8.x-Solaris/lucene/null1481263184
   [delete] Deleting directory /export/home/jenkins/workspace/Lucene-Solr-8.x-Solaris/lucene/null1481263184

resolve-example:

ivy-availability-check:
[loadresource] Do not set property disallowed.ivy.jars.list as its length is 0.

-ivy-fail-disallowed-ivy-version:

ivy-fail:

ivy-configure:
[ivy:configure] :: loading settings :: file = /export/home/jenkins/workspace/Lucene-Solr-8.x-Solaris/lucene/top-level-ivy-settings.xml

resolve:

resolve-server:

ivy-availability-check:
[loadresource] Do not set property disallowed.ivy.jars.list as its length is 0.

-ivy-fail-disallowed-ivy-version:

ivy-fail:

ivy-fail:

ivy-configure:
[ivy:configure] :: loading settings :: file = /export/home/jenkins/workspace/Lucene-Solr-8.x-Solaris/lucene/top-level-ivy-settings.xml

resolve:

resolve:

ivy-availability-check:
[loadresource] Do not set property disallowed.ivy.jars.list as its length is 0.

-ivy-fail-disallowed-ivy-version:

ivy-fail:

ivy-fail:

ivy-configure:
[ivy:configure] :: loading settings :: file = /export/home/jenkins/workspace/Lucene-Solr-8.x-Solaris/lucene/top-level-ivy-settings.xml

resolve:

ivy-availability-check:
[loadresource] Do not set property disallowed.ivy.jars.list as its length is 0.

-ivy-fail-disallowed-ivy-version:

ivy-fail:

ivy-fail:

ivy-configure:
[ivy:configure] :: loading settings :: file = /export/home/jenkins/workspace/Lucene-Solr-8.x-Solaris/lucene/top-level-ivy-settings.xml

resolve:

ivy-availability-check:
[loadresource] Do not set property disallowed.ivy.jars.list as its length is 0.

-ivy-fail-disallowed-ivy-version:

ivy-fail:

ivy-configure:
[ivy:configure] :: loading settings :: file = /export/home/jenkins/workspace/Lucene-Solr-8.x-Solaris/lucene/top-level-ivy-settings.xml

resolve:

ivy-availability-check:
[loadresource] Do not set property disallowed.ivy.jars.list as its length is 0.

-ivy-fail-disallowed-ivy-version:

ivy-fail:

ivy-fail:

ivy-configure:
[ivy:configure] :: loading settings :: file = /export/home/jenkins/workspace/Lucene-Solr-8.x-Solaris/lucene/top-level-ivy-settings.xml

resolve:

ivy-availability-check:
[loadresource] Do not set property disallowed.ivy.jars.list as its length is 0.

-ivy-fail-disallowed-ivy-version:

ivy-fail:

ivy-configure:
[ivy:configure] :: loading settings :: file = /export/home/jenkins/workspace/Lucene-Solr-8.x-Solaris/lucene/top-level-ivy-settings.xml

resolve:

ivy-availability-check:
[loadresource] Do not set property disallowed.ivy.jars.list as its length is 0.

-ivy-fail-disallowed-ivy-version:

ivy-fail:

ivy-fail:

ivy-configure:
[ivy:configure] :: loading settings :: file = /export/home/jenkins/workspace/Lucene-Solr-8.x-Solaris/lucene/top-level-ivy-settings.xml

resolve:

ivy-availability-check:
[loadresource] Do not set property disallowed.ivy.jars.list as its length is 0.

-ivy-fail-disallowed-ivy-version:

ivy-fail:

ivy-fail:

ivy-configure:
[ivy:configure] :: loading settings :: file = /export/home/jenkins/workspace/Lucene-Solr-8.x-Solaris/lucene/top-level-ivy-settings.xml

resolve:

ivy-availability-check:
[loadresource] Do not set property disallowed.ivy.jars.list as its length is 0.

-ivy-fail-disallowed-ivy-version:

ivy-fail:

ivy-fail:

ivy-configure:
[ivy:configure] :: loading settings :: file = /export/home/jenkins/workspace/Lucene-Solr-8.x-Solaris/lucene/top-level-ivy-settings.xml

resolve:

ivy-availability-check:
[loadresource] Do not set property disallowed.ivy.jars.list as its length is 0.

-ivy-fail-disallowed-ivy-version:

ivy-fail:

ivy-fail:

ivy-configure:
[ivy:configure] :: loading settings :: file = /export/home/jenkins/workspace/Lucene-Solr-8.x-Solaris/lucene/top-level-ivy-settings.xml

resolve:

ivy-availability-check:
[loadresource] Do not set property disallowed.ivy.jars.list as its length is 0.

-ivy-fail-disallowed-ivy-version:

ivy-fail:

ivy-fail:

ivy-configure:
[ivy:configure] :: loading settings :: file = /export/home/jenkins/workspace/Lucene-Solr-8.x-Solaris/lucene/top-level-ivy-settings.xml

resolve:

ivy-availability-check:
[loadresource] Do not set property disallowed.ivy.jars.list as its length is 0.

-ivy-fail-disallowed-ivy-version:

ivy-fail:

ivy-fail:

ivy-configure:
[ivy:configure] :: loading settings :: file = /export/home/jenkins/workspace/Lucene-Solr-8.x-Solaris/lucene/top-level-ivy-settings.xml

resolve:

ivy-availability-check:
[loadresource] Do not set property disallowed.ivy.jars.list as its length is 0.

-ivy-fail-disallowed-ivy-version:

ivy-fail:

ivy-fail:

ivy-configure:
[ivy:configure] :: loading settings :: file = /export/home/jenkins/workspace/Lucene-Solr-8.x-Solaris/lucene/top-level-ivy-settings.xml

resolve:

ivy-availability-check:
[loadresource] Do not set property disallowed.ivy.jars.list as its length is 0.

-ivy-fail-disallowed-ivy-version:

ivy-fail:

ivy-fail:

ivy-configure:
[ivy:configure] :: loading settings :: file = /export/home/jenkins/workspace/Lucene-Solr-8.x-Solaris/lucene/top-level-ivy-settings.xml

resolve:

ivy-availability-check:
[loadresource] Do not set property disallowed.ivy.jars.list as its length is 0.

-ivy-fail-disallowed-ivy-version:

ivy-fail:

ivy-fail:

ivy-configure:
[ivy:configure] :: loading settings :: file = /export/home/jenkins/workspace/Lucene-Solr-8.x-Solaris/lucene/top-level-ivy-settings.xml

resolve:

ivy-availability-check:
[loadresource] Do not set property disallowed.ivy.jars.list as its length is 0.

-ivy-fail-disallowed-ivy-version:

ivy-fail:

ivy-fail:

ivy-configure:
[ivy:configure] :: loading settings :: file = /export/home/jenkins/workspace/Lucene-Solr-8.x-Solaris/lucene/top-level-ivy-settings.xml

resolve:

ivy-availability-check:
[loadresource] Do not set property disallowed.ivy.jars.list as its length is 0.

-ivy-fail-disallowed-ivy-version:

ivy-fail:

ivy-fail:

ivy-configure:
[ivy:configure] :: loading settings :: file = /export/home/jenkins/workspace/Lucene-Solr-8.x-Solaris/lucene/top-level-ivy-settings.xml

resolve:

jar-checksums:
    [mkdir] Created dir: /export/home/jenkins/workspace/Lucene-Solr-8.x-Solaris/solr/null581383498
     [copy] Copying 249 files to /export/home/jenkins/workspace/Lucene-Solr-8.x-Solaris/solr/null581383498
   [delete] Deleting directory /export/home/jenkins/workspace/Lucene-Solr-8.x-Solaris/solr/null581383498

check-working-copy:
[ivy:cachepath] :: resolving dependencies :: #;working@serv1-vm3
[ivy:cachepath] confs: [default]
[ivy:cachepath] found org.eclipse.jgit#org.eclipse.jgit;5.3.0.201903130848-r in public
[ivy:cachepath] found com.jcraft#jsch;0.1.54 in public
[ivy:cachepath] found com.jcraft#jzlib;1.1.1 in public
[ivy:cachepath] found com.googlecode.javaewah#JavaEWAH;1.1.6 in public
[ivy:cachepath] found org.slf4j#slf4j-api;1.7.2 in public
[ivy:cachepath] found org.bouncycastle#bcpg-jdk15on;1.60 in public
[ivy:cachepath] found org.bouncycastle#bcprov-jdk15on;1.60 in public
[ivy:cachepath] found org.bouncycastle#bcpkix-jdk15on;1.60 in public
[ivy:cachepath] found org.slf4j#slf4j-nop;1.7.2 in public
[ivy:cachepath] :: resolution report :: resolve 73ms :: artifacts dl 10ms
        ---------------------------------------------------------------------
        |                  |            modules            ||   artifacts   |
        |       conf       | number| search|dwnlded|evicted|| number|dwnlded|
        ---------------------------------------------------------------------
        |      default     |   9   |   0   |   0   |   0   ||   9   |   0   |
        ---------------------------------------------------------------------
[wc-checker] Initializing working copy...
[wc-checker] Checking working copy status...

-jenkins-base:

BUILD SUCCESSFUL
Total time: 130 minutes 36 seconds
Setting ANT_1_8_2_HOME=/export/home/jenkins/tools/hudson.tasks.Ant_AntInstallation/ANT_1.8.2
[Lucene-Solr-8.x-Solaris] $ /bin/sh -xe /var/tmp/jenkins1792070626687003766.sh
+ mv lucene/build lucene/build.orig
+ mv solr/build solr/build.orig
+ ANT_HOME=/export/home/jenkins/tools/hudson.tasks.Ant_AntInstallation/ANT_1.8.2
+ export ANT_HOME
+ PATH=/export/home/jenkins/tools/hudson.tasks.Ant_AntInstallation/ANT_1.8.2/bin:/export/home/jenkins/tools/java/64bit/jdk1.8.0/bin:/usr/bin:/usr/sbin
+ export PATH
+ python3.4 -u dev-tools/scripts/reproduceJenkinsFailures.py --no-git https://jenkins.thetaphi.de/job/Lucene-Solr-8.x-Solaris/266/consoleText
[repro] Jenkins log URL: https://jenkins.thetaphi.de/job/Lucene-Solr-8.x-Solaris/266/consoleText

[repro] Revision: ea8f921e71e628e2334ea2fdf2f3c95c6fe427a8

[repro] Ant options: "-Dargs=-XX:+UseCompressedOops -XX:+UseParallelGC"
[repro] Repro line:  ant test  -Dtestcase=TestSolrCloudWithDelegationTokens -Dtests.method=testDelegationTokenRenew -Dtests.seed=61EB2273E740ABB5 -Dtests.slow=true -Dtests.locale=es-CO -Dtests.timezone=Europe/Ljubljana -Dtests.asserts=true -Dtests.file.encoding=ISO-8859-1

[repro] ant clean
Buildfile: /export/home/jenkins/workspace/Lucene-Solr-8.x-Solaris/build.xml

clean:

clean:

clean:

BUILD SUCCESSFUL
Total time: 1 second
[repro] Test suites by module:
[repro]    solr/core
[repro]       TestSolrCloudWithDelegationTokens
[repro] ant compile-test
Buildfile: /export/home/jenkins/workspace/Lucene-Solr-8.x-Solaris/solr/core/build.xml

check-analyzers-icu-uptodate:

jar-analyzers-icu:

-mrjar-classes-uptodate:

ivy-availability-check:
[loadresource] Do not set property disallowed.ivy.jars.list as its length is 0.

-ivy-fail-disallowed-ivy-version:

ivy-fail:

ivy-configure:
[ivy:configure] :: Apache Ivy 2.4.0 - 20141213170938 :: http://ant.apache.org/ivy/ ::
[ivy:configure] :: loading settings :: file = /export/home/jenkins/workspace/Lucene-Solr-8.x-Solaris/lucene/top-level-ivy-settings.xml

resolve-groovy:
[ivy:cachepath] :: resolving dependencies :: org.codehaus.groovy#groovy-all-caller;working
[ivy:cachepath] confs: [default]
[ivy:cachepath] found org.codehaus.groovy#groovy-all;2.4.16 in public
[ivy:cachepath] :: resolution report :: resolve 328ms :: artifacts dl 4ms
        ---------------------------------------------------------------------
        |                  |            modules            ||   artifacts   |
        |       conf       | number| search|dwnlded|evicted|| number|dwnlded|
        ---------------------------------------------------------------------
        |      default     |   1   |   0   |   0   |   0   ||   1   |   0   |
        ---------------------------------------------------------------------

check-analyzers-common-uptodate:

jar-analyzers-common:

-mrjar-classes-uptodate:

ivy-availability-check:
[loadresource] Do not set property disallowed.ivy.jars.list as its length is 0.

-ivy-fail-disallowed-ivy-version:

ivy-fail:

ivy-configure:
[ivy:configure] :: loading settings :: file = /export/home/jenkins/workspace/Lucene-Solr-8.x-Solaris/lucene/top-level-ivy-settings.xml

resolve-groovy:

-check-git-state:

-git-cleanroot:

-copy-git-state:
     [copy] Copying 1 file to /export/home/jenkins/workspace/Lucene-Solr-8.x-Solaris/lucene/build

git-autoclean:

resolve:

common.init:

compile-lucene-core:

-check-git-state:

-git-cleanroot:

-copy-git-state:

git-autoclean:

ivy-availability-check:
[loadresource] Do not set property disallowed.ivy.jars.list as its length is 0.

-ivy-fail-disallowed-ivy-version:

ivy-fail:

ivy-configure:
[ivy:configure] :: loading settings :: file = /export/home/jenkins/workspace/Lucene-Solr-8.x-Solaris/lucene/top-level-ivy-settings.xml

resolve:

init:

-clover.disable:

-clover.load:

-clover.classpath:

-clover.setup:

clover:

compile-core:
    [mkdir] Created dir: /export/home/jenkins/workspace/Lucene-Solr-8.x-Solaris/lucene/build/core/classes/java
    [javac] Compiling 883 source files to /export/home/jenkins/workspace/Lucene-Solr-8.x-Solaris/lucene/build/core/classes/java
    [javac] Note: Some input files use or override a deprecated API.
    [javac] Note: Recompile with -Xlint:deprecation for details.
    [javac] Creating empty /export/home/jenkins/workspace/Lucene-Solr-8.x-Solaris/lucene/build/core/classes/java/org/apache/lucene/util/graph/package-info.class
    [javac] Creating empty /export/home/jenkins/workspace/Lucene-Solr-8.x-Solaris/lucene/build/core/classes/java/org/apache/lucene/document/package-info.class
    [javac] Creating empty /export/home/jenkins/workspace/Lucene-Solr-8.x-Solaris/lucene/build/core/classes/java/org/apache/lucene/package-info.class
    [javac] Creating empty /export/home/jenkins/workspace/Lucene-Solr-8.x-Solaris/lucene/build/core/classes/java/org/apache/lucene/util/bkd/package-info.class
    [javac] Creating empty /export/home/jenkins/workspace/Lucene-Solr-8.x-Solaris/lucene/build/core/classes/java/org/apache/lucene/codecs/compressing/package-info.class
    [javac] Creating empty /export/home/jenkins/workspace/Lucene-Solr-8.x-Solaris/lucene/build/core/classes/java/org/apache/lucene/codecs/lucene60/package-info.class
    [javac] Creating empty /export/home/jenkins/workspace/Lucene-Solr-8.x-Solaris/lucene/build/core/classes/java/org/apache/lucene/codecs/package-info.class
    [javac] Creating empty /export/home/jenkins/workspace/Lucene-Solr-8.x-Solaris/lucene/build/core/classes/java/org/apache/lucene/codecs/lucene80/package-info.class
    [javac] Creating empty /export/home/jenkins/workspace/Lucene-Solr-8.x-Solaris/lucene/build/core/classes/java/org/apache/lucene/util/package-info.class
    [javac] Creating empty /export/home/jenkins/workspace/Lucene-Solr-8.x-Solaris/lucene/build/core/classes/java/org/apache/lucene/index/package-info.class
    [javac] Creating empty /export/home/jenkins/workspace/Lucene-Solr-8.x-Solaris/lucene/build/core/classes/java/org/apache/lucene/util/fst/package-info.class
    [javac] Creating empty /export/home/jenkins/workspace/Lucene-Solr-8.x-Solaris/lucene/build/core/classes/java/org/apache/lucene/analysis/tokenattributes/package-info.class
    [javac] Creating empty /export/home/jenkins/workspace/Lucene-Solr-8.x-Solaris/lucene/build/core/classes/java/org/apache/lucene/search/package-info.class
    [javac] Creating empty /export/home/jenkins/workspace/Lucene-Solr-8.x-Solaris/lucene/build/core/classes/java/org/apache/lucene/util/packed/package-info.class
    [javac] Creating empty /export/home/jenkins/workspace/Lucene-Solr-8.x-Solaris/lucene/build/core/classes/java/org/apache/lucene/util/mutable/package-info.class
    [javac] Creating empty /export/home/jenkins/workspace/Lucene-Solr-8.x-Solaris/lucene/build/core/classes/java/org/apache/lucene/codecs/lucene70/package-info.class
    [javac] Creating empty /export/home/jenkins/workspace/Lucene-Solr-8.x-Solaris/lucene/build/core/classes/java/org/apache/lucene/codecs/perfield/package-info.class
    [javac] Creating empty /export/home/jenkins/workspace/Lucene-Solr-8.x-Solaris/lucene/build/core/classes/java/org/apache/lucene/analysis/package-info.class
    [javac] Creating empty /export/home/jenkins/workspace/Lucene-Solr-8.x-Solaris/lucene/build/core/classes/java/org/apache/lucene/analysis/standard/package-info.class
    [javac] Creating empty /export/home/jenkins/workspace/Lucene-Solr-8.x-Solaris/lucene/build/core/classes/java/org/apache/lucene/store/package-info.class
    [javac] Creating empty /export/home/jenkins/workspace/Lucene-Solr-8.x-Solaris/lucene/build/core/classes/java/org/apache/lucene/codecs/blocktree/package-info.class
    [javac] Creating empty /export/home/jenkins/workspace/Lucene-Solr-8.x-Solaris/lucene/build/core/classes/java/org/apache/lucene/search/spans/package-info.class
    [javac] Creating empty /export/home/jenkins/workspace/Lucene-Solr-8.x-Solaris/lucene/build/core/classes/java/org/apache/lucene/search/similarities/package-info.class
    [javac] Creating empty /export/home/jenkins/workspace/Lucene-Solr-8.x-Solaris/lucene/build/core/classes/java/org/apache/lucene/util/automaton/package-info.class
    [javac] Creating empty /export/home/jenkins/workspace/Lucene-Solr-8.x-Solaris/lucene/build/core/classes/java/org/apache/lucene/codecs/lucene50/package-info.class
    [javac] Creating empty /export/home/jenkins/workspace/Lucene-Solr-8.x-Solaris/lucene/build/core/classes/java/org/apache/lucene/geo/package-info.class
     [copy] Copying 3 files to /export/home/jenkins/workspace/Lucene-Solr-8.x-Solaris/lucene/build/core/classes/java

init:

-clover.disable:

-clover.load:

-clover.classpath:

-clover.setup:

clover:

compile-core:
    [mkdir] Created dir: /export/home/jenkins/workspace/Lucene-Solr-8.x-Solaris/lucene/build/analysis/common/classes/java
    [javac] Compiling 478 source files to /export/home/jenkins/workspace/Lucene-Solr-8.x-Solaris/lucene/build/analysis/common/classes/java
    [javac] Note: Some input files use or override a deprecated API.
    [javac] Note: Recompile with -Xlint:deprecation for details.
    [javac] Creating empty /export/home/jenkins/workspace/Lucene-Solr-8.x-Solaris/lucene/build/analysis/common/classes/java/org/apache/lucene/analysis/hunspell/package-info.class
    [javac] Creating empty /export/home/jenkins/workspace/Lucene-Solr-8.x-Solaris/lucene/build/analysis/common/classes/java/org/apache/lucene/analysis/minhash/package-info.class
    [javac] Creating empty /export/home/jenkins/workspace/Lucene-Solr-8.x-Solaris/lucene/build/analysis/common/classes/java/org/apache/lucene/analysis/ga/package-info.class
    [javac] Creating empty /export/home/jenkins/workspace/Lucene-Solr-8.x-Solaris/lucene/build/analysis/common/classes/java/org/apache/lucene/analysis/ca/package-info.class
    [javac] Creating empty /export/home/jenkins/workspace/Lucene-Solr-8.x-Solaris/lucene/build/analysis/common/classes/java/org/apache/lucene/analysis/custom/package-info.class
    [javac] Creating empty /export/home/jenkins/workspace/Lucene-Solr-8.x-Solaris/lucene/build/analysis/common/classes/java/org/apache/lucene/analysis/sr/package-info.class
    [javac] Creating empty /export/home/jenkins/workspace/Lucene-Solr-8.x-Solaris/lucene/build/analysis/common/classes/java/org/apache/lucene/collation/package-info.class
    [javac] Creating empty /export/home/jenkins/workspace/Lucene-Solr-8.x-Solaris/lucene/build/analysis/common/classes/java/org/apache/lucene/analysis/sv/package-info.class
    [javac] Creating empty /export/home/jenkins/workspace/Lucene-Solr-8.x-Solaris/lucene/build/analysis/common/classes/java/org/apache/lucene/analysis/bg/package-info.class
    [javac] Creating empty /export/home/jenkins/workspace/Lucene-Solr-8.x-Solaris/lucene/build/analysis/common/classes/java/org/apache/lucene/analysis/payloads/package-info.class
    [javac] Creating empty /export/home/jenkins/workspace/Lucene-Solr-8.x-Solaris/lucene/build/analysis/common/classes/java/org/apache/lucene/analysis/ngram/package-info.class
    [javac] Creating empty /export/home/jenkins/workspace/Lucene-Solr-8.x-Solaris/lucene/build/analysis/common/classes/java/org/apache/lucene/analysis/core/package-info.class
    [javac] Creating empty /export/home/jenkins/workspace/Lucene-Solr-8.x-Solaris/lucene/build/analysis/common/classes/java/org/apache/lucene/analysis/bn/package-info.class
    [javac] Creating empty /export/home/jenkins/workspace/Lucene-Solr-8.x-Solaris/lucene/build/analysis/common/classe

[...truncated too long message...]

TestSolrCloudWithDelegationTokens.testZNodePaths
   [junit4] Completed [1/5] on J0 in 18.91s, 8 tests
   [junit4]
   [junit4] Suite: org.apache.solr.cloud.TestSolrCloudWithDelegationTokens
   [junit4] OK      1.13s J1 | TestSolrCloudWithDelegationTokens.testDelegationOtherOp
   [junit4] OK      1.16s J1 | TestSolrCloudWithDelegationTokens.testDelegationTokenVerify
   [junit4] OK      0.15s J1 | TestSolrCloudWithDelegationTokens.testDelegationTokenCancelFail
   [junit4] OK      0.09s J1 | TestSolrCloudWithDelegationTokens.testDelegationTokenSolrClient
   [junit4] OK      0.11s J1 | TestSolrCloudWithDelegationTokens.testDelegationTokenRenewFail
   [junit4] OK      1.92s J1 | TestSolrCloudWithDelegationTokens.testDelegationTokenRenew
   [junit4] OK      0.66s J1 | TestSolrCloudWithDelegationTokens.testDelegationTokenCancel
   [junit4] OK      0.18s J1 | TestSolrCloudWithDelegationTokens.testZNodePaths
   [junit4] Completed [2/5] on J1 in 20.94s, 8 tests
   [junit4]
   [junit4] Suite: org.apache.solr.cloud.TestSolrCloudWithDelegationTokens
   [junit4] OK      0.13s J0 | TestSolrCloudWithDelegationTokens.testDelegationOtherOp
   [junit4] OK      0.41s J0 | TestSolrCloudWithDelegationTokens.testDelegationTokenVerify
   [junit4] OK      0.14s J0 | TestSolrCloudWithDelegationTokens.testDelegationTokenCancelFail
   [junit4] OK      0.08s J0 | TestSolrCloudWithDelegationTokens.testDelegationTokenSolrClient
   [junit4] OK      0.07s J0 | TestSolrCloudWithDelegationTokens.testDelegationTokenRenewFail
   [junit4] OK      1.88s J0 | TestSolrCloudWithDelegationTokens.testDelegationTokenRenew
   [junit4] OK      0.56s J0 | TestSolrCloudWithDelegationTokens.testDelegationTokenCancel
   [junit4] OK      0.16s J0 | TestSolrCloudWithDelegationTokens.testZNodePaths
   [junit4] Completed [3/5] on J0 in 7.10s, 8 tests
   [junit4]
   [junit4] Suite: org.apache.solr.cloud.TestSolrCloudWithDelegationTokens
   [junit4] OK      0.14s J1 | TestSolrCloudWithDelegationTokens.testDelegationOtherOp
   [junit4] OK      0.54s J1 | TestSolrCloudWithDelegationTokens.testDelegationTokenVerify
   [junit4] OK      0.20s J1 | TestSolrCloudWithDelegationTokens.testDelegationTokenCancelFail
   [junit4] OK      0.16s J1 | TestSolrCloudWithDelegationTokens.testDelegationTokenSolrClient
   [junit4] OK      0.13s J1 | TestSolrCloudWithDelegationTokens.testDelegationTokenRenewFail
   [junit4] OK      1.54s J1 | TestSolrCloudWithDelegationTokens.testDelegationTokenRenew
   [junit4] OK      0.33s J1 | TestSolrCloudWithDelegationTokens.testDelegationTokenCancel
   [junit4] OK      0.15s J1 | TestSolrCloudWithDelegationTokens.testZNodePaths
   [junit4] Completed [4/5] on J1 in 7.06s, 8 tests
   [junit4]
   [junit4] Suite: org.apache.solr.cloud.TestSolrCloudWithDelegationTokens
   [junit4] OK      0.08s J0 | TestSolrCloudWithDelegationTokens.testDelegationOtherOp
   [junit4] OK      0.35s J0 | TestSolrCloudWithDelegationTokens.testDelegationTokenVerify
   [junit4] OK      0.13s J0 | TestSolrCloudWithDelegationTokens.testDelegationTokenCancelFail
   [junit4] OK      0.20s J0 | TestSolrCloudWithDelegationTokens.testDelegationTokenSolrClient
   [junit4] OK      0.17s J0 | TestSolrCloudWithDelegationTokens.testDelegationTokenRenewFail
   [junit4] OK      1.98s J0 | TestSolrCloudWithDelegationTokens.testDelegationTokenRenew
   [junit4] OK      0.60s J0 | TestSolrCloudWithDelegationTokens.testDelegationTokenCancel
   [junit4] OK      0.23s J0 | TestSolrCloudWithDelegationTokens.testZNodePaths
   [junit4] Completed [5/5] on J0 in 7.91s, 8 tests
   [junit4]
   [junit4] JVM J0:     0.75 ..    36.21 =    35.46s
   [junit4] JVM J1:     0.75 ..    30.31 =    29.55s
   [junit4] Execution time total: 36 seconds
   [junit4] Tests summary: 5 suites, 40 tests
   [junit4] Could not remove temporary path: /export/home/jenkins/workspace/Lucene-Solr-8.x-Solaris/solr/build/solr-core/test/J1 (java.nio.file.DirectoryNotEmptyException: Remaining files: [/export/home/jenkins/workspace/Lucene-Solr-8.x-Solaris/solr/build/solr-core/test/J1/temp])
   [junit4] Could not remove temporary path: /export/home/jenkins/workspace/Lucene-Solr-8.x-Solaris/solr/build/solr-core/test/J0 (java.nio.file.DirectoryNotEmptyException: Remaining files: [/export/home/jenkins/workspace/Lucene-Solr-8.x-Solaris/solr/build/solr-core/test/J0/temp])
     [echo] 5 slowest tests:
[junit4:tophints] 275.92s | org.apache.solr.cloud.autoscaling.IndexSizeTriggerTest
[junit4:tophints] 255.79s | org.apache.solr.search.facet.TestJsonFacets
[junit4:tophints] 253.10s | org.apache.solr.cloud.api.collections.ShardSplitTest
[junit4:tophints] 152.68s | org.apache.solr.cloud.CollectionsAPISolrJTest
[junit4:tophints] 137.63s | org.apache.solr.update.processor.CategoryRoutedAliasUpdateProcessorTest

-check-totals:

test-nocompile:

BUILD SUCCESSFUL
Total time: 40 seconds
[repro] Failures:
[repro]   0/5 failed: org.apache.solr.cloud.TestSolrCloudWithDelegationTokens
[repro] Exiting with code 0
+ mv lucene/build lucene/build.repro
+ mv solr/build solr/build.repro
+ mv lucene/build.orig lucene/build
+ mv solr/build.orig solr/build
Archiving artifacts
Setting ANT_1_8_2_HOME=/export/home/jenkins/tools/hudson.tasks.Ant_AntInstallation/ANT_1.8.2
java.lang.InterruptedException: no matches found within 10000
        at hudson.FilePath$ValidateAntFileMask.hasMatch(FilePath.java:2805)
        at hudson.FilePath$ValidateAntFileMask.invoke(FilePath.java:2684)
        at hudson.FilePath$ValidateAntFileMask.invoke(FilePath.java:2665)
        at hudson.FilePath$FileCallableWrapper.call(FilePath.java:3052)
Also:   hudson.remoting.Channel$CallSiteStackTrace: Remote call to Solaris VBOX
                at hudson.remoting.Channel.attachCallSiteStackTrace(Channel.java:1743)
                at hudson.remoting.UserRequest$ExceptionResponse.retrieve(UserRequest.java:357)
                at hudson.remoting.Channel.call(Channel.java:957)
                at hudson.FilePath.act(FilePath.java:1072)
                at hudson.FilePath.act(FilePath.java:1061)
                at hudson.FilePath.validateAntFileMask(FilePath.java:2663)
                at hudson.tasks.ArtifactArchiver.perform(ArtifactArchiver.java:248)
                at hudson.tasks.BuildStepCompatibilityLayer.perform(BuildStepCompatibilityLayer.java:79)
                at hudson.tasks.BuildStepMonitor$1.perform(BuildStepMonitor.java:20)
                at hudson.model.AbstractBuild$AbstractBuildExecution.perform(AbstractBuild.java:741)
                at hudson.model.AbstractBuild$AbstractBuildExecution.performAllBuildSteps(AbstractBuild.java:690)
                at hudson.model.Build$BuildExecution.post2(Build.java:186)
                at hudson.model.AbstractBuild$AbstractBuildExecution.post(AbstractBuild.java:635)
                at hudson.model.Run.execute(Run.java:1840)
                at hudson.model.FreeStyleBuild.run(FreeStyleBuild.java:43)
                at hudson.model.ResourceController.execute(ResourceController.java:97)
                at hudson.model.Executor.run(Executor.java:429)
Caused: hudson.FilePath$TunneledInterruptedException
        at hudson.FilePath$FileCallableWrapper.call(FilePath.java:3054)
        at hudson.remoting.UserRequest.perform(UserRequest.java:212)
        at hudson.remoting.UserRequest.perform(UserRequest.java:54)
        at hudson.remoting.Request$2.run(Request.java:369)
        at hudson.remoting.InterceptingExecutorService$1.call(InterceptingExecutorService.java:72)
        at java.util.concurrent.FutureTask.run(FutureTask.java:266)
        at java.util.concurrent.ThreadPoolExecutor.runWorker(ThreadPoolExecutor.java:1149)
        at java.util.concurrent.ThreadPoolExecutor$Worker.run(ThreadPoolExecutor.java:624)
        at java.lang.Thread.run(Thread.java:748)
Caused: java.lang.InterruptedException: java.lang.InterruptedException: no matches found within 10000
        at hudson.FilePath.act(FilePath.java:1074)
        at hudson.FilePath.act(FilePath.java:1061)
        at hudson.FilePath.validateAntFileMask(FilePath.java:2663)
        at hudson.tasks.ArtifactArchiver.perform(ArtifactArchiver.java:248)
        at hudson.tasks.BuildStepCompatibilityLayer.perform(BuildStepCompatibilityLayer.java:79)
        at hudson.tasks.BuildStepMonitor$1.perform(BuildStepMonitor.java:20)
        at hudson.model.AbstractBuild$AbstractBuildExecution.perform(AbstractBuild.java:741)
        at hudson.model.AbstractBuild$AbstractBuildExecution.performAllBuildSteps(AbstractBuild.java:690)
        at hudson.model.Build$BuildExecution.post2(Build.java:186)
        at hudson.model.AbstractBuild$AbstractBuildExecution.post(AbstractBuild.java:635)
        at hudson.model.Run.execute(Run.java:1840)
        at hudson.model.FreeStyleBuild.run(FreeStyleBuild.java:43)
        at hudson.model.ResourceController.execute(ResourceController.java:97)
        at hudson.model.Executor.run(Executor.java:429)
No artifacts found that match the file pattern "**/*.events,heapdumps/**,**/*_pid*.log". Configuration error?
[WARNINGS] Parsing warnings in console log with parser Java Compiler (javac)
Setting ANT_1_8_2_HOME=/export/home/jenkins/tools/hudson.tasks.Ant_AntInstallation/ANT_1.8.2
No credentials specified
Setting ANT_1_8_2_HOME=/export/home/jenkins/tools/hudson.tasks.Ant_AntInstallation/ANT_1.8.2
<Git Blamer> Using GitBlamer to create author and commit information for all warnings.
<Git Blamer> GIT_COMMIT=ea8f921e71e628e2334ea2fdf2f3c95c6fe427a8, workspace=/export/home/jenkins/workspace/Lucene-Solr-8.x-Solaris
[WARNINGS] Computing warning deltas based on reference build #265
Recording test results
Setting ANT_1_8_2_HOME=/export/home/jenkins/tools/hudson.tasks.Ant_AntInstallation/ANT_1.8.2
Build step 'Publish JUnit test result report' changed build result to UNSTABLE
Email was triggered for: Unstable (Test Failures)
Sending email for trigger: Unstable (Test Failures)
Setting ANT_1_8_2_HOME=/export/home/jenkins/tools/hudson.tasks.Ant_AntInstallation/ANT_1.8.2
Setting ANT_1_8_2_HOME=/export/home/jenkins/tools/hudson.tasks.Ant_AntInstallation/ANT_1.8.2
Setting ANT_1_8_2_HOME=/export/home/jenkins/tools/hudson.tasks.Ant_AntInstallation/ANT_1.8.2
Setting ANT_1_8_2_HOME=/export/home/jenkins/tools/hudson.tasks.Ant_AntInstallation/ANT_1.8.2
Setting ANT_1_8_2_HOME=/export/home/jenkins/tools/hudson.tasks.Ant_AntInstallation/ANT_1.8.2
Setting ANT_1_8_2_HOME=/export/home/jenkins/tools/hudson.tasks.Ant_AntInstallation/ANT_1.8.2


---------------------------------------------------------------------
To unsubscribe, e-mail: [hidden email]
For additional commands, e-mail: [hidden email]