[JENKINS] Lucene-Solr-8.x-Solaris (64bit/jdk1.8.0) - Build # 288 - Unstable!

classic Classic list List threaded Threaded
1 message Options
Reply | Threaded
Open this post in threaded view
|

[JENKINS] Lucene-Solr-8.x-Solaris (64bit/jdk1.8.0) - Build # 288 - Unstable!

Policeman Jenkins Server-2
Build: https://jenkins.thetaphi.de/job/Lucene-Solr-8.x-Solaris/288/
Java: 64bit/jdk1.8.0 -XX:-UseCompressedOops -XX:+UseConcMarkSweepGC

1 tests failed.
FAILED:  junit.framework.TestSuite.org.apache.solr.rest.TestManagedResourceStorage

Error Message:
ObjectTracker found 2 object(s) that were not released!!! [ZkCollectionTerms, ZkShardTerms] org.apache.solr.common.util.ObjectReleaseTracker$ObjectTrackerException: org.apache.solr.cloud.ZkCollectionTerms  at org.apache.solr.common.util.ObjectReleaseTracker.track(ObjectReleaseTracker.java:42)  at org.apache.solr.cloud.ZkCollectionTerms.<init>(ZkCollectionTerms.java:39)  at org.apache.solr.cloud.ZkController.getCollectionTerms(ZkController.java:1624)  at org.apache.solr.cloud.ZkController.getShardTerms(ZkController.java:1619)  at org.apache.solr.cloud.ZkController.register(ZkController.java:1206)  at org.apache.solr.cloud.ZkController.register(ZkController.java:1171)  at org.apache.solr.core.ZkContainer.lambda$registerInZk$0(ZkContainer.java:191)  at org.apache.solr.common.util.ExecutorUtil$MDCAwareThreadPoolExecutor.lambda$execute$0(ExecutorUtil.java:210)  at java.util.concurrent.ThreadPoolExecutor.runWorker(ThreadPoolExecutor.java:1149)  at java.util.concurrent.ThreadPoolExecutor$Worker.run(ThreadPoolExecutor.java:624)  at java.lang.Thread.run(Thread.java:748)  org.apache.solr.common.util.ObjectReleaseTracker$ObjectTrackerException: org.apache.solr.cloud.ZkShardTerms  at org.apache.solr.common.util.ObjectReleaseTracker.track(ObjectReleaseTracker.java:42)  at org.apache.solr.cloud.ZkShardTerms.<init>(ZkShardTerms.java:93)  at org.apache.solr.cloud.ZkCollectionTerms.getShard(ZkCollectionTerms.java:45)  at org.apache.solr.cloud.ZkController.getShardTerms(ZkController.java:1619)  at org.apache.solr.cloud.ZkController.register(ZkController.java:1206)  at org.apache.solr.cloud.ZkController.register(ZkController.java:1171)  at org.apache.solr.core.ZkContainer.lambda$registerInZk$0(ZkContainer.java:191)  at org.apache.solr.common.util.ExecutorUtil$MDCAwareThreadPoolExecutor.lambda$execute$0(ExecutorUtil.java:210)  at java.util.concurrent.ThreadPoolExecutor.runWorker(ThreadPoolExecutor.java:1149)  at java.util.concurrent.ThreadPoolExecutor$Worker.run(ThreadPoolExecutor.java:624)  at java.lang.Thread.run(Thread.java:748)   expected null, but was:<ObjectTracker found 2 object(s) that were not released!!! [ZkCollectionTerms, ZkShardTerms] org.apache.solr.common.util.ObjectReleaseTracker$ObjectTrackerException: org.apache.solr.cloud.ZkCollectionTerms  at org.apache.solr.common.util.ObjectReleaseTracker.track(ObjectReleaseTracker.java:42)  at org.apache.solr.cloud.ZkCollectionTerms.<init>(ZkCollectionTerms.java:39)  at org.apache.solr.cloud.ZkController.getCollectionTerms(ZkController.java:1624)  at org.apache.solr.cloud.ZkController.getShardTerms(ZkController.java:1619)  at org.apache.solr.cloud.ZkController.register(ZkController.java:1206)  at org.apache.solr.cloud.ZkController.register(ZkController.java:1171)  at org.apache.solr.core.ZkContainer.lambda$registerInZk$0(ZkContainer.java:191)  at org.apache.solr.common.util.ExecutorUtil$MDCAwareThreadPoolExecutor.lambda$execute$0(ExecutorUtil.java:210)  at java.util.concurrent.ThreadPoolExecutor.runWorker(ThreadPoolExecutor.java:1149)  at java.util.concurrent.ThreadPoolExecutor$Worker.run(ThreadPoolExecutor.java:624)  at java.lang.Thread.run(Thread.java:748)  org.apache.solr.common.util.ObjectReleaseTracker$ObjectTrackerException: org.apache.solr.cloud.ZkShardTerms  at org.apache.solr.common.util.ObjectReleaseTracker.track(ObjectReleaseTracker.java:42)  at org.apache.solr.cloud.ZkShardTerms.<init>(ZkShardTerms.java:93)  at org.apache.solr.cloud.ZkCollectionTerms.getShard(ZkCollectionTerms.java:45)  at org.apache.solr.cloud.ZkController.getShardTerms(ZkController.java:1619)  at org.apache.solr.cloud.ZkController.register(ZkController.java:1206)  at org.apache.solr.cloud.ZkController.register(ZkController.java:1171)  at org.apache.solr.core.ZkContainer.lambda$registerInZk$0(ZkContainer.java:191)  at org.apache.solr.common.util.ExecutorUtil$MDCAwareThreadPoolExecutor.lambda$execute$0(ExecutorUtil.java:210)  at java.util.concurrent.ThreadPoolExecutor.runWorker(ThreadPoolExecutor.java:1149)  at java.util.concurrent.ThreadPoolExecutor$Worker.run(ThreadPoolExecutor.java:624)  at java.lang.Thread.run(Thread.java:748)  >

Stack Trace:
java.lang.AssertionError: ObjectTracker found 2 object(s) that were not released!!! [ZkCollectionTerms, ZkShardTerms]
org.apache.solr.common.util.ObjectReleaseTracker$ObjectTrackerException: org.apache.solr.cloud.ZkCollectionTerms
        at org.apache.solr.common.util.ObjectReleaseTracker.track(ObjectReleaseTracker.java:42)
        at org.apache.solr.cloud.ZkCollectionTerms.<init>(ZkCollectionTerms.java:39)
        at org.apache.solr.cloud.ZkController.getCollectionTerms(ZkController.java:1624)
        at org.apache.solr.cloud.ZkController.getShardTerms(ZkController.java:1619)
        at org.apache.solr.cloud.ZkController.register(ZkController.java:1206)
        at org.apache.solr.cloud.ZkController.register(ZkController.java:1171)
        at org.apache.solr.core.ZkContainer.lambda$registerInZk$0(ZkContainer.java:191)
        at org.apache.solr.common.util.ExecutorUtil$MDCAwareThreadPoolExecutor.lambda$execute$0(ExecutorUtil.java:210)
        at java.util.concurrent.ThreadPoolExecutor.runWorker(ThreadPoolExecutor.java:1149)
        at java.util.concurrent.ThreadPoolExecutor$Worker.run(ThreadPoolExecutor.java:624)
        at java.lang.Thread.run(Thread.java:748)

org.apache.solr.common.util.ObjectReleaseTracker$ObjectTrackerException: org.apache.solr.cloud.ZkShardTerms
        at org.apache.solr.common.util.ObjectReleaseTracker.track(ObjectReleaseTracker.java:42)
        at org.apache.solr.cloud.ZkShardTerms.<init>(ZkShardTerms.java:93)
        at org.apache.solr.cloud.ZkCollectionTerms.getShard(ZkCollectionTerms.java:45)
        at org.apache.solr.cloud.ZkController.getShardTerms(ZkController.java:1619)
        at org.apache.solr.cloud.ZkController.register(ZkController.java:1206)
        at org.apache.solr.cloud.ZkController.register(ZkController.java:1171)
        at org.apache.solr.core.ZkContainer.lambda$registerInZk$0(ZkContainer.java:191)
        at org.apache.solr.common.util.ExecutorUtil$MDCAwareThreadPoolExecutor.lambda$execute$0(ExecutorUtil.java:210)
        at java.util.concurrent.ThreadPoolExecutor.runWorker(ThreadPoolExecutor.java:1149)
        at java.util.concurrent.ThreadPoolExecutor$Worker.run(ThreadPoolExecutor.java:624)
        at java.lang.Thread.run(Thread.java:748)

 expected null, but was:<ObjectTracker found 2 object(s) that were not released!!! [ZkCollectionTerms, ZkShardTerms]
org.apache.solr.common.util.ObjectReleaseTracker$ObjectTrackerException: org.apache.solr.cloud.ZkCollectionTerms
        at org.apache.solr.common.util.ObjectReleaseTracker.track(ObjectReleaseTracker.java:42)
        at org.apache.solr.cloud.ZkCollectionTerms.<init>(ZkCollectionTerms.java:39)
        at org.apache.solr.cloud.ZkController.getCollectionTerms(ZkController.java:1624)
        at org.apache.solr.cloud.ZkController.getShardTerms(ZkController.java:1619)
        at org.apache.solr.cloud.ZkController.register(ZkController.java:1206)
        at org.apache.solr.cloud.ZkController.register(ZkController.java:1171)
        at org.apache.solr.core.ZkContainer.lambda$registerInZk$0(ZkContainer.java:191)
        at org.apache.solr.common.util.ExecutorUtil$MDCAwareThreadPoolExecutor.lambda$execute$0(ExecutorUtil.java:210)
        at java.util.concurrent.ThreadPoolExecutor.runWorker(ThreadPoolExecutor.java:1149)
        at java.util.concurrent.ThreadPoolExecutor$Worker.run(ThreadPoolExecutor.java:624)
        at java.lang.Thread.run(Thread.java:748)

org.apache.solr.common.util.ObjectReleaseTracker$ObjectTrackerException: org.apache.solr.cloud.ZkShardTerms
        at org.apache.solr.common.util.ObjectReleaseTracker.track(ObjectReleaseTracker.java:42)
        at org.apache.solr.cloud.ZkShardTerms.<init>(ZkShardTerms.java:93)
        at org.apache.solr.cloud.ZkCollectionTerms.getShard(ZkCollectionTerms.java:45)
        at org.apache.solr.cloud.ZkController.getShardTerms(ZkController.java:1619)
        at org.apache.solr.cloud.ZkController.register(ZkController.java:1206)
        at org.apache.solr.cloud.ZkController.register(ZkController.java:1171)
        at org.apache.solr.core.ZkContainer.lambda$registerInZk$0(ZkContainer.java:191)
        at org.apache.solr.common.util.ExecutorUtil$MDCAwareThreadPoolExecutor.lambda$execute$0(ExecutorUtil.java:210)
        at java.util.concurrent.ThreadPoolExecutor.runWorker(ThreadPoolExecutor.java:1149)
        at java.util.concurrent.ThreadPoolExecutor$Worker.run(ThreadPoolExecutor.java:624)
        at java.lang.Thread.run(Thread.java:748)

>
        at __randomizedtesting.SeedInfo.seed([C5F5E66E6873139E]:0)
        at org.junit.Assert.fail(Assert.java:88)
        at org.junit.Assert.failNotNull(Assert.java:755)
        at org.junit.Assert.assertNull(Assert.java:737)
        at org.apache.solr.SolrTestCaseJ4.teardownTestCases(SolrTestCaseJ4.java:340)
        at sun.reflect.NativeMethodAccessorImpl.invoke0(Native Method)
        at sun.reflect.NativeMethodAccessorImpl.invoke(NativeMethodAccessorImpl.java:62)
        at sun.reflect.DelegatingMethodAccessorImpl.invoke(DelegatingMethodAccessorImpl.java:43)
        at java.lang.reflect.Method.invoke(Method.java:498)
        at com.carrotsearch.randomizedtesting.RandomizedRunner.invoke(RandomizedRunner.java:1750)
        at com.carrotsearch.randomizedtesting.RandomizedRunner$7.evaluate(RandomizedRunner.java:901)
        at com.carrotsearch.randomizedtesting.rules.StatementAdapter.evaluate(StatementAdapter.java:36)
        at com.carrotsearch.randomizedtesting.rules.SystemPropertiesRestoreRule$1.evaluate(SystemPropertiesRestoreRule.java:57)
        at org.apache.lucene.util.AbstractBeforeAfterRule$1.evaluate(AbstractBeforeAfterRule.java:45)
        at com.carrotsearch.randomizedtesting.rules.StatementAdapter.evaluate(StatementAdapter.java:36)
        at org.apache.lucene.util.TestRuleStoreClassName$1.evaluate(TestRuleStoreClassName.java:41)
        at com.carrotsearch.randomizedtesting.rules.NoShadowingOrOverridesOnMethodsRule$1.evaluate(NoShadowingOrOverridesOnMethodsRule.java:40)
        at com.carrotsearch.randomizedtesting.rules.NoShadowingOrOverridesOnMethodsRule$1.evaluate(NoShadowingOrOverridesOnMethodsRule.java:40)
        at com.carrotsearch.randomizedtesting.rules.StatementAdapter.evaluate(StatementAdapter.java:36)
        at com.carrotsearch.randomizedtesting.rules.StatementAdapter.evaluate(StatementAdapter.java:36)
        at com.carrotsearch.randomizedtesting.rules.StatementAdapter.evaluate(StatementAdapter.java:36)
        at org.apache.lucene.util.TestRuleAssertionsRequired$1.evaluate(TestRuleAssertionsRequired.java:53)
        at org.apache.lucene.util.TestRuleMarkFailure$1.evaluate(TestRuleMarkFailure.java:47)
        at org.apache.lucene.util.TestRuleIgnoreAfterMaxFailures$1.evaluate(TestRuleIgnoreAfterMaxFailures.java:64)
        at org.apache.lucene.util.TestRuleIgnoreTestSuites$1.evaluate(TestRuleIgnoreTestSuites.java:54)
        at com.carrotsearch.randomizedtesting.rules.StatementAdapter.evaluate(StatementAdapter.java:36)
        at com.carrotsearch.randomizedtesting.ThreadLeakControl$StatementRunner.run(ThreadLeakControl.java:368)
        at java.lang.Thread.run(Thread.java:748)




Build Log:
[...truncated 13353 lines...]
   [junit4] Suite: org.apache.solr.rest.TestManagedResourceStorage
   [junit4]   2> 324643 INFO  (SUITE-TestManagedResourceStorage-seed#[C5F5E66E6873139E]-worker) [     ] o.a.s.SolrTestCaseJ4 Created dataDir: /export/home/jenkins/workspace/Lucene-Solr-8.x-Solaris/solr/build/solr-core/test/J1/temp/solr.rest.TestManagedResourceStorage_C5F5E66E6873139E-001/data-dir-18-001
   [junit4]   2> 324643 INFO  (SUITE-TestManagedResourceStorage-seed#[C5F5E66E6873139E]-worker) [     ] o.a.s.SolrTestCaseJ4 Using PointFields (NUMERIC_POINTS_SYSPROP=true) w/NUMERIC_DOCVALUES_SYSPROP=false
   [junit4]   2> 324645 INFO  (SUITE-TestManagedResourceStorage-seed#[C5F5E66E6873139E]-worker) [     ] o.a.s.SolrTestCaseJ4 Randomized ssl (true) and clientAuth (false) via: @org.apache.solr.util.RandomizeSSL(reason=, value=NaN, ssl=NaN, clientAuth=NaN)
   [junit4]   2> 324646 INFO  (SUITE-TestManagedResourceStorage-seed#[C5F5E66E6873139E]-worker) [     ] o.a.s.SolrTestCaseJ4 SecureRandom sanity checks: test.solr.allowed.securerandom=null & java.security.egd=file:/dev/./urandom
   [junit4]   2> 324649 INFO  (SUITE-TestManagedResourceStorage-seed#[C5F5E66E6873139E]-worker) [     ] o.a.s.c.ZkTestServer STARTING ZK TEST SERVER
   [junit4]   2> 324649 INFO  (ZkTestServer Run Thread) [     ] o.a.s.c.ZkTestServer client port:0.0.0.0/0.0.0.0:0
   [junit4]   2> 324649 INFO  (ZkTestServer Run Thread) [     ] o.a.s.c.ZkTestServer Starting server
   [junit4]   2> 324749 INFO  (SUITE-TestManagedResourceStorage-seed#[C5F5E66E6873139E]-worker) [     ] o.a.s.c.ZkTestServer start zk server on port:35446
   [junit4]   2> 324749 INFO  (SUITE-TestManagedResourceStorage-seed#[C5F5E66E6873139E]-worker) [     ] o.a.s.c.ZkTestServer waitForServerUp: 127.0.0.1:35446
   [junit4]   2> 324749 INFO  (SUITE-TestManagedResourceStorage-seed#[C5F5E66E6873139E]-worker) [     ] o.a.s.c.ZkTestServer parse host and port list: 127.0.0.1:35446
   [junit4]   2> 324749 INFO  (SUITE-TestManagedResourceStorage-seed#[C5F5E66E6873139E]-worker) [     ] o.a.s.c.ZkTestServer connecting to 127.0.0.1 35446
   [junit4]   2> 324757 INFO  (SUITE-TestManagedResourceStorage-seed#[C5F5E66E6873139E]-worker) [     ] o.a.s.c.c.ConnectionManager Waiting for client to connect to ZooKeeper
   [junit4]   2> 324762 INFO  (zkConnectionManagerCallback-1782-thread-1) [     ] o.a.s.c.c.ConnectionManager zkClient has connected
   [junit4]   2> 324762 INFO  (SUITE-TestManagedResourceStorage-seed#[C5F5E66E6873139E]-worker) [     ] o.a.s.c.c.ConnectionManager Client is connected to ZooKeeper
   [junit4]   2> 324766 INFO  (SUITE-TestManagedResourceStorage-seed#[C5F5E66E6873139E]-worker) [     ] o.a.s.c.c.ConnectionManager Waiting for client to connect to ZooKeeper
   [junit4]   2> 324768 INFO  (zkConnectionManagerCallback-1784-thread-1) [     ] o.a.s.c.c.ConnectionManager zkClient has connected
   [junit4]   2> 324768 INFO  (SUITE-TestManagedResourceStorage-seed#[C5F5E66E6873139E]-worker) [     ] o.a.s.c.c.ConnectionManager Client is connected to ZooKeeper
   [junit4]   2> 324770 INFO  (SUITE-TestManagedResourceStorage-seed#[C5F5E66E6873139E]-worker) [     ] o.a.s.c.ZkTestServer put /export/home/jenkins/workspace/Lucene-Solr-8.x-Solaris/solr/core/src/test-files/solr/collection1/conf/solrconfig.xml to /configs/conf1/solrconfig.xml
   [junit4]   2> 324772 INFO  (SUITE-TestManagedResourceStorage-seed#[C5F5E66E6873139E]-worker) [     ] o.a.s.c.ZkTestServer put /export/home/jenkins/workspace/Lucene-Solr-8.x-Solaris/solr/core/src/test-files/solr/collection1/conf/schema.xml to /configs/conf1/schema.xml
   [junit4]   2> 324774 INFO  (SUITE-TestManagedResourceStorage-seed#[C5F5E66E6873139E]-worker) [     ] o.a.s.c.ZkTestServer put /export/home/jenkins/workspace/Lucene-Solr-8.x-Solaris/solr/core/src/test-files/solr/collection1/conf/solrconfig.snippet.randomindexconfig.xml to /configs/conf1/solrconfig.snippet.randomindexconfig.xml
   [junit4]   2> 324776 INFO  (SUITE-TestManagedResourceStorage-seed#[C5F5E66E6873139E]-worker) [     ] o.a.s.c.ZkTestServer put /export/home/jenkins/workspace/Lucene-Solr-8.x-Solaris/solr/core/src/test-files/solr/collection1/conf/stopwords.txt to /configs/conf1/stopwords.txt
   [junit4]   2> 324777 INFO  (SUITE-TestManagedResourceStorage-seed#[C5F5E66E6873139E]-worker) [     ] o.a.s.c.ZkTestServer put /export/home/jenkins/workspace/Lucene-Solr-8.x-Solaris/solr/core/src/test-files/solr/collection1/conf/protwords.txt to /configs/conf1/protwords.txt
   [junit4]   2> 324779 INFO  (SUITE-TestManagedResourceStorage-seed#[C5F5E66E6873139E]-worker) [     ] o.a.s.c.ZkTestServer put /export/home/jenkins/workspace/Lucene-Solr-8.x-Solaris/solr/core/src/test-files/solr/collection1/conf/currency.xml to /configs/conf1/currency.xml
   [junit4]   2> 324780 INFO  (SUITE-TestManagedResourceStorage-seed#[C5F5E66E6873139E]-worker) [     ] o.a.s.c.ZkTestServer put /export/home/jenkins/workspace/Lucene-Solr-8.x-Solaris/solr/core/src/test-files/solr/collection1/conf/enumsConfig.xml to /configs/conf1/enumsConfig.xml
   [junit4]   2> 324782 INFO  (SUITE-TestManagedResourceStorage-seed#[C5F5E66E6873139E]-worker) [     ] o.a.s.c.ZkTestServer put /export/home/jenkins/workspace/Lucene-Solr-8.x-Solaris/solr/core/src/test-files/solr/collection1/conf/open-exchange-rates.json to /configs/conf1/open-exchange-rates.json
   [junit4]   2> 324783 INFO  (SUITE-TestManagedResourceStorage-seed#[C5F5E66E6873139E]-worker) [     ] o.a.s.c.ZkTestServer put /export/home/jenkins/workspace/Lucene-Solr-8.x-Solaris/solr/core/src/test-files/solr/collection1/conf/mapping-ISOLatin1Accent.txt to /configs/conf1/mapping-ISOLatin1Accent.txt
   [junit4]   2> 324785 INFO  (SUITE-TestManagedResourceStorage-seed#[C5F5E66E6873139E]-worker) [     ] o.a.s.c.ZkTestServer put /export/home/jenkins/workspace/Lucene-Solr-8.x-Solaris/solr/core/src/test-files/solr/collection1/conf/old_synonyms.txt to /configs/conf1/old_synonyms.txt
   [junit4]   2> 324787 INFO  (SUITE-TestManagedResourceStorage-seed#[C5F5E66E6873139E]-worker) [     ] o.a.s.c.ZkTestServer put /export/home/jenkins/workspace/Lucene-Solr-8.x-Solaris/solr/core/src/test-files/solr/collection1/conf/synonyms.txt to /configs/conf1/synonyms.txt
   [junit4]   2> 324788 INFO  (SUITE-TestManagedResourceStorage-seed#[C5F5E66E6873139E]-worker) [     ] o.a.s.SolrTestCaseJ4 ####initCore
   [junit4]   2> 324789 INFO  (SUITE-TestManagedResourceStorage-seed#[C5F5E66E6873139E]-worker) [     ] o.a.s.c.SolrResourceLoader [null] Added 2 libs to classloader, from paths: [/export/home/jenkins/workspace/Lucene-Solr-8.x-Solaris/solr/core/src/test-files/solr/collection1/lib, /export/home/jenkins/workspace/Lucene-Solr-8.x-Solaris/solr/core/src/test-files/solr/collection1/lib/classes]
   [junit4]   2> 324810 INFO  (SUITE-TestManagedResourceStorage-seed#[C5F5E66E6873139E]-worker) [     ] o.a.s.c.SolrConfig Using Lucene MatchVersion: 8.3.0
   [junit4]   2> 324831 INFO  (SUITE-TestManagedResourceStorage-seed#[C5F5E66E6873139E]-worker) [     ] o.a.s.s.IndexSchema [null] Schema name=test
   [junit4]   2> 324935 INFO  (SUITE-TestManagedResourceStorage-seed#[C5F5E66E6873139E]-worker) [     ] o.a.s.s.IndexSchema Loaded schema test/1.0 with uniqueid field id
   [junit4]   2> 325341 INFO  (SUITE-TestManagedResourceStorage-seed#[C5F5E66E6873139E]-worker) [     ] o.a.s.h.c.HttpShardHandlerFactory Host whitelist initialized: WhitelistHostChecker [whitelistHosts=null, whitelistHostCheckingEnabled=true]
   [junit4]   2> 325342 WARN  (SUITE-TestManagedResourceStorage-seed#[C5F5E66E6873139E]-worker) [     ] o.a.s.c.s.i.Http2SolrClient Create Http2SolrClient with HTTP/1.1 transport since Java 8 or lower versions does not support SSL + HTTP/2
   [junit4]   2> 325344 WARN  (SUITE-TestManagedResourceStorage-seed#[C5F5E66E6873139E]-worker) [     ] o.e.j.u.s.S.config Trusting all certificates configured for Client@5c45dc50[provider=null,keyStore=null,trustStore=null]
   [junit4]   2> 325344 WARN  (SUITE-TestManagedResourceStorage-seed#[C5F5E66E6873139E]-worker) [     ] o.e.j.u.s.S.config No Client EndPointIdentificationAlgorithm configured for Client@5c45dc50[provider=null,keyStore=null,trustStore=null]
   [junit4]   2> 325347 WARN  (SUITE-TestManagedResourceStorage-seed#[C5F5E66E6873139E]-worker) [     ] o.a.s.c.s.i.Http2SolrClient Create Http2SolrClient with HTTP/1.1 transport since Java 8 or lower versions does not support SSL + HTTP/2
   [junit4]   2> 325350 WARN  (SUITE-TestManagedResourceStorage-seed#[C5F5E66E6873139E]-worker) [     ] o.e.j.u.s.S.config Trusting all certificates configured for Client@32a48475[provider=null,keyStore=null,trustStore=null]
   [junit4]   2> 325350 WARN  (SUITE-TestManagedResourceStorage-seed#[C5F5E66E6873139E]-worker) [     ] o.e.j.u.s.S.config No Client EndPointIdentificationAlgorithm configured for Client@32a48475[provider=null,keyStore=null,trustStore=null]
   [junit4]   2> 325351 INFO  (SUITE-TestManagedResourceStorage-seed#[C5F5E66E6873139E]-worker) [     ] o.a.s.c.ZkContainer Zookeeper client=127.0.0.1:35446/solr
   [junit4]   2> 325351 INFO  (SUITE-TestManagedResourceStorage-seed#[C5F5E66E6873139E]-worker) [     ] o.a.s.c.c.ConnectionManager Waiting for client to connect to ZooKeeper
   [junit4]   2> 325356 INFO  (zkConnectionManagerCallback-1791-thread-1) [     ] o.a.s.c.c.ConnectionManager zkClient has connected
   [junit4]   2> 325360 INFO  (SUITE-TestManagedResourceStorage-seed#[C5F5E66E6873139E]-worker) [     ] o.a.s.c.c.ConnectionManager Client is connected to ZooKeeper
   [junit4]   2> 325485 INFO  (SUITE-TestManagedResourceStorage-seed#[C5F5E66E6873139E]-worker) [n:127.0.0.1:8983_     ] o.a.s.c.c.ConnectionManager Waiting for client to connect to ZooKeeper
   [junit4]   2> 325488 INFO  (zkConnectionManagerCallback-1793-thread-1) [     ] o.a.s.c.c.ConnectionManager zkClient has connected
   [junit4]   2> 325488 INFO  (SUITE-TestManagedResourceStorage-seed#[C5F5E66E6873139E]-worker) [n:127.0.0.1:8983_     ] o.a.s.c.c.ConnectionManager Client is connected to ZooKeeper
   [junit4]   2> 325633 INFO  (SUITE-TestManagedResourceStorage-seed#[C5F5E66E6873139E]-worker) [n:127.0.0.1:8983_     ] o.a.s.c.OverseerElectionContext I am going to be the leader 127.0.0.1:8983_
   [junit4]   2> 325634 INFO  (SUITE-TestManagedResourceStorage-seed#[C5F5E66E6873139E]-worker) [n:127.0.0.1:8983_     ] o.a.s.c.Overseer Overseer (id=72183343474999299-127.0.0.1:8983_-n_0000000000) starting
   [junit4]   2> 325643 INFO  (SUITE-TestManagedResourceStorage-seed#[C5F5E66E6873139E]-worker) [n:127.0.0.1:8983_     ] o.a.s.c.c.ConnectionManager Waiting for client to connect to ZooKeeper
   [junit4]   2> 325646 INFO  (zkConnectionManagerCallback-1800-thread-1) [     ] o.a.s.c.c.ConnectionManager zkClient has connected
   [junit4]   2> 325646 INFO  (SUITE-TestManagedResourceStorage-seed#[C5F5E66E6873139E]-worker) [n:127.0.0.1:8983_     ] o.a.s.c.c.ConnectionManager Client is connected to ZooKeeper
   [junit4]   2> 325650 INFO  (SUITE-TestManagedResourceStorage-seed#[C5F5E66E6873139E]-worker) [n:127.0.0.1:8983_     ] o.a.s.c.s.i.ZkClientClusterStateProvider Cluster at 127.0.0.1:35446/solr ready
   [junit4]   2> 325651 INFO  (SUITE-TestManagedResourceStorage-seed#[C5F5E66E6873139E]-worker) [n:127.0.0.1:8983_     ] o.a.s.c.ZkController Register node as live in ZooKeeper:/live_nodes/127.0.0.1:8983_
   [junit4]   2> 325651 INFO  (OverseerStateUpdate-72183343474999299-127.0.0.1:8983_-n_0000000000) [n:127.0.0.1:8983_     ] o.a.s.c.Overseer Starting to work on the main queue : 127.0.0.1:8983_
   [junit4]   2> 325654 INFO  (zkCallback-1799-thread-1) [     ] o.a.s.c.c.ZkStateReader Updated live nodes from ZooKeeper... (0) -> (1)
   [junit4]   2> 325654 INFO  (OverseerStateUpdate-72183343474999299-127.0.0.1:8983_-n_0000000000) [n:127.0.0.1:8983_     ] o.a.s.c.c.ZkStateReader Updated live nodes from ZooKeeper... (0) -> (1)
   [junit4]   2> 325657 INFO  (SUITE-TestManagedResourceStorage-seed#[C5F5E66E6873139E]-worker) [n:127.0.0.1:8983_     ] o.a.s.c.PackageManager clusterprops.json changed , version 0
   [junit4]   2> 325699 INFO  (SUITE-TestManagedResourceStorage-seed#[C5F5E66E6873139E]-worker) [n:127.0.0.1:8983_     ] o.a.s.h.a.MetricsHistoryHandler No .system collection, keeping metrics history in memory.
   [junit4]   2> 325712 INFO  (SUITE-TestManagedResourceStorage-seed#[C5F5E66E6873139E]-worker) [n:127.0.0.1:8983_     ] o.a.s.m.r.SolrJmxReporter JMX monitoring for 'solr.node' (registry 'solr.node') enabled at server: com.sun.jmx.mbeanserver.JmxMBeanServer@4d7045d2
   [junit4]   2> 325716 INFO  (SUITE-TestManagedResourceStorage-seed#[C5F5E66E6873139E]-worker) [n:127.0.0.1:8983_     ] o.a.s.m.r.SolrJmxReporter JMX monitoring for 'solr.jvm' (registry 'solr.jvm') enabled at server: com.sun.jmx.mbeanserver.JmxMBeanServer@4d7045d2
   [junit4]   2> 325716 INFO  (SUITE-TestManagedResourceStorage-seed#[C5F5E66E6873139E]-worker) [n:127.0.0.1:8983_     ] o.a.s.m.r.SolrJmxReporter JMX monitoring for 'solr.jetty' (registry 'solr.jetty') enabled at server: com.sun.jmx.mbeanserver.JmxMBeanServer@4d7045d2
   [junit4]   2> 325718 INFO  (coreLoadExecutor-1536-thread-1-processing-n:127.0.0.1:8983_) [n:127.0.0.1:8983_     ] o.a.s.c.TransientSolrCoreCacheDefault Allocating transient cache for 2147483647 transient cores
   [junit4]   2> 326728 INFO  (coreLoadExecutor-1536-thread-1-processing-n:127.0.0.1:8983_) [n:127.0.0.1:8983_ c:collection1 s:shard1  x:collection1 ] o.a.s.c.SolrResourceLoader [null] Added 2 libs to classloader, from paths: [/export/home/jenkins/workspace/Lucene-Solr-8.x-Solaris/solr/core/src/test-files/solr/collection1/lib, /export/home/jenkins/workspace/Lucene-Solr-8.x-Solaris/solr/core/src/test-files/solr/collection1/lib/classes]
   [junit4]   2> 326748 INFO  (coreLoadExecutor-1536-thread-1-processing-n:127.0.0.1:8983_) [n:127.0.0.1:8983_ c:collection1 s:shard1  x:collection1 ] o.a.s.c.SolrConfig Using Lucene MatchVersion: 8.3.0
   [junit4]   2> 326770 INFO  (coreLoadExecutor-1536-thread-1-processing-n:127.0.0.1:8983_) [n:127.0.0.1:8983_ c:collection1 s:shard1  x:collection1 ] o.a.s.s.IndexSchema [collection1] Schema name=test
   [junit4]   2> 326861 INFO  (coreLoadExecutor-1536-thread-1-processing-n:127.0.0.1:8983_) [n:127.0.0.1:8983_ c:collection1 s:shard1  x:collection1 ] o.a.s.s.IndexSchema Loaded schema test/1.0 with uniqueid field id
   [junit4]   2> 326883 INFO  (coreLoadExecutor-1536-thread-1-processing-n:127.0.0.1:8983_) [n:127.0.0.1:8983_ c:collection1 s:shard1  x:collection1 ] o.a.s.c.CoreContainer Creating SolrCore 'collection1' using configuration from collection collection1, trusted=true
   [junit4]   2> 326883 INFO  (coreLoadExecutor-1536-thread-1-processing-n:127.0.0.1:8983_) [n:127.0.0.1:8983_ c:collection1 s:shard1  x:collection1 ] o.a.s.m.r.SolrJmxReporter JMX monitoring for 'solr.core.collection1.shard1.127.0.0.1:8983__collection1' (registry 'solr.core.collection1.shard1.127.0.0.1:8983__collection1') enabled at server: com.sun.jmx.mbeanserver.JmxMBeanServer@4d7045d2
   [junit4]   2> 326883 INFO  (coreLoadExecutor-1536-thread-1-processing-n:127.0.0.1:8983_) [n:127.0.0.1:8983_ c:collection1 s:shard1  x:collection1 ] o.a.s.c.SolrCore [[collection1] ] Opening new SolrCore at [/export/home/jenkins/workspace/Lucene-Solr-8.x-Solaris/solr/core/src/test-files/solr/collection1], dataDir=[/export/home/jenkins/workspace/Lucene-Solr-8.x-Solaris/solr/build/solr-core/test/J1/temp/solr.rest.TestManagedResourceStorage_C5F5E66E6873139E-001/data-dir-18-001/]
   [junit4]   2> 326884 INFO  (coreLoadExecutor-1536-thread-1-processing-n:127.0.0.1:8983_) [n:127.0.0.1:8983_ c:collection1 s:shard1  x:collection1 ] o.a.s.u.RandomMergePolicy RandomMergePolicy wrapping class org.apache.lucene.index.TieredMergePolicy: [TieredMergePolicy: maxMergeAtOnce=42, maxMergeAtOnceExplicit=21, maxMergedSegmentMB=85.2314453125, floorSegmentMB=0.4912109375, forceMergeDeletesPctAllowed=18.930393747906322, segmentsPerTier=25.0, maxCFSSegmentSizeMB=8.796093022207999E12, noCFSRatio=0.1645378522658555, deletesPctAllowed=28.33785662248259
   [junit4]   2> 326937 INFO  (coreLoadExecutor-1536-thread-1-processing-n:127.0.0.1:8983_) [n:127.0.0.1:8983_ c:collection1 s:shard1  x:collection1 ] o.a.s.u.UpdateHandler Using UpdateLog implementation: org.apache.solr.update.UpdateLog
   [junit4]   2> 326937 INFO  (coreLoadExecutor-1536-thread-1-processing-n:127.0.0.1:8983_) [n:127.0.0.1:8983_ c:collection1 s:shard1  x:collection1 ] o.a.s.u.UpdateLog Initializing UpdateLog: dataDir= defaultSyncLevel=FLUSH numRecordsToKeep=100 maxNumLogsToKeep=10 numVersionBuckets=65536
   [junit4]   2> 326938 INFO  (coreLoadExecutor-1536-thread-1-processing-n:127.0.0.1:8983_) [n:127.0.0.1:8983_ c:collection1 s:shard1  x:collection1 ] o.a.s.u.CommitTracker Hard AutoCommit: disabled
   [junit4]   2> 326938 INFO  (coreLoadExecutor-1536-thread-1-processing-n:127.0.0.1:8983_) [n:127.0.0.1:8983_ c:collection1 s:shard1  x:collection1 ] o.a.s.u.CommitTracker Soft AutoCommit: disabled
   [junit4]   2> 326939 INFO  (coreLoadExecutor-1536-thread-1-processing-n:127.0.0.1:8983_) [n:127.0.0.1:8983_ c:collection1 s:shard1  x:collection1 ] o.a.s.u.RandomMergePolicy RandomMergePolicy wrapping class org.apache.lucene.index.LogDocMergePolicy: [LogDocMergePolicy: minMergeSize=1000, mergeFactor=10, maxMergeSize=9223372036854775807, maxMergeSizeForForcedMerge=9223372036854775807, calibrateSizeByDeletes=false, maxMergeDocs=2147483647, maxCFSSegmentSizeMB=8.796093022207999E12, noCFSRatio=0.33556196900193536]
   [junit4]   2> 326943 INFO  (coreLoadExecutor-1536-thread-1-processing-n:127.0.0.1:8983_) [n:127.0.0.1:8983_ c:collection1 s:shard1  x:collection1 ] o.a.s.s.SolrIndexSearcher Opening [Searcher@1c032363[collection1] main]
   [junit4]   2> 326947 INFO  (coreLoadExecutor-1536-thread-1-processing-n:127.0.0.1:8983_) [n:127.0.0.1:8983_ c:collection1 s:shard1  x:collection1 ] o.a.s.h.c.SpellCheckComponent Initializing spell checkers
   [junit4]   2> 326954 INFO  (coreLoadExecutor-1536-thread-1-processing-n:127.0.0.1:8983_) [n:127.0.0.1:8983_ c:collection1 s:shard1  x:collection1 ] o.a.s.s.DirectSolrSpellChecker init: {name=direct,classname=DirectSolrSpellChecker,field=lowerfilt,minQueryLength=3}
   [junit4]   2> 327018 INFO  (coreLoadExecutor-1536-thread-1-processing-n:127.0.0.1:8983_) [n:127.0.0.1:8983_ c:collection1 s:shard1  x:collection1 ] o.a.s.h.ReplicationHandler Commits will be reserved for 10000ms.
   [junit4]   2> 327024 INFO  (coreLoadExecutor-1536-thread-1-processing-n:127.0.0.1:8983_) [n:127.0.0.1:8983_ c:collection1 s:shard1  x:collection1 ] o.a.s.u.UpdateLog Could not find max version in index or recent updates, using new clock 1642891017252241408
   [junit4]   2> 327033 INFO  (searcherExecutor-1537-thread-1-processing-n:127.0.0.1:8983_ x:collection1 c:collection1 s:shard1) [n:127.0.0.1:8983_ c:collection1 s:shard1  x:collection1 ] o.a.s.h.c.SpellCheckComponent Loading spell index for spellchecker: default
   [junit4]   2> 327034 INFO  (searcherExecutor-1537-thread-1-processing-n:127.0.0.1:8983_ x:collection1 c:collection1 s:shard1) [n:127.0.0.1:8983_ c:collection1 s:shard1  x:collection1 ] o.a.s.h.c.SpellCheckComponent Loading spell index for spellchecker: direct
   [junit4]   2> 327034 INFO  (searcherExecutor-1537-thread-1-processing-n:127.0.0.1:8983_ x:collection1 c:collection1 s:shard1) [n:127.0.0.1:8983_ c:collection1 s:shard1  x:collection1 ] o.a.s.h.c.SpellCheckComponent Loading spell index for spellchecker: wordbreak
   [junit4]   2> 327034 INFO  (searcherExecutor-1537-thread-1-processing-n:127.0.0.1:8983_ x:collection1 c:collection1 s:shard1) [n:127.0.0.1:8983_ c:collection1 s:shard1  x:collection1 ] o.a.s.h.c.SpellCheckComponent Loading spell index for spellchecker: multipleFields
   [junit4]   2> 327034 INFO  (searcherExecutor-1537-thread-1-processing-n:127.0.0.1:8983_ x:collection1 c:collection1 s:shard1) [n:127.0.0.1:8983_ c:collection1 s:shard1  x:collection1 ] o.a.s.h.c.SpellCheckComponent Loading spell index for spellchecker: jarowinkler
   [junit4]   2> 327035 INFO  (searcherExecutor-1537-thread-1-processing-n:127.0.0.1:8983_ x:collection1 c:collection1 s:shard1) [n:127.0.0.1:8983_ c:collection1 s:shard1  x:collection1 ] o.a.s.h.c.SpellCheckComponent Loading spell index for spellchecker: external
   [junit4]   2> 327035 INFO  (searcherExecutor-1537-thread-1-processing-n:127.0.0.1:8983_ x:collection1 c:collection1 s:shard1) [n:127.0.0.1:8983_ c:collection1 s:shard1  x:collection1 ] o.a.s.h.c.SpellCheckComponent Loading spell index for spellchecker: freq
   [junit4]   2> 327035 INFO  (searcherExecutor-1537-thread-1-processing-n:127.0.0.1:8983_ x:collection1 c:collection1 s:shard1) [n:127.0.0.1:8983_ c:collection1 s:shard1  x:collection1 ] o.a.s.h.c.SpellCheckComponent Loading spell index for spellchecker: fqcn
   [junit4]   2> 327036 INFO  (searcherExecutor-1537-thread-1-processing-n:127.0.0.1:8983_ x:collection1 c:collection1 s:shard1) [n:127.0.0.1:8983_ c:collection1 s:shard1  x:collection1 ] o.a.s.h.c.SpellCheckComponent Loading spell index for spellchecker: perDict
   [junit4]   2> 327038 INFO  (SUITE-TestManagedResourceStorage-seed#[C5F5E66E6873139E]-worker) [n:127.0.0.1:8983_     ] o.a.s.SolrTestCaseJ4 ####initCore end
   [junit4]   2> 327049 INFO  (TEST-TestManagedResourceStorage.testFileBasedJsonStorage-seed#[C5F5E66E6873139E]) [n:127.0.0.1:8983_     ] o.a.s.SolrTestCaseJ4 ###Starting testFileBasedJsonStorage
   [junit4]   2> 327050 INFO  (TEST-TestManagedResourceStorage.testFileBasedJsonStorage-seed#[C5F5E66E6873139E]) [n:127.0.0.1:8983_     ] o.a.s.r.ManagedResourceStorage File-based storage initialized to use dir: /export/home/jenkins/workspace/Lucene-Solr-8.x-Solaris/solr/build/solr-core/test/J1/temp/solr.rest.TestManagedResourceStorage_C5F5E66E6873139E-001/json-storage-001/managed
   [junit4]   2> 327050 INFO  (TEST-TestManagedResourceStorage.testFileBasedJsonStorage-seed#[C5F5E66E6873139E]) [n:127.0.0.1:8983_     ] o.a.s.r.ManagedResourceStorage Saved JSON object to path _test_foo.json using file:dir=/export/home/jenkins/workspace/Lucene-Solr-8.x-Solaris/solr/build/solr-core/test/J1/temp/solr.rest.TestManagedResourceStorage_C5F5E66E6873139E-001/json-storage-001/managed
   [junit4]   2> 327050 INFO  (TEST-TestManagedResourceStorage.testFileBasedJsonStorage-seed#[C5F5E66E6873139E]) [n:127.0.0.1:8983_     ] o.a.s.r.ManagedResourceStorage Loaded LinkedHashMap at path _test_foo.json using file:dir=/export/home/jenkins/workspace/Lucene-Solr-8.x-Solaris/solr/build/solr-core/test/J1/temp/solr.rest.TestManagedResourceStorage_C5F5E66E6873139E-001/json-storage-001/managed
   [junit4]   2> 327050 INFO  (TEST-TestManagedResourceStorage.testFileBasedJsonStorage-seed#[C5F5E66E6873139E]) [n:127.0.0.1:8983_     ] o.a.s.r.ManagedResourceStorage Saved JSON object to path _test_foo.json using file:dir=/export/home/jenkins/workspace/Lucene-Solr-8.x-Solaris/solr/build/solr-core/test/J1/temp/solr.rest.TestManagedResourceStorage_C5F5E66E6873139E-001/json-storage-001/managed
   [junit4]   2> 327051 INFO  (TEST-TestManagedResourceStorage.testFileBasedJsonStorage-seed#[C5F5E66E6873139E]) [n:127.0.0.1:8983_     ] o.a.s.r.ManagedResourceStorage Loaded LinkedHashMap at path _test_foo.json using file:dir=/export/home/jenkins/workspace/Lucene-Solr-8.x-Solaris/solr/build/solr-core/test/J1/temp/solr.rest.TestManagedResourceStorage_C5F5E66E6873139E-001/json-storage-001/managed
   [junit4]   2> 327051 INFO  (TEST-TestManagedResourceStorage.testFileBasedJsonStorage-seed#[C5F5E66E6873139E]) [n:127.0.0.1:8983_     ] o.a.s.SolrTestCaseJ4 ###Ending testFileBasedJsonStorage
   [junit4]   2> 327061 INFO  (TEST-TestManagedResourceStorage.testZkBasedJsonStorage-seed#[C5F5E66E6873139E]) [n:127.0.0.1:8983_     ] o.a.s.SolrTestCaseJ4 ###Starting testZkBasedJsonStorage
   [junit4]   2> 327062 INFO  (searcherExecutor-1537-thread-1-processing-n:127.0.0.1:8983_ x:collection1 c:collection1 s:shard1) [n:127.0.0.1:8983_ c:collection1 s:shard1  x:collection1 ] o.a.s.c.SolrCore [collection1] Registered new searcher Searcher@1c032363[collection1] main{ExitableDirectoryReader(UninvertingDirectoryReader())}
   [junit4]   2> 327094 INFO  (TEST-TestManagedResourceStorage.testZkBasedJsonStorage-seed#[C5F5E66E6873139E]) [n:127.0.0.1:8983_     ] o.a.s.r.ManagedResourceStorage Configured ZooKeeperStorageIO with znodeBase: /test
   [junit4]   2> 327096 INFO  (TEST-TestManagedResourceStorage.testZkBasedJsonStorage-seed#[C5F5E66E6873139E]) [n:127.0.0.1:8983_     ] o.a.s.r.ManagedResourceStorage Wrote 136 bytes to new znode /test/_test_foo.json
   [junit4]   2> 327096 INFO  (TEST-TestManagedResourceStorage.testZkBasedJsonStorage-seed#[C5F5E66E6873139E]) [n:127.0.0.1:8983_     ] o.a.s.r.ManagedResourceStorage Saved JSON object to path _test_foo.json using ZooKeeperStorageIO:path=/test
   [junit4]   2> 327097 INFO  (TEST-TestManagedResourceStorage.testZkBasedJsonStorage-seed#[C5F5E66E6873139E]) [n:127.0.0.1:8983_     ] o.a.s.r.ManagedResourceStorage Loaded LinkedHashMap at path _test_foo.json using ZooKeeperStorageIO:path=/test
   [junit4]   2> 327098 INFO  (TEST-TestManagedResourceStorage.testZkBasedJsonStorage-seed#[C5F5E66E6873139E]) [n:127.0.0.1:8983_     ] o.a.s.r.ManagedResourceStorage Wrote 175 bytes to existing znode /test/_test_foo.json
   [junit4]   2> 327098 INFO  (TEST-TestManagedResourceStorage.testZkBasedJsonStorage-seed#[C5F5E66E6873139E]) [n:127.0.0.1:8983_     ] o.a.s.r.ManagedResourceStorage Saved JSON object to path _test_foo.json using ZooKeeperStorageIO:path=/test
   [junit4]   2> 327098 INFO  (TEST-TestManagedResourceStorage.testZkBasedJsonStorage-seed#[C5F5E66E6873139E]) [n:127.0.0.1:8983_     ] o.a.s.r.ManagedResourceStorage Loaded LinkedHashMap at path _test_foo.json using ZooKeeperStorageIO:path=/test
   [junit4]   2> 327099 INFO  (TEST-TestManagedResourceStorage.testZkBasedJsonStorage-seed#[C5F5E66E6873139E]) [n:127.0.0.1:8983_     ] o.a.s.SolrTestCaseJ4 ###Ending testZkBasedJsonStorage
   [junit4]   2> 327099 INFO  (SUITE-TestManagedResourceStorage-seed#[C5F5E66E6873139E]-worker) [n:127.0.0.1:8983_     ] o.a.s.SolrTestCaseJ4 ###deleteCore
   [junit4]   2> 327099 INFO  (SUITE-TestManagedResourceStorage-seed#[C5F5E66E6873139E]-worker) [n:127.0.0.1:8983_     ] o.a.s.c.CoreContainer Shutting down CoreContainer instance=544336524
   [junit4]   2> 327099 INFO  (SUITE-TestManagedResourceStorage-seed#[C5F5E66E6873139E]-worker) [n:127.0.0.1:8983_     ] o.a.s.c.ZkController Remove node as live in ZooKeeper:/live_nodes/127.0.0.1:8983_
   [junit4]   2> 327100 INFO  (SUITE-TestManagedResourceStorage-seed#[C5F5E66E6873139E]-worker) [n:127.0.0.1:8983_     ] o.a.s.c.ZkController Publish this node as DOWN...
   [junit4]   2> 327100 INFO  (SUITE-TestManagedResourceStorage-seed#[C5F5E66E6873139E]-worker) [n:127.0.0.1:8983_     ] o.a.s.c.ZkController Publish node=127.0.0.1:8983_ as DOWN
   [junit4]   2> 327102 INFO  (coreCloseExecutor-1542-thread-1-processing-n:127.0.0.1:8983_) [n:127.0.0.1:8983_ c:collection1 s:shard1 r:127.0.0.1:8983__collection1 x:collection1 ] o.a.s.c.SolrCore [collection1]  CLOSING SolrCore org.apache.solr.core.SolrCore@30c0721
   [junit4]   2> 327102 INFO  (coreCloseExecutor-1542-thread-1-processing-n:127.0.0.1:8983_) [n:127.0.0.1:8983_ c:collection1 s:shard1 r:127.0.0.1:8983__collection1 x:collection1 ] o.a.s.m.SolrMetricManager Closing metric reporters for registry=solr.core.collection1.shard1.127.0.0.1:8983__collection1, tag=SolrCore@30c0721
   [junit4]   2> 327102 INFO  (coreCloseExecutor-1542-thread-1-processing-n:127.0.0.1:8983_) [n:127.0.0.1:8983_ c:collection1 s:shard1 r:127.0.0.1:8983__collection1 x:collection1 ] o.a.s.m.r.SolrJmxReporter Closing reporter [org.apache.solr.metrics.reporters.SolrJmxReporter@4d833e14: rootName = null, domain = solr.core.collection1.shard1.127.0.0.1:8983__collection1, service url = null, agent id = null] for registry solr.core.collection1.shard1.127.0.0.1:8983__collection1 / com.codahale.metrics.MetricRegistry@23da488f
   [junit4]   2> 327109 INFO  (coreCloseExecutor-1542-thread-1-processing-n:127.0.0.1:8983_) [n:127.0.0.1:8983_ c:collection1 s:shard1 r:127.0.0.1:8983__collection1 x:collection1 ] o.a.s.m.SolrMetricManager Closing metric reporters for registry=solr.collection.collection1.shard1.leader, tag=SolrCore@30c0721
   [junit4]   2> 327117 INFO  (SUITE-TestManagedResourceStorage-seed#[C5F5E66E6873139E]-worker) [n:127.0.0.1:8983_     ] o.a.s.m.SolrMetricManager Closing metric reporters for registry=solr.node, tag=null
   [junit4]   2> 327117 INFO  (SUITE-TestManagedResourceStorage-seed#[C5F5E66E6873139E]-worker) [n:127.0.0.1:8983_     ] o.a.s.m.r.SolrJmxReporter Closing reporter [org.apache.solr.metrics.reporters.SolrJmxReporter@719d83d2: rootName = null, domain = solr.node, service url = null, agent id = null] for registry solr.node / com.codahale.metrics.MetricRegistry@2b27746
   [junit4]   2> 327120 INFO  (SUITE-TestManagedResourceStorage-seed#[C5F5E66E6873139E]-worker) [n:127.0.0.1:8983_     ] o.a.s.m.SolrMetricManager Closing metric reporters for registry=solr.jvm, tag=null
   [junit4]   2> 327120 INFO  (SUITE-TestManagedResourceStorage-seed#[C5F5E66E6873139E]-worker) [n:127.0.0.1:8983_     ] o.a.s.m.r.SolrJmxReporter Closing reporter [org.apache.solr.metrics.reporters.SolrJmxReporter@3b80a980: rootName = null, domain = solr.jvm, service url = null, agent id = null] for registry solr.jvm / com.codahale.metrics.MetricRegistry@2f957fcc
   [junit4]   2> 327121 INFO  (SUITE-TestManagedResourceStorage-seed#[C5F5E66E6873139E]-worker) [n:127.0.0.1:8983_     ] o.a.s.m.SolrMetricManager Closing metric reporters for registry=solr.jetty, tag=null
   [junit4]   2> 327121 INFO  (SUITE-TestManagedResourceStorage-seed#[C5F5E66E6873139E]-worker) [n:127.0.0.1:8983_     ] o.a.s.m.r.SolrJmxReporter Closing reporter [org.apache.solr.metrics.reporters.SolrJmxReporter@3da9c545: rootName = null, domain = solr.jetty, service url = null, agent id = null] for registry solr.jetty / com.codahale.metrics.MetricRegistry@552b7e0f
   [junit4]   2> 327121 INFO  (SUITE-TestManagedResourceStorage-seed#[C5F5E66E6873139E]-worker) [n:127.0.0.1:8983_     ] o.a.s.m.SolrMetricManager Closing metric reporters for registry=solr.cluster, tag=null
   [junit4]   2> 327122 INFO  (closeThreadPool-1805-thread-2-processing-n:127.0.0.1:8983_) [n:127.0.0.1:8983_     ] o.a.s.c.Overseer Overseer (id=72183343474999299-127.0.0.1:8983_-n_0000000000) closing
   [junit4]   2> 327123 INFO  (OverseerStateUpdate-72183343474999299-127.0.0.1:8983_-n_0000000000) [n:127.0.0.1:8983_     ] o.a.s.c.Overseer Overseer Loop exiting : 127.0.0.1:8983_
   [junit4]   2> 327123 INFO  (OverseerAutoScalingTriggerThread-72183343474999299-127.0.0.1:8983_-n_0000000000) [     ] o.a.s.c.a.OverseerTriggerThread OverseerTriggerThread woken up but we are closed, exiting.
   [junit4]   2> 327137 INFO  (closeThreadPool-1805-thread-1-processing-n:127.0.0.1:8983_) [n:127.0.0.1:8983_     ] o.a.s.c.Overseer Overseer (id=72183343474999299-127.0.0.1:8983_-n_0000000000) closing
   [junit4]   2> 327239 ERROR (coreZkRegister-1524-thread-1-processing-n:127.0.0.1:8983_ x:collection1 c:collection1 s:shard1) [n:127.0.0.1:8983_ c:collection1 s:shard1 r:127.0.0.1:8983__collection1 x:collection1 ] o.a.s.c.ZkContainer :org.apache.solr.common.SolrException: Error while saving shard term for collection: collection1
   [junit4]   2> at org.apache.solr.cloud.ZkShardTerms.saveTerms(ZkShardTerms.java:307)
   [junit4]   2> at org.apache.solr.cloud.ZkShardTerms.forceSaveTerms(ZkShardTerms.java:281)
   [junit4]   2> at org.apache.solr.cloud.ZkShardTerms.registerTerm(ZkShardTerms.java:198)
   [junit4]   2> at org.apache.solr.cloud.ZkController.register(ZkController.java:1209)
   [junit4]   2> at org.apache.solr.cloud.ZkController.register(ZkController.java:1171)
   [junit4]   2> at org.apache.solr.core.ZkContainer.lambda$registerInZk$0(ZkContainer.java:191)
   [junit4]   2> at org.apache.solr.common.util.ExecutorUtil$MDCAwareThreadPoolExecutor.lambda$execute$0(ExecutorUtil.java:210)
   [junit4]   2> at java.util.concurrent.ThreadPoolExecutor.runWorker(ThreadPoolExecutor.java:1149)
   [junit4]   2> at java.util.concurrent.ThreadPoolExecutor$Worker.run(ThreadPoolExecutor.java:624)
   [junit4]   2> at java.lang.Thread.run(Thread.java:748)
   [junit4]   2> Caused by: org.apache.zookeeper.KeeperException$SessionExpiredException: KeeperErrorCode = Session expired for /collections/collection1/terms/shard1
   [junit4]   2> at org.apache.zookeeper.KeeperException.create(KeeperException.java:134)
   [junit4]   2> at org.apache.zookeeper.KeeperException.create(KeeperException.java:54)
   [junit4]   2> at org.apache.zookeeper.ZooKeeper.setData(ZooKeeper.java:2384)
   [junit4]   2> at org.apache.solr.common.cloud.SolrZkClient.lambda$setData$6(SolrZkClient.java:349)
   [junit4]   2> at org.apache.solr.common.cloud.ZkCmdExecutor.retryOperation(ZkCmdExecutor.java:71)
   [junit4]   2> at org.apache.solr.common.cloud.SolrZkClient.setData(SolrZkClient.java:349)
   [junit4]   2> at org.apache.solr.cloud.ZkShardTerms.saveTerms(ZkShardTerms.java:297)
   [junit4]   2> ... 9 more
   [junit4]   2>
   [junit4]   2> 327239 INFO  (SUITE-TestManagedResourceStorage-seed#[C5F5E66E6873139E]-worker) [n:127.0.0.1:8983_     ] o.a.s.c.Overseer Overseer (id=72183343474999299-127.0.0.1:8983_-n_0000000000) closing
   [junit4]   2> 327348 INFO  (SUITE-TestManagedResourceStorage-seed#[C5F5E66E6873139E]-worker) [n:127.0.0.1:8983_     ] o.a.s.c.ZkTestServer Shutting down ZkTestServer.
   [junit4]   2> 327553 WARN  (ZkTestServer Run Thread) [     ] o.a.s.c.ZkTestServer Watch limit violations:
   [junit4]   2> Maximum concurrent create/delete watches above limit:
   [junit4]   2>
   [junit4]   2> 2 /solr/aliases.json
   [junit4]   2>
   [junit4]   2> Maximum concurrent data watches above limit:
   [junit4]   2>
   [junit4]   2> 4 /solr/clusterstate.json
   [junit4]   2> 2 /solr/clusterprops.json
   [junit4]   2>
   [junit4]   2> Maximum concurrent children watches above limit:
   [junit4]   2>
   [junit4]   2> 4 /solr/overseer/queue
   [junit4]   2> 4 /solr/live_nodes
   [junit4]   2> 2 /solr/collections
   [junit4]   2>
   [junit4]   2> 327557 INFO  (SUITE-TestManagedResourceStorage-seed#[C5F5E66E6873139E]-worker) [n:127.0.0.1:8983_     ] o.a.s.c.ZkTestServer waitForServerDown: 127.0.0.1:35446
   [junit4]   2> 327557 INFO  (SUITE-TestManagedResourceStorage-seed#[C5F5E66E6873139E]-worker) [n:127.0.0.1:8983_     ] o.a.s.c.ZkTestServer parse host and port list: 127.0.0.1:35446
   [junit4]   2> 327557 INFO  (SUITE-TestManagedResourceStorage-seed#[C5F5E66E6873139E]-worker) [n:127.0.0.1:8983_     ] o.a.s.c.ZkTestServer connecting to 127.0.0.1 35446
   [junit4]   2> 327558 INFO  (SUITE-TestManagedResourceStorage-seed#[C5F5E66E6873139E]-worker) [n:127.0.0.1:8983_     ] o.a.s.SolrTestCaseJ4 Waiting for all tracked resources to be released
   [junit4]   2> 337567 INFO  (SUITE-TestManagedResourceStorage-seed#[C5F5E66E6873139E]-worker) [n:127.0.0.1:8983_     ] o.a.s.SolrTestCaseJ4 Waiting for all tracked resources to be released
   [junit4]   2> 347584 INFO  (SUITE-TestManagedResourceStorage-seed#[C5F5E66E6873139E]-worker) [n:127.0.0.1:8983_     ] o.a.s.SolrTestCaseJ4 Waiting for all tracked resources to be released
   [junit4]   2> SUITE-TestManagedResourceStorage-seed#[C5F5E66E6873139E]:
   [junit4]   2>     java.lang.Thread.sleep(Native Method)
   [junit4]   2>     [...com.carrotsearch.randomizedtesting.*]
   [junit4]   2>
   [junit4]   2> Log4j2-TF-1-AsyncLoggerConfig-1:
   [junit4]   2>     [...sun.*]
   [junit4]   2>     java.util.concurrent.locks.LockSupport.parkNanos(LockSupport.java:215)
   [junit4]   2>     java.util.concurrent.locks.AbstractQueuedSynchronizer$ConditionObject.awaitNanos(AbstractQueuedSynchronizer.java:2078)
   [junit4]   2>     com.lmax.disruptor.TimeoutBlockingWaitStrategy.waitFor(TimeoutBlockingWaitStrategy.java:38)
   [junit4]   2>     com.lmax.disruptor.ProcessingSequenceBarrier.waitFor(ProcessingSequenceBarrier.java:56)
   [junit4]   2>     com.lmax.disruptor.BatchEventProcessor.processEvents(BatchEventProcessor.java:159)
   [junit4]   2>     com.lmax.disruptor.BatchEventProcessor.run(BatchEventProcessor.java:125)
   [junit4]   2>     java.lang.Thread.run(Thread.java:748)
   [junit4]   2>
   [junit4]   2> Reference Handler:
   [junit4]   2>     java.lang.Object.wait(Native Method)
   [junit4]   2>     java.lang.Object.wait(Object.java:502)
   [junit4]   2>     java.lang.ref.Reference.tryHandlePending(Reference.java:191)
   [junit4]   2>     java.lang.ref.Reference$ReferenceHandler.run(Reference.java:153)
   [junit4]   2>
   [junit4]   2> JUnit4-serializer-daemon:
   [junit4]   2>     java.lang.Thread.sleep(Native Method)
   [junit4]   2>     com.carrotsearch.ant.tasks.junit4.events.Serializer$1.run(Serializer.java:50)
   [junit4]   2>
   [junit4]   2> SUITE-TestManagedResourceStorage-seed#[C5F5E66E6873139E]-worker:
   [junit4]   2>     java.lang.Thread.dumpThreads(Native Method)
   [junit4]   2>     java.lang.Thread.getAllStackTraces(Thread.java:1610)
   [junit4]   2>     org.apache.solr.SolrTestCaseJ4.clearObjectTrackerAndCheckEmpty(SolrTestCaseJ4.java:413)
   [junit4]   2>     org.apache.solr.SolrTestCaseJ4.teardownTestCases(SolrTestCaseJ4.java:339)
   [junit4]   2>     [...sun.*, java.lang.reflect.*, com.carrotsearch.randomizedtesting.*]
   [junit4]   2>     org.apache.lucene.util.AbstractBeforeAfterRule$1.evaluate(AbstractBeforeAfterRule.java:45)
   [junit4]   2>     [...com.carrotsearch.randomizedtesting.*]
   [junit4]   2>     org.apache.lucene.util.TestRuleStoreClassName$1.evaluate(TestRuleStoreClassName.java:41)
   [junit4]   2>     [...com.carrotsearch.randomizedtesting.*]
   [junit4]   2>     org.apache.lucene.util.TestRuleAssertionsRequired$1.evaluate(TestRuleAssertionsRequired.java:53)
   [junit4]   2>     org.apache.lucene.util.TestRuleMarkFailure$1.evaluate(TestRuleMarkFailure.java:47)
   [junit4]   2>     org.apache.lucene.util.TestRuleIgnoreAfterMaxFailures$1.evaluate(TestRuleIgnoreAfterMaxFailures.java:64)
   [junit4]   2>     org.apache.lucene.util.TestRuleIgnoreTestSuites$1.evaluate(TestRuleIgnoreTestSuites.java:54)
   [junit4]   2>     [...com.carrotsearch.randomizedtesting.*]
   [junit4]   2>     java.lang.Thread.run(Thread.java:748)
   [junit4]   2>
   [junit4]   2> Signal Dispatcher:
   [junit4]   2>
   [junit4]   2> main:
   [junit4]   2>     java.lang.Object.wait(Native Method)
   [junit4]   2>     java.lang.Thread.join(Thread.java:1252)
   [junit4]   2>     java.lang.Thread.join(Thread.java:1326)
   [junit4]   2>     [...com.carrotsearch.randomizedtesting.*]
   [junit4]   2>     com.carrotsearch.ant.tasks.junit4.slave.SlaveMain.execute(SlaveMain.java:269)
   [junit4]   2>     com.carrotsearch.ant.tasks.junit4.slave.SlaveMain.main(SlaveMain.java:394)
   [junit4]   2>     com.carrotsearch.ant.tasks.junit4.slave.SlaveMainSafe.main(SlaveMainSafe.java:13)
   [junit4]   2>
   [junit4]   2> Java2D Disposer:
   [junit4]   2>     java.lang.Object.wait(Native Method)
   [junit4]   2>     java.lang.ref.ReferenceQueue.remove(ReferenceQueue.java:144)
   [junit4]   2>     java.lang.ref.ReferenceQueue.remove(ReferenceQueue.java:165)
   [junit4]   2>     [...sun.*]
   [junit4]   2>     java.lang.Thread.run(Thread.java:748)
   [junit4]   2>
   [junit4]   2> Finalizer:
   [junit4]   2>     java.lang.Object.wait(Native Method)
   [junit4]   2>     java.lang.ref.ReferenceQueue.remove(ReferenceQueue.java:144)
   [junit4]   2>     java.lang.ref.ReferenceQueue.remove(ReferenceQueue.java:165)
   [junit4]   2>     java.lang.ref.Finalizer$FinalizerThread.run(Finalizer.java:216)
   [junit4]   2>
   [junit4]   2> 357596 INFO  (SUITE-TestManagedResourceStorage-seed#[C5F5E66E6873139E]-worker) [n:127.0.0.1:8983_     ] o.a.s.SolrTestCaseJ4 Waiting for all tracked resources to be released
   [junit4]   2> SUITE-TestManagedResourceStorage-seed#[C5F5E66E6873139E]:
   [junit4]   2>     java.lang.Thread.sleep(Native Method)
   [junit4]   2>     [...com.carrotsearch.randomizedtesting.*]
   [junit4]   2>
   [junit4]   2> Log4j2-TF-1-AsyncLoggerConfig-1:
   [junit4]   2>     java.lang.Thread.holdsLock(Native Method)
   [junit4]   2>     com.carrotsearch.ant.tasks.junit4.events.Serializer.flushQueue(Serializer.java:106)
   [junit4]   2>     com.carrotsearch.ant.tasks.junit4.events.Serializer.serialize(Serializer.java:98)
   [junit4]   2>     com.carrotsearch.ant.tasks.junit4.slave.SlaveMain$3$2.write(SlaveMain.java:498)
   [junit4]   2>     java.io.BufferedOutputStream.flushBuffer(BufferedOutputStream.java:82)
   [junit4]   2>     java.io.BufferedOutputStream.flush(BufferedOutputStream.java:140)
   [junit4]   2>     java.io.PrintStream.flush(PrintStream.java:338)
   [junit4]   2>     org.apache.lucene.util.TestRuleLimitSysouts$DelegateStream.flush(TestRuleLimitSysouts.java:189)
   [junit4]   2>     java.io.PrintStream.write(PrintStream.java:482)
   [junit4]   2>     org.apache.logging.log4j.core.util.CloseShieldOutputStream.write(CloseShieldOutputStream.java:53)
   [junit4]   2>     org.apache.logging.log4j.core.appender.OutputStreamManager.writeToDestination(OutputStreamManager.java:261)
   [junit4]   2>     org.apache.logging.log4j.core.appender.OutputStreamManager.flushBuffer(OutputStreamManager.java:293)
   [junit4]   2>     org.apache.logging.log4j.core.appender.OutputStreamManager.flush(OutputStreamManager.java:302)
   [junit4]   2>     org.apache.logging.log4j.core.appender.AbstractOutputStreamAppender.directEncodeEvent(AbstractOutputStreamAppender.java:199)
   [junit4]   2>     org.apache.logging.log4j.core.appender.AbstractOutputStreamAppender.tryAppend(AbstractOutputStreamAppender.java:190)
   [junit4]   2>     org.apache.logging.log4j.core.appender.AbstractOutputStreamAppender.append(AbstractOutputStreamAppender.java:181)
   [junit4]   2>     org.apache.logging.log4j.core.config.AppenderControl.tryCallAppender(AppenderControl.java:156)
   [junit4]   2>     org.apache.logging.log4j.core.config.AppenderControl.callAppender0(AppenderControl.java:129)
   [junit4]   2>     org.apache.logging.log4j.core.config.AppenderControl.callAppenderPreventRecursion(AppenderControl.java:120)
   [junit4]   2>     org.apache.logging.log4j.core.config.AppenderControl.callAppender(AppenderControl.java:84)
   [junit4]   2>     org.apache.logging.log4j.core.config.LoggerConfig.callAppenders(LoggerConfig.java:464)
   [junit4]   2>     org.apache.logging.log4j.core.async.AsyncLoggerConfig.callAppenders(AsyncLoggerConfig.java:127)
   [junit4]   2>     org.apache.logging.log4j.core.config.LoggerConfig.processLogEvent(LoggerConfig.java:448)
   [junit4]   2>     org.apache.logging.log4j.core.config.LoggerConfig.log(LoggerConfig.java:431)
   [junit4]   2>     org.apache.logging.log4j.core.async.AsyncLoggerConfig.log(AsyncLoggerConfig.java:121)
   [junit4]   2>     org.apache.logging.log4j.core.async.AsyncLoggerConfig.logToAsyncLoggerConfigsOnCurrentThread(AsyncLoggerConfig.java:169)
   [junit4]   2>     org.apache.logging.log4j.core.async.AsyncLoggerConfigDisruptor$Log4jEventWrapperHandler.onEvent(AsyncLoggerConfigDisruptor.java:111)
   [junit4]   2>     org.apache.logging.log4j.core.async.AsyncLoggerConfigDisruptor$Log4jEventWrapperHandler.onEvent(AsyncLoggerConfigDisruptor.java:97)
   [junit4]   2>     com.lmax.disruptor.BatchEventProcessor.processEvents(BatchEventProcessor.java:168)
   [junit4]   2>     com.lmax.disruptor.BatchEventProcessor.run(BatchEventProcessor.java:125)
   [junit4]   2>     java.lang.Thread.run(Thread.java:748)
   [junit4]   2>
   [junit4]   2> Reference Handler:
   [junit4]   2>     java.lang.Object.wait(Native Method)
   [junit4]   2>     java.lang.Object.wait(Object.java:502)
   [junit4]   2>     java.lang.ref.Reference.tryHandlePending(Reference.java:191)
   [junit4]   2>     java.lang.ref.Reference$ReferenceHandler.run(Reference.java:153)
   [junit4]   2>
   [junit4]   2> JUnit4-serializer-daemon:
   [junit4]   2>     java.lang.Thread.sleep(Native Method)
   [junit4]   2>     com.carrotsearch.ant.tasks.junit4.events.Serializer$1.run(Serializer.java:50)
   [junit4]   2>
   [junit4]   2> SUITE-TestManagedResourceStorage-seed#[C5F5E66E6873139E]-worker:
   [junit4]   2>     java.lang.Thread.dumpThreads(Native Method)
   [junit4]   2>     java.lang.Thread.getAllStackTraces(Thread.java:1610)
   [junit4]   2>     org.apache.solr.SolrTestCaseJ4.clearObjectTrackerAndCheckEmpty(SolrTestCaseJ4.java:413)
   [junit4]   2>     org.apache.solr.SolrTestCaseJ4.teardownTestCases(SolrTestCaseJ4.java:339)
   [junit4]   2>     [...sun.*, java.lang.reflect.*, com.carrotsearch.randomizedtesting.*]
   [junit4]   2>     org.apache.lucene.util.AbstractBeforeAfterRule$1.evaluate(AbstractBeforeAfterRule.java:45)
   [junit4]   2>     [...com.carrotsearch.randomizedtesting.*]
   [junit4]   2>     org.apache.lucene.util.TestRuleStoreClassName$1.evaluate(TestRuleStoreClassName.java:41)
   [junit4]   2>     [...com.carrotsearch.randomizedtesting.*]
   [junit4]   2>     org.apache.lucene.util.TestRuleAssertionsRequired$1.evaluate(TestRuleAssertionsRequired.java:53)
   [junit4]   2>     org.apache.lucene.util.TestRuleMarkFailure$1.evaluate(TestRuleMarkFailure.java:47)
   [junit4]   2>     org.apache.lucene.util.TestRuleIgnoreAfterMaxFailures$1.evaluate(TestRuleIgnoreAfterMaxFailures.java:64)
   [junit4]   2>     org.apache.lucene.util.TestRuleIgnoreTestSuites$1.evaluate(TestRuleIgnoreTestSuites.java:54)
   [junit4]   2>     [...com.carrotsearch.randomizedtesting.*]
   [junit4]   2>     java.lang.Thread.run(Thread.java:748)
   [junit4]   2>
   [junit4]   2> Signal Dispatcher:
   [junit4]   2>
   [junit4]   2> main:
   [junit4]   2>     java.lang.Object.wait(Native Method)
   [junit4]   2>     java.lang.Thread.join(Thread.java:1252)
   [junit4]   2>     java.lang.Thread.join(Thread.java:1326)
   [junit4]   2>     [...com.carrotsearch.randomizedtesting.*]
   [junit4]   2>     com.carrotsearch.ant.tasks.junit4.slave.SlaveMain.execute(SlaveMain.java:269)
   [junit4]   2>     com.carrotsearch.ant.tasks.junit4.slave.SlaveMain.main(SlaveMain.java:394)
   [junit4]   2>     com.carrotsearch.ant.tasks.junit4.slave.SlaveMainSafe.main(SlaveMainSafe.java:13)
   [junit4]   2>
   [junit4]   2> Java2D Disposer:
   [junit4]   2>     java.lang.Object.wait(Native Method)
   [junit4]   2>     java.lang.ref.ReferenceQueue.remove(ReferenceQueue.java:144)
   [junit4]   2>     java.lang.ref.ReferenceQueue.remove(ReferenceQueue.java:165)
   [junit4]   2>     [...sun.*]
   [junit4]   2>     java.lang.Thread.run(Thread.java:748)
   [junit4]   2>
   [junit4]   2> Finalizer:
   [junit4]   2>     java.lang.Object.wait(Native Method)
   [junit4]   2>     java.lang.ref.ReferenceQueue.remove(ReferenceQueue.java:144)
   [junit4]   2>     java.lang.ref.ReferenceQueue.remove(ReferenceQueue.java:165)
   [junit4]   2>     java.lang.ref.Finalizer$FinalizerThread.run(Finalizer.java:216)
   [junit4]   2>
   [junit4]   2> 367606 INFO  (SUITE-TestManagedResourceStorage-seed#[C5F5E66E6873139E]-worker) [n:127.0.0.1:8983_     ] o.a.s.SolrTestCaseJ4 Waiting for all tracked resources to be released
   [junit4]   2> SUITE-TestManagedResourceStorage-seed#[C5F5E66E6873139E]:
   [junit4]   2>     java.lang.Thread.sleep(Native Method)
   [junit4]   2>     [...com.carrotsearch.randomizedtesting.*]
   [junit4]   2>
   [junit4]   2> Log4j2-TF-1-AsyncLoggerConfig-1:
   [junit4]   2>     [...sun.*]
   [junit4]   2>     java.util.concurrent.locks.LockSupport.parkNanos(LockSupport.java:215)
   [junit4]   2>     java.util.concurrent.locks.AbstractQueuedSynchronizer$ConditionObject.awaitNanos(AbstractQueuedSynchronizer.java:2078)
   [junit4]   2>     com.lmax.disruptor.TimeoutBlockingWaitStrategy.waitFor(TimeoutBlockingWaitStrategy.java:38)
   [junit4]   2>     com.lmax.disruptor.ProcessingSequenceBarrier.waitFor(ProcessingSequenceBarrier.java:56)
   [junit4]   2>     com.lmax.disruptor.BatchEventProcessor.processEvents(BatchEventProcessor.java:159)
   [junit4]   2>     com.lmax.disruptor.BatchEventProcessor.run(BatchEventProcessor.java:125)
   [junit4]   2>     java.lang.Thread.run(Thread.java:748)
   [junit4]   2>
   [junit4]   2> Reference Handler:
   [junit4]   2>     java.lang.Object.wait(Native Method)
   [junit4]   2>     java.lang.Object.wait(Object.java:502)
   [junit4]   2>     java.lang.ref.Reference.tryHandlePending(Reference.java:191)
   [junit4]   2>     java.lang.ref.Reference$ReferenceHandler.run(Reference.java:153)
   [junit4]   2>
   [junit4]   2> JUnit4-serializer-daemon:
   [junit4]   2>     java.lang.Thread.sleep(Native Method)
   [junit4]   2>     com.carrotsearch.ant.tasks.junit4.events.Serializer$1.run(Serializer.java:50)
   [junit4]   2>
   [junit4]   2> SUITE-TestManagedResourceStorage-seed#[C5F5E66E6873139E]-worker:
   [junit4]   2>     java.lang.Thread.dumpThreads(Native Method)
   [junit4]   2>     java.lang.Thread.getAllStackTraces(Thread.java:1610)
   [junit4]   2>     org.apache.solr.SolrTestCaseJ4.clearObjectTrackerAndCheckEmpty(SolrTestCaseJ4.java:413)
   [junit4]   2>     org.apache.solr.SolrTestCaseJ4.teardownTestCases(SolrTestCaseJ4.java:339)
   [junit4]   2>     [...sun.*, java.lang.reflect.*, com.carrotsearch.randomizedtesting.*]
   [junit4]   2>     org.apache.lucene.util.AbstractBeforeAfterRule$1.evaluate(AbstractBeforeAfterRule.java:45)
   [junit4]   2>     [...com.carrotsearch.randomizedtesting.*]
   [junit4]   2>     org.apache.lucene.util.TestRuleStoreClassName$1.evaluate(TestRuleStoreClassName.java:41)
   [junit4]   2>     [...com.carrotsearch.randomizedtesting.*]
   [junit4]   2>     org.apache.lucene.util.TestRuleAssertionsRequired$1.evaluate(TestRuleAssertionsRequired.java:53)
   [junit4]   2>     org.apache.lucene.util.TestRuleMarkFailure$1.evaluate(TestRuleMarkFailure.java:47)
   [junit4]   2>     org.apache.lucene.util.TestRuleIgnoreAfterMaxFailures$1.evaluate(TestRuleIgnoreAfterMaxFailures.java:64)
   [junit4]   2>     org.apache.lucene.util.TestRuleIgnoreTestSuites$1.evaluate(TestRuleIgnoreTestSuites.java:54)
   [junit4]   2>     [...com.carrotsearch.randomizedtesting.*]
   [junit4]   2>     java.lang.Thread.run(Thread.java:748)
   [junit4]   2>
   [junit4]   2> Signal Dispatcher:
   [junit4]   2>
   [junit4]   2> main:
   [junit4]   2>     java.lang.Object.wait(Native Method)
   [junit4]   2>     java.lang.Thread.join(Thread.java:1252)
   [junit4]   2>     java.lang.Thread.join(Thread.java:1326)
   [junit4]   2>     [...com.carrotsearch.randomizedtesting.*]
   [junit4]   2>     com.carrotsearch.ant.tasks.junit4.slave.SlaveMain.execute(SlaveMain.java:269)
   [junit4]   2>     com.carrotsearch.ant.tasks.junit4.slave.SlaveMain.main(SlaveMain.java:394)
   [junit4]   2>     com.carrotsearch.ant.tasks.junit4.slave.SlaveMainSafe.main(SlaveMainSafe.java:13)
   [junit4]   2>
   [junit4]   2> Java2D Disposer:
   [junit4]   2>     java.lang.Object.wait(Native Method)
   [junit4]   2>     java.lang.ref.ReferenceQueue.remove(ReferenceQueue.java:144)
   [junit4]   2>     java.lang.ref.ReferenceQueue.remove(ReferenceQueue.java:165)
   [junit4]   2>     [...sun.*]
   [junit4]   2>     java.lang.Thread.run(Thread.java:748)
   [junit4]   2>
   [junit4]   2> Finalizer:
   [junit4]   2>     java.lang.Object.wait(Native Method)
   [junit4]   2>     java.lang.ref.ReferenceQueue.remove(ReferenceQueue.java:144)
   [junit4]   2>     java.lang.ref.ReferenceQueue.remove(ReferenceQueue.java:165)
   [junit4]   2>     java.lang.ref.Finalizer$FinalizerThread.run(Finalizer.java:216)
   [junit4]   2>
   [junit4]   2> 377614 INFO  (SUITE-TestManagedResourceStorage-seed#[C5F5E66E6873139E]-worker) [n:127.0.0.1:8983_     ] o.a.s.SolrTestCaseJ4 Waiting for all tracked resources to be released
   [junit4]   2> SUITE-TestManagedResourceStorage-seed#[C5F5E66E6873139E]:
   [junit4]   2>     java.lang.Thread.sleep(Native Method)
   [junit4]   2>     [...com.carrotsearch.randomizedtesting.*]
   [junit4]   2>
   [junit4]   2> Log4j2-TF-1-AsyncLoggerConfig-1:
   [junit4]   2>     java.lang.Thread.holdsLock(Native Method)
   [junit4]   2>     com.carrotsearch.ant.tasks.junit4.events.Serializer.flushQueue(Serializer.java:106)
   [junit4]   2>     com.carrotsearch.ant.tasks.junit4.events.Serializer.serialize(Serializer.java:98)
   [junit4]   2>     com.carrotsearch.ant.tasks.junit4.slave.SlaveMain$3$2.write(SlaveMain.java:498)
   [junit4]   2>     java.io.BufferedOutputStream.flushBuffer(BufferedOutputStream.java:82)
   [junit4]   2>     java.io.BufferedOutputStream.flush(BufferedOutputStream.java:140)
   [junit4]   2>     java.io.PrintStream.flush(PrintStream.java:338)
   [junit4]   2>     org.apache.lucene.util.TestRuleLimitSysouts$DelegateStream.flush(TestRuleLimitSysouts.java:189)
   [junit4]   2>     java.io.PrintStream.write(PrintStream.java:482)
   [junit4]   2>     org.apache.logging.log4j.core.util.CloseShieldOutputStream.write(CloseShieldOutputStream.java:53)
   [junit4]   2>     org.apache.logging.log4j.core.appender.OutputStreamManager.writeToDestination(OutputStreamManager.java:261)
   [junit4]   2>     org.apache.logging.log4j.core.appender.OutputStreamManager.flushBuffer(OutputStreamManager.java:293)
   [junit4]   2>     org.apache.logging.log4j.core.appender.OutputStreamManager.flush(OutputStreamManager.java:302)
   [junit4]   2>     org.apache.logging.log4j.core.appender.AbstractOutputStreamAppender.directEncodeEvent(AbstractOutputStreamAppender.java:199)
   [junit4]   2>     org.apache.logging.log4j.core.appender.AbstractOutputStreamAppender.tryAppend(AbstractOutputStreamAppender.java:190)
   [junit4]   2>     org.apache.logging.log4j.core.appender.AbstractOutputStreamAppender.append(AbstractOutputStreamAppender.java:181)
   [junit4]   2>     org.apache.logging.log4j.core.config.AppenderControl.tryCallAppender(AppenderControl.java:156)
   [junit4]   2>     org.apache.logging.log4j.core.config.AppenderControl.callAppender0(AppenderControl.java:129)
   [junit4]   2>     org.apache.logging.log4j.core.config.AppenderControl.callAppenderPreventRecursion(AppenderControl.java:120)
   [junit4]   2>     org.apache.logging.log4j.core.config.AppenderControl.callAppender(AppenderControl.java:84)
   [junit4]   2>     org.apache.logging.log4j.core.config.LoggerConfig.callAppenders(LoggerConfig.java:464)
   [junit4]   2>     org.apache.logging.log4j.core.async.AsyncLoggerConfig.callAppenders(AsyncLoggerConfig.java:127)
   [junit4]   2>     org.apache.logging.log4j.core.config.LoggerConfig.processLogEvent(LoggerConfig.java:448)
   [junit4]   2>     org.apache.logging.log4j.core.config.LoggerConfig.log(LoggerConfig.java:431)
   [junit4]   2>     org.apache.logging.log4j.core.async.AsyncLoggerConfig.log(AsyncLoggerConfig.java:121)
   [junit4]   2>     org.apache.logging.log4j.core.async.AsyncLoggerConfig.logToAsyncLoggerConfigsOnCurrentThread(AsyncLoggerConfig.java:169)
   [junit4]   2>     org.apache.logging.log4j.core.async.AsyncLoggerConfigDisruptor$Log4jEventWrapperHandler.onEvent(AsyncLoggerConfigDisruptor.java:111)
   [junit4]   2>     org.apache.logging.log4j.core.async.AsyncLoggerConfigDisruptor$Log4jEventWrapperHandler.onEvent(AsyncLoggerConfigDisruptor.java:97)
   [junit4]   2>     com.lmax.disruptor.BatchEventProcessor.processEvents(BatchEventProcessor.java:168)
   [junit4]   2>     com.lmax.disruptor.BatchEventProcessor.run(BatchEventProcessor.java:125)
   [junit4]   2>     java.lang.Thread.run(Thread.java:748)
   [junit4]   2>
   [junit4]   2> Reference Handler:
   [junit4]   2>     java.lang.Object.wait(Native Method)
   [junit4]   2>     java.lang.Object.wait(Object.java:502)
   [junit4]   2>     java.lang.ref.Reference.tryHandlePending(Reference.java:191)
   [junit4]   2>     java.lang.ref.Reference$ReferenceHandler.run(Reference.java:153)
   [junit4]   2>
   [junit4]   2> JUnit4-serializer-daemon:
   [junit4]   2>     java.lang.Thread.sleep(Native Method)
   [junit4]   2>     com.carrotsearch.ant.tasks.junit4.events.Serializer$1.run(Serializer.java:50)
   [junit4]   2>
   [junit4]   2> SUITE-TestManagedResourceStorage-seed#[C5F5E66E6873139E]-worker:
   [junit4]   2>     java.lang.Thread.dumpThreads(Native Method)
   [junit4]   2>     java.lang.Thread.getAllStackTraces(Thread.java:1610)
   [junit4]   2>     org.apache.solr.SolrTestCaseJ4.clearObjectTrackerAndCheckEmpty(SolrTestCaseJ4.java:413)
   [junit4]   2>     org.apache.solr.SolrTestCaseJ4.teardownTestCases(SolrTestCaseJ4.java:339)
   [junit4]   2>     [...sun.*, java.lang.reflect.*, com.carrotsearch.randomizedtesting.*]
   [junit4]   2>     org.apache.lucene.util.AbstractBeforeAfterRule$1.evaluate(AbstractBeforeAfterRule.java:45)
   [junit4]   2>     [...com.carrotsearch.randomizedtesting.*]
   [junit4]   2>     org.apache.lucene.util.TestRuleStoreClassName$1.evaluate(TestRuleStoreClassName.java:41)
   [junit4]   2>     [...com.carrotsearch.randomizedtesting.*]
   [junit4]   2>     org.apache.lucene.util.TestRuleAssertionsRequired$1.evaluate(TestRuleAssertionsRequired.java:53)
   [junit4]   2>     org.apache.lucene.util.TestRuleMarkFailure$1.evaluate(TestRuleMarkFailure.java:47)
   [junit4]   2>     org.apache.lucene.util.TestRuleIgnoreAfterMaxFailures$1.evaluate(TestRuleIgnoreAfterMaxFailures.java:64)
   [junit4]   2>     org.apache.lucene.util.TestRuleIgnoreTestSuites$1.evaluate(TestRuleIgnoreTestSuites.java:54)
   [junit4]   2>     [...com.carrotsearch.randomizedtesting.*]
   [junit4]   2>     java.lang.Thread.run(Thread.java:748)
   [junit4]   2>
   [junit4]   2> Signal Dispatcher:
   [junit4]   2>
   [junit4]   2> main:
   [junit4]   2>     java.lang.Object.wait(Native Method)
   [junit4]   2>     java.lang.Thread.join(Thread.java:1252)
   [junit4]   2>     java.lang.Thread.join(Thread.java:1326)
   [junit4]   2>     [...com.carrotsearch.randomizedtesting.*]
   [junit4]   2>     com.carrotsearch.ant.tasks.junit4.slave.SlaveMain.execute(SlaveMain.java:269)
   [junit4]   2>     com.carrotsearch.ant.tasks.junit4.slave.SlaveMain.main(SlaveMain.java:394)
   [junit4]   2>     com.carrotsearch.ant.tasks.junit4.slave.SlaveMainSafe.main(SlaveMainSafe.java:13)
   [junit4]   2>
   [junit4]   2> Java2D Disposer:
   [junit4]   2>     java.lang.Object.wait(Native Method)
   [junit4]   2>     java.lang.ref.ReferenceQueue.remove(ReferenceQueue.java:144)
   [junit4]   2>     java.lang.ref.ReferenceQueue.remove(ReferenceQueue.java:165)
   [junit4]   2>     [...sun.*]
   [junit4]   2>     java.lang.Thread.run(Thread.java:748)
   [junit4]   2>
   [junit4]   2> Finalizer:
   [junit4]   2>     java.lang.Object.wait(Native Method)
   [junit4]   2>     java.lang.ref.ReferenceQueue.remove(ReferenceQueue.java:144)
   [junit4]   2>     java.lang.ref.ReferenceQueue.remove(ReferenceQueue.java:165)
   [junit4]   2>     java.lang.ref.Finalizer$FinalizerThread.run(Finalizer.java:216)
   [junit4]   2>
   [junit4]   2> 387625 INFO  (SUITE-TestManagedResourceStorage-seed#[C5F5E66E6873139E]-worker) [n:127.0.0.1:8983_     ] o.a.s.SolrTestCaseJ4 Waiting for all tracked resources to be released
   [junit4]   2> SUITE-TestManagedResourceStorage-seed#[C5F5E66E6873139E]:
   [junit4]   2>     java.lang.Thread.sleep(Native Method)
   [junit4]   2>     [...com.carrotsearch.randomizedtesting.*]
   [junit4]   2>
   [junit4]   2> Log4j2-TF-1-AsyncLoggerConfig-1:
   [junit4]   2>     [...sun.*]
   [junit4]   2>     java.util.concurrent.locks.LockSupport.parkNanos(LockSupport.java:215)
   [junit4]   2>     java.util.concurrent.locks.AbstractQueuedSynchronizer$ConditionObject.awaitNanos(AbstractQueuedSynchronizer.java:2078)
   [junit4]   2>     com.lmax.disruptor.TimeoutBlockingWaitStrategy.waitFor(TimeoutBlockingWaitStrategy.java:38)
   [junit4]   2>     com.lmax.disruptor.ProcessingSequenceBarrier.waitFor(ProcessingSequenceBarrier.java:56)
   [junit4]   2>     com.lmax.disruptor.BatchEventProcessor.processEvents(BatchEventProcessor.java:159)
   [junit4]   2>     com.lmax.disruptor.BatchEventProcessor.run(BatchEventProcessor.java:125)
   [junit4]   2>     java.lang.Thread.run(Thread.java:748)
   [junit4]   2>
   [junit4]   2> Reference Handler:
   [junit4]   2>     java.lang.Object.wait(Native Method)
   [junit4]   2>     java.lang.Object.wait(Object.java:502)
   [junit4]   2>     java.lang.ref.Reference.tryHandlePending(Reference.java:191)
   [junit4]   2>     java.lang.ref.Reference$ReferenceHandler.run(Reference.java:153)
   [junit4]   2>
   [junit4]   2> JUnit4-serializer-daemon:
   [junit4]   2>     java.lang.Thread.sleep(Native Method)
   [junit4]   2>     com.carrotsearch.ant.tasks.junit4.events.Serializer$1.run(Serializer.java:50)
   [junit4]   2>
   [junit4]   2> SUITE-TestManagedResourceStorage-seed#[C5F5E66E6873139E]-worker:
   [junit4]   2>     java.lang.Thread.dumpThreads(Native Method)
   [junit4]   2>     java.lang.Thread.getAllStackTraces(Thread.java:1610)
   [junit4]   2>     org.apache.solr.SolrTestCaseJ4.clearObjectTrackerAndCheckEmpty(SolrTestCaseJ4.java:413)
   [junit4]   2>     org.apache.solr.SolrTestCaseJ4.teardownTestCases(SolrTestCaseJ4.java:339)
   [junit4]   2>     [...sun.*, java.lang.reflect.*, com.carrotsearch.randomizedtesting.*]
   [junit4]   2>     org.apache.lucene.util.AbstractBeforeAfterRule$1.evaluate(AbstractBeforeAfterRule.java:45)
   [junit4]   2>     [...com.carrotsearch.randomizedtesting.*]
   [junit4]   2>     org.apache.lucene.util.TestRuleStoreClassName$1.evaluate(TestRuleStoreClassName.java:41)
   [junit4]   2>     [...com.carrotsearch.randomizedtesting.*]
   [junit4]   2>     org.apache.lucene.util.TestRuleAssertionsRequired$1.evaluate(TestRuleAssertionsRequired.java:53)
   [junit4]   2>     org.apache.lucene.util.TestRuleMarkFailure$1.evaluate(TestRuleMarkFailure.java:47)
   [junit4]   2>     org.apache.lucene.util.TestRuleIgnoreAfterMaxFailures$1.evaluate(TestRuleIgnoreAfterMaxFailures.java:64)
   [junit4]   2>     org.apache.lucene.util.TestRuleIgnoreTestSuites$1.evaluate(TestRuleIgnoreTestSuites.java:54)
   [junit4]   2>     [...com.carrotsearch.randomizedtesting.*]
   [junit4]   2>     java.lang.Thread.run(Thread.java:748)
   [junit4]   2>
   [junit4]   2> Signal Dispatcher:
   [junit4]   2>
   [junit4]   2> main:
   [junit4]   2>     java.lang.Object.wait(Native Method)
   [junit4]   2>     java.lang.Thread.join(Thread.java:1252)
   [junit4]   2>     java.lang.Thread.join(Thread.java:1326)
   [junit4]   2>     [...com.carrotsearch.randomizedtesting.*]
   [junit4]   2>     com.carrotsearch.ant.tasks.junit4.slave.SlaveMain.execute(SlaveMain.java:269)
   [junit4]   2>     com.carrotsearch.ant.tasks.junit4.slave.SlaveMain.main(SlaveMain.java:394)
   [junit4]   2>     com.carrotsearch.ant.tasks.junit4.slave.SlaveMainSafe.main(SlaveMainSafe.java:13)
   [junit4]   2>
   [junit4]   2> Java2D Disposer:
   [junit4]   2>     java.lang.Object.wait(Native Method)
   [junit4]   2>     java.lang.ref.ReferenceQueue.remove(ReferenceQueue.java:144)
   [junit4]   2>     java.lang.ref.ReferenceQueue.remove(ReferenceQueue.java:165)
   [junit4]   2>     [...sun.*]
   [junit4]   2>     java.lang.Thread.run(Thread.java:748)
   [junit4]   2>
   [junit4]   2> Finalizer:
   [junit4]   2>     java.lang.Object.wait(Native Method)
   [junit4]   2>     java.lang.ref.ReferenceQueue.remove(ReferenceQueue.java:144)
   [junit4]   2>     java.lang.ref.ReferenceQueue.remove(ReferenceQueue.java:165)
   [junit4]   2>     java.lang.ref.Finalizer$FinalizerThread.run(Finalizer.java:216)
   [junit4]   2>
   [junit4]   2> 388629 INFO  (SUITE-TestManagedResourceStorage-seed#[C5F5E66E6873139E]-worker) [n:127.0.0.1:8983_     ] o.a.s.SolrTestCaseJ4 ------------------------------------------------------- Done waiting for tracked resources to be released
   [junit4]   2> NOTE: test params are: codec=Asserting(Lucene80), sim=Asserting(org.apache.lucene.search.similarities.AssertingSimilarity@335571a3), locale=en-GB, timezone=Europe/Athens
   [junit4]   2> NOTE: SunOS 5.11 amd64/Oracle Corporation 1.8.0_221 (64-bit)/cpus=3,threads=1,free=356104200,total=518979584
   [junit4]   2> NOTE: All tests run in this JVM: [SuggesterTSTTest, TestCollectionsAPIViaSolrCloudCluster, TestSizeLimitedDistributedMap, TestClassicSimilarityFactory, MetricsHistoryIntegrationTest, TestDeprecatedFilters, DimensionalRoutedAliasUpdateProcessorTest, LeaderVoteWaitTimeoutTest, BinaryUpdateRequestHandlerTest, TestDocTermOrds, HdfsBasicDistributedZk2Test, TestUnifiedSolrHighlighter, ShardRoutingCustomTest, TestFieldCollectionResource, TermVectorComponentTest, TestSimPolicyCloud, TestCloudJSONFacetSKG, LeaderElectionContextKeyTest, HdfsNNFailoverTest, RestoreTriggerStateTest, TestManagedResourceStorage]
   [junit4]   2> NOTE: reproduce with: ant test  -Dtestcase=TestManagedResourceStorage -Dtests.seed=C5F5E66E6873139E -Dtests.slow=true -Dtests.locale=en-GB -Dtests.timezone=Europe/Athens -Dtests.asserts=true -Dtests.file.encoding=UTF-8
   [junit4] ERROR   0.00s J1 | TestManagedResourceStorage (suite) <<<
   [junit4]    > Throwable #1: java.lang.AssertionError: ObjectTracker found 2 object(s) that were not released!!! [ZkCollectionTerms, ZkShardTerms]
   [junit4]    > org.apache.solr.common.util.ObjectReleaseTracker$ObjectTrackerException: org.apache.solr.cloud.ZkCollectionTerms
   [junit4]    > at org.apache.solr.common.util.ObjectReleaseTracker.track(ObjectReleaseTracker.java:42)
   [junit4]    > at org.apache.solr.cloud.ZkCollectionTerms.<init>(ZkCollectionTerms.java:39)
   [junit4]    > at org.apache.solr.cloud.ZkController.getCollectionTerms(ZkController.java:1624)
   [junit4]    > at org.apache.solr.cloud.ZkController.getShardTerms(ZkController.java:1619)
   [junit4]    > at org.apache.solr.cloud.ZkController.register(ZkController.java:1206)
   [junit4]    > at org.apache.solr.cloud.ZkController.register(ZkController.java:1171)
   [junit4]    > at org.apache.solr.core.ZkContainer.lambda$registerInZk$0(ZkContainer.java:191)
   [junit4]    > at org.apache.solr.common.util.ExecutorUtil$MDCAwareThreadPoolExecutor.lambda$execute$0(ExecutorUtil.java:210)
   [junit4]    > at java.util.concurrent.ThreadPoolExecutor.runWorker(ThreadPoolExecutor.java:1149)
   [junit4]    > at java.util.concurrent.ThreadPoolExecutor$Worker.run(ThreadPoolExecutor.java:624)
   [junit4]    > at java.lang.Thread.run(Thread.java:748)
   [junit4]    > org.apache.solr.common.util.ObjectReleaseTracker$ObjectTrackerException: org.apache.solr.cloud.ZkShardTerms
   [junit4]    > at org.apache.solr.common.util.ObjectReleaseTracker.track(ObjectReleaseTracker.java:42)
   [junit4]    > at org.apache.solr.cloud.ZkShardTerms.<init>(ZkShardTerms.java:93)
   [junit4]    > at org.apache.solr.cloud.ZkCollectionTerms.getShard(ZkCollectionTerms.java:45)
   [junit4]    > at org.apache.solr.cloud.ZkController.getShardTerms(ZkController.java:1619)
   [junit4]    > at org.apache.solr.cloud.ZkController.register(ZkController.java:1206)
   [junit4]    > at org.apache.solr.cloud.ZkController.register(ZkController.java:1171)
   [junit4]    > at org.apache.solr.core.ZkContainer.lambda$registerInZk$0(ZkContainer.java:191)
   [junit4]    > at org.apache.solr.common.util.ExecutorUtil$MDCAwareThreadPoolExecutor.lambda$execute$0(ExecutorUtil.java:210)
   [junit4]    > at java.util.concurrent.ThreadPoolExecutor.runWorker(ThreadPoolExecutor.java:1149)
   [junit4]    > at java.util.concurrent.ThreadPoolExecutor$Worker.run(ThreadPoolExecutor.java:624)
   [junit4]    > at java.lang.Thread.run(Thread.java:748)
   [junit4]    >  expected null, but was:<ObjectTracker found 2 object(s) that were not released!!! [ZkCollectionTerms, ZkShardTerms]
   [junit4]    > org.apache.solr.common.util.ObjectReleaseTracker$ObjectTrackerException: org.apache.solr.cloud.ZkCollectionTerms
   [junit4]    > at org.apache.solr.common.util.ObjectReleaseTracker.track(ObjectReleaseTracker.java:42)
   [junit4]    > at org.apache.solr.cloud.ZkCollectionTerms.<init>(ZkCollectionTerms.java:39)
   [junit4]    > at org.apache.solr.cloud.ZkController.getCollectionTerms(ZkController.java:1624)
   [junit4]    > at org.apache.solr.cloud.ZkController.getShardTerms(ZkController.java:1619)
   [junit4]    > at org.apache.solr.cloud.ZkController.register(ZkController.java:1206)
   [junit4]    > at org.apache.solr.cloud.ZkController.register(ZkController.java:1171)
   [junit4]    > at org.apache.solr.core.ZkContainer.lambda$registerInZk$0(ZkContainer.java:191)
   [junit4]    > at org.apache.solr.common.util.ExecutorUtil$MDCAwareThreadPoolExecutor.lambda$execute$0(ExecutorUtil.java:210)
   [junit4]    > at java.util.concurrent.ThreadPoolExecutor.runWorker(ThreadPoolExecutor.java:1149)
   [junit4]    > at java.util.concurrent.ThreadPoolExecutor$Worker.run(ThreadPoolExecutor.java:624)
   [junit4]    > at java.lang.Thread.run(Thread.java:748)
   [junit4]    > org.apache.solr.common.util.ObjectReleaseTracker$ObjectTrackerException: org.apache.solr.cloud.ZkShardTerms
   [junit4]    > at org.apache.solr.common.util.ObjectReleaseTracker.track(ObjectReleaseTracker.java:42)
   [junit4]    > at org.apache.solr.cloud.ZkShardTerms.<init>(ZkShardTerms.java:93)
   [junit4]    > at org.apache.solr.cloud.ZkCollectionTerms.getShard(ZkCollectionTerms.java:45)
   [junit4]    > at org.apache.solr.cloud.ZkController.getShardTerms(ZkController.java:1619)
   [junit4]    > at org.apache.solr.cloud.ZkController.register(ZkController.java:1206)
   [junit4]    > at org.apache.solr.cloud.ZkController.register(ZkController.java:1171)
   [junit4]    > at org.apache.solr.core.ZkContainer.lambda$registerInZk$0(ZkContainer.java:191)
   [junit4]    > at org.apache.solr.common.util.ExecutorUtil$MDCAwareThreadPoolExecutor.lambda$execute$0(ExecutorUtil.java:210)
   [junit4]    > at java.util.concurrent.ThreadPoolExecutor.runWorker(ThreadPoolExecutor.java:1149)
   [junit4]    > at java.util.concurrent.ThreadPoolExecutor$Worker.run(ThreadPoolExecutor.java:624)
   [junit4]    > at java.lang.Thread.run(Thread.java:748)
   [junit4]    > >
   [junit4]    > at __randomizedtesting.SeedInfo.seed([C5F5E66E6873139E]:0)
   [junit4]    > at org.apache.solr.SolrTestCaseJ4.teardownTestCases(SolrTestCaseJ4.java:340)
   [junit4]    > at java.lang.Thread.run(Thread.java:748)
   [junit4] Completed [75/874 (1!)] on J1 in 64.03s, 2 tests, 1 failure <<< FAILURES!

[...truncated 54932 lines...]
[asciidoctor:convert] asciidoctor: ERROR: about-this-guide.adoc: line 1: invalid part, must have at least one section (e.g., chapter, appendix, etc.)
[asciidoctor:convert] asciidoctor: ERROR: solr-glossary.adoc: line 1: invalid part, must have at least one section (e.g., chapter, appendix, etc.)
     [java] Processed 2594 links (2120 relative) to 3410 anchors in 259 files
     [echo] Validated Links & Anchors via: /export/home/jenkins/workspace/Lucene-Solr-8.x-Solaris/solr/build/solr-ref-guide/bare-bones-html/

-documentation-lint:
    [jtidy] Checking for broken html (such as invalid tags)...
   [delete] Deleting directory /export/home/jenkins/workspace/Lucene-Solr-8.x-Solaris/lucene/build/jtidy_tmp
     [echo] Checking for broken links...
     [exec]
     [exec] Crawl/parse...
     [exec]
     [exec] Verify...
     [echo] Checking for malformed docs...

jar-checksums:

resolve:

ivy-availability-check:
[loadresource] Do not set property disallowed.ivy.jars.list as its length is 0.

-ivy-fail-disallowed-ivy-version:

ivy-fail:

ivy-configure:
[ivy:configure] :: loading settings :: file = /export/home/jenkins/workspace/Lucene-Solr-8.x-Solaris/lucene/top-level-ivy-settings.xml

resolve:

ivy-availability-check:
[loadresource] Do not set property disallowed.ivy.jars.list as its length is 0.

-ivy-fail-disallowed-ivy-version:

ivy-fail:

ivy-configure:
[ivy:configure] :: loading settings :: file = /export/home/jenkins/workspace/Lucene-Solr-8.x-Solaris/lucene/top-level-ivy-settings.xml

resolve:

resolve:

ivy-availability-check:
[loadresource] Do not set property disallowed.ivy.jars.list as its length is 0.

-ivy-fail-disallowed-ivy-version:

ivy-fail:

ivy-configure:
[ivy:configure] :: loading settings :: file = /export/home/jenkins/workspace/Lucene-Solr-8.x-Solaris/lucene/top-level-ivy-settings.xml

resolve:

ivy-availability-check:
[loadresource] Do not set property disallowed.ivy.jars.list as its length is 0.

-ivy-fail-disallowed-ivy-version:

ivy-fail:

ivy-configure:
[ivy:configure] :: loading settings :: file = /export/home/jenkins/workspace/Lucene-Solr-8.x-Solaris/lucene/top-level-ivy-settings.xml

resolve:

ivy-availability-check:
[loadresource] Do not set property disallowed.ivy.jars.list as its length is 0.

-ivy-fail-disallowed-ivy-version:

ivy-fail:

ivy-configure:
[ivy:configure] :: loading settings :: file = /export/home/jenkins/workspace/Lucene-Solr-8.x-Solaris/lucene/top-level-ivy-settings.xml

resolve:

ivy-availability-check:
[loadresource] Do not set property disallowed.ivy.jars.list as its length is 0.

-ivy-fail-disallowed-ivy-version:

ivy-fail:

ivy-configure:
[ivy:configure] :: loading settings :: file = /export/home/jenkins/workspace/Lucene-Solr-8.x-Solaris/lucene/top-level-ivy-settings.xml

resolve:

ivy-availability-check:
[loadresource] Do not set property disallowed.ivy.jars.list as its length is 0.

-ivy-fail-disallowed-ivy-version:

ivy-fail:

ivy-configure:
[ivy:configure] :: loading settings :: file = /export/home/jenkins/workspace/Lucene-Solr-8.x-Solaris/lucene/top-level-ivy-settings.xml

resolve:

ivy-availability-check:
[loadresource] Do not set property disallowed.ivy.jars.list as its length is 0.

-ivy-fail-disallowed-ivy-version:

ivy-fail:

ivy-configure:
[ivy:configure] :: loading settings :: file = /export/home/jenkins/workspace/Lucene-Solr-8.x-Solaris/lucene/top-level-ivy-settings.xml

resolve:

ivy-availability-check:
[loadresource] Do not set property disallowed.ivy.jars.list as its length is 0.

-ivy-fail-disallowed-ivy-version:

ivy-fail:

ivy-configure:
[ivy:configure] :: loading settings :: file = /export/home/jenkins/workspace/Lucene-Solr-8.x-Solaris/lucene/top-level-ivy-settings.xml

resolve:

ivy-availability-check:
[loadresource] Do not set property disallowed.ivy.jars.list as its length is 0.

-ivy-fail-disallowed-ivy-version:

ivy-fail:

ivy-configure:
[ivy:configure] :: loading settings :: file = /export/home/jenkins/workspace/Lucene-Solr-8.x-Solaris/lucene/top-level-ivy-settings.xml

resolve:

ivy-availability-check:
[loadresource] Do not set property disallowed.ivy.jars.list as its length is 0.

-ivy-fail-disallowed-ivy-version:

ivy-fail:

ivy-configure:
[ivy:configure] :: loading settings :: file = /export/home/jenkins/workspace/Lucene-Solr-8.x-Solaris/lucene/top-level-ivy-settings.xml

resolve:

ivy-availability-check:
[loadresource] Do not set property disallowed.ivy.jars.list as its length is 0.

-ivy-fail-disallowed-ivy-version:

ivy-fail:

ivy-configure:
[ivy:configure] :: loading settings :: file = /export/home/jenkins/workspace/Lucene-Solr-8.x-Solaris/lucene/top-level-ivy-settings.xml

resolve:

ivy-availability-check:
[loadresource] Do not set property disallowed.ivy.jars.list as its length is 0.

-ivy-fail-disallowed-ivy-version:

ivy-fail:

ivy-configure:
[ivy:configure] :: loading settings :: file = /export/home/jenkins/workspace/Lucene-Solr-8.x-Solaris/lucene/top-level-ivy-settings.xml

resolve:

ivy-availability-check:
[loadresource] Do not set property disallowed.ivy.jars.list as its length is 0.

-ivy-fail-disallowed-ivy-version:

ivy-fail:

ivy-configure:
[ivy:configure] :: loading settings :: file = /export/home/jenkins/workspace/Lucene-Solr-8.x-Solaris/lucene/top-level-ivy-settings.xml

resolve:

ivy-availability-check:
[loadresource] Do not set property disallowed.ivy.jars.list as its length is 0.

-ivy-fail-disallowed-ivy-version:

ivy-fail:

ivy-configure:
[ivy:configure] :: loading settings :: file = /export/home/jenkins/workspace/Lucene-Solr-8.x-Solaris/lucene/top-level-ivy-settings.xml

resolve:

ivy-availability-check:
[loadresource] Do not set property disallowed.ivy.jars.list as its length is 0.

-ivy-fail-disallowed-ivy-version:

ivy-fail:

ivy-configure:
[ivy:configure] :: loading settings :: file = /export/home/jenkins/workspace/Lucene-Solr-8.x-Solaris/lucene/top-level-ivy-settings.xml

resolve:

ivy-availability-check:
[loadresource] Do not set property disallowed.ivy.jars.list as its length is 0.

-ivy-fail-disallowed-ivy-version:

ivy-fail:

ivy-configure:
[ivy:configure] :: loading settings :: file = /export/home/jenkins/workspace/Lucene-Solr-8.x-Solaris/lucene/top-level-ivy-settings.xml

resolve:

ivy-availability-check:
[loadresource] Do not set property disallowed.ivy.jars.list as its length is 0.

-ivy-fail-disallowed-ivy-version:

ivy-fail:

ivy-configure:
[ivy:configure] :: loading settings :: file = /export/home/jenkins/workspace/Lucene-Solr-8.x-Solaris/lucene/top-level-ivy-settings.xml

resolve:

ivy-availability-check:
[loadresource] Do not set property disallowed.ivy.jars.list as its length is 0.

-ivy-fail-disallowed-ivy-version:

ivy-fail:

ivy-configure:
[ivy:configure] :: loading settings :: file = /export/home/jenkins/workspace/Lucene-Solr-8.x-Solaris/lucene/top-level-ivy-settings.xml

resolve:

ivy-availability-check:
[loadresource] Do not set property disallowed.ivy.jars.list as its length is 0.

-ivy-fail-disallowed-ivy-version:

ivy-fail:

ivy-configure:
[ivy:configure] :: loading settings :: file = /export/home/jenkins/workspace/Lucene-Solr-8.x-Solaris/lucene/top-level-ivy-settings.xml

resolve:

ivy-availability-check:
[loadresource] Do not set property disallowed.ivy.jars.list as its length is 0.

-ivy-fail-disallowed-ivy-version:

ivy-fail:

ivy-configure:
[ivy:configure] :: loading settings :: file = /export/home/jenkins/workspace/Lucene-Solr-8.x-Solaris/lucene/top-level-ivy-settings.xml

resolve:

ivy-availability-check:
[loadresource] Do not set property disallowed.ivy.jars.list as its length is 0.

-ivy-fail-disallowed-ivy-version:

ivy-fail:

ivy-configure:
[ivy:configure] :: loading settings :: file = /export/home/jenkins/workspace/Lucene-Solr-8.x-Solaris/lucene/top-level-ivy-settings.xml

resolve:

ivy-availability-check:
[loadresource] Do not set property disallowed.ivy.jars.list as its length is 0.

-ivy-fail-disallowed-ivy-version:

ivy-fail:

ivy-configure:
[ivy:configure] :: loading settings :: file = /export/home/jenkins/workspace/Lucene-Solr-8.x-Solaris/lucene/top-level-ivy-settings.xml

resolve:

ivy-availability-check:
[loadresource] Do not set property disallowed.ivy.jars.list as its length is 0.

-ivy-fail-disallowed-ivy-version:

ivy-fail:

ivy-configure:
[ivy:configure] :: loading settings :: file = /export/home/jenkins/workspace/Lucene-Solr-8.x-Solaris/lucene/top-level-ivy-settings.xml

resolve:

ivy-availability-check:
[loadresource] Do not set property disallowed.ivy.jars.list as its length is 0.

-ivy-fail-disallowed-ivy-version:

ivy-fail:

ivy-configure:
[ivy:configure] :: loading settings :: file = /export/home/jenkins/workspace/Lucene-Solr-8.x-Solaris/lucene/top-level-ivy-settings.xml

resolve:

ivy-availability-chec

[...truncated too long message...]

time: 1 minute 16 seconds
[repro] ant test-nocompile -Dtests.dups=5 -Dtests.maxfailures=5 -Dtests.class="*.TestManagedResourceStorage" -Dtests.showOutput=onerror "-Dargs=-XX:-UseCompressedOops -XX:+UseConcMarkSweepGC" -Dtests.seed=C5F5E66E6873139E -Dtests.slow=true -Dtests.locale=en-GB -Dtests.timezone=Europe/Athens -Dtests.asserts=true -Dtests.file.encoding=UTF-8
Buildfile: /export/home/jenkins/workspace/Lucene-Solr-8.x-Solaris/solr/core/build.xml

-clover.disable:

ivy-configure:
[ivy:configure] :: Apache Ivy 2.4.0 - 20141213170938 :: http://ant.apache.org/ivy/ ::
[ivy:configure] :: loading settings :: file = /export/home/jenkins/workspace/Lucene-Solr-8.x-Solaris/lucene/top-level-ivy-settings.xml

install-junit4-taskdef:

ivy-availability-check:
[loadresource] Do not set property disallowed.ivy.jars.list as its length is 0.

-ivy-fail-disallowed-ivy-version:

ivy-fail:

resolve-groovy:
[ivy:cachepath] :: resolving dependencies :: org.codehaus.groovy#groovy-all-caller;working
[ivy:cachepath] confs: [default]
[ivy:cachepath] found org.codehaus.groovy#groovy-all;2.4.16 in public
[ivy:cachepath] :: resolution report :: resolve 18ms :: artifacts dl 0ms
        ---------------------------------------------------------------------
        |                  |            modules            ||   artifacts   |
        |       conf       | number| search|dwnlded|evicted|| number|dwnlded|
        ---------------------------------------------------------------------
        |      default     |   1   |   0   |   0   |   0   ||   1   |   0   |
        ---------------------------------------------------------------------

-init-totals:

-test:
    [mkdir] Created dir: /export/home/jenkins/workspace/Lucene-Solr-8.x-Solaris/solr/build/solr-core/test
[junit4:pickseed] Seed property 'tests.seed' already defined: C5F5E66E6873139E
    [mkdir] Created dir: /export/home/jenkins/workspace/Lucene-Solr-8.x-Solaris/solr/build/solr-core/test/temp
   [junit4] <JUnit4> says ᐊᐃ! Master seed: C5F5E66E6873139E
   [junit4] Executing 5 suites with 2 JVMs.
   [junit4]
   [junit4] Started J0 PID(28550@serv1-vm3).
   [junit4] Started J1 PID(28549@serv1-vm3).
   [junit4] Suite: org.apache.solr.rest.TestManagedResourceStorage
   [junit4] OK      0.16s J1 | TestManagedResourceStorage.testFileBasedJsonStorage
   [junit4] OK      0.08s J1 | TestManagedResourceStorage.testZkBasedJsonStorage
   [junit4] Completed [1/5] on J1 in 17.59s, 2 tests
   [junit4]
   [junit4] Suite: org.apache.solr.rest.TestManagedResourceStorage
   [junit4] OK      0.07s J0 | TestManagedResourceStorage.testFileBasedJsonStorage
   [junit4] OK      0.05s J0 | TestManagedResourceStorage.testZkBasedJsonStorage
   [junit4] Completed [2/5] on J0 in 18.44s, 2 tests
   [junit4]
   [junit4] Suite: org.apache.solr.rest.TestManagedResourceStorage
   [junit4] OK      0.08s J1 | TestManagedResourceStorage.testFileBasedJsonStorage
   [junit4] OK      0.14s J1 | TestManagedResourceStorage.testZkBasedJsonStorage
   [junit4] Completed [3/5] on J1 in 7.00s, 2 tests
   [junit4]
   [junit4] Suite: org.apache.solr.rest.TestManagedResourceStorage
   [junit4] OK      0.20s J0 | TestManagedResourceStorage.testFileBasedJsonStorage
   [junit4] OK      0.09s J0 | TestManagedResourceStorage.testZkBasedJsonStorage
   [junit4] Completed [4/5] on J0 in 8.93s, 2 tests
   [junit4]
   [junit4] Suite: org.apache.solr.rest.TestManagedResourceStorage
   [junit4] OK      0.12s J1 | TestManagedResourceStorage.testFileBasedJsonStorage
   [junit4] OK      0.11s J1 | TestManagedResourceStorage.testZkBasedJsonStorage
   [junit4] Completed [5/5] on J1 in 8.00s, 2 tests
   [junit4]
   [junit4] JVM J0:     0.76 ..    29.18 =    28.41s
   [junit4] JVM J1:     0.77 ..    35.13 =    34.37s
   [junit4] Execution time total: 35 seconds
   [junit4] Tests summary: 5 suites, 10 tests
   [junit4] Could not remove temporary path: /export/home/jenkins/workspace/Lucene-Solr-8.x-Solaris/solr/build/solr-core/test/J1 (java.nio.file.DirectoryNotEmptyException: Remaining files: [/export/home/jenkins/workspace/Lucene-Solr-8.x-Solaris/solr/build/solr-core/test/J1/temp])
   [junit4] Could not remove temporary path: /export/home/jenkins/workspace/Lucene-Solr-8.x-Solaris/solr/build/solr-core/test/J0 (java.nio.file.DirectoryNotEmptyException: Remaining files: [/export/home/jenkins/workspace/Lucene-Solr-8.x-Solaris/solr/build/solr-core/test/J0/temp])
     [echo] 5 slowest tests:
[junit4:tophints] 294.39s | org.apache.solr.cloud.api.collections.ShardSplitTest
[junit4:tophints] 270.68s | org.apache.solr.cloud.autoscaling.IndexSizeTriggerTest
[junit4:tophints] 149.13s | org.apache.solr.cloud.CollectionsAPISolrJTest
[junit4:tophints] 141.17s | org.apache.solr.search.facet.TestJsonFacets
[junit4:tophints] 128.85s | org.apache.solr.cloud.ReindexCollectionTest

-check-totals:

test-nocompile:

BUILD SUCCESSFUL
Total time: 38 seconds
[repro] Failures:
[repro]   0/5 failed: org.apache.solr.rest.TestManagedResourceStorage
[repro] Exiting with code 0
+ mv lucene/build lucene/build.repro
+ mv solr/build solr/build.repro
+ mv lucene/build.orig lucene/build
+ mv solr/build.orig solr/build
Archiving artifacts
Setting ANT_1_8_2_HOME=/export/home/jenkins/tools/hudson.tasks.Ant_AntInstallation/ANT_1.8.2
java.lang.InterruptedException: no matches found within 10000
        at hudson.FilePath$ValidateAntFileMask.hasMatch(FilePath.java:2805)
        at hudson.FilePath$ValidateAntFileMask.invoke(FilePath.java:2684)
        at hudson.FilePath$ValidateAntFileMask.invoke(FilePath.java:2665)
        at hudson.FilePath$FileCallableWrapper.call(FilePath.java:3052)
Also:   hudson.remoting.Channel$CallSiteStackTrace: Remote call to Solaris VBOX
                at hudson.remoting.Channel.attachCallSiteStackTrace(Channel.java:1743)
                at hudson.remoting.UserRequest$ExceptionResponse.retrieve(UserRequest.java:357)
                at hudson.remoting.Channel.call(Channel.java:957)
                at hudson.FilePath.act(FilePath.java:1072)
                at hudson.FilePath.act(FilePath.java:1061)
                at hudson.FilePath.validateAntFileMask(FilePath.java:2663)
                at hudson.tasks.ArtifactArchiver.perform(ArtifactArchiver.java:248)
                at hudson.tasks.BuildStepCompatibilityLayer.perform(BuildStepCompatibilityLayer.java:79)
                at hudson.tasks.BuildStepMonitor$1.perform(BuildStepMonitor.java:20)
                at hudson.model.AbstractBuild$AbstractBuildExecution.perform(AbstractBuild.java:741)
                at hudson.model.AbstractBuild$AbstractBuildExecution.performAllBuildSteps(AbstractBuild.java:690)
                at hudson.model.Build$BuildExecution.post2(Build.java:186)
                at hudson.model.AbstractBuild$AbstractBuildExecution.post(AbstractBuild.java:635)
                at hudson.model.Run.execute(Run.java:1840)
                at hudson.model.FreeStyleBuild.run(FreeStyleBuild.java:43)
                at hudson.model.ResourceController.execute(ResourceController.java:97)
                at hudson.model.Executor.run(Executor.java:429)
Caused: hudson.FilePath$TunneledInterruptedException
        at hudson.FilePath$FileCallableWrapper.call(FilePath.java:3054)
        at hudson.remoting.UserRequest.perform(UserRequest.java:212)
        at hudson.remoting.UserRequest.perform(UserRequest.java:54)
        at hudson.remoting.Request$2.run(Request.java:369)
        at hudson.remoting.InterceptingExecutorService$1.call(InterceptingExecutorService.java:72)
        at java.util.concurrent.FutureTask.run(FutureTask.java:266)
        at java.util.concurrent.ThreadPoolExecutor.runWorker(ThreadPoolExecutor.java:1149)
        at java.util.concurrent.ThreadPoolExecutor$Worker.run(ThreadPoolExecutor.java:624)
        at java.lang.Thread.run(Thread.java:748)
Caused: java.lang.InterruptedException: java.lang.InterruptedException: no matches found within 10000
        at hudson.FilePath.act(FilePath.java:1074)
        at hudson.FilePath.act(FilePath.java:1061)
        at hudson.FilePath.validateAntFileMask(FilePath.java:2663)
        at hudson.tasks.ArtifactArchiver.perform(ArtifactArchiver.java:248)
        at hudson.tasks.BuildStepCompatibilityLayer.perform(BuildStepCompatibilityLayer.java:79)
        at hudson.tasks.BuildStepMonitor$1.perform(BuildStepMonitor.java:20)
        at hudson.model.AbstractBuild$AbstractBuildExecution.perform(AbstractBuild.java:741)
        at hudson.model.AbstractBuild$AbstractBuildExecution.performAllBuildSteps(AbstractBuild.java:690)
        at hudson.model.Build$BuildExecution.post2(Build.java:186)
        at hudson.model.AbstractBuild$AbstractBuildExecution.post(AbstractBuild.java:635)
        at hudson.model.Run.execute(Run.java:1840)
        at hudson.model.FreeStyleBuild.run(FreeStyleBuild.java:43)
        at hudson.model.ResourceController.execute(ResourceController.java:97)
        at hudson.model.Executor.run(Executor.java:429)
No artifacts found that match the file pattern "**/*.events,heapdumps/**,**/*_pid*.log". Configuration error?
[WARNINGS] Parsing warnings in console log with parser Java Compiler (javac)
Setting ANT_1_8_2_HOME=/export/home/jenkins/tools/hudson.tasks.Ant_AntInstallation/ANT_1.8.2
No credentials specified
Setting ANT_1_8_2_HOME=/export/home/jenkins/tools/hudson.tasks.Ant_AntInstallation/ANT_1.8.2
<Git Blamer> Using GitBlamer to create author and commit information for all warnings.
<Git Blamer> GIT_COMMIT=b7c9a9f4a1a72ac0003f9fa98582ad89e75f043f, workspace=/export/home/jenkins/workspace/Lucene-Solr-8.x-Solaris
[WARNINGS] Computing warning deltas based on reference build #287
Recording test results
Setting ANT_1_8_2_HOME=/export/home/jenkins/tools/hudson.tasks.Ant_AntInstallation/ANT_1.8.2
Build step 'Publish JUnit test result report' changed build result to UNSTABLE
Email was triggered for: Unstable (Test Failures)
Sending email for trigger: Unstable (Test Failures)
Setting ANT_1_8_2_HOME=/export/home/jenkins/tools/hudson.tasks.Ant_AntInstallation/ANT_1.8.2
Setting ANT_1_8_2_HOME=/export/home/jenkins/tools/hudson.tasks.Ant_AntInstallation/ANT_1.8.2
Setting ANT_1_8_2_HOME=/export/home/jenkins/tools/hudson.tasks.Ant_AntInstallation/ANT_1.8.2
Setting ANT_1_8_2_HOME=/export/home/jenkins/tools/hudson.tasks.Ant_AntInstallation/ANT_1.8.2
Setting ANT_1_8_2_HOME=/export/home/jenkins/tools/hudson.tasks.Ant_AntInstallation/ANT_1.8.2
Setting ANT_1_8_2_HOME=/export/home/jenkins/tools/hudson.tasks.Ant_AntInstallation/ANT_1.8.2


---------------------------------------------------------------------
To unsubscribe, e-mail: [hidden email]
For additional commands, e-mail: [hidden email]