[JENKINS] Lucene-Solr-8.x-Windows (32bit/jdk1.8.0_201) - Build # 418 - Unstable!

classic Classic list List threaded Threaded
1 message Options
Reply | Threaded
Open this post in threaded view
|

[JENKINS] Lucene-Solr-8.x-Windows (32bit/jdk1.8.0_201) - Build # 418 - Unstable!

Policeman Jenkins Server-2
Build: https://jenkins.thetaphi.de/job/Lucene-Solr-8.x-Windows/418/
Java: 32bit/jdk1.8.0_201 -client -XX:+UseConcMarkSweepGC

16 tests failed.
FAILED:  org.apache.solr.handler.TestContainerReqHandler.testCacheLoadFromPackage

Error Message:
Error from server at http://127.0.0.1:54077/solr: Underlying core creation failed while creating collection: globalCacheColl

Stack Trace:
org.apache.solr.client.solrj.impl.HttpSolrClient$RemoteSolrException: Error from server at http://127.0.0.1:54077/solr: Underlying core creation failed while creating collection: globalCacheColl
        at __randomizedtesting.SeedInfo.seed([8C8DA3E418A7D013:40A8F77A13F066F0]:0)
        at org.apache.solr.client.solrj.impl.HttpSolrClient.executeMethod(HttpSolrClient.java:656)
        at org.apache.solr.client.solrj.impl.HttpSolrClient.request(HttpSolrClient.java:262)
        at org.apache.solr.client.solrj.impl.HttpSolrClient.request(HttpSolrClient.java:245)
        at org.apache.solr.client.solrj.impl.LBSolrClient.doRequest(LBSolrClient.java:368)
        at org.apache.solr.client.solrj.impl.LBSolrClient.request(LBSolrClient.java:296)
        at org.apache.solr.client.solrj.impl.BaseCloudSolrClient.sendRequest(BaseCloudSolrClient.java:1128)
        at org.apache.solr.client.solrj.impl.BaseCloudSolrClient.requestWithRetryOnStaleState(BaseCloudSolrClient.java:897)
        at org.apache.solr.client.solrj.impl.BaseCloudSolrClient.request(BaseCloudSolrClient.java:829)
        at org.apache.solr.client.solrj.SolrRequest.process(SolrRequest.java:211)
        at org.apache.solr.client.solrj.SolrRequest.process(SolrRequest.java:228)
        at org.apache.solr.handler.TestContainerReqHandler.testCacheLoadFromPackage(TestContainerReqHandler.java:687)
        at sun.reflect.NativeMethodAccessorImpl.invoke0(Native Method)
        at sun.reflect.NativeMethodAccessorImpl.invoke(NativeMethodAccessorImpl.java:62)
        at sun.reflect.DelegatingMethodAccessorImpl.invoke(DelegatingMethodAccessorImpl.java:43)
        at java.lang.reflect.Method.invoke(Method.java:498)
        at com.carrotsearch.randomizedtesting.RandomizedRunner.invoke(RandomizedRunner.java:1750)
        at com.carrotsearch.randomizedtesting.RandomizedRunner$8.evaluate(RandomizedRunner.java:938)
        at com.carrotsearch.randomizedtesting.RandomizedRunner$9.evaluate(RandomizedRunner.java:974)
        at com.carrotsearch.randomizedtesting.RandomizedRunner$10.evaluate(RandomizedRunner.java:988)
        at com.carrotsearch.randomizedtesting.rules.SystemPropertiesRestoreRule$1.evaluate(SystemPropertiesRestoreRule.java:57)
        at org.apache.lucene.util.TestRuleSetupTeardownChained$1.evaluate(TestRuleSetupTeardownChained.java:49)
        at org.apache.lucene.util.AbstractBeforeAfterRule$1.evaluate(AbstractBeforeAfterRule.java:45)
        at org.apache.lucene.util.TestRuleThreadAndTestName$1.evaluate(TestRuleThreadAndTestName.java:48)
        at org.apache.lucene.util.TestRuleIgnoreAfterMaxFailures$1.evaluate(TestRuleIgnoreAfterMaxFailures.java:64)
        at org.apache.lucene.util.TestRuleMarkFailure$1.evaluate(TestRuleMarkFailure.java:47)
        at com.carrotsearch.randomizedtesting.rules.StatementAdapter.evaluate(StatementAdapter.java:36)
        at com.carrotsearch.randomizedtesting.ThreadLeakControl$StatementRunner.run(ThreadLeakControl.java:368)
        at com.carrotsearch.randomizedtesting.ThreadLeakControl.forkTimeoutingTask(ThreadLeakControl.java:817)
        at com.carrotsearch.randomizedtesting.ThreadLeakControl$3.evaluate(ThreadLeakControl.java:468)
        at com.carrotsearch.randomizedtesting.RandomizedRunner.runSingleTest(RandomizedRunner.java:947)
        at com.carrotsearch.randomizedtesting.RandomizedRunner$5.evaluate(RandomizedRunner.java:832)
        at com.carrotsearch.randomizedtesting.RandomizedRunner$6.evaluate(RandomizedRunner.java:883)
        at com.carrotsearch.randomizedtesting.RandomizedRunner$7.evaluate(RandomizedRunner.java:894)
        at com.carrotsearch.randomizedtesting.rules.StatementAdapter.evaluate(StatementAdapter.java:36)
        at com.carrotsearch.randomizedtesting.rules.SystemPropertiesRestoreRule$1.evaluate(SystemPropertiesRestoreRule.java:57)
        at org.apache.lucene.util.AbstractBeforeAfterRule$1.evaluate(AbstractBeforeAfterRule.java:45)
        at com.carrotsearch.randomizedtesting.rules.StatementAdapter.evaluate(StatementAdapter.java:36)
        at org.apache.lucene.util.TestRuleStoreClassName$1.evaluate(TestRuleStoreClassName.java:41)
        at com.carrotsearch.randomizedtesting.rules.NoShadowingOrOverridesOnMethodsRule$1.evaluate(NoShadowingOrOverridesOnMethodsRule.java:40)
        at com.carrotsearch.randomizedtesting.rules.NoShadowingOrOverridesOnMethodsRule$1.evaluate(NoShadowingOrOverridesOnMethodsRule.java:40)
        at com.carrotsearch.randomizedtesting.rules.StatementAdapter.evaluate(StatementAdapter.java:36)
        at com.carrotsearch.randomizedtesting.rules.StatementAdapter.evaluate(StatementAdapter.java:36)
        at com.carrotsearch.randomizedtesting.rules.StatementAdapter.evaluate(StatementAdapter.java:36)
        at org.apache.lucene.util.TestRuleAssertionsRequired$1.evaluate(TestRuleAssertionsRequired.java:53)
        at org.apache.lucene.util.TestRuleMarkFailure$1.evaluate(TestRuleMarkFailure.java:47)
        at org.apache.lucene.util.TestRuleIgnoreAfterMaxFailures$1.evaluate(TestRuleIgnoreAfterMaxFailures.java:64)
        at org.apache.lucene.util.TestRuleIgnoreTestSuites$1.evaluate(TestRuleIgnoreTestSuites.java:54)
        at com.carrotsearch.randomizedtesting.rules.StatementAdapter.evaluate(StatementAdapter.java:36)
        at com.carrotsearch.randomizedtesting.ThreadLeakControl$StatementRunner.run(ThreadLeakControl.java:368)
        at java.lang.Thread.run(Thread.java:748)


FAILED:  org.apache.solr.handler.TestContainerReqHandler.testCacheLoadFromPackage

Error Message:
Error from server at http://127.0.0.1:54359/solr: Underlying core creation failed while creating collection: globalCacheColl

Stack Trace:
org.apache.solr.client.solrj.impl.HttpSolrClient$RemoteSolrException: Error from server at http://127.0.0.1:54359/solr: Underlying core creation failed while creating collection: globalCacheColl
        at __randomizedtesting.SeedInfo.seed([8C8DA3E418A7D013:40A8F77A13F066F0]:0)
        at org.apache.solr.client.solrj.impl.HttpSolrClient.executeMethod(HttpSolrClient.java:656)
        at org.apache.solr.client.solrj.impl.HttpSolrClient.request(HttpSolrClient.java:262)
        at org.apache.solr.client.solrj.impl.HttpSolrClient.request(HttpSolrClient.java:245)
        at org.apache.solr.client.solrj.impl.LBSolrClient.doRequest(LBSolrClient.java:368)
        at org.apache.solr.client.solrj.impl.LBSolrClient.request(LBSolrClient.java:296)
        at org.apache.solr.client.solrj.impl.BaseCloudSolrClient.sendRequest(BaseCloudSolrClient.java:1128)
        at org.apache.solr.client.solrj.impl.BaseCloudSolrClient.requestWithRetryOnStaleState(BaseCloudSolrClient.java:897)
        at org.apache.solr.client.solrj.impl.BaseCloudSolrClient.request(BaseCloudSolrClient.java:829)
        at org.apache.solr.client.solrj.SolrRequest.process(SolrRequest.java:211)
        at org.apache.solr.client.solrj.SolrRequest.process(SolrRequest.java:228)
        at org.apache.solr.handler.TestContainerReqHandler.testCacheLoadFromPackage(TestContainerReqHandler.java:687)
        at sun.reflect.NativeMethodAccessorImpl.invoke0(Native Method)
        at sun.reflect.NativeMethodAccessorImpl.invoke(NativeMethodAccessorImpl.java:62)
        at sun.reflect.DelegatingMethodAccessorImpl.invoke(DelegatingMethodAccessorImpl.java:43)
        at java.lang.reflect.Method.invoke(Method.java:498)
        at com.carrotsearch.randomizedtesting.RandomizedRunner.invoke(RandomizedRunner.java:1750)
        at com.carrotsearch.randomizedtesting.RandomizedRunner$8.evaluate(RandomizedRunner.java:938)
        at com.carrotsearch.randomizedtesting.RandomizedRunner$9.evaluate(RandomizedRunner.java:974)
        at com.carrotsearch.randomizedtesting.RandomizedRunner$10.evaluate(RandomizedRunner.java:988)
        at com.carrotsearch.randomizedtesting.rules.SystemPropertiesRestoreRule$1.evaluate(SystemPropertiesRestoreRule.java:57)
        at org.apache.lucene.util.TestRuleSetupTeardownChained$1.evaluate(TestRuleSetupTeardownChained.java:49)
        at org.apache.lucene.util.AbstractBeforeAfterRule$1.evaluate(AbstractBeforeAfterRule.java:45)
        at org.apache.lucene.util.TestRuleThreadAndTestName$1.evaluate(TestRuleThreadAndTestName.java:48)
        at org.apache.lucene.util.TestRuleIgnoreAfterMaxFailures$1.evaluate(TestRuleIgnoreAfterMaxFailures.java:64)
        at org.apache.lucene.util.TestRuleMarkFailure$1.evaluate(TestRuleMarkFailure.java:47)
        at com.carrotsearch.randomizedtesting.rules.StatementAdapter.evaluate(StatementAdapter.java:36)
        at com.carrotsearch.randomizedtesting.ThreadLeakControl$StatementRunner.run(ThreadLeakControl.java:368)
        at com.carrotsearch.randomizedtesting.ThreadLeakControl.forkTimeoutingTask(ThreadLeakControl.java:817)
        at com.carrotsearch.randomizedtesting.ThreadLeakControl$3.evaluate(ThreadLeakControl.java:468)
        at com.carrotsearch.randomizedtesting.RandomizedRunner.runSingleTest(RandomizedRunner.java:947)
        at com.carrotsearch.randomizedtesting.RandomizedRunner$5.evaluate(RandomizedRunner.java:832)
        at com.carrotsearch.randomizedtesting.RandomizedRunner$6.evaluate(RandomizedRunner.java:883)
        at com.carrotsearch.randomizedtesting.RandomizedRunner$7.evaluate(RandomizedRunner.java:894)
        at com.carrotsearch.randomizedtesting.rules.StatementAdapter.evaluate(StatementAdapter.java:36)
        at com.carrotsearch.randomizedtesting.rules.SystemPropertiesRestoreRule$1.evaluate(SystemPropertiesRestoreRule.java:57)
        at org.apache.lucene.util.AbstractBeforeAfterRule$1.evaluate(AbstractBeforeAfterRule.java:45)
        at com.carrotsearch.randomizedtesting.rules.StatementAdapter.evaluate(StatementAdapter.java:36)
        at org.apache.lucene.util.TestRuleStoreClassName$1.evaluate(TestRuleStoreClassName.java:41)
        at com.carrotsearch.randomizedtesting.rules.NoShadowingOrOverridesOnMethodsRule$1.evaluate(NoShadowingOrOverridesOnMethodsRule.java:40)
        at com.carrotsearch.randomizedtesting.rules.NoShadowingOrOverridesOnMethodsRule$1.evaluate(NoShadowingOrOverridesOnMethodsRule.java:40)
        at com.carrotsearch.randomizedtesting.rules.StatementAdapter.evaluate(StatementAdapter.java:36)
        at com.carrotsearch.randomizedtesting.rules.StatementAdapter.evaluate(StatementAdapter.java:36)
        at com.carrotsearch.randomizedtesting.rules.StatementAdapter.evaluate(StatementAdapter.java:36)
        at org.apache.lucene.util.TestRuleAssertionsRequired$1.evaluate(TestRuleAssertionsRequired.java:53)
        at org.apache.lucene.util.TestRuleMarkFailure$1.evaluate(TestRuleMarkFailure.java:47)
        at org.apache.lucene.util.TestRuleIgnoreAfterMaxFailures$1.evaluate(TestRuleIgnoreAfterMaxFailures.java:64)
        at org.apache.lucene.util.TestRuleIgnoreTestSuites$1.evaluate(TestRuleIgnoreTestSuites.java:54)
        at com.carrotsearch.randomizedtesting.rules.StatementAdapter.evaluate(StatementAdapter.java:36)
        at com.carrotsearch.randomizedtesting.ThreadLeakControl$StatementRunner.run(ThreadLeakControl.java:368)
        at java.lang.Thread.run(Thread.java:748)


FAILED:  org.apache.solr.handler.TestContainerReqHandler.testPackageAPI

Error Message:
attempt: 9 Mismatch for value : '[requestHandler]' in response {   "responseHeader":{     "status":0,     "QTime":0},   "metadata":{"version":3},   "runtimeLib":[{       "name":"global",       "url":"http://localhost:55556/jar3.jar",       "60ec88c2a2e9b409f7afc309273383810a0d07a078b482434eda9674f7e25b8adafa8a67c9913c996cbfb78a7f6ad2b9db26dbd4fe0ca4068f248d5db563f922":"60ec88c2a2e9b409f7afc309273383810a0d07a078b482434eda9674f7e25b8adafa8a67c9913c996cbfb78a7f6ad2b9db26dbd4fe0ca4068f248d5db563f922",       "znodeVersion":3}],   "requestHandler":[{       "name":"bar",       "znodeVersion":3,       "class":"org.apache.solr.core.RuntimeLibReqHandler",       "package":"global"}]}

Stack Trace:
java.lang.AssertionError: attempt: 9 Mismatch for value : '[requestHandler]' in response {
  "responseHeader":{
    "status":0,
    "QTime":0},
  "metadata":{"version":3},
  "runtimeLib":[{
      "name":"global",
      "url":"http://localhost:55556/jar3.jar",
      "60ec88c2a2e9b409f7afc309273383810a0d07a078b482434eda9674f7e25b8adafa8a67c9913c996cbfb78a7f6ad2b9db26dbd4fe0ca4068f248d5db563f922":"60ec88c2a2e9b409f7afc309273383810a0d07a078b482434eda9674f7e25b8adafa8a67c9913c996cbfb78a7f6ad2b9db26dbd4fe0ca4068f248d5db563f922",
      "znodeVersion":3}],
  "requestHandler":[{
      "name":"bar",
      "znodeVersion":3,
      "class":"org.apache.solr.core.RuntimeLibReqHandler",
      "package":"global"}]}
        at __randomizedtesting.SeedInfo.seed([8C8DA3E418A7D013:FE82B6AAB4FC8A03]:0)
        at org.junit.Assert.fail(Assert.java:88)
        at org.apache.solr.handler.TestContainerReqHandler.assertResponseValues(TestContainerReqHandler.java:117)
        at org.apache.solr.handler.TestContainerReqHandler.testPackageAPI(TestContainerReqHandler.java:232)
        at sun.reflect.NativeMethodAccessorImpl.invoke0(Native Method)
        at sun.reflect.NativeMethodAccessorImpl.invoke(NativeMethodAccessorImpl.java:62)
        at sun.reflect.DelegatingMethodAccessorImpl.invoke(DelegatingMethodAccessorImpl.java:43)
        at java.lang.reflect.Method.invoke(Method.java:498)
        at com.carrotsearch.randomizedtesting.RandomizedRunner.invoke(RandomizedRunner.java:1750)
        at com.carrotsearch.randomizedtesting.RandomizedRunner$8.evaluate(RandomizedRunner.java:938)
        at com.carrotsearch.randomizedtesting.RandomizedRunner$9.evaluate(RandomizedRunner.java:974)
        at com.carrotsearch.randomizedtesting.RandomizedRunner$10.evaluate(RandomizedRunner.java:988)
        at com.carrotsearch.randomizedtesting.rules.SystemPropertiesRestoreRule$1.evaluate(SystemPropertiesRestoreRule.java:57)
        at org.apache.lucene.util.TestRuleSetupTeardownChained$1.evaluate(TestRuleSetupTeardownChained.java:49)
        at org.apache.lucene.util.AbstractBeforeAfterRule$1.evaluate(AbstractBeforeAfterRule.java:45)
        at org.apache.lucene.util.TestRuleThreadAndTestName$1.evaluate(TestRuleThreadAndTestName.java:48)
        at org.apache.lucene.util.TestRuleIgnoreAfterMaxFailures$1.evaluate(TestRuleIgnoreAfterMaxFailures.java:64)
        at org.apache.lucene.util.TestRuleMarkFailure$1.evaluate(TestRuleMarkFailure.java:47)
        at com.carrotsearch.randomizedtesting.rules.StatementAdapter.evaluate(StatementAdapter.java:36)
        at com.carrotsearch.randomizedtesting.ThreadLeakControl$StatementRunner.run(ThreadLeakControl.java:368)
        at com.carrotsearch.randomizedtesting.ThreadLeakControl.forkTimeoutingTask(ThreadLeakControl.java:817)
        at com.carrotsearch.randomizedtesting.ThreadLeakControl$3.evaluate(ThreadLeakControl.java:468)
        at com.carrotsearch.randomizedtesting.RandomizedRunner.runSingleTest(RandomizedRunner.java:947)
        at com.carrotsearch.randomizedtesting.RandomizedRunner$5.evaluate(RandomizedRunner.java:832)
        at com.carrotsearch.randomizedtesting.RandomizedRunner$6.evaluate(RandomizedRunner.java:883)
        at com.carrotsearch.randomizedtesting.RandomizedRunner$7.evaluate(RandomizedRunner.java:894)
        at com.carrotsearch.randomizedtesting.rules.StatementAdapter.evaluate(StatementAdapter.java:36)
        at com.carrotsearch.randomizedtesting.rules.SystemPropertiesRestoreRule$1.evaluate(SystemPropertiesRestoreRule.java:57)
        at org.apache.lucene.util.AbstractBeforeAfterRule$1.evaluate(AbstractBeforeAfterRule.java:45)
        at com.carrotsearch.randomizedtesting.rules.StatementAdapter.evaluate(StatementAdapter.java:36)
        at org.apache.lucene.util.TestRuleStoreClassName$1.evaluate(TestRuleStoreClassName.java:41)
        at com.carrotsearch.randomizedtesting.rules.NoShadowingOrOverridesOnMethodsRule$1.evaluate(NoShadowingOrOverridesOnMethodsRule.java:40)
        at com.carrotsearch.randomizedtesting.rules.NoShadowingOrOverridesOnMethodsRule$1.evaluate(NoShadowingOrOverridesOnMethodsRule.java:40)
        at com.carrotsearch.randomizedtesting.rules.StatementAdapter.evaluate(StatementAdapter.java:36)
        at com.carrotsearch.randomizedtesting.rules.StatementAdapter.evaluate(StatementAdapter.java:36)
        at com.carrotsearch.randomizedtesting.rules.StatementAdapter.evaluate(StatementAdapter.java:36)
        at org.apache.lucene.util.TestRuleAssertionsRequired$1.evaluate(TestRuleAssertionsRequired.java:53)
        at org.apache.lucene.util.TestRuleMarkFailure$1.evaluate(TestRuleMarkFailure.java:47)
        at org.apache.lucene.util.TestRuleIgnoreAfterMaxFailures$1.evaluate(TestRuleIgnoreAfterMaxFailures.java:64)
        at org.apache.lucene.util.TestRuleIgnoreTestSuites$1.evaluate(TestRuleIgnoreTestSuites.java:54)
        at com.carrotsearch.randomizedtesting.rules.StatementAdapter.evaluate(StatementAdapter.java:36)
        at com.carrotsearch.randomizedtesting.ThreadLeakControl$StatementRunner.run(ThreadLeakControl.java:368)
        at java.lang.Thread.run(Thread.java:748)


FAILED:  org.apache.solr.handler.TestContainerReqHandler.testCacheLoadFromPackage

Error Message:
Error from server at http://127.0.0.1:55774/solr: Underlying core creation failed while creating collection: globalCacheColl

Stack Trace:
org.apache.solr.client.solrj.impl.HttpSolrClient$RemoteSolrException: Error from server at http://127.0.0.1:55774/solr: Underlying core creation failed while creating collection: globalCacheColl
        at __randomizedtesting.SeedInfo.seed([8C8DA3E418A7D013:40A8F77A13F066F0]:0)
        at org.apache.solr.client.solrj.impl.HttpSolrClient.executeMethod(HttpSolrClient.java:656)
        at org.apache.solr.client.solrj.impl.HttpSolrClient.request(HttpSolrClient.java:262)
        at org.apache.solr.client.solrj.impl.HttpSolrClient.request(HttpSolrClient.java:245)
        at org.apache.solr.client.solrj.impl.LBSolrClient.doRequest(LBSolrClient.java:368)
        at org.apache.solr.client.solrj.impl.LBSolrClient.request(LBSolrClient.java:296)
        at org.apache.solr.client.solrj.impl.BaseCloudSolrClient.sendRequest(BaseCloudSolrClient.java:1128)
        at org.apache.solr.client.solrj.impl.BaseCloudSolrClient.requestWithRetryOnStaleState(BaseCloudSolrClient.java:897)
        at org.apache.solr.client.solrj.impl.BaseCloudSolrClient.request(BaseCloudSolrClient.java:829)
        at org.apache.solr.client.solrj.SolrRequest.process(SolrRequest.java:211)
        at org.apache.solr.client.solrj.SolrRequest.process(SolrRequest.java:228)
        at org.apache.solr.handler.TestContainerReqHandler.testCacheLoadFromPackage(TestContainerReqHandler.java:687)
        at sun.reflect.NativeMethodAccessorImpl.invoke0(Native Method)
        at sun.reflect.NativeMethodAccessorImpl.invoke(NativeMethodAccessorImpl.java:62)
        at sun.reflect.DelegatingMethodAccessorImpl.invoke(DelegatingMethodAccessorImpl.java:43)
        at java.lang.reflect.Method.invoke(Method.java:498)
        at com.carrotsearch.randomizedtesting.RandomizedRunner.invoke(RandomizedRunner.java:1750)
        at com.carrotsearch.randomizedtesting.RandomizedRunner$8.evaluate(RandomizedRunner.java:938)
        at com.carrotsearch.randomizedtesting.RandomizedRunner$9.evaluate(RandomizedRunner.java:974)
        at com.carrotsearch.randomizedtesting.RandomizedRunner$10.evaluate(RandomizedRunner.java:988)
        at com.carrotsearch.randomizedtesting.rules.SystemPropertiesRestoreRule$1.evaluate(SystemPropertiesRestoreRule.java:57)
        at org.apache.lucene.util.TestRuleSetupTeardownChained$1.evaluate(TestRuleSetupTeardownChained.java:49)
        at org.apache.lucene.util.AbstractBeforeAfterRule$1.evaluate(AbstractBeforeAfterRule.java:45)
        at org.apache.lucene.util.TestRuleThreadAndTestName$1.evaluate(TestRuleThreadAndTestName.java:48)
        at org.apache.lucene.util.TestRuleIgnoreAfterMaxFailures$1.evaluate(TestRuleIgnoreAfterMaxFailures.java:64)
        at org.apache.lucene.util.TestRuleMarkFailure$1.evaluate(TestRuleMarkFailure.java:47)
        at com.carrotsearch.randomizedtesting.rules.StatementAdapter.evaluate(StatementAdapter.java:36)
        at com.carrotsearch.randomizedtesting.ThreadLeakControl$StatementRunner.run(ThreadLeakControl.java:368)
        at com.carrotsearch.randomizedtesting.ThreadLeakControl.forkTimeoutingTask(ThreadLeakControl.java:817)
        at com.carrotsearch.randomizedtesting.ThreadLeakControl$3.evaluate(ThreadLeakControl.java:468)
        at com.carrotsearch.randomizedtesting.RandomizedRunner.runSingleTest(RandomizedRunner.java:947)
        at com.carrotsearch.randomizedtesting.RandomizedRunner$5.evaluate(RandomizedRunner.java:832)
        at com.carrotsearch.randomizedtesting.RandomizedRunner$6.evaluate(RandomizedRunner.java:883)
        at com.carrotsearch.randomizedtesting.RandomizedRunner$7.evaluate(RandomizedRunner.java:894)
        at com.carrotsearch.randomizedtesting.rules.StatementAdapter.evaluate(StatementAdapter.java:36)
        at com.carrotsearch.randomizedtesting.rules.SystemPropertiesRestoreRule$1.evaluate(SystemPropertiesRestoreRule.java:57)
        at org.apache.lucene.util.AbstractBeforeAfterRule$1.evaluate(AbstractBeforeAfterRule.java:45)
        at com.carrotsearch.randomizedtesting.rules.StatementAdapter.evaluate(StatementAdapter.java:36)
        at org.apache.lucene.util.TestRuleStoreClassName$1.evaluate(TestRuleStoreClassName.java:41)
        at com.carrotsearch.randomizedtesting.rules.NoShadowingOrOverridesOnMethodsRule$1.evaluate(NoShadowingOrOverridesOnMethodsRule.java:40)
        at com.carrotsearch.randomizedtesting.rules.NoShadowingOrOverridesOnMethodsRule$1.evaluate(NoShadowingOrOverridesOnMethodsRule.java:40)
        at com.carrotsearch.randomizedtesting.rules.StatementAdapter.evaluate(StatementAdapter.java:36)
        at com.carrotsearch.randomizedtesting.rules.StatementAdapter.evaluate(StatementAdapter.java:36)
        at com.carrotsearch.randomizedtesting.rules.StatementAdapter.evaluate(StatementAdapter.java:36)
        at org.apache.lucene.util.TestRuleAssertionsRequired$1.evaluate(TestRuleAssertionsRequired.java:53)
        at org.apache.lucene.util.TestRuleMarkFailure$1.evaluate(TestRuleMarkFailure.java:47)
        at org.apache.lucene.util.TestRuleIgnoreAfterMaxFailures$1.evaluate(TestRuleIgnoreAfterMaxFailures.java:64)
        at org.apache.lucene.util.TestRuleIgnoreTestSuites$1.evaluate(TestRuleIgnoreTestSuites.java:54)
        at com.carrotsearch.randomizedtesting.rules.StatementAdapter.evaluate(StatementAdapter.java:36)
        at com.carrotsearch.randomizedtesting.ThreadLeakControl$StatementRunner.run(ThreadLeakControl.java:368)
        at java.lang.Thread.run(Thread.java:748)


FAILED:  org.apache.solr.handler.TestContainerReqHandler.testPackageAPI

Error Message:
attempt: 9 Mismatch for value : '[requestHandler]' in response {   "responseHeader":{     "status":0,     "QTime":0},   "metadata":{"version":3},   "runtimeLib":[{       "name":"global",       "url":"http://localhost:56470/jar3.jar",       "60ec88c2a2e9b409f7afc309273383810a0d07a078b482434eda9674f7e25b8adafa8a67c9913c996cbfb78a7f6ad2b9db26dbd4fe0ca4068f248d5db563f922":"60ec88c2a2e9b409f7afc309273383810a0d07a078b482434eda9674f7e25b8adafa8a67c9913c996cbfb78a7f6ad2b9db26dbd4fe0ca4068f248d5db563f922",       "znodeVersion":3}],   "requestHandler":[{       "name":"bar",       "znodeVersion":3,       "class":"org.apache.solr.core.RuntimeLibReqHandler",       "package":"global"}]}

Stack Trace:
java.lang.AssertionError: attempt: 9 Mismatch for value : '[requestHandler]' in response {
  "responseHeader":{
    "status":0,
    "QTime":0},
  "metadata":{"version":3},
  "runtimeLib":[{
      "name":"global",
      "url":"http://localhost:56470/jar3.jar",
      "60ec88c2a2e9b409f7afc309273383810a0d07a078b482434eda9674f7e25b8adafa8a67c9913c996cbfb78a7f6ad2b9db26dbd4fe0ca4068f248d5db563f922":"60ec88c2a2e9b409f7afc309273383810a0d07a078b482434eda9674f7e25b8adafa8a67c9913c996cbfb78a7f6ad2b9db26dbd4fe0ca4068f248d5db563f922",
      "znodeVersion":3}],
  "requestHandler":[{
      "name":"bar",
      "znodeVersion":3,
      "class":"org.apache.solr.core.RuntimeLibReqHandler",
      "package":"global"}]}
        at __randomizedtesting.SeedInfo.seed([8C8DA3E418A7D013:FE82B6AAB4FC8A03]:0)
        at org.junit.Assert.fail(Assert.java:88)
        at org.apache.solr.handler.TestContainerReqHandler.assertResponseValues(TestContainerReqHandler.java:117)
        at org.apache.solr.handler.TestContainerReqHandler.testPackageAPI(TestContainerReqHandler.java:232)
        at sun.reflect.NativeMethodAccessorImpl.invoke0(Native Method)
        at sun.reflect.NativeMethodAccessorImpl.invoke(NativeMethodAccessorImpl.java:62)
        at sun.reflect.DelegatingMethodAccessorImpl.invoke(DelegatingMethodAccessorImpl.java:43)
        at java.lang.reflect.Method.invoke(Method.java:498)
        at com.carrotsearch.randomizedtesting.RandomizedRunner.invoke(RandomizedRunner.java:1750)
        at com.carrotsearch.randomizedtesting.RandomizedRunner$8.evaluate(RandomizedRunner.java:938)
        at com.carrotsearch.randomizedtesting.RandomizedRunner$9.evaluate(RandomizedRunner.java:974)
        at com.carrotsearch.randomizedtesting.RandomizedRunner$10.evaluate(RandomizedRunner.java:988)
        at com.carrotsearch.randomizedtesting.rules.SystemPropertiesRestoreRule$1.evaluate(SystemPropertiesRestoreRule.java:57)
        at org.apache.lucene.util.TestRuleSetupTeardownChained$1.evaluate(TestRuleSetupTeardownChained.java:49)
        at org.apache.lucene.util.AbstractBeforeAfterRule$1.evaluate(AbstractBeforeAfterRule.java:45)
        at org.apache.lucene.util.TestRuleThreadAndTestName$1.evaluate(TestRuleThreadAndTestName.java:48)
        at org.apache.lucene.util.TestRuleIgnoreAfterMaxFailures$1.evaluate(TestRuleIgnoreAfterMaxFailures.java:64)
        at org.apache.lucene.util.TestRuleMarkFailure$1.evaluate(TestRuleMarkFailure.java:47)
        at com.carrotsearch.randomizedtesting.rules.StatementAdapter.evaluate(StatementAdapter.java:36)
        at com.carrotsearch.randomizedtesting.ThreadLeakControl$StatementRunner.run(ThreadLeakControl.java:368)
        at com.carrotsearch.randomizedtesting.ThreadLeakControl.forkTimeoutingTask(ThreadLeakControl.java:817)
        at com.carrotsearch.randomizedtesting.ThreadLeakControl$3.evaluate(ThreadLeakControl.java:468)
        at com.carrotsearch.randomizedtesting.RandomizedRunner.runSingleTest(RandomizedRunner.java:947)
        at com.carrotsearch.randomizedtesting.RandomizedRunner$5.evaluate(RandomizedRunner.java:832)
        at com.carrotsearch.randomizedtesting.RandomizedRunner$6.evaluate(RandomizedRunner.java:883)
        at com.carrotsearch.randomizedtesting.RandomizedRunner$7.evaluate(RandomizedRunner.java:894)
        at com.carrotsearch.randomizedtesting.rules.StatementAdapter.evaluate(StatementAdapter.java:36)
        at com.carrotsearch.randomizedtesting.rules.SystemPropertiesRestoreRule$1.evaluate(SystemPropertiesRestoreRule.java:57)
        at org.apache.lucene.util.AbstractBeforeAfterRule$1.evaluate(AbstractBeforeAfterRule.java:45)
        at com.carrotsearch.randomizedtesting.rules.StatementAdapter.evaluate(StatementAdapter.java:36)
        at org.apache.lucene.util.TestRuleStoreClassName$1.evaluate(TestRuleStoreClassName.java:41)
        at com.carrotsearch.randomizedtesting.rules.NoShadowingOrOverridesOnMethodsRule$1.evaluate(NoShadowingOrOverridesOnMethodsRule.java:40)
        at com.carrotsearch.randomizedtesting.rules.NoShadowingOrOverridesOnMethodsRule$1.evaluate(NoShadowingOrOverridesOnMethodsRule.java:40)
        at com.carrotsearch.randomizedtesting.rules.StatementAdapter.evaluate(StatementAdapter.java:36)
        at com.carrotsearch.randomizedtesting.rules.StatementAdapter.evaluate(StatementAdapter.java:36)
        at com.carrotsearch.randomizedtesting.rules.StatementAdapter.evaluate(StatementAdapter.java:36)
        at org.apache.lucene.util.TestRuleAssertionsRequired$1.evaluate(TestRuleAssertionsRequired.java:53)
        at org.apache.lucene.util.TestRuleMarkFailure$1.evaluate(TestRuleMarkFailure.java:47)
        at org.apache.lucene.util.TestRuleIgnoreAfterMaxFailures$1.evaluate(TestRuleIgnoreAfterMaxFailures.java:64)
        at org.apache.lucene.util.TestRuleIgnoreTestSuites$1.evaluate(TestRuleIgnoreTestSuites.java:54)
        at com.carrotsearch.randomizedtesting.rules.StatementAdapter.evaluate(StatementAdapter.java:36)
        at com.carrotsearch.randomizedtesting.ThreadLeakControl$StatementRunner.run(ThreadLeakControl.java:368)
        at java.lang.Thread.run(Thread.java:748)


FAILED:  org.apache.solr.handler.TestContainerReqHandler.testCacheLoadFromPackage

Error Message:
Error from server at http://127.0.0.1:56058/solr: Underlying core creation failed while creating collection: globalCacheColl

Stack Trace:
org.apache.solr.client.solrj.impl.HttpSolrClient$RemoteSolrException: Error from server at http://127.0.0.1:56058/solr: Underlying core creation failed while creating collection: globalCacheColl
        at __randomizedtesting.SeedInfo.seed([8C8DA3E418A7D013:40A8F77A13F066F0]:0)
        at org.apache.solr.client.solrj.impl.HttpSolrClient.executeMethod(HttpSolrClient.java:656)
        at org.apache.solr.client.solrj.impl.HttpSolrClient.request(HttpSolrClient.java:262)
        at org.apache.solr.client.solrj.impl.HttpSolrClient.request(HttpSolrClient.java:245)
        at org.apache.solr.client.solrj.impl.LBSolrClient.doRequest(LBSolrClient.java:368)
        at org.apache.solr.client.solrj.impl.LBSolrClient.request(LBSolrClient.java:296)
        at org.apache.solr.client.solrj.impl.BaseCloudSolrClient.sendRequest(BaseCloudSolrClient.java:1128)
        at org.apache.solr.client.solrj.impl.BaseCloudSolrClient.requestWithRetryOnStaleState(BaseCloudSolrClient.java:897)
        at org.apache.solr.client.solrj.impl.BaseCloudSolrClient.request(BaseCloudSolrClient.java:829)
        at org.apache.solr.client.solrj.SolrRequest.process(SolrRequest.java:211)
        at org.apache.solr.client.solrj.SolrRequest.process(SolrRequest.java:228)
        at org.apache.solr.handler.TestContainerReqHandler.testCacheLoadFromPackage(TestContainerReqHandler.java:687)
        at sun.reflect.NativeMethodAccessorImpl.invoke0(Native Method)
        at sun.reflect.NativeMethodAccessorImpl.invoke(NativeMethodAccessorImpl.java:62)
        at sun.reflect.DelegatingMethodAccessorImpl.invoke(DelegatingMethodAccessorImpl.java:43)
        at java.lang.reflect.Method.invoke(Method.java:498)
        at com.carrotsearch.randomizedtesting.RandomizedRunner.invoke(RandomizedRunner.java:1750)
        at com.carrotsearch.randomizedtesting.RandomizedRunner$8.evaluate(RandomizedRunner.java:938)
        at com.carrotsearch.randomizedtesting.RandomizedRunner$9.evaluate(RandomizedRunner.java:974)
        at com.carrotsearch.randomizedtesting.RandomizedRunner$10.evaluate(RandomizedRunner.java:988)
        at com.carrotsearch.randomizedtesting.rules.SystemPropertiesRestoreRule$1.evaluate(SystemPropertiesRestoreRule.java:57)
        at org.apache.lucene.util.TestRuleSetupTeardownChained$1.evaluate(TestRuleSetupTeardownChained.java:49)
        at org.apache.lucene.util.AbstractBeforeAfterRule$1.evaluate(AbstractBeforeAfterRule.java:45)
        at org.apache.lucene.util.TestRuleThreadAndTestName$1.evaluate(TestRuleThreadAndTestName.java:48)
        at org.apache.lucene.util.TestRuleIgnoreAfterMaxFailures$1.evaluate(TestRuleIgnoreAfterMaxFailures.java:64)
        at org.apache.lucene.util.TestRuleMarkFailure$1.evaluate(TestRuleMarkFailure.java:47)
        at com.carrotsearch.randomizedtesting.rules.StatementAdapter.evaluate(StatementAdapter.java:36)
        at com.carrotsearch.randomizedtesting.ThreadLeakControl$StatementRunner.run(ThreadLeakControl.java:368)
        at com.carrotsearch.randomizedtesting.ThreadLeakControl.forkTimeoutingTask(ThreadLeakControl.java:817)
        at com.carrotsearch.randomizedtesting.ThreadLeakControl$3.evaluate(ThreadLeakControl.java:468)
        at com.carrotsearch.randomizedtesting.RandomizedRunner.runSingleTest(RandomizedRunner.java:947)
        at com.carrotsearch.randomizedtesting.RandomizedRunner$5.evaluate(RandomizedRunner.java:832)
        at com.carrotsearch.randomizedtesting.RandomizedRunner$6.evaluate(RandomizedRunner.java:883)
        at com.carrotsearch.randomizedtesting.RandomizedRunner$7.evaluate(RandomizedRunner.java:894)
        at com.carrotsearch.randomizedtesting.rules.StatementAdapter.evaluate(StatementAdapter.java:36)
        at com.carrotsearch.randomizedtesting.rules.SystemPropertiesRestoreRule$1.evaluate(SystemPropertiesRestoreRule.java:57)
        at org.apache.lucene.util.AbstractBeforeAfterRule$1.evaluate(AbstractBeforeAfterRule.java:45)
        at com.carrotsearch.randomizedtesting.rules.StatementAdapter.evaluate(StatementAdapter.java:36)
        at org.apache.lucene.util.TestRuleStoreClassName$1.evaluate(TestRuleStoreClassName.java:41)
        at com.carrotsearch.randomizedtesting.rules.NoShadowingOrOverridesOnMethodsRule$1.evaluate(NoShadowingOrOverridesOnMethodsRule.java:40)
        at com.carrotsearch.randomizedtesting.rules.NoShadowingOrOverridesOnMethodsRule$1.evaluate(NoShadowingOrOverridesOnMethodsRule.java:40)
        at com.carrotsearch.randomizedtesting.rules.StatementAdapter.evaluate(StatementAdapter.java:36)
        at com.carrotsearch.randomizedtesting.rules.StatementAdapter.evaluate(StatementAdapter.java:36)
        at com.carrotsearch.randomizedtesting.rules.StatementAdapter.evaluate(StatementAdapter.java:36)
        at org.apache.lucene.util.TestRuleAssertionsRequired$1.evaluate(TestRuleAssertionsRequired.java:53)
        at org.apache.lucene.util.TestRuleMarkFailure$1.evaluate(TestRuleMarkFailure.java:47)
        at org.apache.lucene.util.TestRuleIgnoreAfterMaxFailures$1.evaluate(TestRuleIgnoreAfterMaxFailures.java:64)
        at org.apache.lucene.util.TestRuleIgnoreTestSuites$1.evaluate(TestRuleIgnoreTestSuites.java:54)
        at com.carrotsearch.randomizedtesting.rules.StatementAdapter.evaluate(StatementAdapter.java:36)
        at com.carrotsearch.randomizedtesting.ThreadLeakControl$StatementRunner.run(ThreadLeakControl.java:368)
        at java.lang.Thread.run(Thread.java:748)


FAILED:  org.apache.solr.handler.TestContainerReqHandler.testPackageAPI

Error Message:
attempt: 9 Mismatch for value : '[requestHandler]' in response {   "responseHeader":{     "status":0,     "QTime":0},   "metadata":{"version":3},   "runtimeLib":[{       "name":"global",       "url":"http://localhost:57075/jar3.jar",       "60ec88c2a2e9b409f7afc309273383810a0d07a078b482434eda9674f7e25b8adafa8a67c9913c996cbfb78a7f6ad2b9db26dbd4fe0ca4068f248d5db563f922":"60ec88c2a2e9b409f7afc309273383810a0d07a078b482434eda9674f7e25b8adafa8a67c9913c996cbfb78a7f6ad2b9db26dbd4fe0ca4068f248d5db563f922",       "znodeVersion":3}],   "requestHandler":[{       "name":"bar",       "znodeVersion":3,       "class":"org.apache.solr.core.RuntimeLibReqHandler",       "package":"global"}]}

Stack Trace:
java.lang.AssertionError: attempt: 9 Mismatch for value : '[requestHandler]' in response {
  "responseHeader":{
    "status":0,
    "QTime":0},
  "metadata":{"version":3},
  "runtimeLib":[{
      "name":"global",
      "url":"http://localhost:57075/jar3.jar",
      "60ec88c2a2e9b409f7afc309273383810a0d07a078b482434eda9674f7e25b8adafa8a67c9913c996cbfb78a7f6ad2b9db26dbd4fe0ca4068f248d5db563f922":"60ec88c2a2e9b409f7afc309273383810a0d07a078b482434eda9674f7e25b8adafa8a67c9913c996cbfb78a7f6ad2b9db26dbd4fe0ca4068f248d5db563f922",
      "znodeVersion":3}],
  "requestHandler":[{
      "name":"bar",
      "znodeVersion":3,
      "class":"org.apache.solr.core.RuntimeLibReqHandler",
      "package":"global"}]}
        at __randomizedtesting.SeedInfo.seed([8C8DA3E418A7D013:FE82B6AAB4FC8A03]:0)
        at org.junit.Assert.fail(Assert.java:88)
        at org.apache.solr.handler.TestContainerReqHandler.assertResponseValues(TestContainerReqHandler.java:117)
        at org.apache.solr.handler.TestContainerReqHandler.testPackageAPI(TestContainerReqHandler.java:232)
        at sun.reflect.NativeMethodAccessorImpl.invoke0(Native Method)
        at sun.reflect.NativeMethodAccessorImpl.invoke(NativeMethodAccessorImpl.java:62)
        at sun.reflect.DelegatingMethodAccessorImpl.invoke(DelegatingMethodAccessorImpl.java:43)
        at java.lang.reflect.Method.invoke(Method.java:498)
        at com.carrotsearch.randomizedtesting.RandomizedRunner.invoke(RandomizedRunner.java:1750)
        at com.carrotsearch.randomizedtesting.RandomizedRunner$8.evaluate(RandomizedRunner.java:938)
        at com.carrotsearch.randomizedtesting.RandomizedRunner$9.evaluate(RandomizedRunner.java:974)
        at com.carrotsearch.randomizedtesting.RandomizedRunner$10.evaluate(RandomizedRunner.java:988)
        at com.carrotsearch.randomizedtesting.rules.SystemPropertiesRestoreRule$1.evaluate(SystemPropertiesRestoreRule.java:57)
        at org.apache.lucene.util.TestRuleSetupTeardownChained$1.evaluate(TestRuleSetupTeardownChained.java:49)
        at org.apache.lucene.util.AbstractBeforeAfterRule$1.evaluate(AbstractBeforeAfterRule.java:45)
        at org.apache.lucene.util.TestRuleThreadAndTestName$1.evaluate(TestRuleThreadAndTestName.java:48)
        at org.apache.lucene.util.TestRuleIgnoreAfterMaxFailures$1.evaluate(TestRuleIgnoreAfterMaxFailures.java:64)
        at org.apache.lucene.util.TestRuleMarkFailure$1.evaluate(TestRuleMarkFailure.java:47)
        at com.carrotsearch.randomizedtesting.rules.StatementAdapter.evaluate(StatementAdapter.java:36)
        at com.carrotsearch.randomizedtesting.ThreadLeakControl$StatementRunner.run(ThreadLeakControl.java:368)
        at com.carrotsearch.randomizedtesting.ThreadLeakControl.forkTimeoutingTask(ThreadLeakControl.java:817)
        at com.carrotsearch.randomizedtesting.ThreadLeakControl$3.evaluate(ThreadLeakControl.java:468)
        at com.carrotsearch.randomizedtesting.RandomizedRunner.runSingleTest(RandomizedRunner.java:947)
        at com.carrotsearch.randomizedtesting.RandomizedRunner$5.evaluate(RandomizedRunner.java:832)
        at com.carrotsearch.randomizedtesting.RandomizedRunner$6.evaluate(RandomizedRunner.java:883)
        at com.carrotsearch.randomizedtesting.RandomizedRunner$7.evaluate(RandomizedRunner.java:894)
        at com.carrotsearch.randomizedtesting.rules.StatementAdapter.evaluate(StatementAdapter.java:36)
        at com.carrotsearch.randomizedtesting.rules.SystemPropertiesRestoreRule$1.evaluate(SystemPropertiesRestoreRule.java:57)
        at org.apache.lucene.util.AbstractBeforeAfterRule$1.evaluate(AbstractBeforeAfterRule.java:45)
        at com.carrotsearch.randomizedtesting.rules.StatementAdapter.evaluate(StatementAdapter.java:36)
        at org.apache.lucene.util.TestRuleStoreClassName$1.evaluate(TestRuleStoreClassName.java:41)
        at com.carrotsearch.randomizedtesting.rules.NoShadowingOrOverridesOnMethodsRule$1.evaluate(NoShadowingOrOverridesOnMethodsRule.java:40)
        at com.carrotsearch.randomizedtesting.rules.NoShadowingOrOverridesOnMethodsRule$1.evaluate(NoShadowingOrOverridesOnMethodsRule.java:40)
        at com.carrotsearch.randomizedtesting.rules.StatementAdapter.evaluate(StatementAdapter.java:36)
        at com.carrotsearch.randomizedtesting.rules.StatementAdapter.evaluate(StatementAdapter.java:36)
        at com.carrotsearch.randomizedtesting.rules.StatementAdapter.evaluate(StatementAdapter.java:36)
        at org.apache.lucene.util.TestRuleAssertionsRequired$1.evaluate(TestRuleAssertionsRequired.java:53)
        at org.apache.lucene.util.TestRuleMarkFailure$1.evaluate(TestRuleMarkFailure.java:47)
        at org.apache.lucene.util.TestRuleIgnoreAfterMaxFailures$1.evaluate(TestRuleIgnoreAfterMaxFailures.java:64)
        at org.apache.lucene.util.TestRuleIgnoreTestSuites$1.evaluate(TestRuleIgnoreTestSuites.java:54)
        at com.carrotsearch.randomizedtesting.rules.StatementAdapter.evaluate(StatementAdapter.java:36)
        at com.carrotsearch.randomizedtesting.ThreadLeakControl$StatementRunner.run(ThreadLeakControl.java:368)
        at java.lang.Thread.run(Thread.java:748)


FAILED:  org.apache.solr.handler.TestContainerReqHandler.testCacheLoadFromPackage

Error Message:
Error from server at http://127.0.0.1:53507/solr: Underlying core creation failed while creating collection: globalCacheColl

Stack Trace:
org.apache.solr.client.solrj.impl.HttpSolrClient$RemoteSolrException: Error from server at http://127.0.0.1:53507/solr: Underlying core creation failed while creating collection: globalCacheColl
        at __randomizedtesting.SeedInfo.seed([8C8DA3E418A7D013:40A8F77A13F066F0]:0)
        at org.apache.solr.client.solrj.impl.HttpSolrClient.executeMethod(HttpSolrClient.java:656)
        at org.apache.solr.client.solrj.impl.HttpSolrClient.request(HttpSolrClient.java:262)
        at org.apache.solr.client.solrj.impl.HttpSolrClient.request(HttpSolrClient.java:245)
        at org.apache.solr.client.solrj.impl.LBSolrClient.doRequest(LBSolrClient.java:368)
        at org.apache.solr.client.solrj.impl.LBSolrClient.request(LBSolrClient.java:296)
        at org.apache.solr.client.solrj.impl.BaseCloudSolrClient.sendRequest(BaseCloudSolrClient.java:1128)
        at org.apache.solr.client.solrj.impl.BaseCloudSolrClient.requestWithRetryOnStaleState(BaseCloudSolrClient.java:897)
        at org.apache.solr.client.solrj.impl.BaseCloudSolrClient.request(BaseCloudSolrClient.java:829)
        at org.apache.solr.client.solrj.SolrRequest.process(SolrRequest.java:211)
        at org.apache.solr.client.solrj.SolrRequest.process(SolrRequest.java:228)
        at org.apache.solr.handler.TestContainerReqHandler.testCacheLoadFromPackage(TestContainerReqHandler.java:687)
        at sun.reflect.NativeMethodAccessorImpl.invoke0(Native Method)
        at sun.reflect.NativeMethodAccessorImpl.invoke(NativeMethodAccessorImpl.java:62)
        at sun.reflect.DelegatingMethodAccessorImpl.invoke(DelegatingMethodAccessorImpl.java:43)
        at java.lang.reflect.Method.invoke(Method.java:498)
        at com.carrotsearch.randomizedtesting.RandomizedRunner.invoke(RandomizedRunner.java:1750)
        at com.carrotsearch.randomizedtesting.RandomizedRunner$8.evaluate(RandomizedRunner.java:938)
        at com.carrotsearch.randomizedtesting.RandomizedRunner$9.evaluate(RandomizedRunner.java:974)
        at com.carrotsearch.randomizedtesting.RandomizedRunner$10.evaluate(RandomizedRunner.java:988)
        at com.carrotsearch.randomizedtesting.rules.SystemPropertiesRestoreRule$1.evaluate(SystemPropertiesRestoreRule.java:57)
        at org.apache.lucene.util.TestRuleSetupTeardownChained$1.evaluate(TestRuleSetupTeardownChained.java:49)
        at org.apache.lucene.util.AbstractBeforeAfterRule$1.evaluate(AbstractBeforeAfterRule.java:45)
        at org.apache.lucene.util.TestRuleThreadAndTestName$1.evaluate(TestRuleThreadAndTestName.java:48)
        at org.apache.lucene.util.TestRuleIgnoreAfterMaxFailures$1.evaluate(TestRuleIgnoreAfterMaxFailures.java:64)
        at org.apache.lucene.util.TestRuleMarkFailure$1.evaluate(TestRuleMarkFailure.java:47)
        at com.carrotsearch.randomizedtesting.rules.StatementAdapter.evaluate(StatementAdapter.java:36)
        at com.carrotsearch.randomizedtesting.ThreadLeakControl$StatementRunner.run(ThreadLeakControl.java:368)
        at com.carrotsearch.randomizedtesting.ThreadLeakControl.forkTimeoutingTask(ThreadLeakControl.java:817)
        at com.carrotsearch.randomizedtesting.ThreadLeakControl$3.evaluate(ThreadLeakControl.java:468)
        at com.carrotsearch.randomizedtesting.RandomizedRunner.runSingleTest(RandomizedRunner.java:947)
        at com.carrotsearch.randomizedtesting.RandomizedRunner$5.evaluate(RandomizedRunner.java:832)
        at com.carrotsearch.randomizedtesting.RandomizedRunner$6.evaluate(RandomizedRunner.java:883)
        at com.carrotsearch.randomizedtesting.RandomizedRunner$7.evaluate(RandomizedRunner.java:894)
        at com.carrotsearch.randomizedtesting.rules.StatementAdapter.evaluate(StatementAdapter.java:36)
        at com.carrotsearch.randomizedtesting.rules.SystemPropertiesRestoreRule$1.evaluate(SystemPropertiesRestoreRule.java:57)
        at org.apache.lucene.util.AbstractBeforeAfterRule$1.evaluate(AbstractBeforeAfterRule.java:45)
        at com.carrotsearch.randomizedtesting.rules.StatementAdapter.evaluate(StatementAdapter.java:36)
        at org.apache.lucene.util.TestRuleStoreClassName$1.evaluate(TestRuleStoreClassName.java:41)
        at com.carrotsearch.randomizedtesting.rules.NoShadowingOrOverridesOnMethodsRule$1.evaluate(NoShadowingOrOverridesOnMethodsRule.java:40)
        at com.carrotsearch.randomizedtesting.rules.NoShadowingOrOverridesOnMethodsRule$1.evaluate(NoShadowingOrOverridesOnMethodsRule.java:40)
        at com.carrotsearch.randomizedtesting.rules.StatementAdapter.evaluate(StatementAdapter.java:36)
        at com.carrotsearch.randomizedtesting.rules.StatementAdapter.evaluate(StatementAdapter.java:36)
        at com.carrotsearch.randomizedtesting.rules.StatementAdapter.evaluate(StatementAdapter.java:36)
        at org.apache.lucene.util.TestRuleAssertionsRequired$1.evaluate(TestRuleAssertionsRequired.java:53)
        at org.apache.lucene.util.TestRuleMarkFailure$1.evaluate(TestRuleMarkFailure.java:47)
        at org.apache.lucene.util.TestRuleIgnoreAfterMaxFailures$1.evaluate(TestRuleIgnoreAfterMaxFailures.java:64)
        at org.apache.lucene.util.TestRuleIgnoreTestSuites$1.evaluate(TestRuleIgnoreTestSuites.java:54)
        at com.carrotsearch.randomizedtesting.rules.StatementAdapter.evaluate(StatementAdapter.java:36)
        at com.carrotsearch.randomizedtesting.ThreadLeakControl$StatementRunner.run(ThreadLeakControl.java:368)
        at java.lang.Thread.run(Thread.java:748)


FAILED:  org.apache.solr.handler.TestContainerReqHandler.testCacheLoadFromPackage

Error Message:
Error from server at http://127.0.0.1:60442/solr: Underlying core creation failed while creating collection: globalCacheColl

Stack Trace:
org.apache.solr.client.solrj.impl.HttpSolrClient$RemoteSolrException: Error from server at http://127.0.0.1:60442/solr: Underlying core creation failed while creating collection: globalCacheColl
        at __randomizedtesting.SeedInfo.seed([8C8DA3E418A7D013:40A8F77A13F066F0]:0)
        at org.apache.solr.client.solrj.impl.HttpSolrClient.executeMethod(HttpSolrClient.java:656)
        at org.apache.solr.client.solrj.impl.HttpSolrClient.request(HttpSolrClient.java:262)
        at org.apache.solr.client.solrj.impl.HttpSolrClient.request(HttpSolrClient.java:245)
        at org.apache.solr.client.solrj.impl.LBSolrClient.doRequest(LBSolrClient.java:368)
        at org.apache.solr.client.solrj.impl.LBSolrClient.request(LBSolrClient.java:296)
        at org.apache.solr.client.solrj.impl.BaseCloudSolrClient.sendRequest(BaseCloudSolrClient.java:1128)
        at org.apache.solr.client.solrj.impl.BaseCloudSolrClient.requestWithRetryOnStaleState(BaseCloudSolrClient.java:897)
        at org.apache.solr.client.solrj.impl.BaseCloudSolrClient.request(BaseCloudSolrClient.java:829)
        at org.apache.solr.client.solrj.SolrRequest.process(SolrRequest.java:211)
        at org.apache.solr.client.solrj.SolrRequest.process(SolrRequest.java:228)
        at org.apache.solr.handler.TestContainerReqHandler.testCacheLoadFromPackage(TestContainerReqHandler.java:687)
        at sun.reflect.NativeMethodAccessorImpl.invoke0(Native Method)
        at sun.reflect.NativeMethodAccessorImpl.invoke(NativeMethodAccessorImpl.java:62)
        at sun.reflect.DelegatingMethodAccessorImpl.invoke(DelegatingMethodAccessorImpl.java:43)
        at java.lang.reflect.Method.invoke(Method.java:498)
        at com.carrotsearch.randomizedtesting.RandomizedRunner.invoke(RandomizedRunner.java:1750)
        at com.carrotsearch.randomizedtesting.RandomizedRunner$8.evaluate(RandomizedRunner.java:938)
        at com.carrotsearch.randomizedtesting.RandomizedRunner$9.evaluate(RandomizedRunner.java:974)
        at com.carrotsearch.randomizedtesting.RandomizedRunner$10.evaluate(RandomizedRunner.java:988)
        at com.carrotsearch.randomizedtesting.rules.SystemPropertiesRestoreRule$1.evaluate(SystemPropertiesRestoreRule.java:57)
        at org.apache.lucene.util.TestRuleSetupTeardownChained$1.evaluate(TestRuleSetupTeardownChained.java:49)
        at org.apache.lucene.util.AbstractBeforeAfterRule$1.evaluate(AbstractBeforeAfterRule.java:45)
        at org.apache.lucene.util.TestRuleThreadAndTestName$1.evaluate(TestRuleThreadAndTestName.java:48)
        at org.apache.lucene.util.TestRuleIgnoreAfterMaxFailures$1.evaluate(TestRuleIgnoreAfterMaxFailures.java:64)
        at org.apache.lucene.util.TestRuleMarkFailure$1.evaluate(TestRuleMarkFailure.java:47)
        at com.carrotsearch.randomizedtesting.rules.StatementAdapter.evaluate(StatementAdapter.java:36)
        at com.carrotsearch.randomizedtesting.ThreadLeakControl$StatementRunner.run(ThreadLeakControl.java:368)
        at com.carrotsearch.randomizedtesting.ThreadLeakControl.forkTimeoutingTask(ThreadLeakControl.java:817)
        at com.carrotsearch.randomizedtesting.ThreadLeakControl$3.evaluate(ThreadLeakControl.java:468)
        at com.carrotsearch.randomizedtesting.RandomizedRunner.runSingleTest(RandomizedRunner.java:947)
        at com.carrotsearch.randomizedtesting.RandomizedRunner$5.evaluate(RandomizedRunner.java:832)
        at com.carrotsearch.randomizedtesting.RandomizedRunner$6.evaluate(RandomizedRunner.java:883)
        at com.carrotsearch.randomizedtesting.RandomizedRunner$7.evaluate(RandomizedRunner.java:894)
        at com.carrotsearch.randomizedtesting.rules.StatementAdapter.evaluate(StatementAdapter.java:36)
        at com.carrotsearch.randomizedtesting.rules.SystemPropertiesRestoreRule$1.evaluate(SystemPropertiesRestoreRule.java:57)
        at org.apache.lucene.util.AbstractBeforeAfterRule$1.evaluate(AbstractBeforeAfterRule.java:45)
        at com.carrotsearch.randomizedtesting.rules.StatementAdapter.evaluate(StatementAdapter.java:36)
        at org.apache.lucene.util.TestRuleStoreClassName$1.evaluate(TestRuleStoreClassName.java:41)
        at com.carrotsearch.randomizedtesting.rules.NoShadowingOrOverridesOnMethodsRule$1.evaluate(NoShadowingOrOverridesOnMethodsRule.java:40)
        at com.carrotsearch.randomizedtesting.rules.NoShadowingOrOverridesOnMethodsRule$1.evaluate(NoShadowingOrOverridesOnMethodsRule.java:40)
        at com.carrotsearch.randomizedtesting.rules.StatementAdapter.evaluate(StatementAdapter.java:36)
        at com.carrotsearch.randomizedtesting.rules.StatementAdapter.evaluate(StatementAdapter.java:36)
        at com.carrotsearch.randomizedtesting.rules.StatementAdapter.evaluate(StatementAdapter.java:36)
        at org.apache.lucene.util.TestRuleAssertionsRequired$1.evaluate(TestRuleAssertionsRequired.java:53)
        at org.apache.lucene.util.TestRuleMarkFailure$1.evaluate(TestRuleMarkFailure.java:47)
        at org.apache.lucene.util.TestRuleIgnoreAfterMaxFailures$1.evaluate(TestRuleIgnoreAfterMaxFailures.java:64)
        at org.apache.lucene.util.TestRuleIgnoreTestSuites$1.evaluate(TestRuleIgnoreTestSuites.java:54)
        at com.carrotsearch.randomizedtesting.rules.StatementAdapter.evaluate(StatementAdapter.java:36)
        at com.carrotsearch.randomizedtesting.ThreadLeakControl$StatementRunner.run(ThreadLeakControl.java:368)
        at java.lang.Thread.run(Thread.java:748)


FAILED:  org.apache.solr.handler.TestContainerReqHandler.testPackageAPI

Error Message:
attempt: 9 Mismatch for value : '[requestHandler]' in response {   "responseHeader":{     "status":0,     "QTime":0},   "metadata":{"version":3},   "runtimeLib":[{       "name":"global",       "url":"http://localhost:61262/jar3.jar",       "60ec88c2a2e9b409f7afc309273383810a0d07a078b482434eda9674f7e25b8adafa8a67c9913c996cbfb78a7f6ad2b9db26dbd4fe0ca4068f248d5db563f922":"60ec88c2a2e9b409f7afc309273383810a0d07a078b482434eda9674f7e25b8adafa8a67c9913c996cbfb78a7f6ad2b9db26dbd4fe0ca4068f248d5db563f922",       "znodeVersion":3}],   "requestHandler":[{       "name":"bar",       "znodeVersion":3,       "class":"org.apache.solr.core.RuntimeLibReqHandler",       "package":"global"}]}

Stack Trace:
java.lang.AssertionError: attempt: 9 Mismatch for value : '[requestHandler]' in response {
  "responseHeader":{
    "status":0,
    "QTime":0},
  "metadata":{"version":3},
  "runtimeLib":[{
      "name":"global",
      "url":"http://localhost:61262/jar3.jar",
      "60ec88c2a2e9b409f7afc309273383810a0d07a078b482434eda9674f7e25b8adafa8a67c9913c996cbfb78a7f6ad2b9db26dbd4fe0ca4068f248d5db563f922":"60ec88c2a2e9b409f7afc309273383810a0d07a078b482434eda9674f7e25b8adafa8a67c9913c996cbfb78a7f6ad2b9db26dbd4fe0ca4068f248d5db563f922",
      "znodeVersion":3}],
  "requestHandler":[{
      "name":"bar",
      "znodeVersion":3,
      "class":"org.apache.solr.core.RuntimeLibReqHandler",
      "package":"global"}]}
        at __randomizedtesting.SeedInfo.seed([8C8DA3E418A7D013:FE82B6AAB4FC8A03]:0)
        at org.junit.Assert.fail(Assert.java:88)
        at org.apache.solr.handler.TestContainerReqHandler.assertResponseValues(TestContainerReqHandler.java:117)
        at org.apache.solr.handler.TestContainerReqHandler.testPackageAPI(TestContainerReqHandler.java:232)
        at sun.reflect.NativeMethodAccessorImpl.invoke0(Native Method)
        at sun.reflect.NativeMethodAccessorImpl.invoke(NativeMethodAccessorImpl.java:62)
        at sun.reflect.DelegatingMethodAccessorImpl.invoke(DelegatingMethodAccessorImpl.java:43)
        at java.lang.reflect.Method.invoke(Method.java:498)
        at com.carrotsearch.randomizedtesting.RandomizedRunner.invoke(RandomizedRunner.java:1750)
        at com.carrotsearch.randomizedtesting.RandomizedRunner$8.evaluate(RandomizedRunner.java:938)
        at com.carrotsearch.randomizedtesting.RandomizedRunner$9.evaluate(RandomizedRunner.java:974)
        at com.carrotsearch.randomizedtesting.RandomizedRunner$10.evaluate(RandomizedRunner.java:988)
        at com.carrotsearch.randomizedtesting.rules.SystemPropertiesRestoreRule$1.evaluate(SystemPropertiesRestoreRule.java:57)
        at org.apache.lucene.util.TestRuleSetupTeardownChained$1.evaluate(TestRuleSetupTeardownChained.java:49)
        at org.apache.lucene.util.AbstractBeforeAfterRule$1.evaluate(AbstractBeforeAfterRule.java:45)
        at org.apache.lucene.util.TestRuleThreadAndTestName$1.evaluate(TestRuleThreadAndTestName.java:48)
        at org.apache.lucene.util.TestRuleIgnoreAfterMaxFailures$1.evaluate(TestRuleIgnoreAfterMaxFailures.java:64)
        at org.apache.lucene.util.TestRuleMarkFailure$1.evaluate(TestRuleMarkFailure.java:47)
        at com.carrotsearch.randomizedtesting.rules.StatementAdapter.evaluate(StatementAdapter.java:36)
        at com.carrotsearch.randomizedtesting.ThreadLeakControl$StatementRunner.run(ThreadLeakControl.java:368)
        at com.carrotsearch.randomizedtesting.ThreadLeakControl.forkTimeoutingTask(ThreadLeakControl.java:817)
        at com.carrotsearch.randomizedtesting.ThreadLeakControl$3.evaluate(ThreadLeakControl.java:468)
        at com.carrotsearch.randomizedtesting.RandomizedRunner.runSingleTest(RandomizedRunner.java:947)
        at com.carrotsearch.randomizedtesting.RandomizedRunner$5.evaluate(RandomizedRunner.java:832)
        at com.carrotsearch.randomizedtesting.RandomizedRunner$6.evaluate(RandomizedRunner.java:883)
        at com.carrotsearch.randomizedtesting.RandomizedRunner$7.evaluate(RandomizedRunner.java:894)
        at com.carrotsearch.randomizedtesting.rules.StatementAdapter.evaluate(StatementAdapter.java:36)
        at com.carrotsearch.randomizedtesting.rules.SystemPropertiesRestoreRule$1.evaluate(SystemPropertiesRestoreRule.java:57)
        at org.apache.lucene.util.AbstractBeforeAfterRule$1.evaluate(AbstractBeforeAfterRule.java:45)
        at com.carrotsearch.randomizedtesting.rules.StatementAdapter.evaluate(StatementAdapter.java:36)
        at org.apache.lucene.util.TestRuleStoreClassName$1.evaluate(TestRuleStoreClassName.java:41)
        at com.carrotsearch.randomizedtesting.rules.NoShadowingOrOverridesOnMethodsRule$1.evaluate(NoShadowingOrOverridesOnMethodsRule.java:40)
        at com.carrotsearch.randomizedtesting.rules.NoShadowingOrOverridesOnMethodsRule$1.evaluate(NoShadowingOrOverridesOnMethodsRule.java:40)
        at com.carrotsearch.randomizedtesting.rules.StatementAdapter.evaluate(StatementAdapter.java:36)
        at com.carrotsearch.randomizedtesting.rules.StatementAdapter.evaluate(StatementAdapter.java:36)
        at com.carrotsearch.randomizedtesting.rules.StatementAdapter.evaluate(StatementAdapter.java:36)
        at org.apache.lucene.util.TestRuleAssertionsRequired$1.evaluate(TestRuleAssertionsRequired.java:53)
        at org.apache.lucene.util.TestRuleMarkFailure$1.evaluate(TestRuleMarkFailure.java:47)
        at org.apache.lucene.util.TestRuleIgnoreAfterMaxFailures$1.evaluate(TestRuleIgnoreAfterMaxFailures.java:64)
        at org.apache.lucene.util.TestRuleIgnoreTestSuites$1.evaluate(TestRuleIgnoreTestSuites.java:54)
        at com.carrotsearch.randomizedtesting.rules.StatementAdapter.evaluate(StatementAdapter.java:36)
        at com.carrotsearch.randomizedtesting.ThreadLeakControl$StatementRunner.run(ThreadLeakControl.java:368)
        at java.lang.Thread.run(Thread.java:748)


FAILED:  org.apache.solr.search.facet.TestCloudJSONFacetSKG.testRandom

Error Message:
Error from server at http://127.0.0.1:55404/solr/org.apache.solr.search.facet.TestCloudJSONFacetSKG_collection: Error from server at null: Expected mime type application/octet-stream but got text/html. <html> <head> <meta http-equiv="Content-Type" content="text/html;charset=utf-8"/> <title>Error 500 Server Error</title> </head> <body><h2>HTTP ERROR 500</h2> <p>Problem accessing /solr/org.apache.solr.search.facet.TestCloudJSONFacetSKG_collection_shard1_replica_n1/select. Reason: <pre>    Server Error</pre></p><h3>Caused by:</h3><pre>java.lang.AssertionError  at java.util.HashMap$TreeNode.moveRootToFront(HashMap.java:1849)  at java.util.HashMap$TreeNode.putTreeVal(HashMap.java:2014)  at java.util.HashMap.putVal(HashMap.java:638)  at java.util.HashMap.put(HashMap.java:612)  at org.apache.solr.search.LRUCache.put(LRUCache.java:197)  at org.apache.solr.search.SolrCacheHolder.put(SolrCacheHolder.java:88)  at org.apache.solr.search.SolrIndexSearcher.getDocListC(SolrIndexSearcher.java:1449)  at org.apache.solr.search.SolrIndexSearcher.search(SolrIndexSearcher.java:568)  at org.apache.solr.handler.component.QueryComponent.doProcessUngroupedSearch(QueryComponent.java:1484)  at org.apache.solr.handler.component.QueryComponent.process(QueryComponent.java:398)  at org.apache.solr.handler.component.SearchHandler.handleRequestBody(SearchHandler.java:305)  at org.apache.solr.handler.RequestHandlerBase.handleRequest(RequestHandlerBase.java:200)  at org.apache.solr.core.SolrCore.execute(SolrCore.java:2609)  at org.apache.solr.servlet.HttpSolrCall.execute(HttpSolrCall.java:780)  at org.apache.solr.servlet.HttpSolrCall.call(HttpSolrCall.java:566)  at org.apache.solr.servlet.SolrDispatchFilter.doFilter(SolrDispatchFilter.java:423)  at org.apache.solr.servlet.SolrDispatchFilter.doFilter(SolrDispatchFilter.java:350)  at org.eclipse.jetty.servlet.ServletHandler$CachedChain.doFilter(ServletHandler.java:1610)  at org.apache.solr.client.solrj.embedded.JettySolrRunner$DebugFilter.doFilter(JettySolrRunner.java:165)  at org.eclipse.jetty.servlet.ServletHandler$CachedChain.doFilter(ServletHandler.java:1610)  at org.eclipse.jetty.servlet.ServletHandler.doHandle(ServletHandler.java:540)  at org.eclipse.jetty.server.handler.ScopedHandler.nextHandle(ScopedHandler.java:255)  at org.eclipse.jetty.server.session.SessionHandler.doHandle(SessionHandler.java:1711)  at org.eclipse.jetty.server.handler.ScopedHandler.nextHandle(ScopedHandler.java:255)  at org.eclipse.jetty.server.handler.ContextHandler.doHandle(ContextHandler.java:1347)  at org.eclipse.jetty.server.handler.ScopedHandler.nextScope(ScopedHandler.java:203)  at org.eclipse.jetty.servlet.ServletHandler.doScope(ServletHandler.java:480)  at org.eclipse.jetty.server.session.SessionHandler.doScope(SessionHandler.java:1678)  at org.eclipse.jetty.server.handler.ScopedHandler.nextScope(ScopedHandler.java:201)  at org.eclipse.jetty.server.handler.ContextHandler.doScope(ContextHandler.java:1249)  at org.eclipse.jetty.server.handler.ScopedHandler.handle(ScopedHandler.java:144)  at org.eclipse.jetty.server.handler.gzip.GzipHandler.handle(GzipHandler.java:703)  at org.eclipse.jetty.server.handler.HandlerWrapper.handle(HandlerWrapper.java:132)  at org.eclipse.jetty.server.Server.handle(Server.java:505)  at org.eclipse.jetty.server.HttpChannel.handle(HttpChannel.java:370)  at org.eclipse.jetty.server.HttpChannel.run(HttpChannel.java:311)  at org.eclipse.jetty.util.thread.QueuedThreadPool.runJob(QueuedThreadPool.java:781)  at org.eclipse.jetty.util.thread.QueuedThreadPool$Runner.run(QueuedThreadPool.java:917)  at java.lang.Thread.run(Thread.java:748) </pre> <hr><a href="http://eclipse.org/jetty">Powered by Jetty:// 9.4.19.v20190610</a><hr/>  </body> </html>

Stack Trace:
org.apache.solr.client.solrj.impl.HttpSolrClient$RemoteSolrException: Error from server at http://127.0.0.1:55404/solr/org.apache.solr.search.facet.TestCloudJSONFacetSKG_collection: Error from server at null: Expected mime type application/octet-stream but got text/html. <html>
<head>
<meta http-equiv="Content-Type" content="text/html;charset=utf-8"/>
<title>Error 500 Server Error</title>
</head>
<body><h2>HTTP ERROR 500</h2>
<p>Problem accessing /solr/org.apache.solr.search.facet.TestCloudJSONFacetSKG_collection_shard1_replica_n1/select. Reason:
<pre>    Server Error</pre></p><h3>Caused by:</h3><pre>java.lang.AssertionError
        at java.util.HashMap$TreeNode.moveRootToFront(HashMap.java:1849)
        at java.util.HashMap$TreeNode.putTreeVal(HashMap.java:2014)
        at java.util.HashMap.putVal(HashMap.java:638)
        at java.util.HashMap.put(HashMap.java:612)
        at org.apache.solr.search.LRUCache.put(LRUCache.java:197)
        at org.apache.solr.search.SolrCacheHolder.put(SolrCacheHolder.java:88)
        at org.apache.solr.search.SolrIndexSearcher.getDocListC(SolrIndexSearcher.java:1449)
        at org.apache.solr.search.SolrIndexSearcher.search(SolrIndexSearcher.java:568)
        at org.apache.solr.handler.component.QueryComponent.doProcessUngroupedSearch(QueryComponent.java:1484)
        at org.apache.solr.handler.component.QueryComponent.process(QueryComponent.java:398)
        at org.apache.solr.handler.component.SearchHandler.handleRequestBody(SearchHandler.java:305)
        at org.apache.solr.handler.RequestHandlerBase.handleRequest(RequestHandlerBase.java:200)
        at org.apache.solr.core.SolrCore.execute(SolrCore.java:2609)
        at org.apache.solr.servlet.HttpSolrCall.execute(HttpSolrCall.java:780)
        at org.apache.solr.servlet.HttpSolrCall.call(HttpSolrCall.java:566)
        at org.apache.solr.servlet.SolrDispatchFilter.doFilter(SolrDispatchFilter.java:423)
        at org.apache.solr.servlet.SolrDispatchFilter.doFilter(SolrDispatchFilter.java:350)
        at org.eclipse.jetty.servlet.ServletHandler$CachedChain.doFilter(ServletHandler.java:1610)
        at org.apache.solr.client.solrj.embedded.JettySolrRunner$DebugFilter.doFilter(JettySolrRunner.java:165)
        at org.eclipse.jetty.servlet.ServletHandler$CachedChain.doFilter(ServletHandler.java:1610)
        at org.eclipse.jetty.servlet.ServletHandler.doHandle(ServletHandler.java:540)
        at org.eclipse.jetty.server.handler.ScopedHandler.nextHandle(ScopedHandler.java:255)
        at org.eclipse.jetty.server.session.SessionHandler.doHandle(SessionHandler.java:1711)
        at org.eclipse.jetty.server.handler.ScopedHandler.nextHandle(ScopedHandler.java:255)
        at org.eclipse.jetty.server.handler.ContextHandler.doHandle(ContextHandler.java:1347)
        at org.eclipse.jetty.server.handler.ScopedHandler.nextScope(ScopedHandler.java:203)
        at org.eclipse.jetty.servlet.ServletHandler.doScope(ServletHandler.java:480)
        at org.eclipse.jetty.server.session.SessionHandler.doScope(SessionHandler.java:1678)
        at org.eclipse.jetty.server.handler.ScopedHandler.nextScope(ScopedHandler.java:201)
        at org.eclipse.jetty.server.handler.ContextHandler.doScope(ContextHandler.java:1249)
        at org.eclipse.jetty.server.handler.ScopedHandler.handle(ScopedHandler.java:144)
        at org.eclipse.jetty.server.handler.gzip.GzipHandler.handle(GzipHandler.java:703)
        at org.eclipse.jetty.server.handler.HandlerWrapper.handle(HandlerWrapper.java:132)
        at org.eclipse.jetty.server.Server.handle(Server.java:505)
        at org.eclipse.jetty.server.HttpChannel.handle(HttpChannel.java:370)
        at org.eclipse.jetty.server.HttpChannel.run(HttpChannel.java:311)
        at org.eclipse.jetty.util.thread.QueuedThreadPool.runJob(QueuedThreadPool.java:781)
        at org.eclipse.jetty.util.thread.QueuedThreadPool$Runner.run(QueuedThreadPool.java:917)
        at java.lang.Thread.run(Thread.java:748)
</pre>
<hr><a href="http://eclipse.org/jetty">Powered by Jetty:// 9.4.19.v20190610</a><hr/>

</body>
</html>

        at __randomizedtesting.SeedInfo.seed([8C8DA3E418A7D013:FEC186EBA9C76660]:0)
        at org.apache.solr.client.solrj.impl.HttpSolrClient.executeMethod(HttpSolrClient.java:656)
        at org.apache.solr.client.solrj.impl.HttpSolrClient.request(HttpSolrClient.java:262)
        at org.apache.solr.client.solrj.impl.HttpSolrClient.request(HttpSolrClient.java:245)
        at org.apache.solr.client.solrj.SolrRequest.process(SolrRequest.java:211)
        at org.apache.solr.client.solrj.SolrClient.query(SolrClient.java:987)
        at org.apache.solr.client.solrj.SolrClient.query(SolrClient.java:1002)
        at org.apache.solr.search.facet.TestCloudJSONFacetSKG.getNumFound(TestCloudJSONFacetSKG.java:669)
        at org.apache.solr.search.facet.TestCloudJSONFacetSKG.verifySKGResults(TestCloudJSONFacetSKG.java:446)
        at org.apache.solr.search.facet.TestCloudJSONFacetSKG.assertFacetSKGsAreCorrect(TestCloudJSONFacetSKG.java:392)
        at org.apache.solr.search.facet.TestCloudJSONFacetSKG.assertFacetSKGsAreCorrect(TestCloudJSONFacetSKG.java:402)
        at org.apache.solr.search.facet.TestCloudJSONFacetSKG.assertFacetSKGsAreCorrect(TestCloudJSONFacetSKG.java:349)
        at org.apache.solr.search.facet.TestCloudJSONFacetSKG.testRandom(TestCloudJSONFacetSKG.java:274)
        at sun.reflect.NativeMethodAccessorImpl.invoke0(Native Method)
        at sun.reflect.NativeMethodAccessorImpl.invoke(NativeMethodAccessorImpl.java:62)
        at sun.reflect.DelegatingMethodAccessorImpl.invoke(DelegatingMethodAccessorImpl.java:43)
        at java.lang.reflect.Method.invoke(Method.java:498)
        at com.carrotsearch.randomizedtesting.RandomizedRunner.invoke(RandomizedRunner.java:1750)
        at com.carrotsearch.randomizedtesting.RandomizedRunner$8.evaluate(RandomizedRunner.java:938)
        at com.carrotsearch.randomizedtesting.RandomizedRunner$9.evaluate(RandomizedRunner.java:974)
        at com.carrotsearch.randomizedtesting.RandomizedRunner$10.evaluate(RandomizedRunner.java:988)
        at com.carrotsearch.randomizedtesting.rules.SystemPropertiesRestoreRule$1.evaluate(SystemPropertiesRestoreRule.java:57)
        at org.apache.lucene.util.TestRuleSetupTeardownChained$1.evaluate(TestRuleSetupTeardownChained.java:49)
        at org.apache.lucene.util.AbstractBeforeAfterRule$1.evaluate(AbstractBeforeAfterRule.java:45)
        at org.apache.lucene.util.TestRuleThreadAndTestName$1.evaluate(TestRuleThreadAndTestName.java:48)
        at org.apache.lucene.util.TestRuleIgnoreAfterMaxFailures$1.evaluate(TestRuleIgnoreAfterMaxFailures.java:64)
        at org.apache.lucene.util.TestRuleMarkFailure$1.evaluate(TestRuleMarkFailure.java:47)
        at com.carrotsearch.randomizedtesting.rules.StatementAdapter.evaluate(StatementAdapter.java:36)
        at com.carrotsearch.randomizedtesting.ThreadLeakControl$StatementRunner.run(ThreadLeakControl.java:368)
        at com.carrotsearch.randomizedtesting.ThreadLeakControl.forkTimeoutingTask(ThreadLeakControl.java:817)
        at com.carrotsearch.randomizedtesting.ThreadLeakControl$3.evaluate(ThreadLeakControl.java:468)
        at com.carrotsearch.randomizedtesting.RandomizedRunner.runSingleTest(RandomizedRunner.java:947)
        at com.carrotsearch.randomizedtesting.RandomizedRunner$5.evaluate(RandomizedRunner.java:832)
        at com.carrotsearch.randomizedtesting.RandomizedRunner$6.evaluate(RandomizedRunner.java:883)
        at com.carrotsearch.randomizedtesting.RandomizedRunner$7.evaluate(RandomizedRunner.java:894)
        at com.carrotsearch.randomizedtesting.rules.StatementAdapter.evaluate(StatementAdapter.java:36)
        at com.carrotsearch.randomizedtesting.rules.SystemPropertiesRestoreRule$1.evaluate(SystemPropertiesRestoreRule.java:57)
        at org.apache.lucene.util.AbstractBeforeAfterRule$1.evaluate(AbstractBeforeAfterRule.java:45)
        at com.carrotsearch.randomizedtesting.rules.StatementAdapter.evaluate(StatementAdapter.java:36)
        at org.apache.lucene.util.TestRuleStoreClassName$1.evaluate(TestRuleStoreClassName.java:41)
        at com.carrotsearch.randomizedtesting.rules.NoShadowingOrOverridesOnMethodsRule$1.evaluate(NoShadowingOrOverridesOnMethodsRule.java:40)
        at com.carrotsearch.randomizedtesting.rules.NoShadowingOrOverridesOnMethodsRule$1.evaluate(NoShadowingOrOverridesOnMethodsRule.java:40)
        at com.carrotsearch.randomizedtesting.rules.StatementAdapter.evaluate(StatementAdapter.java:36)
        at com.carrotsearch.randomizedtesting.rules.StatementAdapter.evaluate(StatementAdapter.java:36)
        at com.carrotsearch.randomizedtesting.rules.StatementAdapter.evaluate(StatementAdapter.java:36)
        at org.apache.lucene.util.TestRuleAssertionsRequired$1.evaluate(TestRuleAssertionsRequired.java:53)
        at org.apache.lucene.util.TestRuleMarkFailure$1.evaluate(TestRuleMarkFailure.java:47)
        at org.apache.lucene.util.TestRuleIgnoreAfterMaxFailures$1.evaluate(TestRuleIgnoreAfterMaxFailures.java:64)
        at org.apache.lucene.util.TestRuleIgnoreTestSuites$1.evaluate(TestRuleIgnoreTestSuites.java:54)
        at com.carrotsearch.randomizedtesting.rules.StatementAdapter.evaluate(StatementAdapter.java:36)
        at com.carrotsearch.randomizedtesting.ThreadLeakControl$StatementRunner.run(ThreadLeakControl.java:368)
        at java.lang.Thread.run(Thread.java:748)


FAILED:  org.apache.solr.search.facet.TestCloudJSONFacetSKG.testRandom

Error Message:
Error from server at http://127.0.0.1:55697/solr/org.apache.solr.search.facet.TestCloudJSONFacetSKG_collection: Error from server at null: Expected mime type application/octet-stream but got text/html. <html> <head> <meta http-equiv="Content-Type" content="text/html;charset=utf-8"/> <title>Error 500 Server Error</title> </head> <body><h2>HTTP ERROR 500</h2> <p>Problem accessing /solr/org.apache.solr.search.facet.TestCloudJSONFacetSKG_collection_shard1_replica_n1/select. Reason: <pre>    Server Error</pre></p><h3>Caused by:</h3><pre>java.lang.AssertionError  at java.util.HashMap$TreeNode.moveRootToFront(HashMap.java:1849)  at java.util.HashMap$TreeNode.putTreeVal(HashMap.java:2014)  at java.util.HashMap.putVal(HashMap.java:638)  at java.util.HashMap.put(HashMap.java:612)  at org.apache.solr.search.LRUCache.put(LRUCache.java:197)  at org.apache.solr.search.SolrCacheHolder.put(SolrCacheHolder.java:88)  at org.apache.solr.search.SolrIndexSearcher.getDocListC(SolrIndexSearcher.java:1449)  at org.apache.solr.search.SolrIndexSearcher.search(SolrIndexSearcher.java:568)  at org.apache.solr.handler.component.QueryComponent.doProcessUngroupedSearch(QueryComponent.java:1484)  at org.apache.solr.handler.component.QueryComponent.process(QueryComponent.java:398)  at org.apache.solr.handler.component.SearchHandler.handleRequestBody(SearchHandler.java:305)  at org.apache.solr.handler.RequestHandlerBase.handleRequest(RequestHandlerBase.java:200)  at org.apache.solr.core.SolrCore.execute(SolrCore.java:2609)  at org.apache.solr.servlet.HttpSolrCall.execute(HttpSolrCall.java:780)  at org.apache.solr.servlet.HttpSolrCall.call(HttpSolrCall.java:566)  at org.apache.solr.servlet.SolrDispatchFilter.doFilter(SolrDispatchFilter.java:423)  at org.apache.solr.servlet.SolrDispatchFilter.doFilter(SolrDispatchFilter.java:350)  at org.eclipse.jetty.servlet.ServletHandler$CachedChain.doFilter(ServletHandler.java:1610)  at org.apache.solr.client.solrj.embedded.JettySolrRunner$DebugFilter.doFilter(JettySolrRunner.java:165)  at org.eclipse.jetty.servlet.ServletHandler$CachedChain.doFilter(ServletHandler.java:1610)  at org.eclipse.jetty.servlet.ServletHandler.doHandle(ServletHandler.java:540)  at org.eclipse.jetty.server.handler.ScopedHandler.nextHandle(ScopedHandler.java:255)  at org.eclipse.jetty.server.session.SessionHandler.doHandle(SessionHandler.java:1711)  at org.eclipse.jetty.server.handler.ScopedHandler.nextHandle(ScopedHandler.java:255)  at org.eclipse.jetty.server.handler.ContextHandler.doHandle(ContextHandler.java:1347)  at org.eclipse.jetty.server.handler.ScopedHandler.nextScope(ScopedHandler.java:203)  at org.eclipse.jetty.servlet.ServletHandler.doScope(ServletHandler.java:480)  at org.eclipse.jetty.server.session.SessionHandler.doScope(SessionHandler.java:1678)  at org.eclipse.jetty.server.handler.ScopedHandler.nextScope(ScopedHandler.java:201)  at org.eclipse.jetty.server.handler.ContextHandler.doScope(ContextHandler.java:1249)  at org.eclipse.jetty.server.handler.ScopedHandler.handle(ScopedHandler.java:144)  at org.eclipse.jetty.server.handler.gzip.GzipHandler.handle(GzipHandler.java:703)  at org.eclipse.jetty.server.handler.HandlerWrapper.handle(HandlerWrapper.java:132)  at org.eclipse.jetty.server.Server.handle(Server.java:505)  at org.eclipse.jetty.server.HttpChannel.handle(HttpChannel.java:370)  at org.eclipse.jetty.server.HttpChannel.run(HttpChannel.java:311)  at org.eclipse.jetty.util.thread.QueuedThreadPool.runJob(QueuedThreadPool.java:781)  at org.eclipse.jetty.util.thread.QueuedThreadPool$Runner.run(QueuedThreadPool.java:917)  at java.lang.Thread.run(Thread.java:748) </pre> <hr><a href="http://eclipse.org/jetty">Powered by Jetty:// 9.4.19.v20190610</a><hr/>  </body> </html>

Stack Trace:
org.apache.solr.client.solrj.impl.HttpSolrClient$RemoteSolrException: Error from server at http://127.0.0.1:55697/solr/org.apache.solr.search.facet.TestCloudJSONFacetSKG_collection: Error from server at null: Expected mime type application/octet-stream but got text/html. <html>
<head>
<meta http-equiv="Content-Type" content="text/html;charset=utf-8"/>
<title>Error 500 Server Error</title>
</head>
<body><h2>HTTP ERROR 500</h2>
<p>Problem accessing /solr/org.apache.solr.search.facet.TestCloudJSONFacetSKG_collection_shard1_replica_n1/select. Reason:
<pre>    Server Error</pre></p><h3>Caused by:</h3><pre>java.lang.AssertionError
        at java.util.HashMap$TreeNode.moveRootToFront(HashMap.java:1849)
        at java.util.HashMap$TreeNode.putTreeVal(HashMap.java:2014)
        at java.util.HashMap.putVal(HashMap.java:638)
        at java.util.HashMap.put(HashMap.java:612)
        at org.apache.solr.search.LRUCache.put(LRUCache.java:197)
        at org.apache.solr.search.SolrCacheHolder.put(SolrCacheHolder.java:88)
        at org.apache.solr.search.SolrIndexSearcher.getDocListC(SolrIndexSearcher.java:1449)
        at org.apache.solr.search.SolrIndexSearcher.search(SolrIndexSearcher.java:568)
        at org.apache.solr.handler.component.QueryComponent.doProcessUngroupedSearch(QueryComponent.java:1484)
        at org.apache.solr.handler.component.QueryComponent.process(QueryComponent.java:398)
        at org.apache.solr.handler.component.SearchHandler.handleRequestBody(SearchHandler.java:305)
        at org.apache.solr.handler.RequestHandlerBase.handleRequest(RequestHandlerBase.java:200)
        at org.apache.solr.core.SolrCore.execute(SolrCore.java:2609)
        at org.apache.solr.servlet.HttpSolrCall.execute(HttpSolrCall.java:780)
        at org.apache.solr.servlet.HttpSolrCall.call(HttpSolrCall.java:566)
        at org.apache.solr.servlet.SolrDispatchFilter.doFilter(SolrDispatchFilter.java:423)
        at org.apache.solr.servlet.SolrDispatchFilter.doFilter(SolrDispatchFilter.java:350)
        at org.eclipse.jetty.servlet.ServletHandler$CachedChain.doFilter(ServletHandler.java:1610)
        at org.apache.solr.client.solrj.embedded.JettySolrRunner$DebugFilter.doFilter(JettySolrRunner.java:165)
        at org.eclipse.jetty.servlet.ServletHandler$CachedChain.doFilter(ServletHandler.java:1610)
        at org.eclipse.jetty.servlet.ServletHandler.doHandle(ServletHandler.java:540)
        at org.eclipse.jetty.server.handler.ScopedHandler.nextHandle(ScopedHandler.java:255)
        at org.eclipse.jetty.server.session.SessionHandler.doHandle(SessionHandler.java:1711)
        at org.eclipse.jetty.server.handler.ScopedHandler.nextHandle(ScopedHandler.java:255)
        at org.eclipse.jetty.server.handler.ContextHandler.doHandle(ContextHandler.java:1347)
        at org.eclipse.jetty.server.handler.ScopedHandler.nextScope(ScopedHandler.java:203)
        at org.eclipse.jetty.servlet.ServletHandler.doScope(ServletHandler.java:480)
        at org.eclipse.jetty.server.session.SessionHandler.doScope(SessionHandler.java:1678)
        at org.eclipse.jetty.server.handler.ScopedHandler.nextScope(ScopedHandler.java:201)
        at org.eclipse.jetty.server.handler.ContextHandler.doScope(ContextHandler.java:1249)
        at org.eclipse.jetty.server.handler.ScopedHandler.handle(ScopedHandler.java:144)
        at org.eclipse.jetty.server.handler.gzip.GzipHandler.handle(GzipHandler.java:703)
        at org.eclipse.jetty.server.handler.HandlerWrapper.handle(HandlerWrapper.java:132)
        at org.eclipse.jetty.server.Server.handle(Server.java:505)
        at org.eclipse.jetty.server.HttpChannel.handle(HttpChannel.java:370)
        at org.eclipse.jetty.server.HttpChannel.run(HttpChannel.java:311)
        at org.eclipse.jetty.util.thread.QueuedThreadPool.runJob(QueuedThreadPool.java:781)
        at org.eclipse.jetty.util.thread.QueuedThreadPool$Runner.run(QueuedThreadPool.java:917)
        at java.lang.Thread.run(Thread.java:748)
</pre>
<hr><a href="http://eclipse.org/jetty">Powered by Jetty:// 9.4.19.v20190610</a><hr/>

</body>
</html>

        at __randomizedtesting.SeedInfo.seed([8C8DA3E418A7D013:FEC186EBA9C76660]:0)
        at org.apache.solr.client.solrj.impl.HttpSolrClient.executeMethod(HttpSolrClient.java:656)
        at org.apache.solr.client.solrj.impl.HttpSolrClient.request(HttpSolrClient.java:262)
        at org.apache.solr.client.solrj.impl.HttpSolrClient.request(HttpSolrClient.java:245)
        at org.apache.solr.client.solrj.SolrRequest.process(SolrRequest.java:211)
        at org.apache.solr.client.solrj.SolrClient.query(SolrClient.java:987)
        at org.apache.solr.client.solrj.SolrClient.query(SolrClient.java:1002)
        at org.apache.solr.search.facet.TestCloudJSONFacetSKG.getNumFound(TestCloudJSONFacetSKG.java:669)
        at org.apache.solr.search.facet.TestCloudJSONFacetSKG.verifySKGResults(TestCloudJSONFacetSKG.java:446)
        at org.apache.solr.search.facet.TestCloudJSONFacetSKG.assertFacetSKGsAreCorrect(TestCloudJSONFacetSKG.java:392)
        at org.apache.solr.search.facet.TestCloudJSONFacetSKG.assertFacetSKGsAreCorrect(TestCloudJSONFacetSKG.java:402)
        at org.apache.solr.search.facet.TestCloudJSONFacetSKG.assertFacetSKGsAreCorrect(TestCloudJSONFacetSKG.java:349)
        at org.apache.solr.search.facet.TestCloudJSONFacetSKG.testRandom(TestCloudJSONFacetSKG.java:274)
        at sun.reflect.NativeMethodAccessorImpl.invoke0(Native Method)
        at sun.reflect.NativeMethodAccessorImpl.invoke(NativeMethodAccessorImpl.java:62)
        at sun.reflect.DelegatingMethodAccessorImpl.invoke(DelegatingMethodAccessorImpl.java:43)
        at java.lang.reflect.Method.invoke(Method.java:498)
        at com.carrotsearch.randomizedtesting.RandomizedRunner.invoke(RandomizedRunner.java:1750)
        at com.carrotsearch.randomizedtesting.RandomizedRunner$8.evaluate(RandomizedRunner.java:938)
        at com.carrotsearch.randomizedtesting.RandomizedRunner$9.evaluate(RandomizedRunner.java:974)
        at com.carrotsearch.randomizedtesting.RandomizedRunner$10.evaluate(RandomizedRunner.java:988)
        at com.carrotsearch.randomizedtesting.rules.SystemPropertiesRestoreRule$1.evaluate(SystemPropertiesRestoreRule.java:57)
        at org.apache.lucene.util.TestRuleSetupTeardownChained$1.evaluate(TestRuleSetupTeardownChained.java:49)
        at org.apache.lucene.util.AbstractBeforeAfterRule$1.evaluate(AbstractBeforeAfterRule.java:45)
        at org.apache.lucene.util.TestRuleThreadAndTestName$1.evaluate(TestRuleThreadAndTestName.java:48)
        at org.apache.lucene.util.TestRuleIgnoreAfterMaxFailures$1.evaluate(TestRuleIgnoreAfterMaxFailures.java:64)
        at org.apache.lucene.util.TestRuleMarkFailure$1.evaluate(TestRuleMarkFailure.java:47)
        at com.carrotsearch.randomizedtesting.rules.StatementAdapter.evaluate(StatementAdapter.java:36)
        at com.carrotsearch.randomizedtesting.ThreadLeakControl$StatementRunner.run(ThreadLeakControl.java:368)
        at com.carrotsearch.randomizedtesting.ThreadLeakControl.forkTimeoutingTask(ThreadLeakControl.java:817)
        at com.carrotsearch.randomizedtesting.ThreadLeakControl$3.evaluate(ThreadLeakControl.java:468)
        at com.carrotsearch.randomizedtesting.RandomizedRunner.runSingleTest(RandomizedRunner.java:947)
        at com.carrotsearch.randomizedtesting.RandomizedRunner$5.evaluate(RandomizedRunner.java:832)
        at com.carrotsearch.randomizedtesting.RandomizedRunner$6.evaluate(RandomizedRunner.java:883)
        at com.carrotsearch.randomizedtesting.RandomizedRunner$7.evaluate(RandomizedRunner.java:894)
        at com.carrotsearch.randomizedtesting.rules.StatementAdapter.evaluate(StatementAdapter.java:36)
        at com.carrotsearch.randomizedtesting.rules.SystemPropertiesRestoreRule$1.evaluate(SystemPropertiesRestoreRule.java:57)
        at org.apache.lucene.util.AbstractBeforeAfterRule$1.evaluate(AbstractBeforeAfterRule.java:45)
        at com.carrotsearch.randomizedtesting.rules.StatementAdapter.evaluate(StatementAdapter.java:36)
        at org.apache.lucene.util.TestRuleStoreClassName$1.evaluate(TestRuleStoreClassName.java:41)
        at com.carrotsearch.randomizedtesting.rules.NoShadowingOrOverridesOnMethodsRule$1.evaluate(NoShadowingOrOverridesOnMethodsRule.java:40)
        at com.carrotsearch.randomizedtesting.rules.NoShadowingOrOverridesOnMethodsRule$1.evaluate(NoShadowingOrOverridesOnMethodsRule.java:40)
        at com.carrotsearch.randomizedtesting.rules.StatementAdapter.evaluate(StatementAdapter.java:36)
        at com.carrotsearch.randomizedtesting.rules.StatementAdapter.evaluate(StatementAdapter.java:36)
        at com.carrotsearch.randomizedtesting.rules.StatementAdapter.evaluate(StatementAdapter.java:36)
        at org.apache.lucene.util.TestRuleAssertionsRequired$1.evaluate(TestRuleAssertionsRequired.java:53)
        at org.apache.lucene.util.TestRuleMarkFailure$1.evaluate(TestRuleMarkFailure.java:47)
        at org.apache.lucene.util.TestRuleIgnoreAfterMaxFailures$1.evaluate(TestRuleIgnoreAfterMaxFailures.java:64)
        at org.apache.lucene.util.TestRuleIgnoreTestSuites$1.evaluate(TestRuleIgnoreTestSuites.java:54)
        at com.carrotsearch.randomizedtesting.rules.StatementAdapter.evaluate(StatementAdapter.java:36)
        at com.carrotsearch.randomizedtesting.ThreadLeakControl$StatementRunner.run(ThreadLeakControl.java:368)
        at java.lang.Thread.run(Thread.java:748)


FAILED:  org.apache.solr.search.facet.TestCloudJSONFacetSKG.testRandom

Error Message:
Error from server at http://127.0.0.1:56786/solr/org.apache.solr.search.facet.TestCloudJSONFacetSKG_collection: Error from server at null: Expected mime type application/octet-stream but got text/html. <html> <head> <meta http-equiv="Content-Type" content="text/html;charset=utf-8"/> <title>Error 500 Server Error</title> </head> <body><h2>HTTP ERROR 500</h2> <p>Problem accessing /solr/org.apache.solr.search.facet.TestCloudJSONFacetSKG_collection_shard1_replica_n1/select. Reason: <pre>    Server Error</pre></p><h3>Caused by:</h3><pre>java.lang.AssertionError  at java.util.HashMap$TreeNode.moveRootToFront(HashMap.java:1849)  at java.util.HashMap$TreeNode.putTreeVal(HashMap.java:2014)  at java.util.HashMap.putVal(HashMap.java:638)  at java.util.HashMap.put(HashMap.java:612)  at org.apache.solr.search.LRUCache.put(LRUCache.java:197)  at org.apache.solr.search.SolrCacheHolder.put(SolrCacheHolder.java:88)  at org.apache.solr.search.SolrIndexSearcher.getDocListC(SolrIndexSearcher.java:1449)  at org.apache.solr.search.SolrIndexSearcher.search(SolrIndexSearcher.java:568)  at org.apache.solr.handler.component.QueryComponent.doProcessUngroupedSearch(QueryComponent.java:1484)  at org.apache.solr.handler.component.QueryComponent.process(QueryComponent.java:398)  at org.apache.solr.handler.component.SearchHandler.handleRequestBody(SearchHandler.java:305)  at org.apache.solr.handler.RequestHandlerBase.handleRequest(RequestHandlerBase.java:200)  at org.apache.solr.core.SolrCore.execute(SolrCore.java:2609)  at org.apache.solr.servlet.HttpSolrCall.execute(HttpSolrCall.java:780)  at org.apache.solr.servlet.HttpSolrCall.call(HttpSolrCall.java:566)  at org.apache.solr.servlet.SolrDispatchFilter.doFilter(SolrDispatchFilter.java:423)  at org.apache.solr.servlet.SolrDispatchFilter.doFilter(SolrDispatchFilter.java:350)  at org.eclipse.jetty.servlet.ServletHandler$CachedChain.doFilter(ServletHandler.java:1610)  at org.apache.solr.client.solrj.embedded.JettySolrRunner$DebugFilter.doFilter(JettySolrRunner.java:165)  at org.eclipse.jetty.servlet.ServletHandler$CachedChain.doFilter(ServletHandler.java:1610)  at org.eclipse.jetty.servlet.ServletHandler.doHandle(ServletHandler.java:540)  at org.eclipse.jetty.server.handler.ScopedHandler.nextHandle(ScopedHandler.java:255)  at org.eclipse.jetty.server.session.SessionHandler.doHandle(SessionHandler.java:1711)  at org.eclipse.jetty.server.handler.ScopedHandler.nextHandle(ScopedHandler.java:255)  at org.eclipse.jetty.server.handler.ContextHandler.doHandle(ContextHandler.java:1347)  at org.eclipse.jetty.server.handler.ScopedHandler.nextScope(ScopedHandler.java:203)  at org.eclipse.jetty.servlet.ServletHandler.doScope(ServletHandler.java:480)  at org.eclipse.jetty.server.session.SessionHandler.doScope(SessionHandler.java:1678)  at org.eclipse.jetty.server.handler.ScopedHandler.nextScope(ScopedHandler.java:201)  at org.eclipse.jetty.server.handler.ContextHandler.doScope(ContextHandler.java:1249)  at org.eclipse.jetty.server.handler.ScopedHandler.handle(ScopedHandler.java:144)  at org.eclipse.jetty.server.handler.gzip.GzipHandler.handle(GzipHandler.java:703)  at org.eclipse.jetty.server.handler.HandlerWrapper.handle(HandlerWrapper.java:132)  at org.eclipse.jetty.server.Server.handle(Server.java:505)  at org.eclipse.jetty.server.HttpChannel.handle(HttpChannel.java:370)  at org.eclipse.jetty.server.HttpChannel.run(HttpChannel.java:311)  at org.eclipse.jetty.util.thread.QueuedThreadPool.runJob(QueuedThreadPool.java:781)  at org.eclipse.jetty.util.thread.QueuedThreadPool$Runner.run(QueuedThreadPool.java:917)  at java.lang.Thread.run(Thread.java:748) </pre> <hr><a href="http://eclipse.org/jetty">Powered by Jetty:// 9.4.19.v20190610</a><hr/>  </body> </html>

Stack Trace:
org.apache.solr.client.solrj.impl.HttpSolrClient$RemoteSolrException: Error from server at http://127.0.0.1:56786/solr/org.apache.solr.search.facet.TestCloudJSONFacetSKG_collection: Error from server at null: Expected mime type application/octet-stream but got text/html. <html>
<head>
<meta http-equiv="Content-Type" content="text/html;charset=utf-8"/>
<title>Error 500 Server Error</title>
</head>
<body><h2>HTTP ERROR 500</h2>
<p>Problem accessing /solr/org.apache.solr.search.facet.TestCloudJSONFacetSKG_collection_shard1_replica_n1/select. Reason:
<pre>    Server Error</pre></p><h3>Caused by:</h3><pre>java.lang.AssertionError
        at java.util.HashMap$TreeNode.moveRootToFront(HashMap.java:1849)
        at java.util.HashMap$TreeNode.putTreeVal(HashMap.java:2014)
        at java.util.HashMap.putVal(HashMap.java:638)
        at java.util.HashMap.put(HashMap.java:612)
        at org.apache.solr.search.LRUCache.put(LRUCache.java:197)
        at org.apache.solr.search.SolrCacheHolder.put(SolrCacheHolder.java:88)
        at org.apache.solr.search.SolrIndexSearcher.getDocListC(SolrIndexSearcher.java:1449)
        at org.apache.solr.search.SolrIndexSearcher.search(SolrIndexSearcher.java:568)
        at org.apache.solr.handler.component.QueryComponent.doProcessUngroupedSearch(QueryComponent.java:1484)
        at org.apache.solr.handler.component.QueryComponent.process(QueryComponent.java:398)
        at org.apache.solr.handler.component.SearchHandler.handleRequestBody(SearchHandler.java:305)
        at org.apache.solr.handler.RequestHandlerBase.handleRequest(RequestHandlerBase.java:200)
        at org.apache.solr.core.SolrCore.execute(SolrCore.java:2609)
        at org.apache.solr.servlet.HttpSolrCall.execute(HttpSolrCall.java:780)
        at org.apache.solr.servlet.HttpSolrCall.call(HttpSolrCall.java:566)
        at org.apache.solr.servlet.SolrDispatchFilter.doFilter(SolrDispatchFilter.java:423)
        at org.apache.solr.servlet.SolrDispatchFilter.doFilter(SolrDispatchFilter.java:350)
        at org.eclipse.jetty.servlet.ServletHandler$CachedChain.doFilter(ServletHandler.java:1610)
        at org.apache.solr.client.solrj.embedded.JettySolrRunner$DebugFilter.doFilter(JettySolrRunner.java:165)
        at org.eclipse.jetty.servlet.ServletHandler$CachedChain.doFilter(ServletHandler.java:1610)
        at org.eclipse.jetty.servlet.ServletHandler.doHandle(ServletHandler.java:540)
        at org.eclipse.jetty.server.handler.ScopedHandler.nextHandle(ScopedHandler.java:255)
        at org.eclipse.jetty.server.session.SessionHandler.doHandle(SessionHandler.java:1711)
        at org.eclipse.jetty.server.handler.ScopedHandler.nextHandle(ScopedHandler.java:255)
        at org.eclipse.jetty.server.handler.ContextHandler.doHandle(ContextHandler.java:1347)
        at org.eclipse.jetty.server.handler.ScopedHandler.nextScope(ScopedHandler.java:203)
        at org.eclipse.jetty.servlet.ServletHandler.doScope(ServletHandler.java:480)
        at org.eclipse.jetty.server.session.SessionHandler.doScope(SessionHandler.java:1678)
        at org.eclipse.jetty.server.handler.ScopedHandler.nextScope(ScopedHandler.java:201)
        at org.eclipse.jetty.server.handler.ContextHandler.doScope(ContextHandler.java:1249)
        at org.eclipse.jetty.server.handler.ScopedHandler.handle(ScopedHandler.java:144)
        at org.eclipse.jetty.server.handler.gzip.GzipHandler.handle(GzipHandler.java:703)
        at org.eclipse.jetty.server.handler.HandlerWrapper.handle(HandlerWrapper.java:132)
        at org.eclipse.jetty.server.Server.handle(Server.java:505)
        at org.eclipse.jetty.server.HttpChannel.handle(HttpChannel.java:370)
        at org.eclipse.jetty.server.HttpChannel.run(HttpChannel.java:311)
        at org.eclipse.jetty.util.thread.QueuedThreadPool.runJob(QueuedThreadPool.java:781)
        at org.eclipse.jetty.util.thread.QueuedThreadPool$Runner.run(QueuedThreadPool.java:917)
        at java.lang.Thread.run(Thread.java:748)
</pre>
<hr><a href="http://eclipse.org/jetty">Powered by Jetty:// 9.4.19.v20190610</a><hr/>

</body>
</html>

        at __randomizedtesting.SeedInfo.seed([8C8DA3E418A7D013:FEC186EBA9C76660]:0)
        at org.apache.solr.client.solrj.impl.HttpSolrClient.executeMethod(HttpSolrClient.java:656)
        at org.apache.solr.client.solrj.impl.HttpSolrClient.request(HttpSolrClient.java:262)
        at org.apache.solr.client.solrj.impl.HttpSolrClient.request(HttpSolrClient.java:245)
        at org.apache.solr.client.solrj.SolrRequest.process(SolrRequest.java:211)
        at org.apache.solr.client.solrj.SolrClient.query(SolrClient.java:987)
        at org.apache.solr.client.solrj.SolrClient.query(SolrClient.java:1002)
        at org.apache.solr.search.facet.TestCloudJSONFacetSKG.getNumFound(TestCloudJSONFacetSKG.java:669)
        at org.apache.solr.search.facet.TestCloudJSONFacetSKG.verifySKGResults(TestCloudJSONFacetSKG.java:446)
        at org.apache.solr.search.facet.TestCloudJSONFacetSKG.assertFacetSKGsAreCorrect(TestCloudJSONFacetSKG.java:392)
        at org.apache.solr.search.facet.TestCloudJSONFacetSKG.assertFacetSKGsAreCorrect(TestCloudJSONFacetSKG.java:402)
        at org.apache.solr.search.facet.TestCloudJSONFacetSKG.assertFacetSKGsAreCorrect(TestCloudJSONFacetSKG.java:349)
        at org.apache.solr.search.facet.TestCloudJSONFacetSKG.testRandom(TestCloudJSONFacetSKG.java:274)
        at sun.reflect.NativeMethodAccessorImpl.invoke0(Native Method)
        at sun.reflect.NativeMethodAccessorImpl.invoke(NativeMethodAccessorImpl.java:62)
        at sun.reflect.DelegatingMethodAccessorImpl.invoke(DelegatingMethodAccessorImpl.java:43)
        at java.lang.reflect.Method.invoke(Method.java:498)
        at com.carrotsearch.randomizedtesting.RandomizedRunner.invoke(RandomizedRunner.java:1750)
        at com.carrotsearch.randomizedtesting.RandomizedRunner$8.evaluate(RandomizedRunner.java:938)
        at com.carrotsearch.randomizedtesting.RandomizedRunner$9.evaluate(RandomizedRunner.java:974)
        at com.carrotsearch.randomizedtesting.RandomizedRunner$10.evaluate(RandomizedRunner.java:988)
        at com.carrotsearch.randomizedtesting.rules.SystemPropertiesRestoreRule$1.evaluate(SystemPropertiesRestoreRule.java:57)
        at org.apache.lucene.util.TestRuleSetupTeardownChained$1.evaluate(TestRuleSetupTeardownChained.java:49)
        at org.apache.lucene.util.AbstractBeforeAfterRule$1.evaluate(AbstractBeforeAfterRule.java:45)
        at org.apache.lucene.util.TestRuleThreadAndTestName$1.evaluate(TestRuleThreadAndTestName.java:48)
        at org.apache.lucene.util.TestRuleIgnoreAfterMaxFailures$1.evaluate(TestRuleIgnoreAfterMaxFailures.java:64)
        at org.apache.lucene.util.TestRuleMarkFailure$1.evaluate(TestRuleMarkFailure.java:47)
        at com.carrotsearch.randomizedtesting.rules.StatementAdapter.evaluate(StatementAdapter.java:36)
        at com.carrotsearch.randomizedtesting.ThreadLeakControl$StatementRunner.run(ThreadLeakControl.java:368)
        at com.carrotsearch.randomizedtesting.ThreadLeakControl.forkTimeoutingTask(ThreadLeakControl.java:817)
        at com.carrotsearch.randomizedtesting.ThreadLeakControl$3.evaluate(ThreadLeakControl.java:468)
        at com.carrotsearch.randomizedtesting.RandomizedRunner.runSingleTest(RandomizedRunner.java:947)
        at

[...truncated too long message...]

reporters.SolrJmxReporter@844884: rootName = solr_57218, domain = solr.jetty, service url = null, agent id = null] for registry solr.jetty / com.codahale.metrics.MetricRegistry@16b6b7e
   [junit4]   2> 412060 INFO  (jetty-closer-2301-thread-2) [     ] o.a.s.m.SolrMetricManager Closing metric reporters for registry=solr.jetty, tag=null
   [junit4]   2> 412060 INFO  (jetty-closer-2301-thread-1) [     ] o.a.s.m.SolrMetricManager Closing metric reporters for registry=solr.cluster, tag=null
   [junit4]   2> 412060 INFO  (jetty-closer-2301-thread-2) [     ] o.a.s.m.r.SolrJmxReporter Closing reporter [org.apache.solr.metrics.reporters.SolrJmxReporter@595784: rootName = solr_57213, domain = solr.jetty, service url = null, agent id = null] for registry solr.jetty / com.codahale.metrics.MetricRegistry@16b6b7e
   [junit4]   2> 412060 INFO  (jetty-closer-2301-thread-2) [     ] o.a.s.m.SolrMetricManager Closing metric reporters for registry=solr.cluster, tag=null
   [junit4]   2> 412064 INFO  (closeThreadPool-2308-thread-2) [     ] o.a.s.c.Overseer Overseer (id=72106799477227526-127.0.0.1:57218_solr-n_0000000000) closing
   [junit4]   2> 412066 INFO  (OverseerStateUpdate-72106799477227526-127.0.0.1:57218_solr-n_0000000000) [n:127.0.0.1:57218_solr     ] o.a.s.c.Overseer Overseer Loop exiting : 127.0.0.1:57218_solr
   [junit4]   2> 412066 INFO  (OverseerAutoScalingTriggerThread-72106799477227526-127.0.0.1:57218_solr-n_0000000000) [     ] o.a.s.c.a.OverseerTriggerThread OverseerTriggerThread woken up but we are closed, exiting.
   [junit4]   2> 412071 INFO  (closeThreadPool-2308-thread-1) [     ] o.a.s.c.Overseer Overseer (id=72106799477227526-127.0.0.1:57218_solr-n_0000000000) closing
   [junit4]   2> 412331 INFO  (jetty-closer-2301-thread-2) [     ] o.e.j.s.AbstractConnector Stopped ServerConnector@ff882c{HTTP/1.1,[http/1.1, h2c]}{127.0.0.1:0}
   [junit4]   2> 412331 INFO  (jetty-closer-2301-thread-2) [     ] o.e.j.s.h.ContextHandler Stopped o.e.j.s.ServletContextHandler@1a6d4f{/solr,null,UNAVAILABLE}
   [junit4]   2> 412331 INFO  (jetty-closer-2301-thread-2) [     ] o.e.j.s.session node0 Stopped scavenging
   [junit4]   2> 412415 INFO  (jetty-closer-2301-thread-1) [     ] o.a.s.c.Overseer Overseer (id=72106799477227526-127.0.0.1:57218_solr-n_0000000000) closing
   [junit4]   2> 412417 INFO  (jetty-closer-2301-thread-1) [     ] o.e.j.s.AbstractConnector Stopped ServerConnector@193c07b{HTTP/1.1,[http/1.1, h2c]}{127.0.0.1:0}
   [junit4]   2> 412418 INFO  (jetty-closer-2301-thread-1) [     ] o.e.j.s.h.ContextHandler Stopped o.e.j.s.ServletContextHandler@98fd1b{/solr,null,UNAVAILABLE}
   [junit4]   2> 412418 INFO  (jetty-closer-2301-thread-1) [     ] o.e.j.s.session node0 Stopped scavenging
   [junit4]   2> 412419 INFO  (SUITE-TestCloudJSONFacetSKG-seed#[8C8DA3E418A7D013]-worker) [     ] o.a.s.c.ZkTestServer Shutting down ZkTestServer.
   [junit4]   2> 412594 WARN  (ZkTestServer Run Thread) [     ] o.a.s.c.ZkTestServer Watch limit violations:
   [junit4]   2> Maximum concurrent create/delete watches above limit:
   [junit4]   2>
   [junit4]   2> 5 /solr/aliases.json
   [junit4]   2> 5 /solr/clusterprops.json
   [junit4]   2> 3 /solr/collections/org.apache.solr.search.facet.TestCloudJSONFacetSKG_collection/terms/shard1
   [junit4]   2> 3 /solr/collections/org.apache.solr.search.facet.TestCloudJSONFacetSKG_collection/terms/shard2
   [junit4]   2> 2 /solr/collections/org.apache.solr.search.facet.TestCloudJSONFacetSKG_collection/collectionprops.json
   [junit4]   2> 2 /solr/security.json
   [junit4]   2> 2 /solr/configs/org.apache.solr.search.facet.TestCloudJSONFacetSKG_config-set
   [junit4]   2>
   [junit4]   2> Maximum concurrent data watches above limit:
   [junit4]   2>
   [junit4]   2> 25 /solr/collections/org.apache.solr.search.facet.TestCloudJSONFacetSKG_collection/state.json
   [junit4]   2> 5 /solr/clusterstate.json
   [junit4]   2>
   [junit4]   2> Maximum concurrent children watches above limit:
   [junit4]   2>
   [junit4]   2> 18 /solr/overseer/queue
   [junit4]   2> 10 /solr/live_nodes
   [junit4]   2> 10 /solr/collections
   [junit4]   2> 4 /solr/overseer/collection-queue-work
   [junit4]   2>
   [junit4]   2> 412608 INFO  (SUITE-TestCloudJSONFacetSKG-seed#[8C8DA3E418A7D013]-worker) [     ] o.a.s.c.ZkTestServer waitForServerDown: 127.0.0.1:57200
   [junit4]   2> 412608 INFO  (SUITE-TestCloudJSONFacetSKG-seed#[8C8DA3E418A7D013]-worker) [     ] o.a.s.c.ZkTestServer parse host and port list: 127.0.0.1:57200
   [junit4]   2> 412608 INFO  (SUITE-TestCloudJSONFacetSKG-seed#[8C8DA3E418A7D013]-worker) [     ] o.a.s.c.ZkTestServer connecting to 127.0.0.1 57200
   [junit4]   2> NOTE: leaving temporary files on disk at: C:\Users\jenkins\workspace\Lucene-Solr-8.x-Windows\solr\build\solr-core\test\J0\temp\solr.search.facet.TestCloudJSONFacetSKG_8C8DA3E418A7D013-002
   [junit4]   2> NOTE: test params are: codec=Asserting(Lucene80): {field_4_sds=Lucene50(blocksize=128), field_10_sds=FSTOrd50, field_13_sds=Lucene50(blocksize=128), field_1_sds=Lucene50(blocksize=128), _root_=Lucene50(blocksize=128), field_7_sds=FSTOrd50, field_12_ss=FSTOrd50, field_6_ss=Lucene50(blocksize=128), field_9_ss=Lucene50(blocksize=128), field_8_sdsS=Lucene50(blocksize=128), field_5_sdsS=PostingsFormat(name=MockRandom), field_2_sdsS=FSTOrd50, field_3_ss=FSTOrd50, field_0_ss=PostingsFormat(name=MockRandom), field_14_sdsS=PostingsFormat(name=MockRandom), field_11_sdsS=FSTOrd50, id=Lucene50(blocksize=128)}, docValues:{field_10_sds=DocValuesFormat(name=Lucene80), field_1_sds=DocValuesFormat(name=Lucene80), field_7_sds=DocValuesFormat(name=Lucene80), field_1_ids=DocValuesFormat(name=Lucene80), field_8_sdsS=DocValuesFormat(name=Lucene80), field_12_is=DocValuesFormat(name=Lucene80), field_9_is=DocValuesFormat(name=Lucene80), field_7_ids=DocValuesFormat(name=Lucene80), field_3_is=DocValuesFormat(name=Lucene80), field_4_sds=DocValuesFormat(name=Asserting), field_13_sds=DocValuesFormat(name=Asserting), field_8_idsS=DocValuesFormat(name=Lucene80), field_13_ids=DocValuesFormat(name=Direct), field_5_sdsS=DocValuesFormat(name=Direct), field_2_sdsS=DocValuesFormat(name=Lucene80), _version_=DocValuesFormat(name=Asserting), field_11_idsS=DocValuesFormat(name=Lucene80), field_14_sdsS=DocValuesFormat(name=Direct), field_11_sdsS=DocValuesFormat(name=Lucene80), field_14_idsS=DocValuesFormat(name=Asserting), field_4_ids=DocValuesFormat(name=Direct), field_5_idsS=DocValuesFormat(name=Asserting), field_0_is=DocValuesFormat(name=Asserting), field_2_idsS=DocValuesFormat(name=Lucene80), field_10_ids=DocValuesFormat(name=Lucene80), field_6_is=DocValuesFormat(name=Direct)}, maxPointsInLeafNode=61, maxMBSortInHeap=7.158092268768122, sim=Asserting(org.apache.lucene.search.similarities.AssertingSimilarity@3976ca), locale=id, timezone=Asia/Hong_Kong
   [junit4]   2> NOTE: Windows 10 10.0 x86/Oracle Corporation 1.8.0_201 (32-bit)/cpus=3,threads=1,free=35776680,total=88055808
   [junit4]   2> NOTE: All tests run in this JVM: [TestContainerReqHandler, TestContainerReqHandler, TestCloudJSONFacetSKG, TestContainerReqHandler, TestCloudJSONFacetSKG]
   [junit4] Completed [10/10 (10!)] on J0 in 43.90s, 2 tests, 1 error <<< FAILURES!

[...truncated 19 lines...]
BUILD FAILED
C:\Users\jenkins\workspace\Lucene-Solr-8.x-Windows\lucene\common-build.xml:1572: The following error occurred while executing this line:
C:\Users\jenkins\workspace\Lucene-Solr-8.x-Windows\lucene\common-build.xml:1099: There were test failures: 10 suites, 40 tests, 10 errors, 3 failures [seed: 8C8DA3E418A7D013]

Total time: 6 minutes 59 seconds

[repro] Setting last failure code to 1

[repro] Failures:
[repro]   5/5 failed: org.apache.solr.handler.TestContainerReqHandler
[repro]   5/5 failed: org.apache.solr.search.facet.TestCloudJSONFacetSKG
[repro] Exiting with code 1

C:\Users\jenkins\workspace\Lucene-Solr-8.x-Windows>IF EXIST lucene\build move /y lucene\build lucene\build.repro
        1 dir(s) moved.

C:\Users\jenkins\workspace\Lucene-Solr-8.x-Windows>IF EXIST solr\build move /y solr\build solr\build.repro
        1 dir(s) moved.

C:\Users\jenkins\workspace\Lucene-Solr-8.x-Windows>IF EXIST lucene\build.orig move /y lucene\build.orig lucene\build
        1 dir(s) moved.

C:\Users\jenkins\workspace\Lucene-Solr-8.x-Windows>IF EXIST solr\build.orig move /y solr\build.orig solr\build
        1 dir(s) moved.

C:\Users\jenkins\workspace\Lucene-Solr-8.x-Windows>exit 0
Archiving artifacts
Setting ANT_1_8_2_HOME=C:\Users\jenkins\tools\hudson.tasks.Ant_AntInstallation\ANT_1.8.2
[WARNINGS] Parsing warnings in console log with parser Java Compiler (javac)
Setting ANT_1_8_2_HOME=C:\Users\jenkins\tools\hudson.tasks.Ant_AntInstallation\ANT_1.8.2
No credentials specified
Setting ANT_1_8_2_HOME=C:\Users\jenkins\tools\hudson.tasks.Ant_AntInstallation\ANT_1.8.2
<Git Blamer> Using GitBlamer to create author and commit information for all warnings.
<Git Blamer> GIT_COMMIT=cac4d012e1a8db4b3033bb902c92222fa932f10f, workspace=C:\Users\jenkins\workspace\Lucene-Solr-8.x-Windows
[WARNINGS] Computing warning deltas based on reference build #417
Recording test results
Setting ANT_1_8_2_HOME=C:\Users\jenkins\tools\hudson.tasks.Ant_AntInstallation\ANT_1.8.2
Build step 'Publish JUnit test result report' changed build result to UNSTABLE
Email was triggered for: Unstable (Test Failures)
Sending email for trigger: Unstable (Test Failures)
Setting ANT_1_8_2_HOME=C:\Users\jenkins\tools\hudson.tasks.Ant_AntInstallation\ANT_1.8.2
Setting ANT_1_8_2_HOME=C:\Users\jenkins\tools\hudson.tasks.Ant_AntInstallation\ANT_1.8.2
Setting ANT_1_8_2_HOME=C:\Users\jenkins\tools\hudson.tasks.Ant_AntInstallation\ANT_1.8.2
Setting ANT_1_8_2_HOME=C:\Users\jenkins\tools\hudson.tasks.Ant_AntInstallation\ANT_1.8.2
Setting ANT_1_8_2_HOME=C:\Users\jenkins\tools\hudson.tasks.Ant_AntInstallation\ANT_1.8.2
Setting ANT_1_8_2_HOME=C:\Users\jenkins\tools\hudson.tasks.Ant_AntInstallation\ANT_1.8.2


---------------------------------------------------------------------
To unsubscribe, e-mail: [hidden email]
For additional commands, e-mail: [hidden email]