[JENKINS] Lucene-Solr-BadApples-8.x-Linux (32bit/jdk1.8.0_201) - Build # 107 - Unstable!

classic Classic list List threaded Threaded
1 message Options
Reply | Threaded
Open this post in threaded view
|

[JENKINS] Lucene-Solr-BadApples-8.x-Linux (32bit/jdk1.8.0_201) - Build # 107 - Unstable!

Policeman Jenkins Server-2
Build: https://jenkins.thetaphi.de/job/Lucene-Solr-BadApples-8.x-Linux/107/
Java: 32bit/jdk1.8.0_201 -server -XX:+UseG1GC

1 tests failed.
FAILED:  org.apache.solr.cloud.TestCloudConsistency.testOutOfSyncReplicasCannotBecomeLeader

Error Message:
Doc with id=4 not found in https://127.0.0.1:33845/solr/outOfSyncReplicasCannotBecomeLeader-false due to: Path not found: /id; rsp={doc=null}

Stack Trace:
java.lang.AssertionError: Doc with id=4 not found in https://127.0.0.1:33845/solr/outOfSyncReplicasCannotBecomeLeader-false due to: Path not found: /id; rsp={doc=null}
        at __randomizedtesting.SeedInfo.seed([471DEEE3DFB28547:39F6CEF31CD58A7D]:0)
        at org.junit.Assert.fail(Assert.java:88)
        at org.junit.Assert.assertTrue(Assert.java:41)
        at org.apache.solr.cloud.TestCloudConsistency.assertDocExists(TestCloudConsistency.java:285)
        at org.apache.solr.cloud.TestCloudConsistency.assertDocsExistInAllReplicas(TestCloudConsistency.java:269)
        at org.apache.solr.cloud.TestCloudConsistency.testOutOfSyncReplicasCannotBecomeLeader(TestCloudConsistency.java:140)
        at org.apache.solr.cloud.TestCloudConsistency.testOutOfSyncReplicasCannotBecomeLeader(TestCloudConsistency.java:99)
        at sun.reflect.NativeMethodAccessorImpl.invoke0(Native Method)
        at sun.reflect.NativeMethodAccessorImpl.invoke(NativeMethodAccessorImpl.java:62)
        at sun.reflect.DelegatingMethodAccessorImpl.invoke(DelegatingMethodAccessorImpl.java:43)
        at java.lang.reflect.Method.invoke(Method.java:498)
        at com.carrotsearch.randomizedtesting.RandomizedRunner.invoke(RandomizedRunner.java:1750)
        at com.carrotsearch.randomizedtesting.RandomizedRunner$8.evaluate(RandomizedRunner.java:938)
        at com.carrotsearch.randomizedtesting.RandomizedRunner$9.evaluate(RandomizedRunner.java:974)
        at com.carrotsearch.randomizedtesting.RandomizedRunner$10.evaluate(RandomizedRunner.java:988)
        at com.carrotsearch.randomizedtesting.rules.SystemPropertiesRestoreRule$1.evaluate(SystemPropertiesRestoreRule.java:57)
        at org.apache.lucene.util.TestRuleSetupTeardownChained$1.evaluate(TestRuleSetupTeardownChained.java:49)
        at org.apache.lucene.util.AbstractBeforeAfterRule$1.evaluate(AbstractBeforeAfterRule.java:45)
        at org.apache.lucene.util.TestRuleThreadAndTestName$1.evaluate(TestRuleThreadAndTestName.java:48)
        at org.apache.lucene.util.TestRuleIgnoreAfterMaxFailures$1.evaluate(TestRuleIgnoreAfterMaxFailures.java:64)
        at org.apache.lucene.util.TestRuleMarkFailure$1.evaluate(TestRuleMarkFailure.java:47)
        at com.carrotsearch.randomizedtesting.rules.StatementAdapter.evaluate(StatementAdapter.java:36)
        at com.carrotsearch.randomizedtesting.ThreadLeakControl$StatementRunner.run(ThreadLeakControl.java:368)
        at com.carrotsearch.randomizedtesting.ThreadLeakControl.forkTimeoutingTask(ThreadLeakControl.java:817)
        at com.carrotsearch.randomizedtesting.ThreadLeakControl$3.evaluate(ThreadLeakControl.java:468)
        at com.carrotsearch.randomizedtesting.RandomizedRunner.runSingleTest(RandomizedRunner.java:947)
        at com.carrotsearch.randomizedtesting.RandomizedRunner$5.evaluate(RandomizedRunner.java:832)
        at com.carrotsearch.randomizedtesting.RandomizedRunner$6.evaluate(RandomizedRunner.java:883)
        at com.carrotsearch.randomizedtesting.RandomizedRunner$7.evaluate(RandomizedRunner.java:894)
        at com.carrotsearch.randomizedtesting.rules.StatementAdapter.evaluate(StatementAdapter.java:36)
        at com.carrotsearch.randomizedtesting.rules.SystemPropertiesRestoreRule$1.evaluate(SystemPropertiesRestoreRule.java:57)
        at org.apache.lucene.util.AbstractBeforeAfterRule$1.evaluate(AbstractBeforeAfterRule.java:45)
        at com.carrotsearch.randomizedtesting.rules.StatementAdapter.evaluate(StatementAdapter.java:36)
        at org.apache.lucene.util.TestRuleStoreClassName$1.evaluate(TestRuleStoreClassName.java:41)
        at com.carrotsearch.randomizedtesting.rules.NoShadowingOrOverridesOnMethodsRule$1.evaluate(NoShadowingOrOverridesOnMethodsRule.java:40)
        at com.carrotsearch.randomizedtesting.rules.NoShadowingOrOverridesOnMethodsRule$1.evaluate(NoShadowingOrOverridesOnMethodsRule.java:40)
        at com.carrotsearch.randomizedtesting.rules.StatementAdapter.evaluate(StatementAdapter.java:36)
        at com.carrotsearch.randomizedtesting.rules.StatementAdapter.evaluate(StatementAdapter.java:36)
        at com.carrotsearch.randomizedtesting.rules.StatementAdapter.evaluate(StatementAdapter.java:36)
        at org.apache.lucene.util.TestRuleAssertionsRequired$1.evaluate(TestRuleAssertionsRequired.java:53)
        at org.apache.lucene.util.TestRuleMarkFailure$1.evaluate(TestRuleMarkFailure.java:47)
        at org.apache.lucene.util.TestRuleIgnoreAfterMaxFailures$1.evaluate(TestRuleIgnoreAfterMaxFailures.java:64)
        at org.apache.lucene.util.TestRuleIgnoreTestSuites$1.evaluate(TestRuleIgnoreTestSuites.java:54)
        at com.carrotsearch.randomizedtesting.rules.StatementAdapter.evaluate(StatementAdapter.java:36)
        at com.carrotsearch.randomizedtesting.ThreadLeakControl$StatementRunner.run(ThreadLeakControl.java:368)
        at java.lang.Thread.run(Thread.java:748)




Build Log:
[...truncated 14845 lines...]
   [junit4] Suite: org.apache.solr.cloud.TestCloudConsistency
   [junit4]   2> 1733231 INFO  (SUITE-TestCloudConsistency-seed#[471DEEE3DFB28547]-worker) [     ] o.a.s.SolrTestCaseJ4 SecureRandom sanity checks: test.solr.allowed.securerandom=null & java.security.egd=file:/dev/./urandom
   [junit4]   2> 1733231 INFO  (SUITE-TestCloudConsistency-seed#[471DEEE3DFB28547]-worker) [     ] o.a.s.SolrTestCaseJ4 Created dataDir: /home/jenkins/workspace/Lucene-Solr-BadApples-8.x-Linux/solr/build/solr-core/test/J1/temp/solr.cloud.TestCloudConsistency_471DEEE3DFB28547-001/data-dir-161-001
   [junit4]   2> 1733231 WARN  (SUITE-TestCloudConsistency-seed#[471DEEE3DFB28547]-worker) [     ] o.a.s.SolrTestCaseJ4 startTrackingSearchers: numOpens=2 numCloses=2
   [junit4]   2> 1733231 INFO  (SUITE-TestCloudConsistency-seed#[471DEEE3DFB28547]-worker) [     ] o.a.s.SolrTestCaseJ4 Using PointFields (NUMERIC_POINTS_SYSPROP=true) w/NUMERIC_DOCVALUES_SYSPROP=true
   [junit4]   2> 1733232 INFO  (SUITE-TestCloudConsistency-seed#[471DEEE3DFB28547]-worker) [     ] o.a.s.SolrTestCaseJ4 Randomized ssl (true) and clientAuth (true) via: @org.apache.solr.util.RandomizeSSL(reason=, ssl=NaN, value=NaN, clientAuth=NaN)
   [junit4]   2> 1733235 INFO  (TEST-TestCloudConsistency.testOutOfSyncReplicasCannotBecomeLeaderAfterRestart-seed#[471DEEE3DFB28547]) [     ] o.a.s.SolrTestCaseJ4 ###Starting testOutOfSyncReplicasCannotBecomeLeaderAfterRestart
   [junit4]   2> 1733235 INFO  (TEST-TestCloudConsistency.testOutOfSyncReplicasCannotBecomeLeaderAfterRestart-seed#[471DEEE3DFB28547]) [     ] o.a.s.c.MiniSolrCloudCluster Starting cluster of 4 servers in /home/jenkins/workspace/Lucene-Solr-BadApples-8.x-Linux/solr/build/solr-core/test/J1/temp/solr.cloud.TestCloudConsistency_471DEEE3DFB28547-001/tempDir-001
   [junit4]   2> 1733235 INFO  (TEST-TestCloudConsistency.testOutOfSyncReplicasCannotBecomeLeaderAfterRestart-seed#[471DEEE3DFB28547]) [     ] o.a.s.c.ZkTestServer STARTING ZK TEST SERVER
   [junit4]   2> 1733235 INFO  (ZkTestServer Run Thread) [     ] o.a.s.c.ZkTestServer client port:0.0.0.0/0.0.0.0:0
   [junit4]   2> 1733235 INFO  (ZkTestServer Run Thread) [     ] o.a.s.c.ZkTestServer Starting server
   [junit4]   2> 1733336 INFO  (TEST-TestCloudConsistency.testOutOfSyncReplicasCannotBecomeLeaderAfterRestart-seed#[471DEEE3DFB28547]) [     ] o.a.s.c.ZkTestServer start zk server on port:46495
   [junit4]   2> 1733336 INFO  (TEST-TestCloudConsistency.testOutOfSyncReplicasCannotBecomeLeaderAfterRestart-seed#[471DEEE3DFB28547]) [     ] o.a.s.c.ZkTestServer waitForServerUp: 127.0.0.1:46495
   [junit4]   2> 1733336 INFO  (TEST-TestCloudConsistency.testOutOfSyncReplicasCannotBecomeLeaderAfterRestart-seed#[471DEEE3DFB28547]) [     ] o.a.s.c.ZkTestServer parse host and port list: 127.0.0.1:46495
   [junit4]   2> 1733336 INFO  (TEST-TestCloudConsistency.testOutOfSyncReplicasCannotBecomeLeaderAfterRestart-seed#[471DEEE3DFB28547]) [     ] o.a.s.c.ZkTestServer connecting to 127.0.0.1 46495
   [junit4]   2> 1733337 INFO  (TEST-TestCloudConsistency.testOutOfSyncReplicasCannotBecomeLeaderAfterRestart-seed#[471DEEE3DFB28547]) [     ] o.a.s.c.c.ConnectionManager Waiting for client to connect to ZooKeeper
   [junit4]   2> 1733339 INFO  (zkConnectionManagerCallback-12722-thread-1) [     ] o.a.s.c.c.ConnectionManager zkClient has connected
   [junit4]   2> 1733339 INFO  (TEST-TestCloudConsistency.testOutOfSyncReplicasCannotBecomeLeaderAfterRestart-seed#[471DEEE3DFB28547]) [     ] o.a.s.c.c.ConnectionManager Client is connected to ZooKeeper
   [junit4]   2> 1733355 INFO  (TEST-TestCloudConsistency.testOutOfSyncReplicasCannotBecomeLeaderAfterRestart-seed#[471DEEE3DFB28547]) [     ] o.a.s.c.c.ConnectionManager Waiting for client to connect to ZooKeeper
   [junit4]   2> 1733356 INFO  (zkConnectionManagerCallback-12724-thread-1) [     ] o.a.s.c.c.ConnectionManager zkClient has connected
   [junit4]   2> 1733356 INFO  (TEST-TestCloudConsistency.testOutOfSyncReplicasCannotBecomeLeaderAfterRestart-seed#[471DEEE3DFB28547]) [     ] o.a.s.c.c.ConnectionManager Client is connected to ZooKeeper
   [junit4]   2> 1733357 INFO  (TEST-TestCloudConsistency.testOutOfSyncReplicasCannotBecomeLeaderAfterRestart-seed#[471DEEE3DFB28547]) [     ] o.a.s.c.c.ConnectionManager Waiting for client to connect to ZooKeeper
   [junit4]   2> 1733358 INFO  (zkConnectionManagerCallback-12726-thread-1) [     ] o.a.s.c.c.ConnectionManager zkClient has connected
   [junit4]   2> 1733358 INFO  (TEST-TestCloudConsistency.testOutOfSyncReplicasCannotBecomeLeaderAfterRestart-seed#[471DEEE3DFB28547]) [     ] o.a.s.c.c.ConnectionManager Client is connected to ZooKeeper
   [junit4]   2> 1733462 WARN  (jetty-launcher-12727-thread-1) [     ] o.e.j.s.AbstractConnector Ignoring deprecated socket close linger time
   [junit4]   2> 1733462 WARN  (jetty-launcher-12727-thread-3) [     ] o.e.j.s.AbstractConnector Ignoring deprecated socket close linger time
   [junit4]   2> 1733462 WARN  (jetty-launcher-12727-thread-4) [     ] o.e.j.s.AbstractConnector Ignoring deprecated socket close linger time
   [junit4]   2> 1733462 WARN  (jetty-launcher-12727-thread-2) [     ] o.e.j.s.AbstractConnector Ignoring deprecated socket close linger time
   [junit4]   2> 1733462 INFO  (jetty-launcher-12727-thread-4) [     ] o.a.s.c.s.e.JettySolrRunner Start Jetty (original configured port=0)
   [junit4]   2> 1733462 INFO  (jetty-launcher-12727-thread-2) [     ] o.a.s.c.s.e.JettySolrRunner Start Jetty (original configured port=0)
   [junit4]   2> 1733462 INFO  (jetty-launcher-12727-thread-1) [     ] o.a.s.c.s.e.JettySolrRunner Start Jetty (original configured port=0)
   [junit4]   2> 1733462 INFO  (jetty-launcher-12727-thread-3) [     ] o.a.s.c.s.e.JettySolrRunner Start Jetty (original configured port=0)
   [junit4]   2> 1733462 INFO  (jetty-launcher-12727-thread-4) [     ] o.a.s.c.s.e.JettySolrRunner Trying to start Jetty on port 0 try number 1 ...
   [junit4]   2> 1733462 INFO  (jetty-launcher-12727-thread-3) [     ] o.a.s.c.s.e.JettySolrRunner Trying to start Jetty on port 0 try number 1 ...
   [junit4]   2> 1733462 INFO  (jetty-launcher-12727-thread-1) [     ] o.a.s.c.s.e.JettySolrRunner Trying to start Jetty on port 0 try number 1 ...
   [junit4]   2> 1733462 INFO  (jetty-launcher-12727-thread-2) [     ] o.a.s.c.s.e.JettySolrRunner Trying to start Jetty on port 0 try number 1 ...
   [junit4]   2> 1733462 INFO  (jetty-launcher-12727-thread-3) [     ] o.e.j.s.Server jetty-9.4.19.v20190610; built: 2019-06-10T16:30:51.723Z; git: afcf563148970e98786327af5e07c261fda175d3; jvm 1.8.0_201-b09
   [junit4]   2> 1733462 INFO  (jetty-launcher-12727-thread-1) [     ] o.e.j.s.Server jetty-9.4.19.v20190610; built: 2019-06-10T16:30:51.723Z; git: afcf563148970e98786327af5e07c261fda175d3; jvm 1.8.0_201-b09
   [junit4]   2> 1733462 INFO  (jetty-launcher-12727-thread-2) [     ] o.e.j.s.Server jetty-9.4.19.v20190610; built: 2019-06-10T16:30:51.723Z; git: afcf563148970e98786327af5e07c261fda175d3; jvm 1.8.0_201-b09
   [junit4]   2> 1733462 INFO  (jetty-launcher-12727-thread-4) [     ] o.e.j.s.Server jetty-9.4.19.v20190610; built: 2019-06-10T16:30:51.723Z; git: afcf563148970e98786327af5e07c261fda175d3; jvm 1.8.0_201-b09
   [junit4]   2> 1733471 INFO  (jetty-launcher-12727-thread-3) [     ] o.e.j.s.session DefaultSessionIdManager workerName=node0
   [junit4]   2> 1733471 INFO  (jetty-launcher-12727-thread-3) [     ] o.e.j.s.session No SessionScavenger set, using defaults
   [junit4]   2> 1733471 INFO  (jetty-launcher-12727-thread-3) [     ] o.e.j.s.session node0 Scavenging every 660000ms
   [junit4]   2> 1733473 INFO  (jetty-launcher-12727-thread-3) [     ] o.e.j.s.h.ContextHandler Started o.e.j.s.ServletContextHandler@7eaedd{/solr,null,AVAILABLE}
   [junit4]   2> 1733474 INFO  (jetty-launcher-12727-thread-2) [     ] o.e.j.s.session DefaultSessionIdManager workerName=node0
   [junit4]   2> 1733474 INFO  (jetty-launcher-12727-thread-2) [     ] o.e.j.s.session No SessionScavenger set, using defaults
   [junit4]   2> 1733474 INFO  (jetty-launcher-12727-thread-2) [     ] o.e.j.s.session node0 Scavenging every 600000ms
   [junit4]   2> 1733474 INFO  (jetty-launcher-12727-thread-4) [     ] o.e.j.s.session DefaultSessionIdManager workerName=node0
   [junit4]   2> 1733474 INFO  (jetty-launcher-12727-thread-4) [     ] o.e.j.s.session No SessionScavenger set, using defaults
   [junit4]   2> 1733474 INFO  (jetty-launcher-12727-thread-4) [     ] o.e.j.s.session node0 Scavenging every 600000ms
   [junit4]   2> 1733474 INFO  (jetty-launcher-12727-thread-1) [     ] o.e.j.s.session DefaultSessionIdManager workerName=node0
   [junit4]   2> 1733474 INFO  (jetty-launcher-12727-thread-1) [     ] o.e.j.s.session No SessionScavenger set, using defaults
   [junit4]   2> 1733474 INFO  (jetty-launcher-12727-thread-1) [     ] o.e.j.s.session node0 Scavenging every 600000ms
   [junit4]   2> 1733474 INFO  (jetty-launcher-12727-thread-4) [     ] o.e.j.s.h.ContextHandler Started o.e.j.s.ServletContextHandler@1e58385{/solr,null,AVAILABLE}
   [junit4]   2> 1733474 INFO  (jetty-launcher-12727-thread-2) [     ] o.e.j.s.h.ContextHandler Started o.e.j.s.ServletContextHandler@c1e75d{/solr,null,AVAILABLE}
   [junit4]   2> 1733474 INFO  (jetty-launcher-12727-thread-3) [     ] o.e.j.s.AbstractConnector Started ServerConnector@1539e48{SSL,[ssl, http/1.1]}{127.0.0.1:44859}
   [junit4]   2> 1733474 INFO  (jetty-launcher-12727-thread-3) [     ] o.e.j.s.Server Started @1733522ms
   [junit4]   2> 1733474 INFO  (jetty-launcher-12727-thread-3) [     ] o.a.s.c.s.e.JettySolrRunner Jetty properties: {hostContext=/solr, hostPort=44859}
   [junit4]   2> 1733474 INFO  (jetty-launcher-12727-thread-1) [     ] o.e.j.s.h.ContextHandler Started o.e.j.s.ServletContextHandler@e96169{/solr,null,AVAILABLE}
   [junit4]   2> 1733474 ERROR (jetty-launcher-12727-thread-3) [     ] o.a.s.u.StartupLoggingUtils Missing Java Option solr.log.dir. Logging may be missing or incomplete.
   [junit4]   2> 1733474 INFO  (jetty-launcher-12727-thread-3) [     ] o.a.s.s.SolrDispatchFilter Using logger factory org.apache.logging.slf4j.Log4jLoggerFactory
   [junit4]   2> 1733474 INFO  (jetty-launcher-12727-thread-3) [     ] o.a.s.s.SolrDispatchFilter  ___      _       Welcome to Apache Solr™ version 8.3.0
   [junit4]   2> 1733474 INFO  (jetty-launcher-12727-thread-3) [     ] o.a.s.s.SolrDispatchFilter / __| ___| |_ _   Starting in cloud mode on port null
   [junit4]   2> 1733474 INFO  (jetty-launcher-12727-thread-3) [     ] o.a.s.s.SolrDispatchFilter \__ \/ _ \ | '_|  Install dir: null
   [junit4]   2> 1733474 INFO  (jetty-launcher-12727-thread-3) [     ] o.a.s.s.SolrDispatchFilter |___/\___/_|_|    Start time: 2019-08-28T04:35:03.889Z
   [junit4]   2> 1733474 INFO  (jetty-launcher-12727-thread-4) [     ] o.e.j.s.AbstractConnector Started ServerConnector@28bbe9{SSL,[ssl, http/1.1]}{127.0.0.1:37101}
   [junit4]   2> 1733474 INFO  (jetty-launcher-12727-thread-4) [     ] o.e.j.s.Server Started @1733523ms
   [junit4]   2> 1733474 INFO  (jetty-launcher-12727-thread-4) [     ] o.a.s.c.s.e.JettySolrRunner Jetty properties: {hostContext=/solr, hostPort=37101}
   [junit4]   2> 1733474 ERROR (jetty-launcher-12727-thread-4) [     ] o.a.s.u.StartupLoggingUtils Missing Java Option solr.log.dir. Logging may be missing or incomplete.
   [junit4]   2> 1733474 INFO  (jetty-launcher-12727-thread-4) [     ] o.a.s.s.SolrDispatchFilter Using logger factory org.apache.logging.slf4j.Log4jLoggerFactory
   [junit4]   2> 1733475 INFO  (jetty-launcher-12727-thread-4) [     ] o.a.s.s.SolrDispatchFilter  ___      _       Welcome to Apache Solr™ version 8.3.0
   [junit4]   2> 1733475 INFO  (jetty-launcher-12727-thread-4) [     ] o.a.s.s.SolrDispatchFilter / __| ___| |_ _   Starting in cloud mode on port null
   [junit4]   2> 1733475 INFO  (jetty-launcher-12727-thread-4) [     ] o.a.s.s.SolrDispatchFilter \__ \/ _ \ | '_|  Install dir: null
   [junit4]   2> 1733475 INFO  (jetty-launcher-12727-thread-4) [     ] o.a.s.s.SolrDispatchFilter |___/\___/_|_|    Start time: 2019-08-28T04:35:03.890Z
   [junit4]   2> 1733475 INFO  (jetty-launcher-12727-thread-2) [     ] o.e.j.s.AbstractConnector Started ServerConnector@baf9d0{SSL,[ssl, http/1.1]}{127.0.0.1:44775}
   [junit4]   2> 1733475 INFO  (jetty-launcher-12727-thread-1) [     ] o.e.j.s.AbstractConnector Started ServerConnector@1ba537{SSL,[ssl, http/1.1]}{127.0.0.1:41011}
   [junit4]   2> 1733475 INFO  (jetty-launcher-12727-thread-1) [     ] o.e.j.s.Server Started @1733523ms
   [junit4]   2> 1733475 INFO  (jetty-launcher-12727-thread-2) [     ] o.e.j.s.Server Started @1733523ms
   [junit4]   2> 1733475 INFO  (jetty-launcher-12727-thread-2) [     ] o.a.s.c.s.e.JettySolrRunner Jetty properties: {hostContext=/solr, hostPort=44775}
   [junit4]   2> 1733475 INFO  (jetty-launcher-12727-thread-1) [     ] o.a.s.c.s.e.JettySolrRunner Jetty properties: {hostContext=/solr, hostPort=41011}
   [junit4]   2> 1733475 ERROR (jetty-launcher-12727-thread-1) [     ] o.a.s.u.StartupLoggingUtils Missing Java Option solr.log.dir. Logging may be missing or incomplete.
   [junit4]   2> 1733475 ERROR (jetty-launcher-12727-thread-2) [     ] o.a.s.u.StartupLoggingUtils Missing Java Option solr.log.dir. Logging may be missing or incomplete.
   [junit4]   2> 1733475 INFO  (jetty-launcher-12727-thread-2) [     ] o.a.s.s.SolrDispatchFilter Using logger factory org.apache.logging.slf4j.Log4jLoggerFactory
   [junit4]   2> 1733475 INFO  (jetty-launcher-12727-thread-1) [     ] o.a.s.s.SolrDispatchFilter Using logger factory org.apache.logging.slf4j.Log4jLoggerFactory
   [junit4]   2> 1733475 INFO  (jetty-launcher-12727-thread-2) [     ] o.a.s.s.SolrDispatchFilter  ___      _       Welcome to Apache Solr™ version 8.3.0
   [junit4]   2> 1733475 INFO  (jetty-launcher-12727-thread-1) [     ] o.a.s.s.SolrDispatchFilter  ___      _       Welcome to Apache Solr™ version 8.3.0
   [junit4]   2> 1733475 INFO  (jetty-launcher-12727-thread-2) [     ] o.a.s.s.SolrDispatchFilter / __| ___| |_ _   Starting in cloud mode on port null
   [junit4]   2> 1733475 INFO  (jetty-launcher-12727-thread-1) [     ] o.a.s.s.SolrDispatchFilter / __| ___| |_ _   Starting in cloud mode on port null
   [junit4]   2> 1733475 INFO  (jetty-launcher-12727-thread-2) [     ] o.a.s.s.SolrDispatchFilter \__ \/ _ \ | '_|  Install dir: null
   [junit4]   2> 1733475 INFO  (jetty-launcher-12727-thread-2) [     ] o.a.s.s.SolrDispatchFilter |___/\___/_|_|    Start time: 2019-08-28T04:35:03.890Z
   [junit4]   2> 1733475 INFO  (jetty-launcher-12727-thread-1) [     ] o.a.s.s.SolrDispatchFilter \__ \/ _ \ | '_|  Install dir: null
   [junit4]   2> 1733475 INFO  (jetty-launcher-12727-thread-1) [     ] o.a.s.s.SolrDispatchFilter |___/\___/_|_|    Start time: 2019-08-28T04:35:03.890Z
   [junit4]   2> 1733475 INFO  (jetty-launcher-12727-thread-3) [     ] o.a.s.c.c.ConnectionManager Waiting for client to connect to ZooKeeper
   [junit4]   2> 1733476 INFO  (jetty-launcher-12727-thread-1) [     ] o.a.s.c.c.ConnectionManager Waiting for client to connect to ZooKeeper
   [junit4]   2> 1733476 INFO  (jetty-launcher-12727-thread-4) [     ] o.a.s.c.c.ConnectionManager Waiting for client to connect to ZooKeeper
   [junit4]   2> 1733476 INFO  (jetty-launcher-12727-thread-2) [     ] o.a.s.c.c.ConnectionManager Waiting for client to connect to ZooKeeper
   [junit4]   2> 1733476 INFO  (zkConnectionManagerCallback-12729-thread-1) [     ] o.a.s.c.c.ConnectionManager zkClient has connected
   [junit4]   2> 1733476 INFO  (jetty-launcher-12727-thread-3) [     ] o.a.s.c.c.ConnectionManager Client is connected to ZooKeeper
   [junit4]   2> 1733476 INFO  (zkConnectionManagerCallback-12735-thread-1) [     ] o.a.s.c.c.ConnectionManager zkClient has connected
   [junit4]   2> 1733476 INFO  (jetty-launcher-12727-thread-1) [     ] o.a.s.c.c.ConnectionManager Client is connected to ZooKeeper
   [junit4]   2> 1733476 INFO  (zkConnectionManagerCallback-12731-thread-1) [     ] o.a.s.c.c.ConnectionManager zkClient has connected
   [junit4]   2> 1733476 INFO  (jetty-launcher-12727-thread-4) [     ] o.a.s.c.c.ConnectionManager Client is connected to ZooKeeper
   [junit4]   2> 1733477 INFO  (zkConnectionManagerCallback-12734-thread-1) [     ] o.a.s.c.c.ConnectionManager zkClient has connected
   [junit4]   2> 1733477 INFO  (jetty-launcher-12727-thread-2) [     ] o.a.s.c.c.ConnectionManager Client is connected to ZooKeeper
   [junit4]   2> 1733477 INFO  (jetty-launcher-12727-thread-1) [     ] o.a.s.s.SolrDispatchFilter solr.xml found in ZooKeeper. Loading...
   [junit4]   2> 1733477 INFO  (jetty-launcher-12727-thread-3) [     ] o.a.s.s.SolrDispatchFilter solr.xml found in ZooKeeper. Loading...
   [junit4]   2> 1733477 INFO  (jetty-launcher-12727-thread-4) [     ] o.a.s.s.SolrDispatchFilter solr.xml found in ZooKeeper. Loading...
   [junit4]   2> 1733477 INFO  (jetty-launcher-12727-thread-2) [     ] o.a.s.s.SolrDispatchFilter solr.xml found in ZooKeeper. Loading...
   [junit4]   2> 1733819 INFO  (jetty-launcher-12727-thread-2) [     ] o.a.s.h.c.HttpShardHandlerFactory Host whitelist initialized: WhitelistHostChecker [whitelistHosts=null, whitelistHostCheckingEnabled=true]
   [junit4]   2> 1733820 WARN  (jetty-launcher-12727-thread-2) [     ] o.a.s.c.s.i.Http2SolrClient Create Http2SolrClient with HTTP/1.1 transport since Java 8 or lower versions does not support SSL + HTTP/2
   [junit4]   2> 1733820 WARN  (jetty-launcher-12727-thread-2) [     ] o.e.j.u.s.S.config Trusting all certificates configured for Client@8e1fe0[provider=null,keyStore=null,trustStore=null]
   [junit4]   2> 1733820 WARN  (jetty-launcher-12727-thread-2) [     ] o.e.j.u.s.S.config No Client EndPointIdentificationAlgorithm configured for Client@8e1fe0[provider=null,keyStore=null,trustStore=null]
   [junit4]   2> 1733823 WARN  (jetty-launcher-12727-thread-2) [     ] o.a.s.c.s.i.Http2SolrClient Create Http2SolrClient with HTTP/1.1 transport since Java 8 or lower versions does not support SSL + HTTP/2
   [junit4]   2> 1733825 WARN  (jetty-launcher-12727-thread-2) [     ] o.e.j.u.s.S.config Trusting all certificates configured for Client@e4b4a2[provider=null,keyStore=null,trustStore=null]
   [junit4]   2> 1733825 WARN  (jetty-launcher-12727-thread-2) [     ] o.e.j.u.s.S.config No Client EndPointIdentificationAlgorithm configured for Client@e4b4a2[provider=null,keyStore=null,trustStore=null]
   [junit4]   2> 1733825 INFO  (jetty-launcher-12727-thread-2) [     ] o.a.s.c.ZkContainer Zookeeper client=127.0.0.1:46495/solr
   [junit4]   2> 1733826 INFO  (jetty-launcher-12727-thread-2) [     ] o.a.s.c.c.ConnectionManager Waiting for client to connect to ZooKeeper
   [junit4]   2> 1733827 INFO  (zkConnectionManagerCallback-12744-thread-1) [     ] o.a.s.c.c.ConnectionManager zkClient has connected
   [junit4]   2> 1733827 INFO  (jetty-launcher-12727-thread-2) [     ] o.a.s.c.c.ConnectionManager Client is connected to ZooKeeper
   [junit4]   2> 1733982 INFO  (jetty-launcher-12727-thread-2) [n:127.0.0.1:44775_solr     ] o.a.s.c.c.ConnectionManager Waiting for client to connect to ZooKeeper
   [junit4]   2> 1733983 INFO  (zkConnectionManagerCallback-12747-thread-1) [     ] o.a.s.c.c.ConnectionManager zkClient has connected
   [junit4]   2> 1733983 INFO  (jetty-launcher-12727-thread-2) [n:127.0.0.1:44775_solr     ] o.a.s.c.c.ConnectionManager Client is connected to ZooKeeper
   [junit4]   2> 1733991 INFO  (jetty-launcher-12727-thread-1) [     ] o.a.s.h.c.HttpShardHandlerFactory Host whitelist initialized: WhitelistHostChecker [whitelistHosts=null, whitelistHostCheckingEnabled=true]
   [junit4]   2> 1733992 WARN  (jetty-launcher-12727-thread-1) [     ] o.a.s.c.s.i.Http2SolrClient Create Http2SolrClient with HTTP/1.1 transport since Java 8 or lower versions does not support SSL + HTTP/2
   [junit4]   2> 1733992 WARN  (jetty-launcher-12727-thread-1) [     ] o.e.j.u.s.S.config Trusting all certificates configured for Client@4b8516[provider=null,keyStore=null,trustStore=null]
   [junit4]   2> 1733992 WARN  (jetty-launcher-12727-thread-1) [     ] o.e.j.u.s.S.config No Client EndPointIdentificationAlgorithm configured for Client@4b8516[provider=null,keyStore=null,trustStore=null]
   [junit4]   2> 1733994 WARN  (jetty-launcher-12727-thread-1) [     ] o.a.s.c.s.i.Http2SolrClient Create Http2SolrClient with HTTP/1.1 transport since Java 8 or lower versions does not support SSL + HTTP/2
   [junit4]   2> 1733994 WARN  (jetty-launcher-12727-thread-1) [     ] o.e.j.u.s.S.config Trusting all certificates configured for Client@1208403[provider=null,keyStore=null,trustStore=null]
   [junit4]   2> 1733994 WARN  (jetty-launcher-12727-thread-1) [     ] o.e.j.u.s.S.config No Client EndPointIdentificationAlgorithm configured for Client@1208403[provider=null,keyStore=null,trustStore=null]
   [junit4]   2> 1733996 INFO  (jetty-launcher-12727-thread-1) [     ] o.a.s.c.ZkContainer Zookeeper client=127.0.0.1:46495/solr
   [junit4]   2> 1733999 INFO  (jetty-launcher-12727-thread-1) [     ] o.a.s.c.c.ConnectionManager Waiting for client to connect to ZooKeeper
   [junit4]   2> 1733999 INFO  (zkConnectionManagerCallback-12755-thread-1) [     ] o.a.s.c.c.ConnectionManager zkClient has connected
   [junit4]   2> 1733999 INFO  (jetty-launcher-12727-thread-1) [     ] o.a.s.c.c.ConnectionManager Client is connected to ZooKeeper
   [junit4]   2> 1734014 INFO  (jetty-launcher-12727-thread-2) [n:127.0.0.1:44775_solr     ] o.a.s.c.OverseerElectionContext I am going to be the leader 127.0.0.1:44775_solr
   [junit4]   2> 1734014 INFO  (jetty-launcher-12727-thread-2) [n:127.0.0.1:44775_solr     ] o.a.s.c.Overseer Overseer (id=72192654650572808-127.0.0.1:44775_solr-n_0000000000) starting
   [junit4]   2> 1734016 INFO  (jetty-launcher-12727-thread-2) [n:127.0.0.1:44775_solr     ] o.a.s.c.c.ConnectionManager Waiting for client to connect to ZooKeeper
   [junit4]   2> 1734017 INFO  (zkConnectionManagerCallback-12760-thread-1) [     ] o.a.s.c.c.ConnectionManager zkClient has connected
   [junit4]   2> 1734017 INFO  (jetty-launcher-12727-thread-2) [n:127.0.0.1:44775_solr     ] o.a.s.c.c.ConnectionManager Client is connected to ZooKeeper
   [junit4]   2> 1734018 INFO  (jetty-launcher-12727-thread-2) [n:127.0.0.1:44775_solr     ] o.a.s.c.s.i.ZkClientClusterStateProvider Cluster at 127.0.0.1:46495/solr ready
   [junit4]   2> 1734019 INFO  (OverseerStateUpdate-72192654650572808-127.0.0.1:44775_solr-n_0000000000) [n:127.0.0.1:44775_solr     ] o.a.s.c.Overseer Starting to work on the main queue : 127.0.0.1:44775_solr
   [junit4]   2> 1734023 INFO  (jetty-launcher-12727-thread-2) [n:127.0.0.1:44775_solr     ] o.a.s.c.ZkController Register node as live in ZooKeeper:/live_nodes/127.0.0.1:44775_solr
   [junit4]   2> 1734024 INFO  (jetty-launcher-12727-thread-2) [n:127.0.0.1:44775_solr     ] o.a.s.c.PackageManager clusterprops.json changed , version 0
   [junit4]   2> 1734027 INFO  (zkCallback-12759-thread-1) [     ] o.a.s.c.c.ZkStateReader Updated live nodes from ZooKeeper... (0) -> (1)
   [junit4]   2> 1734031 INFO  (zkCallback-12746-thread-1) [     ] o.a.s.c.c.ZkStateReader Updated live nodes from ZooKeeper... (0) -> (1)
   [junit4]   2> 1734039 INFO  (jetty-launcher-12727-thread-2) [n:127.0.0.1:44775_solr     ] o.a.s.h.a.MetricsHistoryHandler No .system collection, keeping metrics history in memory.
   [junit4]   2> 1734057 INFO  (jetty-launcher-12727-thread-2) [n:127.0.0.1:44775_solr     ] o.a.s.m.r.SolrJmxReporter JMX monitoring for 'solr_44775.solr.node' (registry 'solr.node') enabled at server: com.sun.jmx.mbeanserver.JmxMBeanServer@19abb0a
   [junit4]   2> 1734063 INFO  (jetty-launcher-12727-thread-2) [n:127.0.0.1:44775_solr     ] o.a.s.m.r.SolrJmxReporter JMX monitoring for 'solr_44775.solr.jvm' (registry 'solr.jvm') enabled at server: com.sun.jmx.mbeanserver.JmxMBeanServer@19abb0a
   [junit4]   2> 1734063 INFO  (jetty-launcher-12727-thread-2) [n:127.0.0.1:44775_solr     ] o.a.s.m.r.SolrJmxReporter JMX monitoring for 'solr_44775.solr.jetty' (registry 'solr.jetty') enabled at server: com.sun.jmx.mbeanserver.JmxMBeanServer@19abb0a
   [junit4]   2> 1734063 INFO  (jetty-launcher-12727-thread-2) [n:127.0.0.1:44775_solr     ] o.a.s.c.CorePropertiesLocator Found 0 core definitions underneath /home/jenkins/workspace/Lucene-Solr-BadApples-8.x-Linux/solr/build/solr-core/test/J1/temp/solr.cloud.TestCloudConsistency_471DEEE3DFB28547-001/tempDir-001/node2/.
   [junit4]   2> 1734100 INFO  (jetty-launcher-12727-thread-1) [n:127.0.0.1:41011_solr     ] o.a.s.c.c.ConnectionManager Waiting for client to connect to ZooKeeper
   [junit4]   2> 1734101 INFO  (zkConnectionManagerCallback-12763-thread-1) [     ] o.a.s.c.c.ConnectionManager zkClient has connected
   [junit4]   2> 1734101 INFO  (jetty-launcher-12727-thread-1) [n:127.0.0.1:41011_solr     ] o.a.s.c.c.ConnectionManager Client is connected to ZooKeeper
   [junit4]   2> 1734104 INFO  (jetty-launcher-12727-thread-1) [n:127.0.0.1:41011_solr     ] o.a.s.c.c.ZkStateReader Updated live nodes from ZooKeeper... (0) -> (1)
   [junit4]   2> 1734105 INFO  (jetty-launcher-12727-thread-1) [n:127.0.0.1:41011_solr     ] o.a.s.c.ZkController Publish node=127.0.0.1:41011_solr as DOWN
   [junit4]   2> 1734105 INFO  (jetty-launcher-12727-thread-1) [n:127.0.0.1:41011_solr     ] o.a.s.c.TransientSolrCoreCacheDefault Allocating transient cache for 2147483647 transient cores
   [junit4]   2> 1734105 INFO  (jetty-launcher-12727-thread-1) [n:127.0.0.1:41011_solr     ] o.a.s.c.ZkController Register node as live in ZooKeeper:/live_nodes/127.0.0.1:41011_solr
   [junit4]   2> 1734106 INFO  (zkCallback-12746-thread-1) [     ] o.a.s.c.c.ZkStateReader Updated live nodes from ZooKeeper... (1) -> (2)
   [junit4]   2> 1734106 INFO  (zkCallback-12759-thread-1) [     ] o.a.s.c.c.ZkStateReader Updated live nodes from ZooKeeper... (1) -> (2)
   [junit4]   2> 1734106 INFO  (zkCallback-12762-thread-1) [     ] o.a.s.c.c.ZkStateReader Updated live nodes from ZooKeeper... (1) -> (2)
   [junit4]   2> 1734106 INFO  (jetty-launcher-12727-thread-1) [n:127.0.0.1:41011_solr     ] o.a.s.c.c.ConnectionManager Waiting for client to connect to ZooKeeper
   [junit4]   2> 1734107 INFO  (zkConnectionManagerCallback-12770-thread-1) [     ] o.a.s.c.c.ConnectionManager zkClient has connected
   [junit4]   2> 1734107 INFO  (jetty-launcher-12727-thread-1) [n:127.0.0.1:41011_solr     ] o.a.s.c.c.ConnectionManager Client is connected to ZooKeeper
   [junit4]   2> 1734108 INFO  (jetty-launcher-12727-thread-1) [n:127.0.0.1:41011_solr     ] o.a.s.c.c.ZkStateReader Updated live nodes from ZooKeeper... (0) -> (2)
   [junit4]   2> 1734108 INFO  (jetty-launcher-12727-thread-1) [n:127.0.0.1:41011_solr     ] o.a.s.c.s.i.ZkClientClusterStateProvider Cluster at 127.0.0.1:46495/solr ready
   [junit4]   2> 1734108 INFO  (jetty-launcher-12727-thread-1) [n:127.0.0.1:41011_solr     ] o.a.s.c.PackageManager clusterprops.json changed , version 0
   [junit4]   2> 1734121 INFO  (jetty-launcher-12727-thread-1) [n:127.0.0.1:41011_solr     ] o.a.s.h.a.MetricsHistoryHandler No .system collection, keeping metrics history in memory.
   [junit4]   2> 1734132 INFO  (jetty-launcher-12727-thread-1) [n:127.0.0.1:41011_solr     ] o.a.s.m.r.SolrJmxReporter JMX monitoring for 'solr_41011.solr.node' (registry 'solr.node') enabled at server: com.sun.jmx.mbeanserver.JmxMBeanServer@19abb0a
   [junit4]   2> 1734138 INFO  (jetty-launcher-12727-thread-1) [n:127.0.0.1:41011_solr     ] o.a.s.m.r.SolrJmxReporter JMX monitoring for 'solr_41011.solr.jvm' (registry 'solr.jvm') enabled at server: com.sun.jmx.mbeanserver.JmxMBeanServer@19abb0a
   [junit4]   2> 1734138 INFO  (jetty-launcher-12727-thread-1) [n:127.0.0.1:41011_solr     ] o.a.s.m.r.SolrJmxReporter JMX monitoring for 'solr_41011.solr.jetty' (registry 'solr.jetty') enabled at server: com.sun.jmx.mbeanserver.JmxMBeanServer@19abb0a
   [junit4]   2> 1734139 INFO  (jetty-launcher-12727-thread-1) [n:127.0.0.1:41011_solr     ] o.a.s.c.CorePropertiesLocator Found 0 core definitions underneath /home/jenkins/workspace/Lucene-Solr-BadApples-8.x-Linux/solr/build/solr-core/test/J1/temp/solr.cloud.TestCloudConsistency_471DEEE3DFB28547-001/tempDir-001/node1/.
   [junit4]   2> 1734370 INFO  (jetty-launcher-12727-thread-3) [     ] o.a.s.h.c.HttpShardHandlerFactory Host whitelist initialized: WhitelistHostChecker [whitelistHosts=null, whitelistHostCheckingEnabled=true]
   [junit4]   2> 1734370 WARN  (jetty-launcher-12727-thread-3) [     ] o.a.s.c.s.i.Http2SolrClient Create Http2SolrClient with HTTP/1.1 transport since Java 8 or lower versions does not support SSL + HTTP/2
   [junit4]   2> 1734371 WARN  (jetty-launcher-12727-thread-3) [     ] o.e.j.u.s.S.config Trusting all certificates configured for Client@b8acad[provider=null,keyStore=null,trustStore=null]
   [junit4]   2> 1734371 WARN  (jetty-launcher-12727-thread-3) [     ] o.e.j.u.s.S.config No Client EndPointIdentificationAlgorithm configured for Client@b8acad[provider=null,keyStore=null,trustStore=null]
   [junit4]   2> 1734373 WARN  (jetty-launcher-12727-thread-3) [     ] o.a.s.c.s.i.Http2SolrClient Create Http2SolrClient with HTTP/1.1 transport since Java 8 or lower versions does not support SSL + HTTP/2
   [junit4]   2> 1734374 WARN  (jetty-launcher-12727-thread-3) [     ] o.e.j.u.s.S.config Trusting all certificates configured for Client@1609bf9[provider=null,keyStore=null,trustStore=null]
   [junit4]   2> 1734374 WARN  (jetty-launcher-12727-thread-3) [     ] o.e.j.u.s.S.config No Client EndPointIdentificationAlgorithm configured for Client@1609bf9[provider=null,keyStore=null,trustStore=null]
   [junit4]   2> 1734374 INFO  (jetty-launcher-12727-thread-3) [     ] o.a.s.c.ZkContainer Zookeeper client=127.0.0.1:46495/solr
   [junit4]   2> 1734375 INFO  (jetty-launcher-12727-thread-3) [     ] o.a.s.c.c.ConnectionManager Waiting for client to connect to ZooKeeper
   [junit4]   2> 1734376 INFO  (zkConnectionManagerCallback-12777-thread-1) [     ] o.a.s.c.c.ConnectionManager zkClient has connected
   [junit4]   2> 1734376 INFO  (jetty-launcher-12727-thread-3) [     ] o.a.s.c.c.ConnectionManager Client is connected to ZooKeeper
   [junit4]   2> 1734478 INFO  (jetty-launcher-12727-thread-3) [n:127.0.0.1:44859_solr     ] o.a.s.c.c.ConnectionManager Waiting for client to connect to ZooKeeper
   [junit4]   2> 1734478 INFO  (zkConnectionManagerCallback-12779-thread-1) [     ] o.a.s.c.c.ConnectionManager zkClient has connected
   [junit4]   2> 1734478 INFO  (jetty-launcher-12727-thread-3) [n:127.0.0.1:44859_solr     ] o.a.s.c.c.ConnectionManager Client is connected to ZooKeeper
   [junit4]   2> 1734481 INFO  (jetty-launcher-12727-thread-3) [n:127.0.0.1:44859_solr     ] o.a.s.c.c.ZkStateReader Updated live nodes from ZooKeeper... (0) -> (2)
   [junit4]   2> 1734483 INFO  (jetty-launcher-12727-thread-3) [n:127.0.0.1:44859_solr     ] o.a.s.c.ZkController Publish node=127.0.0.1:44859_solr as DOWN
   [junit4]   2> 1734483 INFO  (jetty-launcher-12727-thread-3) [n:127.0.0.1:44859_solr     ] o.a.s.c.TransientSolrCoreCacheDefault Allocating transient cache for 2147483647 transient cores
   [junit4]   2> 1734483 INFO  (jetty-launcher-12727-thread-3) [n:127.0.0.1:44859_solr     ] o.a.s.c.ZkController Register node as live in ZooKeeper:/live_nodes/127.0.0.1:44859_solr
   [junit4]   2> 1734484 INFO  (zkCallback-12746-thread-1) [     ] o.a.s.c.c.ZkStateReader Updated live nodes from ZooKeeper... (2) -> (3)
   [junit4]   2> 1734484 INFO  (zkCallback-12762-thread-1) [     ] o.a.s.c.c.ZkStateReader Updated live nodes from ZooKeeper... (2) -> (3)
   [junit4]   2> 1734484 INFO  (zkCallback-12759-thread-1) [     ] o.a.s.c.c.ZkStateReader Updated live nodes from ZooKeeper... (2) -> (3)
   [junit4]   2> 1734484 INFO  (zkCallback-12769-thread-1) [     ] o.a.s.c.c.ZkStateReader Updated live nodes from ZooKeeper... (2) -> (3)
   [junit4]   2> 1734484 INFO  (zkCallback-12778-thread-1) [     ] o.a.s.c.c.ZkStateReader Updated live nodes from ZooKeeper... (2) -> (3)
   [junit4]   2> 1734484 INFO  (jetty-launcher-12727-thread-3) [n:127.0.0.1:44859_solr     ] o.a.s.c.c.ConnectionManager Waiting for client to connect to ZooKeeper
   [junit4]   2> 1734485 INFO  (zkConnectionManagerCallback-12786-thread-1) [     ] o.a.s.c.c.ConnectionManager zkClient has connected
   [junit4]   2> 1734485 INFO  (jetty-launcher-12727-thread-3) [n:127.0.0.1:44859_solr     ] o.a.s.c.c.ConnectionManager Client is connected to ZooKeeper
   [junit4]   2> 1734485 INFO  (jetty-launcher-12727-thread-3) [n:127.0.0.1:44859_solr     ] o.a.s.c.c.ZkStateReader Updated live nodes from ZooKeeper... (0) -> (3)
   [junit4]   2> 1734486 INFO  (jetty-launcher-12727-thread-3) [n:127.0.0.1:44859_solr     ] o.a.s.c.s.i.ZkClientClusterStateProvider Cluster at 127.0.0.1:46495/solr ready
   [junit4]   2> 1734486 INFO  (jetty-launcher-12727-thread-3) [n:127.0.0.1:44859_solr     ] o.a.s.c.PackageManager clusterprops.json changed , version 0
   [junit4]   2> 1734500 INFO  (jetty-launcher-12727-thread-3) [n:127.0.0.1:44859_solr     ] o.a.s.h.a.MetricsHistoryHandler No .system collection, keeping metrics history in memory.
   [junit4]   2> 1734512 INFO  (jetty-launcher-12727-thread-3) [n:127.0.0.1:44859_solr     ] o.a.s.m.r.SolrJmxReporter JMX monitoring for 'solr_44859.solr.node' (registry 'solr.node') enabled at server: com.sun.jmx.mbeanserver.JmxMBeanServer@19abb0a
   [junit4]   2> 1734518 INFO  (jetty-launcher-12727-thread-3) [n:127.0.0.1:44859_solr     ] o.a.s.m.r.SolrJmxReporter JMX monitoring for 'solr_44859.solr.jvm' (registry 'solr.jvm') enabled at server: com.sun.jmx.mbeanserver.JmxMBeanServer@19abb0a
   [junit4]   2> 1734518 INFO  (jetty-launcher-12727-thread-3) [n:127.0.0.1:44859_solr     ] o.a.s.m.r.SolrJmxReporter JMX monitoring for 'solr_44859.solr.jetty' (registry 'solr.jetty') enabled at server: com.sun.jmx.mbeanserver.JmxMBeanServer@19abb0a
   [junit4]   2> 1734519 INFO  (jetty-launcher-12727-thread-3) [n:127.0.0.1:44859_solr     ] o.a.s.c.CorePropertiesLocator Found 0 core definitions underneath /home/jenkins/workspace/Lucene-Solr-BadApples-8.x-Linux/solr/build/solr-core/test/J1/temp/solr.cloud.TestCloudConsistency_471DEEE3DFB28547-001/tempDir-001/node3/.
   [junit4]   2> 1735385 INFO  (jetty-launcher-12727-thread-4) [     ] o.a.s.h.c.HttpShardHandlerFactory Host whitelist initialized: WhitelistHostChecker [whitelistHosts=null, whitelistHostCheckingEnabled=true]
   [junit4]   2> 1735386 WARN  (jetty-launcher-12727-thread-4) [     ] o.a.s.c.s.i.Http2SolrClient Create Http2SolrClient with HTTP/1.1 transport since Java 8 or lower versions does not support SSL + HTTP/2
   [junit4]   2> 1735386 WARN  (jetty-launcher-12727-thread-4) [     ] o.e.j.u.s.S.config Trusting all certificates configured for Client@160a3ca[provider=null,keyStore=null,trustStore=null]
   [junit4]   2> 1735386 WARN  (jetty-launcher-12727-thread-4) [     ] o.e.j.u.s.S.config No Client EndPointIdentificationAlgorithm configured for Client@160a3ca[provider=null,keyStore=null,trustStore=null]
   [junit4]   2> 1735388 WARN  (jetty-launcher-12727-thread-4) [     ] o.a.s.c.s.i.Http2SolrClient Create Http2SolrClient with HTTP/1.1 transport since Java 8 or lower versions does not support SSL + HTTP/2
   [junit4]   2> 1735389 WARN  (jetty-launcher-12727-thread-4) [     ] o.e.j.u.s.S.config Trusting all certificates configured for Client@d8c7fb[provider=null,keyStore=null,trustStore=null]
   [junit4]   2> 1735389 WARN  (jetty-launcher-12727-thread-4) [     ] o.e.j.u.s.S.config No Client EndPointIdentificationAlgorithm configured for Client@d8c7fb[provider=null,keyStore=null,trustStore=null]
   [junit4]   2> 1735390 INFO  (jetty-launcher-12727-thread-4) [     ] o.a.s.c.ZkContainer Zookeeper client=127.0.0.1:46495/solr
   [junit4]   2> 1735390 INFO  (jetty-launcher-12727-thread-4) [     ] o.a.s.c.c.ConnectionManager Waiting for client to connect to ZooKeeper
   [junit4]   2> 1735391 INFO  (zkConnectionManagerCallback-12793-thread-1) [     ] o.a.s.c.c.ConnectionManager zkClient has connected
   [junit4]   2> 1735391 INFO  (jetty-launcher-12727-thread-4) [     ] o.a.s.c.c.ConnectionManager Client is connected to ZooKeeper
   [junit4]   2> 1735493 INFO  (jetty-launcher-12727-thread-4) [n:127.0.0.1:37101_solr     ] o.a.s.c.c.ConnectionManager Waiting for client to connect to ZooKeeper
   [junit4]   2> 1735494 INFO  (zkConnectionManagerCallback-12795-thread-1) [     ] o.a.s.c.c.ConnectionManager zkClient has connected
   [junit4]   2> 1735494 INFO  (jetty-launcher-12727-thread-4) [n:127.0.0.1:37101_solr     ] o.a.s.c.c.ConnectionManager Client is connected to ZooKeeper
   [junit4]   2> 1735498 INFO  (jetty-launcher-12727-thread-4) [n:127.0.0.1:37101_solr     ] o.a.s.c.c.ZkStateReader Updated live nodes from ZooKeeper... (0) -> (3)
   [junit4]   2> 1735500 INFO  (jetty-launcher-12727-thread-4) [n:127.0.0.1:37101_solr     ] o.a.s.c.ZkController Publish node=127.0.0.1:37101_solr as DOWN
   [junit4]   2> 1735500 INFO  (jetty-launcher-12727-thread-4) [n:127.0.0.1:37101_solr     ] o.a.s.c.TransientSolrCoreCacheDefault Allocating transient cache for 2147483647 transient cores
   [junit4]   2> 1735500 INFO  (jetty-launcher-12727-thread-4) [n:127.0.0.1:37101_solr     ] o.a.s.c.ZkController Register node as live in ZooKeeper:/live_nodes/127.0.0.1:37101_solr
   [junit4]   2> 1735501 INFO  (zkCallback-12778-thread-1) [     ] o.a.s.c.c.ZkStateReader Updated live nodes from ZooKeeper... (3) -> (4)
   [junit4]   2> 1735501 INFO  (zkCallback-12769-thread-1) [     ] o.a.s.c.c.ZkStateReader Updated live nodes from ZooKeeper... (3) -> (4)
   [junit4]   2> 1735501 INFO  (zkCallback-12762-thread-1) [     ] o.a.s.c.c.ZkStateReader Updated live nodes from ZooKeeper... (3) -> (4)
   [junit4]   2> 1735501 INFO  (zkCallback-12746-thread-1) [     ] o.a.s.c.c.ZkStateReader Updated live nodes from ZooKeeper... (3) -> (4)
   [junit4]   2> 1735501 INFO  (zkCallback-12759-thread-1) [     ] o.a.s.c.c.ZkStateReader Updated live nodes from ZooKeeper... (3) -> (4)
   [junit4]   2> 1735501 INFO  (zkCallback-12785-thread-1) [     ] o.a.s.c.c.ZkStateReader Updated live nodes from ZooKeeper... (3) -> (4)
   [junit4]   2> 1735501 INFO  (zkCallback-12794-thread-1) [     ] o.a.s.c.c.ZkStateReader Updated live nodes from ZooKeeper... (3) -> (4)
   [junit4]   2> 1735501 INFO  (jetty-launcher-12727-thread-4) [n:127.0.0.1:37101_solr     ] o.a.s.c.c.ConnectionManager Waiting for client to connect to ZooKeeper
   [junit4]   2> 1735502 INFO  (zkConnectionManagerCallback-12802-thread-1) [     ] o.a.s.c.c.ConnectionManager zkClient has connected
   [junit4]   2> 1735502 INFO  (jetty-launcher-12727-thread-4) [n:127.0.0.1:37101_solr     ] o.a.s.c.c.ConnectionManager Client is connected to ZooKeeper
   [junit4]   2> 1735503 INFO  (jetty-launcher-12727-thread-4) [n:127.0.0.1:37101_solr     ] o.a.s.c.c.ZkStateReader Updated live nodes from ZooKeeper... (0) -> (4)
   [junit4]   2> 1735503 INFO  (jetty-launcher-12727-thread-4) [n:127.0.0.1:37101_solr     ] o.a.s.c.s.i.ZkClientClusterStateProvider Cluster at 127.0.0.1:46495/solr ready
   [junit4]   2> 1735503 INFO  (jetty-launcher-12727-thread-4) [n:127.0.0.1:37101_solr     ] o.a.s.c.PackageManager clusterprops.json changed , version 0
   [junit4]   2> 1735516 INFO  (jetty-launcher-12727-thread-4) [n:127.0.0.1:37101_solr     ] o.a.s.h.a.MetricsHistoryHandler No .system collection, keeping metrics history in memory.
   [junit4]   2> 1735527 INFO  (jetty-launcher-12727-thread-4) [n:127.0.0.1:37101_solr     ] o.a.s.m.r.SolrJmxReporter JMX monitoring for 'solr_37101.solr.node' (registry 'solr.node') enabled at server: com.sun.jmx.mbeanserver.JmxMBeanServer@19abb0a
   [junit4]   2> 1735533 INFO  (jetty-launcher-12727-thread-4) [n:127.0.0.1:37101_solr     ] o.a.s.m.r.SolrJmxReporter JMX monitoring for 'solr_37101.solr.jvm' (registry 'solr.jvm') enabled at server: com.sun.jmx.mbeanserver.JmxMBeanServer@19abb0a
   [junit4]   2> 1735533 INFO  (jetty-launcher-12727-thread-4) [n:127.0.0.1:37101_solr     ] o.a.s.m.r.SolrJmxReporter JMX monitoring for 'solr_37101.solr.jetty' (registry 'solr.jetty') enabled at server: com.sun.jmx.mbeanserver.JmxMBeanServer@19abb0a
   [junit4]   2> 1735534 INFO  (jetty-launcher-12727-thread-4) [n:127.0.0.1:37101_solr     ] o.a.s.c.CorePropertiesLocator Found 0 core definitions underneath /home/jenkins/workspace/Lucene-Solr-BadApples-8.x-Linux/solr/build/solr-core/test/J1/temp/solr.cloud.TestCloudConsistency_471DEEE3DFB28547-001/tempDir-001/node4/.
   [junit4]   2> 1735562 INFO  (TEST-TestCloudConsistency.testOutOfSyncReplicasCannotBecomeLeaderAfterRestart-seed#[471DEEE3DFB28547]) [     ] o.a.s.c.MiniSolrCloudCluster waitForAllNodes: numServers=4
   [junit4]   2> 1735563 INFO  (TEST-TestCloudConsistency.testOutOfSyncReplicasCannotBecomeLeaderAfterRestart-seed#[471DEEE3DFB28547]) [     ] o.a.s.c.c.ConnectionManager Waiting for client to connect to ZooKeeper
   [junit4]   2> 1735564 INFO  (zkConnectionManagerCallback-12808-thread-1) [     ] o.a.s.c.c.ConnectionManager zkClient has connected
   [junit4]   2> 1735564 INFO  (TEST-TestCloudConsistency.testOutOfSyncReplicasCannotBecomeLeaderAfterRestart-seed#[471DEEE3DFB28547]) [     ] o.a.s.c.c.ConnectionManager Client is connected to ZooKeeper
   [junit4]   2> 1735566 INFO  (TEST-TestCloudConsistency.testOutOfSyncReplicasCannotBecomeLeaderAfterRestart-seed#[471DEEE3DFB28547]) [     ] o.a.s.c.c.ZkStateReader Updated live nodes from ZooKeeper... (0) -> (4)
   [junit4]   2> 1735566 INFO  (TEST-TestCloudConsistency.testOutOfSyncReplicasCannotBecomeLeaderAfterRestart-seed#[471DEEE3DFB28547]) [     ] o.a.s.c.s.i.ZkClientClusterStateProvider Cluster at 127.0.0.1:46495/solr ready
   [junit4]   2> 1735568 INFO  (TEST-TestCloudConsistency.testOutOfSyncReplicasCannotBecomeLeaderAfterRestart-seed#[471DEEE3DFB28547]) [     ] o.a.s.c.CoreContainer Shutting down CoreContainer instance=31247776
   [junit4]   2> 1735568 INFO  (TEST-TestCloudConsistency.testOutOfSyncReplicasCannotBecomeLeaderAfterRestart-seed#[471DEEE3DFB28547]) [     ] o.a.s.c.ZkController Remove node as live in ZooKeeper:/live_nodes/127.0.0.1:44775_solr
   [junit4]   2> 1735568 INFO  (TEST-TestCloudConsistency.testOutOfSyncReplicasCannotBecomeLeaderAfterRestart-seed#[471DEEE3DFB28547]) [     ] o.a.s.c.ZkController Publish this node as DOWN...
   [junit4]   2> 1735568 INFO  (TEST-TestCloudConsistency.testOutOfSyncReplicasCannotBecomeLeaderAfterRestart-seed#[471DEEE3DFB28547]) [     ] o.a.s.c.ZkController Publish node=127.0.0.1:44775_solr as DOWN
   [junit4]   2> 1735570 INFO  (TEST-TestCloudConsistency.testOutOfSyncReplicasCannotBecomeLeaderAfterRestart-seed#[471DEEE3DFB28547]) [     ] o.a.s.c.TransientSolrCoreCacheDefault Allocating transient cache for 2147483647 transient cores
   [junit4]   2> 1735570 INFO  (TEST-TestCloudConsistency.testOutOfSyncReplicasCannotBecomeLeaderAfterRestart-seed#[471DEEE3DFB28547]) [     ] o.a.s.m.SolrMetricManager Closing metric reporters for registry=solr.node, tag=null
   [junit4]   2> 1735570 INFO  (TEST-TestCloudConsistency.testOutOfSyncReplicasCannotBecomeLeaderAfterRestart-seed#[471DEEE3DFB28547]) [     ] o.a.s.m.r.SolrJmxReporter Closing reporter [org.apache.solr.metrics.reporters.SolrJmxReporter@a32628: rootName = solr_44775, domain = solr.node, service url = null, agent id = null] for registry solr.node / com.codahale.metrics.MetricRegistry@9a9563
   [junit4]   2> 1735575 INFO  (TEST-TestCloudConsistency.testOutOfSyncReplicasCannotBecomeLeaderAfterRestart-seed#[471DEEE3DFB28547]) [     ] o.a.s.m.SolrMetricManager Closing metric reporters for registry=solr.jvm, tag=null
   [junit4]   2> 1735575 INFO  (TEST-TestCloudConsistency.testOutOfSyncReplicasCannotBecomeLeaderAfterRestart-seed#[471DEEE3DFB28547]) [     ] o.a.s.m.r.SolrJmxReporter Closing reporter [org.apache.solr.metrics.reporters.SolrJmxReporter@a61ae7: rootName = solr_44775, domain = solr.jvm, service url = null, agent id = null] for registry solr.jvm / com.codahale.metrics.MetricRegistry@368196
   [junit4]   2> 1735577 INFO  (TEST-TestCloudConsistency.testOutOfSyncReplicasCannotBecomeLeaderAfterRestart-seed#[471DEEE3DFB28547]) [     ] o.a.s.m.SolrMetricManager Closing metric reporters for registry=solr.jetty, tag=null
   [junit4]   2> 1735577 INFO  (TEST-TestCloudConsistency.testOutOfSyncReplicasCannotBecomeLeaderAfterRestart-seed#[471DEEE3DFB28547]) [     ] o.a.s.m.r.SolrJmxReporter Closing reporter [org.apache.solr.metrics.reporters.SolrJmxReporter@58e4d2: rootName = solr_44775, domain = solr.jetty, service url = null, agent id = null] for registry solr.jetty / com.codahale.metrics.MetricRegistry@14d7d70
   [junit4]   2> 1735577 INFO  (TEST-TestCloudConsistency.testOutOfSyncReplicasCannotBecomeLeaderAfterRestart-seed#[471DEEE3DFB28547]) [     ] o.a.s.m.SolrMetricManager Closing metric reporters for registry=solr.cluster, tag=null
   [junit4]   2> 1735578 INFO  (closeThreadPool-12812-thread-1) [     ] o.a.s.c.Overseer Overseer (id=72192654650572808-127.0.0.1:44775_solr-n_0000000000) closing
   [junit4]   2> 1735578 INFO  (OverseerStateUpdate-72192654650572808-127.0.0.1:44775_solr-n_0000000000) [n:127.0.0.1:44775_solr     ] o.a.s.c.Overseer Overseer Loop exiting : 127.0.0.1:44775_solr
   [junit4]   2> 1735578 INFO  (OverseerAutoScalingTriggerThread-72192654650572808-127.0.0.1:44775_solr-n_0000000000) [     ] o.a.s.c.a.OverseerTriggerThread OverseerTriggerThread woken up but we are closed, exiting.
   [junit4]   2> 1735579 INFO  (closeThreadPool-12812-thread-2) [     ] o.a.s.c.Overseer Overseer (id=72192654650572808-127.0.0.1:44775_solr-n_0000000000) closing
   [junit4]   2> 1735580 INFO  (zkCallback-12778-thread-1) [     ] o.a.s.c.c.ZkStateReader Updated live nodes from ZooKeeper... (4) -> (3)
   [junit4]   2> 1735580 INFO  (zkCallback-12794-thread-1) [     ] o.a.s.c.c.ZkStateReader Updated live nodes from ZooKeeper... (4) -> (3)
   [junit4]   2> 1735580 INFO  (zkCallback-12785-thread-1) [     ] o.a.s.c.c.ZkStateReader Updated live nodes from ZooKeeper... (4) -> (3)
   [junit4]   2> 1735580 INFO  (zkCallback-12762-thread-1) [     ] o.a.s.c.OverseerElectionContext I am going to be the leader 127.0.0.1:41011_solr
   [junit4]   2> 1735580 INFO  (zkCallback-12769-thread-1) [     ] o.a.s.c.c.ZkStateReader Updated live nodes from ZooKeeper... (4) -> (3)
   [junit4]   2> 1735580 INFO  (zkCallback-12801-thread-1) [     ] o.a.s.c.c.ZkStateReader Updated live nodes from ZooKeeper... (4) -> (3)
   [junit4]   2> 1735580 INFO  (zkCallback-12807-thread-1) [     ] o.a.s.c.c.ZkStateReader Updated live nodes from ZooKeeper... (4) -> (3)
   [junit4]   2> 1735580 INFO  (zkCallback-12762-thread-2) [     ] o.a.s.c.c.ZkStateReader Updated live nodes from ZooKeeper... (4) -> (3)
   [junit4]   2> 1735680 INFO  (TEST-TestCloudConsistency.testOutOfSyncReplicasCannotBecomeLeaderAfterRestart-seed#[471DEEE3DFB28547]) [     ] o.a.s.c.Overseer Overseer (id=72192654650572808-127.0.0.1:44775_solr-n_0000000000) closing
   [junit4]   2> 1735680 INFO  (zkCallback-12762-thread-1) [n:127.0.0.1:41011_solr     ] o.a.s.c.Overseer Overseer (id=72192654650572811-127.0.0.1:41011_solr-n_0000000001) starting
   [junit4]   2> 1735681 INFO  (TEST-TestCloudConsistency.testOutOfSyncReplicasCannotBecomeLeaderAfterRestart-seed#[471DEEE3DFB28547]) [     ] o.e.j.s.AbstractConnector Stopped ServerConnector@baf9d0{SSL,[ssl, http/1.1]}{127.0.0.1:0}
   [junit4]   2> 1735681 INFO  (TEST-TestCloudConsistency.testOutOfSyncReplicasCannotBecomeLeaderAfterRestart-seed#[471DEEE3DFB28547]) [     ] o.e.j.s.h.ContextHandler Stopped o.e.j.s.ServletContextHandler@c1e75d{/solr,null,UNAVAILABLE}
   [junit4]   2> 1735681 INFO  (TEST-TestCloudConsistency.testOutOfSyncReplicasCannotBecomeLeaderAfterRestart-seed#[471DEEE3DFB28547]) [     ] o.e.j.s.session node0 Stopped scavenging
   [junit4]   2> 1735682 INFO  (TEST-TestCloudConsistency.testOutOfSyncReplicasCannotBecomeLeaderAfterRestart-seed#[471DEEE3DFB28547]) [     ] o.a.s.c.s.e.JettySolrRunner Start Jetty (original configured port=0)
   [junit4]   2> 1735682 WARN  (TEST-TestCloudConsistency.testOutOfSyncReplicasCannotBecomeLeaderAfterRestart-seed#[471DEEE3DFB28547]) [     ] o.e.j.s.AbstractConnector Ignoring deprecated socket close linger time
   [junit4]   2> 1735682 INFO  (TEST-TestCloudConsistency.testOutOfSyncReplicasCannotBecomeLeaderAfterRestart-seed#[471DEEE3DFB28547]) [     ] o.a.s.c.s.e.JettySolrRunner Trying to start Jetty on port 0 try number 1 ...
   [junit4]   2> 1735682 INFO  (TEST-TestCloudConsistency.testOutOfSyncReplicasCannotBecomeLeaderAfterRestart-seed#[471DEEE3DFB28547]) [     ] o.e.j.s.Server jetty-9.4.19.v20190610; built: 2019-06-10T16:30:51.723Z; git: afcf563148970e98786327af5e07c261fda175d3; jvm 1.8.0_201-b09
   [junit4]   2> 1735683 INFO  (OverseerStateUpdate-72192654650572811-127.0.0.1:41011_solr-n_0000000001) [n:127.0.0.1:41011_solr     ] o.a.s.c.Overseer Starting to work on the main queue : 127.0.0.1:41011_solr
   [junit4]   2> 1735683 INFO  (TEST-TestCloudConsistency.testOutOfSyncReplicasCannotBecomeLeaderAfterRestart-seed#[471DEEE3DFB28547]) [     ] o.e.j.s.session DefaultSessionIdManager workerName=node0
   [junit4]   2> 1735683 INFO  (TEST-TestCloudConsistency.testOutOfSyncReplicasCannotBecomeLeaderAfterRestart-seed#[471DEEE3DFB28547]) [     ] o.e.j.s.session No SessionScavenger set, using defaults
   [junit4]   2> 1735683 INFO  (TEST-TestCloudConsistency.testOutOfSyncReplicasCannotBecomeLeaderAfterRestart-seed#[471DEEE3DFB28547]) [     ] o.e.j.s.session node0 Scavenging every 660000ms
   [junit4]   2> 1735683 INFO  (TEST-TestCloudConsistency.testOutOfSyncReplicasCannotBecomeLeaderAfterRestart-seed#[471DEEE3DFB28547]) [     ] o.e.j.s.h.ContextHandler Started o.e.j.s.ServletContextHandler@ffd1b9{/solr,null,AVAILABLE}
   [junit4]   2> 1735684 INFO  (TEST-TestCloudConsistency.testOutOfSyncReplicasCannotBecomeLeaderAfterRestart-seed#[471DEEE3DFB28547]) [     ] o.e.j.s.AbstractConnector Started ServerConnector@13ee89{SSL,[ssl, http/1.1]}{127.0.0.1:34595}
   [junit4]   2> 1735684 INFO  (TEST-TestCloudConsistency.testOutOfSyncReplicasCannotBecomeLeaderAfterRestart-seed#[471DEEE3DFB28547]) [     ] o.e.j.s.Server Started @1735732ms
   [junit4]   2> 1735684 INFO  (TEST-TestCloudConsistency.testOutOfSyncReplicasCannotBecomeLeaderAfterRestart-seed#[471DEEE3DFB28547]) [     ] o.a.s.c.s.e.JettySolrRunner Jetty properties: {hostContext=/solr, hostPort=36161}
   [junit4]   2> 1735684 ERROR (TEST-TestCloudConsistency.testOutOfSyncReplicasCannotBecomeLeaderAfterRestart-seed#[471DEEE3DFB28547]) [     ] o.a.s.u.StartupLoggingUtils Missing Java Option solr.log.dir. Logging may be missing or incomplete.
   [junit4]   2> 1735684 INFO  (TEST-TestCloudConsistency.testOutOfSyncReplicasCannotBecomeLeaderAfterRestart-seed#[471DEEE3DFB28547]) [     ] o.a.s.s.SolrDispatchFilter Using logger factory org.apache.logging.slf4j.Log4jLoggerFactory
   [junit4]   2> 1735684 INFO  (TEST-TestCloudConsistency.testOutOfSyncReplicasCannotBecomeLeaderAfterRestart-seed#[471DEEE3DFB28547]) [     ] o.a.s.s.SolrDispatchFilter  ___      _       Welcome to Apache Solr™ version 8.3.0
   [junit4]   2> 1735684 INFO  (TEST-TestCloudConsistency.testOutOfSyncReplicasCannotBecomeLeaderAfterRestart-seed#[471DEEE3DFB28547]) [     ] o.a.s.s.SolrDispatchFilter / __| ___| |_ _   Starting in cloud mode on port null
   [junit4]   2> 1735684 INFO  (TEST-TestCloudConsistency.testOutOfSyncReplicasCannotBecomeLeaderAfterRestart-seed#[471DEEE3DFB28547]) [     ] o.a.s.s.SolrDispatchFilter \__ \/ _ \ | '_|  Install dir: null
   [junit4]   2> 1735684 INFO  (TEST-TestCloudConsistency.testOutOfSyncReplicasCannotBecomeLeaderAfterRestart-seed#[471DEEE3DFB28547]) [     ] o.a.s.s.SolrDispatchFilter |___/\___/_|_|    Start time: 2019-08-28T04:35:06.099Z
   [junit4]   2> 1735685 INFO  (TEST-TestCloudConsistency.testOutOfSyncReplicasCannotBecomeLeaderAfterRestart-seed#[471DEEE3DFB28547]) [     ] o.a.s.c.c.ConnectionManager Waiting for client to connect to ZooKeeper
   [junit4]   2> 1735685 INFO  (zkConnectionManagerCallback-12814-thread-1) [     ] o.a.s.c.c.ConnectionManager zkClient has connected
   [junit4]   2> 1735685 INFO  (TEST-TestCloudConsistency.testOutOfSyncReplicasCannotBecomeLeaderAfterRestart-seed#[471DEEE3DFB28547]) [     ] o.a.s.c.c.ConnectionManager Client is connected to ZooKeeper
   [junit4]   2> 1735686 INFO  (TEST-TestCloudConsistency.testOutOfSyncReplicasCannotBecomeLeaderAfterRestart-seed#[471DEEE3DFB28547]) [     ] o.a.s.s.SolrDispatchFilter solr.xml found in ZooKeeper. Loading...
   [junit4]   2> 1736235 INFO  (TEST-TestCloudConsistency.testOutOfSyncReplicasCannotBecomeLeaderAfterRestart-seed#[471DEEE3DFB28547]) [     ] o.a.s.h.c.HttpShardHandlerFactory Host whitelist initialized: WhitelistHostChecker [whitelistHosts=null, whitelistHostCheckingEnabled=true]
   [junit4]   2> 1736236 WARN  (TEST-TestCloudConsistency.testOutOfSyncReplicasCannotBecomeLeaderAfterRestart-seed#[471DEEE3DFB28547]) [     ] o.a.s.c.s.i.Http2SolrClient Create Http2SolrClient with HTTP/1.1 transport since Java 8 or lower versions does not support SSL + HTTP/2
   [junit4]   2> 1736237 WARN  (TEST-TestCloudConsistency.testOutOfSyncReplicasCannotBecomeLeaderAfterRestart-seed#[471DEEE3DFB28547]) [     ] o.e.j.u.s.S.config Trusting all certificates configured for Client@7b3462[provider=null,keyStore=null,trustStore=null]
   [junit4]   2> 1736237 WARN  (TEST-TestCloudConsistency.testOutOfSyncReplicasCannotBecomeLeaderAfterRestart-seed#[471DEEE3DFB28547]) [     ] o.e.j.u.s.S.config No Client EndPointIdentificationAlgorithm configured for Client@7b3462[provider=null,keyStore=null,trustStore=null]
   [junit4]   2> 1736239 WARN  (TEST-TestCloudConsistency.testOutOfSyncReplicasCannotBecomeLeaderAfterRestart-seed#[471DEEE3DFB28547]) [     ] o.a.s.c.s.i.Http2SolrClient Create Http2SolrClient with HTTP/1.1 transport since Java 8 or lower versions does not support SSL + HTTP/2
   [junit4]   2> 1736240 WARN  (TEST-TestCloudConsistency.testOutOfSyncReplicasCannotBecomeLeaderAfterRestart-seed#[471DEEE3DFB28547]) [     ] o.e.j.u.s.S.config Trusting all certificates configured for Client@160c327[provider=null,keyStore=null,trustStore=null]
   [junit4]   2> 1736240 WARN  (TEST-TestCloudConsistency.testOutOfSyncReplicasCannotBecomeLeaderAfterRestart-seed#[471DEEE3DFB28547]) [     ] o.e.j.u.s.S.config No Client EndPointIdentificationAlgorithm configured for Client@160c327[provider=null,keyStore=null,trustStore=null]
   [junit4]   2> 1736241 INFO  (TEST-TestCloudConsistency.testOutOfSyncReplicasCannotBecomeLeaderAfterRestart-seed#[471DEEE3DFB28547]) [     ] o.a.s.c.ZkContainer Zookeeper client=127.0.0.1:46495/solr
   [junit4]   2> 1736242 INFO  (TEST-TestCloudConsistency.testOutOfSyncReplicasCannotBecomeLeaderAfterRestart-seed#[471DEEE3DFB28547]) [     ] o.a.s.c.c.ConnectionManager Waiting for client to connect to ZooKeeper
   [junit4]   2> 1736243 INFO  (zkConnectionManagerCallback-12821-thread-1) [     ] o.a.s.c.c.ConnectionManager zkClient has connected
   [junit4]   2> 1736243 INFO  (TEST-TestCloudConsistency.testOutOfSyncReplicasCannotBecomeLeaderAfterRestart-seed#[471DEEE3DFB28547]) [     ] o.a.s.c.c.ConnectionManager Client is connected to ZooKeeper
   [junit4]   2> 1736345 INFO  (TEST-TestCloudConsistency.testOutOfSyncReplicasCannotBecomeLeaderAfterRestart-seed#[471DEEE3DFB28547]) [n:127.0.0.1:36161_solr     ] o.a.s.c.c.ConnectionManager Waiting for client to connect to ZooKeeper
   [junit4]   2> 1736346 INFO  (zkConnectionManagerCallback-12823-thread-1) [     ] o.a.s.c.c.ConnectionManager zkClient has connected
   [junit4]   2> 1736346 INFO  (TEST-TestCloudConsistency.testOutOfSyncReplicasCannotBecomeLeaderAfterRestart-seed#[471DEEE3DFB28547]) [n:127.0.0.1:36161_solr     ] o.a.s.c.c.ConnectionManager Client is connected to ZooKeeper
   [junit4]   2> 1736351 INFO  (TEST-TestCloudConsistency.testOutOfSyncReplicasCannotBecomeLeaderAfterRestart-seed#[471DEEE3DFB28547]) [n:127.0.0.1:36161_solr     ] o.a.s.c.c.ZkStateReader Updated live nodes from ZooKeeper... (0) -> (3)
   [junit4]   2> 1736352 INFO  (TEST-TestCloudConsistency.testOutOfSyncReplicasCannotBecomeLeaderAfterRestart-seed#[471DEEE3DFB28547]) [n:127.0.0.1:36161_solr     ] o.a.s.c.ZkController Publish node=127.0.0.1:36161_solr as DOWN
   [junit4]   2> 1736352 INFO  (TEST-TestCloudConsistency.testOutOfSyncReplicasCannotBecomeLeaderAfterRestart-seed#[471DEEE3DFB28547]) [n:127.0.0.1:36161_solr     ] o.a.s.c.TransientSolrCoreCacheDefault Allocating transient cache for 2147483647 transient cores
   [junit4]   2> 1736353 INFO  (TEST-TestCloudConsistency.testOutOfSyncReplicasCannotBecomeLeaderAfterRestart-seed#[471DEEE3DFB28547]) [n:127.0.0.1:36161_solr     ] o.a.s.c.ZkController Register node as live in ZooKeeper:/live_nodes/127.0.0.1:36161_solr
   [junit4]   2> 1736353 INFO  (zkCallback-12794-thread-1) [     ] o.a.s.c.c.ZkStateReader Updated live nodes from ZooKeeper... (3) -> (4)
   [junit4]   2> 1736353 INFO  (zkCallback-12778-thread-1) [     ] o.a.s.c.c.ZkStateReader Updated live nodes from ZooKeeper... (3) -> (4)
   [junit4]   2> 1736353 INFO  (zkCallback-12762-thread-1) [     ] o.a.s.c.c.ZkStateReader Updated live nodes from ZooKeeper... (3) -> (4)
   [junit4]   2> 1736353 INFO  (zkCallback-12801-thread-1) [     ] o.a.s.c.c.ZkStateReader Updated live nodes from ZooKeeper... (3) -> (4)
   [junit4]   2> 1736353 INFO  (zkCallback-12807-thread-1) [     ] o.a.s.c.c.ZkStateReader Updated live nodes from ZooKeeper... (3) -> (4)
   [junit4]   2> 1736353 INFO  (zkCallback-12785-thread-1) [     ] o.a.s.c.c.ZkStateReader Updated live nodes from ZooKeeper... (3) -> (4)
   [junit4]   2> 1736353 INFO  (zkCallback-12769-thread-1) [     ] o.a.s.c.c.ZkStateReader Updated live nodes from ZooKeeper... (3) -> (4)
   [junit4]   2> 1736353 INFO  (zkCallback-12822-thread-1) [     ] o.a.s.c.c.ZkStateReader Updated live nodes from ZooKeeper... (3) -> (4)
   [junit4]   2> 1736354 INFO  (TEST-TestCloudConsistency.testOutOfSyncReplicasCannotBecomeLeaderAfterRestart-seed#[471DEEE3DFB28547]) [n:127.0.0.1:36161_solr     ] o.a.s.c.c.ConnectionManager Waiting for client to connect to ZooKeeper
   [junit4]   2> 1736354 INFO  (zkConnectionManagerCallback-12830-thread-1) [     ] o.a.s.c.c.ConnectionManager zkClient has connected
   [junit4]   2> 1736354 INFO  (TEST-TestCloudConsistency.testOutOfSyncReplicasCannotBecomeLeaderAfterRestart-seed#[471DEEE3DFB28547]) [n:127.0.0.1:36161_solr     ] o.a.s.c.c.ConnectionManager Client is connected to ZooKeeper
   [junit4]   2> 1736356 INFO  (TEST-TestCloudConsistency.testOutOfSyncReplicasCannotBecomeLeaderAfterRestart-seed#[471DEEE3DFB28547]) [n:127.0.0.1:36161_solr     ] o.a.s.c.c.ZkStateReader Updated live nodes from ZooKeeper... (0) -> (4)
   [junit4]   2> 1736356 INFO  (TEST-TestCloudConsistency.testOutOfSyncReplicasCannotBecomeLeaderAfterRestart-seed#[471DEEE3DFB28547]) [n:127.0.0.1:36161_solr     ] o.a.s.c.s.i.ZkClientClusterStateProvider Cluster at 127.0.0.1:46495/solr ready
   [junit4]   2> 1736357 INFO  (TEST-TestCloudConsistency.testOutOfSyncReplicasCannotBecomeLeaderAfterRestart-seed#[471DEEE3DFB28547]) [n:127.0.0.1:36161_solr     ] o.a.s.c.PackageManager clusterprops.json changed , version 0
   [junit4]   2> 1736370 INFO  (TEST-TestCloudConsistency.testOutOfSyncReplicasCannotBecomeLeaderAfterRestart-seed#[471DEEE3DFB28547]) [n:127.0.0.1:36161_solr     ] o.a.s.h.a.MetricsHistoryHandler No .system collection, keeping metrics history in memory.
   [junit4]   2> 1736390 INFO  (TEST-TestCloudConsistency.testOutOfSyncReplicasCannotBecomeLeaderAfterRestart-seed#[471DEEE3DFB28547]) [n:127.0.0.1:36161_solr     ] o.a.s.m.r.SolrJmxReporter JMX monitoring for 'solr_36161.solr.node' (registry 'solr.node') enabled at server: com.sun.jmx.mbeanserver.JmxMBeanServer@19abb0a
   [junit4]   2> 1736397 INFO  (TEST-TestCloudConsistency.testOutOfSyncReplicasCannotBecomeLeaderAfterRestart-seed#[471DEEE3DFB28547]) [n:127.0.0.1:36161_solr     ] o.a.s.m.r.SolrJmxReporter JMX monitoring for 'solr_36161.solr.jvm' (registry 'solr.jvm') enabled at server: com.sun.jmx.mbeanserver.JmxMBeanServer@19abb0a
   [junit4]   2> 1736397 INFO  (TEST-TestCloudConsistency.testOutOfSyncReplicasCannotBecomeLeaderAfterRestart-seed#[471DEEE3DFB28547]) [n:127.0.0.1:36161_solr     ] o.a.s.m.r.SolrJmxReporter JMX monitoring for 'solr_36161.solr.jetty' (registry 'solr.jetty') enabled at server: com.sun.jmx.mbeanserver.JmxMBeanServer@19abb0a
   [junit4]   2> 1736398 INFO  (TEST-TestCloudConsistency.testOutOfSyncReplicasCannotBecomeLeaderAfterRestart-seed#[471DEEE3DFB28547]) [n:127.0.0.1:36161_solr     ] o.a.s.c.CorePropertiesLocator Found 0 core definitions underneath /home/jenkins/workspace/Lucene-Solr-BadApples-8.x-Linux/solr/build/solr-core/test/J1/temp/solr.cloud.TestCloudConsistency_471DEEE3DFB28547-001/tempDir-001/node2/.
   [junit4]   2> 1736433 INFO  (TEST-TestCloudConsistency.testOutOfSyncReplicasCannotBecomeLeaderAfterRestart-seed#[471DEEE3DFB28547]) [     ] o.a.s.c.TestCloudConsistency Adding proxy for URL: https://127.0.0.1:34595/solr. Proxy: https://127.0.0.1:36161/solr
   [junit4]   2> 1736433 INFO  (TEST-TestCloudConsistency.testOutOfSyncReplicasCannotBecomeLeaderAfterRestart-seed#[471DEEE3DFB28547]) [     ] o.a.s.c.CoreContainer Shutting down CoreContainer instance=29518184
   [junit4]   2> 1736433 INFO  (TEST-TestCloudConsistency.testOutOfSyncReplicasCannotBecomeLeaderAfterRestart-seed#[471DEEE3DFB28547]) [     ] o.a.s.c.ZkController Remove node as live in ZooKeeper:/live_nodes/127.0.0.1:41011_solr
   [junit4]   2> 1736434 INFO  (TEST-TestCloudConsistency.testOutOfSyncReplicasCannotBecomeLeaderAfterRestart-seed#[471DEEE3DFB28547]) [     ] o.a.s.c.ZkController Publish this node as DOWN...
   [junit4]   2> 1736434 INFO  (TEST-TestCloudConsistency.testOutOfSyncReplicasCannotBecomeLeaderAfterRestart-seed#[471DEEE3DFB28547]) [     ] o.a.s.c.ZkController Publish node=127.0.0.1:41011_solr as DOWN
   [junit4]   2> 1736436 INFO  (TEST-TestCloudConsistency.testOutOfSyncReplicasCannotBecomeLeaderAfterRestart-seed#[471DEEE3DFB28547]) [     ] o.a.s.m.SolrMetricManager Closing metric reporters for registry=solr.node, tag=null
   [junit4]   2> 1736436 INFO  (TEST-TestCloudConsistency.testOutOfSyncReplicasCannotBecomeLeaderAfterRestart-seed#[471DEEE3DFB28547]) [     ] o.a.s.m.r.SolrJmxReporter Closing reporter [org.apache.solr.metrics.reporters.SolrJmxReporter@ac1b74: rootName = solr_41011, domain = solr.node, service url = null, agent id = null] for registry solr.node / com.codahale.metrics.MetricRegistry@12fe7ba
   [junit4]   2> 1736441 INFO  (TEST-TestCloudConsistency.testOutOfSyncReplicasCannotBecomeLeaderAfterRestart-seed#[471DEEE3DFB28547]) [     ] o.a.s.m.SolrMetricManager Closing metric reporters for registry=solr.jvm, tag=null
   [junit4]   2> 1736441 INFO  (TEST-TestCloudConsistency.testOutOfSyncReplicasCannotBecomeLeaderAfterRestart-seed#[471DEEE3DFB28547]) [     ] o.a.s.m.r.SolrJmxReporter Closing reporter [org.apache.solr.metrics.reporters.SolrJmxReporter@1542856: rootName = solr_41011, domain = solr.jvm, service url = null, agent id = null] for registry solr.jvm / com.codahale.metrics.MetricRegistry@368196
   [junit4]   2> 1736444 INFO  (TEST-TestCloudConsistency.testOutOfSyncReplicasCannotBecomeLeaderAfterRestart-seed#[471DEEE3DFB28547]) [     ] o.a.s.m.SolrMetricManager Closing metric reporters for registry=solr.jetty, tag=null
   [junit4]   2> 1736444 INFO  (TEST-TestCloudConsistency.testOutOfSyncReplicasCannotBecomeLeaderAfterRestart-seed#[471DEEE3DFB28547]) [     ] o.a.s.m.r.SolrJmxReporter Closing reporter [org.apache.solr.metrics.reporters.SolrJmxReporter@19f732d: rootName = solr_41011, domain = solr.jetty, service url = null, agent id = null] for registry solr.jetty / com.codahale.metrics.MetricRegistry@14d7d70
   [junit4]   2> 1736444 INFO  (TEST-TestCloudConsistency.testOutOfSyncReplicasCannotBecomeLeaderAfterRestart-seed#[471DEEE3DFB28547]) [     ] o.a.s.m.SolrMetricManager Closing metric reporters for registry=solr.cluster, tag=null
   [junit4]   2> 1736444 INFO  (closeThreadPool-12835-thread-2) [     ] o.a.s.c.Overseer Overseer (id=72192654650572811-127.0.0.1:41011_solr-n_0000000001) closing
   [junit4]   2> 1736444 INFO  (OverseerStateUpdate-72192654650572811-127.0.0.1:41011_solr-n_0000000001) [n:127.0.0.1:41011_solr     ] o.a.s.c.Overseer Overseer Loop exiting : 127.0.0.1:41011_solr
   [junit4]   2> 1736444 INFO  (OverseerAutoScalingTriggerThread-72192654650572811-127.0.0.1:41011_solr-n_0000000001) [     ] o.a.s.c.a.OverseerTriggerThread OverseerTriggerThread woken up but we are closed, exiting.
   [junit4]   2> 1736446 INFO  (closeThreadPool-12835-thread-1) [     ] o.a.s.c.Overseer Overseer (id=72192654650572811-127.0.0.1:41011_solr-n_0000000001) closing
   [junit4]   2> 1736446 INFO  (zkCallback-12778-thread-1) [     ] o.a.s.c.c.ZkStateReader Updated live nodes from ZooKeeper... (4) -> (3)
   [junit4]   2> 1736446 INFO  (zkCallback-12822-thread-1) [     ] o.a.s.c.c.ZkStateReader Updated live nodes from ZooKeeper... (4) -> (3)
   [junit4]   2> 1736446 INFO  (zkCallback-12785-thread-1) [     ] o.a.s.c.c.ZkStateReader Updated live nodes from ZooKeeper... (4) -> (3)
   [junit4]   2> 1736446 INFO  (zkCallback-12807-thread-1) [     ] o.a.s.c.c.ZkStateReader Updated live nodes from ZooKeeper... (4) -> (3)
   [junit4]   2> 1736446 INFO  (zkCallback-12794-thread-1) [     ] o.a.s.c.c.ZkStateReader Updated live nodes from ZooKeeper... (4) -> (3)
   [junit4]   2> 1736446 INFO  (zkCallback-12801-thread-1) [     ] o.a.s.c.c.ZkStateReader Updated live nodes from ZooKeeper... (4) -> (3)
   [junit4]   2> 1736446 INFO  (zkCallback-12778-thread-2) [     ] o.a.s.c.OverseerElectionContext I am going to be the leader 127.0.0.1:44859_solr
   [junit4]   2> 1736547 INFO  (zkCallback-12829-thread-1) [     ] o.a.s.c.c.ZkStateReader Updated live nodes from ZooKeeper... (4) -> (3)
   [junit4]   2> 1736647 INFO  (TEST-TestCloudConsistency.testOutOfSyncReplicasCannotBecomeLeaderAfterRestart-seed#[471DEEE3DFB28547]) [     ] o.a.s.c.Overseer Overseer (id=72192654650572811-127.0.0.1:41011_solr-n_0000000001) closing
   [junit4]   2> 1736647 INFO  (zkCallback-12778-thread-2) [n:127.0.0.1:44859_solr     ] o.a.s.c.Overseer Overseer (id=72192654650572814-127.0.0.1:44859_solr-n_0000000002) starting
   [junit4]   2> 1736648 INFO  (TEST-TestCloudConsistency.testOutOfSyncReplicasCannotBecomeLeaderAfterRestart-seed#[471DEEE3DFB28547]) [     ] o.e.j.s.AbstractConnector Stopped ServerConnector@1ba537{SSL,[ssl, http/1.1]}{127.0.0.1:0}
   [junit4]   2> 1736648 INFO  (TEST-TestCloudConsistency.testOutOfSyncReplicasCannotBecomeLeaderAfterRestart-seed#[471DEEE3DFB28547]) [     ] o.e.j.s.h.ContextHandler Stopped o.e.j.s.ServletContextHandler@e96169{/solr,null,UNAVAILABLE}
   [junit4]   2> 1736648 INFO  (TEST-TestCloudConsistency.testOutOfSyncReplicasCannotBecomeLeaderAfterRestart-seed#[471DEEE3DFB28547]) [     ] o.e.j.s.session node0 Stopped scavenging
   [junit4]   2> 1736648 INFO  (TEST-TestCloudConsistency.testOutOfSyncReplicasCannotBecomeLeaderAfterRestart-seed#[471DEEE3DFB28547]) [     ] o.a.s.c.s.e.JettySolrRunner Start Jetty (original configured port=0)
   [junit4]   2> 1736649 WARN  (TEST-TestCloudConsistency.testOutOfSyncReplicasCannotBecomeLeaderAfterRestart-seed#[471DEEE3DFB28547]) [     ] o.e.j.s.AbstractConnector Ignoring deprecated socket close linger time
   [junit4]   2> 1736649 INFO  (TEST-TestCloudConsistency.testOutOfSyncReplicasCannotBecomeLeaderAfterRestart-seed#[471DEEE3DFB28547]) [     ] o.a.s.c.s.e.JettySolrRunner Trying to start Jetty on port 0 try number 1 ...
   [junit4]   2> 1736649 INFO  (TEST-TestCloudConsistency.testOutOfSyncReplicasCannotBecomeLeaderAfterRestart-seed#[471DEEE3DFB28547]) [     ] o.e.j.s.Server jetty-9.4.19.v20190610; built: 2019-06-10T16:30:51.723Z; git: afcf563148970e98786327af5e07c261fda175d3; jvm 1.8.0_201-b09
   [junit4]   2> 1736650 INFO  (OverseerStateUpdate-72192654650572814-127.0.0.1:44859_solr-n_0000000002) [n:127.0.0.1:44859_solr     ] o.a.s.c.Overseer Starting to work on the main queue : 127.0.0.1:44859_solr
   [junit4]   2> 1736650 INFO  (TEST-TestCloudConsistency.testOutOfSyncReplicasCannotBecomeLeaderAfterRestart-seed#[471DEEE3DFB28547]) [     ] o.e.j.s.session DefaultSessionIdManager workerName=node0
   [junit4]   2> 1736650 INFO  (TEST-TestCloudConsistency.testOutOfSyncReplicasCannotBecomeLeaderAfterRestart-seed#[471DEEE3DFB28547]) [     ] o.e.j.s.session No SessionScavenger set, using defaults
   [junit4]   2> 1736651 INFO  (TEST-TestCloudConsistency.testOutOfSyncReplicasCannotBecomeLeaderAfterRestart-seed#[471DEEE3DFB28547]) [     ] o.e.j.s.session node0 Scavenging every 600000ms
   [junit4]   2> 1736651 INFO  (TEST-TestCloudConsistency.testOutOfSyncReplicasCannotBecomeLeaderAfterRestart-seed#[471DEEE3DFB28547]) [     ] o.e.j.s.h.ContextHandler Started o.e.j.s.ServletContextHandler@14c58d7{/solr,null,AVAILABLE}
   [junit4]   2> 1736651 INFO  (TEST-TestCloudConsistency.testOutOfSyncReplicasCannotBecomeLeaderAfterRestart-seed#[471DEEE3DFB28547]) [     ] o.e.j.s.AbstractConnector Started ServerConnector@773051{SSL,[ssl, http/1.1]}{127.0.0.1:43447}
   [junit4]   2> 1736651 INFO  (TEST-TestCloudConsistency.testOutOfSyncReplicasCannotBecomeLeaderAfterRestart-seed#[471DEEE3DFB28547]) [     ] o.e.j.s.Server Started @1736700ms
   [junit4]   2> 1736651 INFO  (TEST-TestCloudConsistency.testOutOfSyncReplicasCannotBecomeLeaderAfterRestart-seed#[471DEEE3DFB28547]) [     ] o.a.s.c.s.e.JettySolrRunner Jetty properties: {hostContext=/solr, hostPort=42613}
   [junit4]   2> 1736651 ERROR (TEST-TestCloudConsistency.testOutOfSyncReplicasCannotBecomeLeaderAfterRestart-seed#[471DEEE3DFB28547]) [     ] o.a.s.u.StartupLoggingUtils Missing Java Option solr.log.dir. Logging may be missing or incomplete.
   [junit4]   2> 1736651 INFO  (TEST-TestCloudConsistency.testOutOfSyncReplicasCannotBecomeLeaderAfterRestart-seed#[471DEEE3DFB28547]) [     ] o.a.s.s.SolrDispatchFilter Using logger factory org.apache.logging.slf4j.Log4jLoggerFactory
   [junit4]   2> 1736651 INFO  (TEST-TestCloudConsistency.testOutOfSyncReplicasCannotBecomeLeaderAfterRestart-seed#[471DEEE3DFB28547]) [     ] o.a.s.s.SolrDispatchFilter  ___      _       Welcome to Apache Solr™ version 8.3.0
   [junit4]   2> 1736652 INFO  (TEST-TestCloudConsistency.testOutOfSyncReplicasCannotBecomeLeaderAfterRestart-seed#[471DEEE3DFB28547]) [     ] o.a.s.s.SolrDispatchFilter / __| ___| |_ _   Starting in cloud mode on port null
   [junit4]   2> 1736652 INFO  (TEST-TestCloudConsistency.testOutOfSyncReplicasCannotBecomeLeaderAfterRestart-seed#[471DEEE3DFB28547]) [     ] o.a.s.s.SolrDispatchFilter \__ \/ _ \ | '_|  Install dir: null
   [junit4]   2> 1736652 INFO  (TEST-TestCloudConsistency.testOutOfSyncReplicasCannotBecomeLeaderAfterRestart-seed#[471DEEE3DFB28547]) [     ] o.a.s.s.SolrDispatchFilter |___/\___/_|_|    Start time: 2019-08-28T04:35:07.067Z
   [junit4]   2> 1736652 INFO  (TEST-TestCloudConsistency.testOutOfSyncReplicasCannotBecomeLeaderAfterRestart-seed#[471DEEE3DFB28547]) [     ] o.a.s.c.c.ConnectionManager Waiting for client to connect to ZooKeeper
   [junit4]   2> 1736653 INFO  (zkConnectionManagerCallback-12837-thread-1) [     ] o.a.s.c.c.ConnectionManager zkClient has connected
   [junit4]   2> 1736653 INFO  (TEST-TestCloudConsistency.testOutOfSyncReplicasCannotBecomeLeaderAfterRestart-seed#[471DEEE3DFB28547]) [     ] o.a.s.c.c.ConnectionManager Client is connected to ZooKeeper
   [junit4]   2> 1736653 INFO  (TEST-TestCloudConsistency.testOutOfSyncReplicasCannotBecomeLeaderAfterRestart-seed#[471DEEE3DFB28547]) [     ] o.a.s.s.SolrDispatchFilter solr.xml found in ZooKeeper. Loading...
   [junit4]   2> 1737526 INFO  (TEST-TestCloudConsistency.testOutOfSyncReplicasCannotBecomeLeaderAfterRestart-seed#[471DEEE3DFB28547]) [     ] o.a.s.h.c.HttpShardHandlerFactory Host whitelist initialized: WhitelistHostChecker [whitelistHosts=null, whitelistHostCheckingEnabled=true]
   [junit4]   2> 1737527 WARN  (TEST-TestCloudConsistency.testOutOfSyncReplicasCannotBecomeLeaderAfterRestart-seed#[471DEEE3DFB28547]) [     ] o.a.s.c.s.i.Http2SolrClient Create Http2SolrClient with HTTP/1.1 transport since Java 8 or lower versions does not support SSL + HTTP/2
   [junit4]   2> 1737527 WARN  (TEST-TestCloudConsistency.testOutOfSyncReplicasCannotBecomeLeaderAfterRestart-seed#[471DEEE3DFB28547]) [     ] o.e.j.u.s.S.config Trusting all certificates configured for Client@13ffa01[provider=null,keyStore=null,trustStore=null]
   [junit4]   2> 1737527 WARN  (TEST-TestCloudConsistency.testOutOfSyncReplicasCannotBecomeLeaderAfterRestart-seed#[471DEEE3DFB28547]) [     ] o.e.j.u.s.S.config No Client EndPointIdentificationAlgorithm configured for Client@13ffa01[provider=null,keyStore=null,trustStore=null]
   [junit4]   2> 1737530 WARN  (TEST-TestCloudConsistency.testOutOfSyncReplicasCannotBecomeLeaderAfterRestart-seed#[471DEEE3DFB28547]) [     ] o.a.s.c.s.i.Http2SolrClient Create Http2SolrClient with HTTP/1.1 transport since Java 8 or lower versions does not support SSL + HTTP/2
   [junit4]   2> 1737530 WARN  (TEST-TestCloudConsistency.testOutOfSyncReplicasCannotBecomeLeaderAfterRestart-seed#[471DEEE3DFB28547]) [     ] o.e.j.u.s.S.config Trusting all certificates configured for Client@5a2844[provider=null,keyStore=null,trustStore=null]
   [junit4]   2> 1737530 WARN  (TEST-TestCloudConsistency.testOutOfSyncReplicasCannotBecomeLeaderAfterRestart-seed#[471DEEE3DFB28547]) [     ] o.e.j.u.s.S.config No Client EndPointIdentificationAlgorithm configured for Client@5a2844[provider=null,keyStore=null,trustStore=null]
   [junit4]   2> 1737531 INFO  (TEST-TestCloudConsistency.testOutOfSyncReplicasCannotBecomeLeaderAfterRestart-seed#[471DEEE3DFB28547]) [     ] o.a.s.c.ZkContainer Zookeeper client=127.0.0.1:46495/solr
   [junit4]   2> 1737532 INFO  (TEST-TestCloudConsistency.testOutOfSyncReplicasCannotBecomeLeaderAfterRestart-seed#[471DEEE3DFB28547]) [     ] o.a.s.c.c.ConnectionManager Waiting for client to connect to ZooKeeper
   [junit4]   2> 1737533 INFO  (zkConnectionManagerCallback-12844-thread-1) [     ] o.a.s.c.c.ConnectionManager zkClient has connected
   [junit4]   2> 1737533 INFO  (TEST-TestCloudConsistency.testOutOfSyncReplicasCannotBecomeLeaderAfterRestart-seed#[471DEEE3DFB28547]) [     ] o.a.s.c.c.ConnectionManager Client is connected to ZooKeeper
   [junit4]   2> 1737635 INFO  (TEST-TestCloudConsistency.testOutOfSyncReplicasCannotBecomeLeaderAfterRestart-seed#[471DEEE3DFB28547]) [     ] o.a.s.c.c.ConnectionManager Waiting for client to connect to ZooKeeper
   [junit4]   2> 1737636 INFO  (zkConnectionManagerCallback-12846-thread-1) [     ] o.a.s.c.c.ConnectionManager zkClient has connected
   [junit4]   2> 1737636 INFO  (TEST-TestCloudConsistency.testOutOfSyncReplicasCannotBecomeLeaderAfterRestart-seed#[471DEEE3DFB28547]) [     ] o.a.s.c.c.ConnectionManager Client is connected to ZooKeeper
   [junit4]   2> 1737640 INFO  (TEST-TestCloudConsistency.testOutOfSyncReplicasCannotBecomeLeaderAfterRestart-seed#[471DEEE3DFB28547]) [     ] o.a.s.c.c.ZkStateReader Updated live nodes from ZooKeeper... (0) -> (3)
   [junit4]   2> 1737641 INFO  (TEST-TestCloudConsistency.testOutOfSyncReplicasCannotBecomeLeaderAfterRestart-seed#[471DEEE3DFB28547]) [     ] o.a.s.c.ZkController Publish node=127.0.0.1:42613_solr as DOWN
   [junit4]   2> 1737641 INFO  (TEST-TestCloudConsistency.testOutOfSyncReplicasCannotBecomeLeaderAfterRestart-seed#[471DEEE3DFB28547]) [     ] o.a.s.c.TransientSolrCoreCacheDefault Allocating transient cache for 2147483647 transient cores
   [junit4]   2> 1737641 INFO  (TEST-TestCloudConsistency.testOutOfSyncReplicasCannotBecomeLeaderAfterRestart-seed#[471DEEE3DFB28547]) [     ] o.a.s.c.ZkController Register node as live in ZooKeeper:/live_nodes/127.0.0.1:42613_solr
   [junit4]   2> 1737642 INFO  (zkCallback-12778-thread-2) [     ] o.a.s.c.c.ZkStateReader Updated live nodes from ZooKeeper... (3) -> (4)
   [junit4]   2> 1737642 INFO  (zkCallback-12801-thread-1) [     ] o.a.s.c.c.ZkStateReader Updated live nodes from ZooKeeper... (3) -> (4)
   [junit4]   2> 1737642 INFO  (zkCallback-12794-thread-1) [     ] o.a.s.c.c.ZkStateReader Updated live nodes from ZooKeeper... (3) -> (4)
   [junit4]   2> 1737642 INFO  (zkCallback-12807-thread-1) [     ] o.a.s.c.c.ZkStateReader Updated live nodes from ZooKeeper... (3) -> (4)
   [junit4]   2> 1737642 INFO  (zkCallback-12822-thread-1) [     ] o.a.s.c.c.ZkStateReader Updated live nodes from ZooKeeper... (3) -> (4)
   [junit4]   2> 1737642 INFO  (zkCallback-12785-thread-1) [     ] o.a.s.c.c.ZkStateReader Updated live nodes from ZooKeeper... (3) -> (4)
   [junit4]   2> 1737642 INFO  (zkCallback-12829-thread-1) [     ] o.a.s.c.c.ZkStateReader Updated live nodes from ZooKeeper... (3) -> (4)
   [junit4]   2> 1737642 INFO  (zkCallback-12845-thread-1) [     ] o.a.s.c.c.ZkStateReader Updated live nodes from ZooKeeper... (3) -> (4)
   [junit4]   2> 1737643 INFO  (TEST-TestCloudConsistency.testOutOfSyncReplicasCannotBecomeLeaderAfterRestart-seed#[471DEEE3DFB28547]) [     ] o.a.s.c.c.ConnectionManager Waiting for client to connect to ZooKeeper
   [junit4]   2> 1737643 INFO  (zkConnectionManagerCallback-12853-thread-1) [     ] o.a.s.c.c.ConnectionManager zkClient has connected
   [junit4]   2> 1737643 INFO  (TEST-TestCloudConsistency.testOutOfSyncReplicasCannotBecomeLeaderAfterRestart-seed#[471DEEE3DFB28547]) [     ] o.a.s.c.c.ConnectionManager Client is connected to ZooKeeper
   [junit4]   2> 1737644 INFO  (TEST-TestCloudConsistency.testOutOfSyncReplicasCannotBecomeLeaderAfterRestart-seed#[471DEEE3DFB28547]) [     ] o.a.s.c.c.ZkStateReader Updated live nodes from ZooKeeper... (0) -> (4)
   [junit4]   2> 1737645 INFO  (TEST-TestCloudConsistency.testOutOfSyncReplicasCannotBecomeLeaderAfterRestart-seed#[471DEEE3DFB28547]) [     ] o.a.s.c.s.i.ZkClientClusterStateProvider Cluster at 127.0.0.1:46495/solr ready
   [junit4]   2> 1737645 INFO  (TEST-TestCloudConsistency.testOutOfSyncReplicasCannotBecomeLeaderAfterRestart-seed#[471DEEE3DFB28547]) [     ] o.a.s.c.PackageManager clusterprops.json changed , version 0
   [junit4]   2> 1737662 INFO  (TEST-TestCloudConsistency.testOutOfSyncReplicasCannotBecomeLeaderAfterRestart-seed#[471DEEE3DFB28547]) [     ] o.a.s.h.a.MetricsHistoryHandler No .system collection, keeping metrics history in memory.
   [junit4]   2> 1737676 INFO  (TEST-TestCloudConsistency.testOutOfSyncReplicasCannotBecomeLeaderAfterRestart-seed#[471DEEE3DFB28547]) [     ] o.a.s.m.r.SolrJmxReporter JMX monitoring for 'solr_42613.solr.node' (registry 'solr.node') enabled at server: com.sun.jmx.mbeanserver.JmxMBeanServer@19abb0a
   [junit4]   2> 1737684 INFO  (TEST-TestCloudConsistency.testOutOfSyncReplicasCannotBecomeLeaderAfterRestart-seed#[471DEEE3DFB28547]) [     ] o.a.s.m.r.SolrJmxReporter JMX monitoring for 'solr_42613.solr.jvm' (registry 'solr.jvm') enabled at server: com.sun.jmx.mbeanserver.JmxMBeanServer@19abb0a
   [junit4]   2> 1737685 INFO  (TEST-TestCloudConsistency.testOutOfSyncReplicasCannotBecomeLeaderAfterRestart-seed#[471DEEE3DFB28547]) [     ] o.a.s.m.r.SolrJmxReporter JMX monitoring for 'solr_42613.solr.jetty' (registry 'solr.jetty') enabled at server: com.sun.jmx.mbeanserver.JmxMBeanServer@19abb0a
   [junit4]   2> 1737685 INFO  (TEST-TestCloudConsistency.testOutOfSyncReplicasCannotBecomeLeaderAfterRestart-seed#[471DEEE3DFB28547]) [     ] o.a.s.c.CorePropertiesLocator Found 0 core definitions underneath /home/jenkins/workspace/Lucene-Solr-BadApples-8.x-Linux/solr/build/solr-core/test/J1/temp/solr.cloud.TestCloudConsistency_471DEEE3DFB28547-001/tempDir-001/node1/.
   [junit4]   2> 1737729 INFO  (TEST-TestCloudConsistency.testOutOfSyncReplicasCannotBecomeLeaderAfterRestart-seed#[471DEEE3DFB28547]) [     ] o.a.s.c.TestCloudConsistency Adding proxy for URL: https://127.0.0.1:43447/solr. Proxy: https://127.0.0.1:42613/solr
   [junit4]   2> 1737729 INFO  (TEST-TestCloudConsistency.testOutOfSyncReplicasCannotBecomeLeaderAfterRestart-seed#[471DEEE3DFB28547]) [     ] o.a.s.c.CoreContainer Shutting down CoreContainer instance=2944111
   [junit4]   2> 1737729 INFO  (TEST-TestCloudConsistency.testOutOfSyncReplicasCannotBecomeLeaderAfterRestart-seed#[471DEEE3DFB28547]) [     ] o.a.s.c.ZkController Remove node as live in ZooKeeper:/live_nodes/127.0.0.1:44859_solr
   [junit4]   2> 1737730 INFO  (TEST-TestCloudConsistency.testOutOfSyncReplicasCannotBecomeLeaderAfterRestart-seed#[471DEEE3DFB28547]) [     ] o.a.s.c.ZkController Publish this node as DOWN...
   [junit4]   2> 1737730 INFO  (TEST-TestCloudConsistency.testOutOfSyncReplicasCannotBecomeLeaderAfterRestart-seed#[471DEEE3DFB28547]) [     ] o.a.s.c.ZkController Publish node=127.0.0.1:44859_solr as DOWN
   [junit4]   2> 1737731 INFO  (TEST-TestCloudConsistency.testOutOfSyncReplicasCannotBecomeLeaderAfterRestart-seed#[471DEEE3DFB28547]) [     ] o.a.s.m.SolrMetricManager Closing metric reporters for registry=solr.node, tag=null
   [junit4]   2> 1737731 INFO  (TEST-TestCloudConsistency.testOutOfSyncReplicasCannotBecomeLeaderAfterRestart-seed#[471DEEE3DFB28547]) [     ] o.a.s.m.r.SolrJmxReporter Closing reporter [org.apache.solr.metrics.reporters.SolrJmxReporter@1c3ec72: rootName = solr_44859, domain = solr.node, service url = null, agent id = null] for registry solr.node / com.codahale.metrics.MetricRegistry@1929984
   [junit4]   2> 1737736 INFO  (TEST-TestCloudConsistency.testOutOfSyncReplicasCannotBecomeLeaderAfterRestart-seed#[471DEEE3DFB28547]) [     ] o.a.s.m.SolrMetricManager Closing metric reporters for registry=solr.jvm, tag=null
   [junit4]   2> 1737736 INFO  (TEST-TestCloudConsistency.testOutOfSyncReplicasCannotBecomeLeaderAfterRestart-seed#[471DEEE3DFB28547]) [     ] o.a.s.m.r.SolrJmxReporter Closing reporter [org.apache.solr.metrics.reporters.SolrJmxReporter@32bf12: rootName = solr_44859, domain = solr.jvm, service url = null, agent id = null] for registry solr.jvm / com.codahale.metrics.MetricRegistry@368196
   [junit4]   2> 1737739 INFO  (TEST-TestCloudConsistency.testOutOfSyncReplicasCannotBecomeLeaderAfterRestart-seed#[471DEEE3DFB28547]) [     ] o.a.s.m.SolrMetricManager Closing metric reporters for registry=solr.jetty, tag=null
   [junit4]   2> 1737739 INFO  (TEST-TestCloudConsistency.testOutOfSyncReplicasCannotBecomeLeaderAfterRestart-seed#[471DEEE3DFB28547]) [     ] o.a.s.m.r.SolrJmxReporter Closing reporter [org.apache.solr.metrics.reporters.SolrJmxReporter@1b46cb7: rootName = solr_44859, domain = solr.jetty, service url = null, agent id = null] for registry solr.jetty / com.codahale.metrics.MetricRegistry@14d7d70
   [junit4]   2> 1737739 INFO  (TEST-TestCloudConsistency.testOutOfSyncReplicasCannotBecomeLeaderAfterRestart-seed#[471DEEE3DFB28547]) [     ] o.a.s.m.SolrMetricManager Closing metric reporters for registry=solr.cluster, tag=null
   [junit4]   2> 1737740 INFO  (closeThreadPool-12858-thread-2) [     ] o.a.s.c.Overseer Overseer (id=72192654650572814-127.0.0.1:44859_solr-n_0000000002) closing
   [junit4]   2> 1737742 INFO  (zkCallback-12822-thread-1) [     ] o.a.s.c.c.ZkStateReader Updated live nodes from ZooKeeper... (4) -> (3)
   [junit4]   2> 1737742 INFO  (zkCallback-12801-thread-1) [     ] o.a.s.c.c.ZkStateReader Updated live nodes from ZooKeeper... (4) -> (3)
   [junit4]   2> 1737742 INFO  (zkCallback-12807-thread-1) [     ] o.a.s.c.c.ZkStateReader Updated live nodes from ZooKeeper... (4) -> (3)
   [junit4]   2> 1737742 INFO  (zkCallback-12829-thread-1) [     ] o.a.s.c.c.ZkStateReader Updated live nodes from ZooKeeper... (4) -> (3)
   [junit4]   2> 1737742 INFO  (OverseerStateUpdate-72192654650572814-127.0.0.1:44859_solr-n_0000000002) [n:127.0.0.1:44859_solr     ] o.a.s.c.Overseer Overseer Loop exiting : 127.0.0.1:44859_solr
   [junit4]   2> 1737742 INFO  (OverseerAutoScalingTriggerThread-72192654650572814-127.0.0.1:44859_solr-n_0000000002) [     ] o.a.s.c.a.OverseerTriggerThread OverseerTriggerThread woken up but we are closed, exiting.
   [junit4]   2> 1737742 INFO  (zkCallback-12794-thread-1) [     ] o.a.s.c.OverseerElectionContext I am going to be the leader 127.0.0.1:37101_solr
   [junit4]   2> 1737743 INFO  (zkCallback-12852-thread-1) [     ] o.a.s.c.c.ZkStateReader Updated live nodes from ZooKeeper... (4) -> (3)
   [junit4]   2> 1737743 INFO  (zkCallback-12845-thread-1) [     ] o.a.s.c.c.ZkStateReader Updated live nodes from ZooKeeper... (4) -> (3)
   [junit4]   2> 1737743 INFO  (closeThreadPool-12858-thread-1) [     ] o.a.s.c.Overseer Overseer (id=72192654650572814-127.0.0.1:44859_solr-n_0000000002) closing
   [junit4]   2> 1737743 INFO  (zkCallback-12794-thread-2) [     ] o.a.s.c.c.ZkStateReader Updated live nodes from ZooKeeper... (4) -> (3)
   [junit4]   2> 1737744 INFO  (zkCallback-12794-thread-1) [n:127.0.0.1:37101_solr     ] o.a.s.c.Overseer Overseer (id=72192654650572817-127.0.0.1:37101_solr-n_0000000003) starting
   [junit4]   2> 1737745 INFO  (OverseerStateUpdate-72192654650572817-127.0.0.1:37101_solr-n_0000000003) [n:127.0.0.1:37101_solr     ] o.a.s.c.Overseer Starting to work on the main queue : 127.0.0.1:37101_solr
   [junit4]   2> 1737842 INFO  (TEST-TestCloudConsistency.testOutOfSyncReplicasCanno

[...truncated too long message...]

  2> 1796015 WARN  (ZkTestServer Run Thread) [     ] o.a.s.c.ZkTestServer Watch limit violations:
   [junit4]   2> Maximum concurrent create/delete watches above limit:
   [junit4]   2>
   [junit4]   2> 19 /solr/aliases.json
   [junit4]   2> 16 /solr/collections/outOfSyncReplicasCannotBecomeLeader-false/terms/shard1
   [junit4]   2> 9 /solr/security.json
   [junit4]   2> 4 /solr/collections/outOfSyncReplicasCannotBecomeLeader-false/collectionprops.json
   [junit4]   2> 4 /solr/configs/outOfSyncReplicasCannotBecomeLeader-false.AUTOCREATED/managed-schema
   [junit4]   2> 4 /solr/configs/outOfSyncReplicasCannotBecomeLeader-false.AUTOCREATED
   [junit4]   2>
   [junit4]   2> Maximum concurrent data watches above limit:
   [junit4]   2>
   [junit4]   2> 121 /solr/collections/outOfSyncReplicasCannotBecomeLeader-false/state.json
   [junit4]   2> 19 /solr/clusterprops.json
   [junit4]   2> 19 /solr/clusterstate.json
   [junit4]   2> 6 /solr/autoscaling.json
   [junit4]   2> 2 /solr/overseer_elect/election/72192656920412190-127.0.0.1:35295_solr-n_0000000006
   [junit4]   2>
   [junit4]   2> Maximum concurrent children watches above limit:
   [junit4]   2>
   [junit4]   2> 119 /solr/live_nodes
   [junit4]   2> 62 /solr/overseer/queue
   [junit4]   2> 28 /solr/collections
   [junit4]   2> 22 /solr/overseer/collection-queue-work
   [junit4]   2> 6 /solr/autoscaling/events/.scheduled_maintenance
   [junit4]   2> 6 /solr/autoscaling/events/.auto_add_replicas
   [junit4]   2> 6 /solr/overseer/queue-work
   [junit4]   2>
   [junit4]   2> 1796019 INFO  (TEST-TestCloudConsistency.testOutOfSyncReplicasCannotBecomeLeader-seed#[471DEEE3DFB28547]) [     ] o.a.s.c.ZkTestServer waitForServerDown: 127.0.0.1:35717
   [junit4]   2> 1796019 INFO  (TEST-TestCloudConsistency.testOutOfSyncReplicasCannotBecomeLeader-seed#[471DEEE3DFB28547]) [     ] o.a.s.c.ZkTestServer parse host and port list: 127.0.0.1:35717
   [junit4]   2> 1796019 INFO  (TEST-TestCloudConsistency.testOutOfSyncReplicasCannotBecomeLeader-seed#[471DEEE3DFB28547]) [     ] o.a.s.c.ZkTestServer connecting to 127.0.0.1 35717
   [junit4]   2> 1796019 INFO  (TEST-TestCloudConsistency.testOutOfSyncReplicasCannotBecomeLeader-seed#[471DEEE3DFB28547]) [     ] o.a.s.SolrTestCaseJ4 ###Ending testOutOfSyncReplicasCannotBecomeLeader
   [junit4]   2> NOTE: reproduce with: ant test  -Dtestcase=TestCloudConsistency -Dtests.method=testOutOfSyncReplicasCannotBecomeLeader -Dtests.seed=471DEEE3DFB28547 -Dtests.multiplier=3 -Dtests.slow=true -Dtests.badapples=true -Dtests.locale=en-IN -Dtests.timezone=America/Argentina/Salta -Dtests.asserts=true -Dtests.file.encoding=UTF-8
   [junit4] FAILURE 28.1s J1 | TestCloudConsistency.testOutOfSyncReplicasCannotBecomeLeader <<<
   [junit4]    > Throwable #1: java.lang.AssertionError: Doc with id=4 not found in https://127.0.0.1:33845/solr/outOfSyncReplicasCannotBecomeLeader-false due to: Path not found: /id; rsp={doc=null}
   [junit4]    > at __randomizedtesting.SeedInfo.seed([471DEEE3DFB28547:39F6CEF31CD58A7D]:0)
   [junit4]    > at org.apache.solr.cloud.TestCloudConsistency.assertDocExists(TestCloudConsistency.java:285)
   [junit4]    > at org.apache.solr.cloud.TestCloudConsistency.assertDocsExistInAllReplicas(TestCloudConsistency.java:269)
   [junit4]    > at org.apache.solr.cloud.TestCloudConsistency.testOutOfSyncReplicasCannotBecomeLeader(TestCloudConsistency.java:140)
   [junit4]    > at org.apache.solr.cloud.TestCloudConsistency.testOutOfSyncReplicasCannotBecomeLeader(TestCloudConsistency.java:99)
   [junit4]    > at java.lang.Thread.run(Thread.java:748)
   [junit4]   2> NOTE: leaving temporary files on disk at: /home/jenkins/workspace/Lucene-Solr-BadApples-8.x-Linux/solr/build/solr-core/test/J1/temp/solr.cloud.TestCloudConsistency_471DEEE3DFB28547-001
   [junit4]   2> Aug 28, 2019 4:36:06 AM com.carrotsearch.randomizedtesting.ThreadLeakControl checkThreadLeaks
   [junit4]   2> WARNING: Will linger awaiting termination of 1 leaked thread(s).
   [junit4]   2> NOTE: test params are: codec=CheapBastard, sim=Asserting(org.apache.lucene.search.similarities.AssertingSimilarity@1263150), locale=en-IN, timezone=America/Argentina/Salta
   [junit4]   2> NOTE: Linux 5.0.0-23-generic i386/Oracle Corporation 1.8.0_201 (32-bit)/cpus=8,threads=1,free=124996184,total=536870912
   [junit4]   2> NOTE: All tests run in this JVM: [IndexSchemaTest, ZkCLITest, PhrasesIdentificationComponentTest, TestManagedSchemaThreadSafety, TestComplexPhraseLeadingWildcard, DistanceFunctionTest, FacetPivotSmallTest, TestUninvertingReader, TestSolrCoreParser, TestUseDocValuesAsStored, TestStressLiveNodes, TestCodecSupport, TriggerEventQueueTest, ConcurrentCreateRoutedAliasTest, SolrCoreTest, DisMaxRequestHandlerTest, ExplicitHLLTest, CircularListTest, TestPKIAuthenticationPlugin, Tagger2Test, JsonLoaderTest, CreateCollectionCleanupTest, ConfigureRecoveryStrategyTest, DistributedVersionInfoTest, TestCoreContainer, TestHdfsUpdateLog, OrderedExecutorTest, QueryEqualityTest, TestApiFramework, TestSolrDeletionPolicy1, TestSkipOverseerOperations, HDFSCollectionsAPITest, TestCSVLoader, SolrPluginUtilsTest, TestLazyCores, CollectionTooManyReplicasTest, TestJsonFacetsWithNestedObjects, ScriptEngineTest, TestCustomSort, TestWordDelimiterFilterFactory, SpellCheckCollatorWithCollapseTest, TestCoreBackup, ConcurrentDeleteAndCreateCollectionTest, TestSolrCloudSnapshots, HttpTriggerListenerTest, ResourceLoaderTest, TestTestInjection, TestHighlightDedupGrouping, PreAnalyzedUpdateProcessorTest, TestMultiValuedNumericRangeQuery, BlockDirectoryTest, SolrCloudExampleTest, TestManagedSynonymGraphFilterFactory, TestGraphTermsQParserPlugin, WrapperMergePolicyFactoryTest, TestCloudPhrasesIdentificationComponent, UpdateLogTest, DistributedSpellCheckComponentTest, AddReplicaTest, TestSolrConfigHandlerCloud, FileBasedSpellCheckerTest, RestoreTriggerStateTest, ChaosMonkeyNothingIsSafeTest, TestLocalFSCloudBackupRestore, QueryResultKeyTest, TestNestedUpdateProcessor, TestSimNodeLostTrigger, TestSweetSpotSimilarityFactory, StatsComponentTest, TestInPlaceUpdatesRequiredField, TestSolrCloudWithSecureImpersonation, TestTrieFacet, SyncSliceTest, ZkStateWriterTest, DistributedFacetPivotLargeTest, BigEndianAscendingWordDeserializerTest, MetricsConfigTest, MinimalSchemaTest, AutoAddReplicasIntegrationTest, TestSegmentSorting, LeaderElectionContextKeyTest, ReturnFieldsTest, RulesTest, TestLegacyNumericRangeQueryBuilder, MultiSolrCloudTestCaseTest, DefaultValueUpdateProcessorTest, CursorMarkTest, TestOnReconnectListenerSupport, CloudExitableDirectoryReaderTest, SolrCloudReportersTest, UtilsToolTest, SolrJmxReporterCloudTest, TestLegacyFieldCache, ReplaceNodeTest, HdfsRecoverLeaseTest, RequiredFieldsTest, SharedFSAutoReplicaFailoverTest, LeaderFailoverAfterPartitionTest, TestDeprecatedFilters, TestRTGBase, TestCloudNestedDocsSort, StatelessScriptUpdateProcessorFactoryTest, BooleanFieldTest, DocExpirationUpdateProcessorFactoryTest, TestCloudRecovery, TermVectorComponentDistributedTest, DistanceUnitsTest, ScheduledTriggerTest, TestFacetMethods, TestSimDistributedQueue, TestPushWriter, TestSnapshotCloudManager, TestSolrXml, TestFieldTypeResource, TestClusterStateMutator, HdfsUnloadDistributedZkTest, HdfsChaosMonkeyNothingIsSafeTest, CoreAdminRequestStatusTest, TriLevelCompositeIdRoutingTest, NodeMutatorTest, OverseerCollectionConfigSetProcessorTest, TestBinaryField, TestJettySolrRunner, TestStressLucene, TestSafeXMLParsing, TestNamedUpdateProcessors, TestFieldCache, BasicDistributedZk2Test, BasicAuthIntegrationTest, SolrMetricReporterTest, TestPivotHelperCode, ShardsWhitelistTest, HighlighterMaxOffsetTest, TestZkAclsWithHadoopAuth, DocValuesMissingTest, TestMaxTokenLenTokenizer, JWTAuthPluginIntegrationTest, TestEmbeddedSolrServerAdminHandler, SolrCmdDistributorTest, TestSchemaSimilarityResource, TestSchemaManager, ResponseBuilderTest, DistribDocExpirationUpdateProcessorTest, TestDistributedSearch, TestRandomFaceting, TestTolerantSearch, PathHierarchyTokenizerFactoryTest, AssignBackwardCompatibilityTest, CleanupOldIndexTest, CollectionStateFormat2Test, ConnectionManagerTest, DeleteLastCustomShardedReplicaTest, DeleteNodeTest, DeleteShardTest, DistribCursorPagingTest, HealthCheckHandlerTest, HttpPartitionOnCommitTest, HttpPartitionWithTlogReplicasTest, LegacyCloudClusterPropTest, MetricsHistoryIntegrationTest, MetricsHistoryWithAuthIntegrationTest, MigrateRouteKeyTest, NestedShardedAtomicUpdateTest, OverseerTaskQueueTest, RecoveryZkTest, RemoteQueryErrorTest, ReplaceNodeNoTargetTest, RestartWhileUpdatingTest, RollingRestartTest, RoutingToNodesWithPropertiesTest, SaslZkACLProviderTest, ShardRoutingCustomTest, TestCloudConsistency]
   [junit4] Completed [508/874 (1!)] on J1 in 63.79s, 2 tests, 1 failure <<< FAILURES!

[...truncated 49308 lines...]
[repro] Jenkins log URL: https://jenkins.thetaphi.de/job/Lucene-Solr-BadApples-8.x-Linux/107/consoleText

[repro] Revision: 5aa9a02421820fa3717fde1edf9effa8e5161191

[repro] Repro line:  ant test  -Dtestcase=TestCloudConsistency -Dtests.method=testOutOfSyncReplicasCannotBecomeLeader -Dtests.seed=471DEEE3DFB28547 -Dtests.multiplier=3 -Dtests.slow=true -Dtests.badapples=true -Dtests.locale=en-IN -Dtests.timezone=America/Argentina/Salta -Dtests.asserts=true -Dtests.file.encoding=UTF-8

[repro] ant clean

[...truncated 6 lines...]
[repro] Test suites by module:
[repro]    solr/core
[repro]       TestCloudConsistency
[repro] ant compile-test

[...truncated 3579 lines...]
[repro] ant test-nocompile -Dtests.dups=5 -Dtests.maxfailures=5 -Dtests.class="*.TestCloudConsistency" -Dtests.showOutput=onerror  -Dtests.seed=471DEEE3DFB28547 -Dtests.multiplier=3 -Dtests.slow=true -Dtests.badapples=true -Dtests.locale=en-IN -Dtests.timezone=America/Argentina/Salta -Dtests.asserts=true -Dtests.file.encoding=UTF-8

[...truncated 75 lines...]
[repro] Failures:
[repro]   0/5 failed: org.apache.solr.cloud.TestCloudConsistency
[repro] Exiting with code 0

[...truncated 43 lines...]


---------------------------------------------------------------------
To unsubscribe, e-mail: [hidden email]
For additional commands, e-mail: [hidden email]