[JENKINS] Lucene-Solr-BadApples-Tests-8.x - Build # 211 - Unstable

classic Classic list List threaded Threaded
1 message Options
Reply | Threaded
Open this post in threaded view
|

[JENKINS] Lucene-Solr-BadApples-Tests-8.x - Build # 211 - Unstable

Apache Jenkins Server-2
Build: https://builds.apache.org/job/Lucene-Solr-BadApples-Tests-8.x/211/

1 tests failed.
FAILED:  org.apache.solr.cloud.TestCloudConsistency.testOutOfSyncReplicasCannotBecomeLeader

Error Message:
Doc with id=4 not found in http://127.0.0.1:38475/solr/outOfSyncReplicasCannotBecomeLeader-false due to: Path not found: /id; rsp={doc=null}

Stack Trace:
java.lang.AssertionError: Doc with id=4 not found in http://127.0.0.1:38475/solr/outOfSyncReplicasCannotBecomeLeader-false due to: Path not found: /id; rsp={doc=null}
        at __randomizedtesting.SeedInfo.seed([56E2E9FBED8CB3B0:2809C9EB2EEBBC8A]:0)
        at org.junit.Assert.fail(Assert.java:88)
        at org.junit.Assert.assertTrue(Assert.java:41)
        at org.apache.solr.cloud.TestCloudConsistency.assertDocExists(TestCloudConsistency.java:285)
        at org.apache.solr.cloud.TestCloudConsistency.assertDocsExistInAllReplicas(TestCloudConsistency.java:269)
        at org.apache.solr.cloud.TestCloudConsistency.testOutOfSyncReplicasCannotBecomeLeader(TestCloudConsistency.java:140)
        at org.apache.solr.cloud.TestCloudConsistency.testOutOfSyncReplicasCannotBecomeLeader(TestCloudConsistency.java:99)
        at sun.reflect.NativeMethodAccessorImpl.invoke0(Native Method)
        at sun.reflect.NativeMethodAccessorImpl.invoke(NativeMethodAccessorImpl.java:62)
        at sun.reflect.DelegatingMethodAccessorImpl.invoke(DelegatingMethodAccessorImpl.java:43)
        at java.lang.reflect.Method.invoke(Method.java:498)
        at com.carrotsearch.randomizedtesting.RandomizedRunner.invoke(RandomizedRunner.java:1750)
        at com.carrotsearch.randomizedtesting.RandomizedRunner$8.evaluate(RandomizedRunner.java:938)
        at com.carrotsearch.randomizedtesting.RandomizedRunner$9.evaluate(RandomizedRunner.java:974)
        at com.carrotsearch.randomizedtesting.RandomizedRunner$10.evaluate(RandomizedRunner.java:988)
        at com.carrotsearch.randomizedtesting.rules.SystemPropertiesRestoreRule$1.evaluate(SystemPropertiesRestoreRule.java:57)
        at org.apache.lucene.util.TestRuleSetupTeardownChained$1.evaluate(TestRuleSetupTeardownChained.java:49)
        at org.apache.lucene.util.AbstractBeforeAfterRule$1.evaluate(AbstractBeforeAfterRule.java:45)
        at org.apache.lucene.util.TestRuleThreadAndTestName$1.evaluate(TestRuleThreadAndTestName.java:48)
        at org.apache.lucene.util.TestRuleIgnoreAfterMaxFailures$1.evaluate(TestRuleIgnoreAfterMaxFailures.java:64)
        at org.apache.lucene.util.TestRuleMarkFailure$1.evaluate(TestRuleMarkFailure.java:47)
        at com.carrotsearch.randomizedtesting.rules.StatementAdapter.evaluate(StatementAdapter.java:36)
        at com.carrotsearch.randomizedtesting.ThreadLeakControl$StatementRunner.run(ThreadLeakControl.java:368)
        at com.carrotsearch.randomizedtesting.ThreadLeakControl.forkTimeoutingTask(ThreadLeakControl.java:817)
        at com.carrotsearch.randomizedtesting.ThreadLeakControl$3.evaluate(ThreadLeakControl.java:468)
        at com.carrotsearch.randomizedtesting.RandomizedRunner.runSingleTest(RandomizedRunner.java:947)
        at com.carrotsearch.randomizedtesting.RandomizedRunner$5.evaluate(RandomizedRunner.java:832)
        at com.carrotsearch.randomizedtesting.RandomizedRunner$6.evaluate(RandomizedRunner.java:883)
        at com.carrotsearch.randomizedtesting.RandomizedRunner$7.evaluate(RandomizedRunner.java:894)
        at com.carrotsearch.randomizedtesting.rules.StatementAdapter.evaluate(StatementAdapter.java:36)
        at com.carrotsearch.randomizedtesting.rules.SystemPropertiesRestoreRule$1.evaluate(SystemPropertiesRestoreRule.java:57)
        at org.apache.lucene.util.AbstractBeforeAfterRule$1.evaluate(AbstractBeforeAfterRule.java:45)
        at com.carrotsearch.randomizedtesting.rules.StatementAdapter.evaluate(StatementAdapter.java:36)
        at org.apache.lucene.util.TestRuleStoreClassName$1.evaluate(TestRuleStoreClassName.java:41)
        at com.carrotsearch.randomizedtesting.rules.NoShadowingOrOverridesOnMethodsRule$1.evaluate(NoShadowingOrOverridesOnMethodsRule.java:40)
        at com.carrotsearch.randomizedtesting.rules.NoShadowingOrOverridesOnMethodsRule$1.evaluate(NoShadowingOrOverridesOnMethodsRule.java:40)
        at com.carrotsearch.randomizedtesting.rules.StatementAdapter.evaluate(StatementAdapter.java:36)
        at com.carrotsearch.randomizedtesting.rules.StatementAdapter.evaluate(StatementAdapter.java:36)
        at com.carrotsearch.randomizedtesting.rules.StatementAdapter.evaluate(StatementAdapter.java:36)
        at org.apache.lucene.util.TestRuleAssertionsRequired$1.evaluate(TestRuleAssertionsRequired.java:53)
        at org.apache.lucene.util.TestRuleMarkFailure$1.evaluate(TestRuleMarkFailure.java:47)
        at org.apache.lucene.util.TestRuleIgnoreAfterMaxFailures$1.evaluate(TestRuleIgnoreAfterMaxFailures.java:64)
        at org.apache.lucene.util.TestRuleIgnoreTestSuites$1.evaluate(TestRuleIgnoreTestSuites.java:54)
        at com.carrotsearch.randomizedtesting.rules.StatementAdapter.evaluate(StatementAdapter.java:36)
        at com.carrotsearch.randomizedtesting.ThreadLeakControl$StatementRunner.run(ThreadLeakControl.java:368)
        at java.lang.Thread.run(Thread.java:748)




Build Log:
[...truncated 14728 lines...]
   [junit4] Suite: org.apache.solr.cloud.TestCloudConsistency
   [junit4]   2> 1675773 INFO  (SUITE-TestCloudConsistency-seed#[56E2E9FBED8CB3B0]-worker) [     ] o.a.s.SolrTestCaseJ4 Created dataDir: /home/jenkins/jenkins-slave/workspace/Lucene-Solr-BadApples-Tests-8.x/solr/build/solr-core/test/J1/temp/solr.cloud.TestCloudConsistency_56E2E9FBED8CB3B0-001/data-dir-119-001
   [junit4]   2> 1675773 WARN  (SUITE-TestCloudConsistency-seed#[56E2E9FBED8CB3B0]-worker) [     ] o.a.s.SolrTestCaseJ4 startTrackingSearchers: numOpens=1 numCloses=1
   [junit4]   2> 1675773 INFO  (SUITE-TestCloudConsistency-seed#[56E2E9FBED8CB3B0]-worker) [     ] o.a.s.SolrTestCaseJ4 Using PointFields (NUMERIC_POINTS_SYSPROP=true) w/NUMERIC_DOCVALUES_SYSPROP=false
   [junit4]   2> 1675776 INFO  (SUITE-TestCloudConsistency-seed#[56E2E9FBED8CB3B0]-worker) [     ] o.a.s.SolrTestCaseJ4 Randomized ssl (false) and clientAuth (false) via: @org.apache.solr.util.RandomizeSSL(reason=, ssl=NaN, value=NaN, clientAuth=NaN)
   [junit4]   2> 1675776 INFO  (SUITE-TestCloudConsistency-seed#[56E2E9FBED8CB3B0]-worker) [     ] o.a.s.SolrTestCaseJ4 SecureRandom sanity checks: test.solr.allowed.securerandom=null & java.security.egd=file:/dev/./urandom
   [junit4]   2> 1675787 INFO  (TEST-TestCloudConsistency.testOutOfSyncReplicasCannotBecomeLeader-seed#[56E2E9FBED8CB3B0]) [     ] o.a.s.SolrTestCaseJ4 ###Starting testOutOfSyncReplicasCannotBecomeLeader
   [junit4]   2> 1675792 INFO  (TEST-TestCloudConsistency.testOutOfSyncReplicasCannotBecomeLeader-seed#[56E2E9FBED8CB3B0]) [     ] o.a.s.c.MiniSolrCloudCluster Starting cluster of 4 servers in /home/jenkins/jenkins-slave/workspace/Lucene-Solr-BadApples-Tests-8.x/solr/build/solr-core/test/J1/temp/solr.cloud.TestCloudConsistency_56E2E9FBED8CB3B0-001/tempDir-001
   [junit4]   2> 1675796 INFO  (TEST-TestCloudConsistency.testOutOfSyncReplicasCannotBecomeLeader-seed#[56E2E9FBED8CB3B0]) [     ] o.a.s.c.ZkTestServer STARTING ZK TEST SERVER
   [junit4]   2> 1675798 INFO  (ZkTestServer Run Thread) [     ] o.a.s.c.ZkTestServer client port:0.0.0.0/0.0.0.0:0
   [junit4]   2> 1675799 INFO  (ZkTestServer Run Thread) [     ] o.a.s.c.ZkTestServer Starting server
   [junit4]   2> 1675898 INFO  (TEST-TestCloudConsistency.testOutOfSyncReplicasCannotBecomeLeader-seed#[56E2E9FBED8CB3B0]) [     ] o.a.s.c.ZkTestServer start zk server on port:40611
   [junit4]   2> 1675898 INFO  (TEST-TestCloudConsistency.testOutOfSyncReplicasCannotBecomeLeader-seed#[56E2E9FBED8CB3B0]) [     ] o.a.s.c.ZkTestServer waitForServerUp: 127.0.0.1:40611
   [junit4]   2> 1675898 INFO  (TEST-TestCloudConsistency.testOutOfSyncReplicasCannotBecomeLeader-seed#[56E2E9FBED8CB3B0]) [     ] o.a.s.c.ZkTestServer parse host and port list: 127.0.0.1:40611
   [junit4]   2> 1675898 INFO  (TEST-TestCloudConsistency.testOutOfSyncReplicasCannotBecomeLeader-seed#[56E2E9FBED8CB3B0]) [     ] o.a.s.c.ZkTestServer connecting to 127.0.0.1 40611
   [junit4]   2> 1675924 INFO  (TEST-TestCloudConsistency.testOutOfSyncReplicasCannotBecomeLeader-seed#[56E2E9FBED8CB3B0]) [     ] o.a.s.c.c.ConnectionManager Waiting for client to connect to ZooKeeper
   [junit4]   2> 1675969 INFO  (zkConnectionManagerCallback-7890-thread-1) [     ] o.a.s.c.c.ConnectionManager zkClient has connected
   [junit4]   2> 1675969 INFO  (TEST-TestCloudConsistency.testOutOfSyncReplicasCannotBecomeLeader-seed#[56E2E9FBED8CB3B0]) [     ] o.a.s.c.c.ConnectionManager Client is connected to ZooKeeper
   [junit4]   2> 1676057 INFO  (TEST-TestCloudConsistency.testOutOfSyncReplicasCannotBecomeLeader-seed#[56E2E9FBED8CB3B0]) [     ] o.a.s.c.c.ConnectionManager Waiting for client to connect to ZooKeeper
   [junit4]   2> 1676087 INFO  (zkConnectionManagerCallback-7892-thread-1) [     ] o.a.s.c.c.ConnectionManager zkClient has connected
   [junit4]   2> 1676087 INFO  (TEST-TestCloudConsistency.testOutOfSyncReplicasCannotBecomeLeader-seed#[56E2E9FBED8CB3B0]) [     ] o.a.s.c.c.ConnectionManager Client is connected to ZooKeeper
   [junit4]   2> 1676108 INFO  (TEST-TestCloudConsistency.testOutOfSyncReplicasCannotBecomeLeader-seed#[56E2E9FBED8CB3B0]) [     ] o.a.s.c.c.ConnectionManager Waiting for client to connect to ZooKeeper
   [junit4]   2> 1676137 INFO  (zkConnectionManagerCallback-7894-thread-1) [     ] o.a.s.c.c.ConnectionManager zkClient has connected
   [junit4]   2> 1676137 INFO  (TEST-TestCloudConsistency.testOutOfSyncReplicasCannotBecomeLeader-seed#[56E2E9FBED8CB3B0]) [     ] o.a.s.c.c.ConnectionManager Client is connected to ZooKeeper
   [junit4]   2> 1676248 WARN  (jetty-launcher-7895-thread-1) [     ] o.e.j.s.AbstractConnector Ignoring deprecated socket close linger time
   [junit4]   2> 1676250 WARN  (jetty-launcher-7895-thread-2) [     ] o.e.j.s.AbstractConnector Ignoring deprecated socket close linger time
   [junit4]   2> 1676251 INFO  (jetty-launcher-7895-thread-1) [     ] o.a.s.c.s.e.JettySolrRunner Start Jetty (original configured port=0)
   [junit4]   2> 1676251 INFO  (jetty-launcher-7895-thread-1) [     ] o.a.s.c.s.e.JettySolrRunner Trying to start Jetty on port 0 try number 1 ...
   [junit4]   2> 1676251 INFO  (jetty-launcher-7895-thread-2) [     ] o.a.s.c.s.e.JettySolrRunner Start Jetty (original configured port=0)
   [junit4]   2> 1676251 INFO  (jetty-launcher-7895-thread-2) [     ] o.a.s.c.s.e.JettySolrRunner Trying to start Jetty on port 0 try number 1 ...
   [junit4]   2> 1676251 INFO  (jetty-launcher-7895-thread-1) [     ] o.e.j.s.Server jetty-9.4.19.v20190610; built: 2019-06-10T16:30:51.723Z; git: afcf563148970e98786327af5e07c261fda175d3; jvm 1.8.0_191-b12
   [junit4]   2> 1676251 INFO  (jetty-launcher-7895-thread-2) [     ] o.e.j.s.Server jetty-9.4.19.v20190610; built: 2019-06-10T16:30:51.723Z; git: afcf563148970e98786327af5e07c261fda175d3; jvm 1.8.0_191-b12
   [junit4]   2> 1676251 WARN  (jetty-launcher-7895-thread-4) [     ] o.e.j.s.AbstractConnector Ignoring deprecated socket close linger time
   [junit4]   2> 1676252 INFO  (jetty-launcher-7895-thread-4) [     ] o.a.s.c.s.e.JettySolrRunner Start Jetty (original configured port=0)
   [junit4]   2> 1676252 INFO  (jetty-launcher-7895-thread-4) [     ] o.a.s.c.s.e.JettySolrRunner Trying to start Jetty on port 0 try number 1 ...
   [junit4]   2> 1676252 INFO  (jetty-launcher-7895-thread-4) [     ] o.e.j.s.Server jetty-9.4.19.v20190610; built: 2019-06-10T16:30:51.723Z; git: afcf563148970e98786327af5e07c261fda175d3; jvm 1.8.0_191-b12
   [junit4]   2> 1676252 WARN  (jetty-launcher-7895-thread-3) [     ] o.e.j.s.AbstractConnector Ignoring deprecated socket close linger time
   [junit4]   2> 1676253 INFO  (jetty-launcher-7895-thread-3) [     ] o.a.s.c.s.e.JettySolrRunner Start Jetty (original configured port=0)
   [junit4]   2> 1676253 INFO  (jetty-launcher-7895-thread-3) [     ] o.a.s.c.s.e.JettySolrRunner Trying to start Jetty on port 0 try number 1 ...
   [junit4]   2> 1676253 INFO  (jetty-launcher-7895-thread-3) [     ] o.e.j.s.Server jetty-9.4.19.v20190610; built: 2019-06-10T16:30:51.723Z; git: afcf563148970e98786327af5e07c261fda175d3; jvm 1.8.0_191-b12
   [junit4]   2> 1676253 INFO  (jetty-launcher-7895-thread-1) [     ] o.e.j.s.session DefaultSessionIdManager workerName=node0
   [junit4]   2> 1676253 INFO  (jetty-launcher-7895-thread-1) [     ] o.e.j.s.session No SessionScavenger set, using defaults
   [junit4]   2> 1676253 INFO  (jetty-launcher-7895-thread-1) [     ] o.e.j.s.session node0 Scavenging every 600000ms
   [junit4]   2> 1676255 INFO  (jetty-launcher-7895-thread-1) [     ] o.e.j.s.h.ContextHandler Started o.e.j.s.ServletContextHandler@4f8f12fa{/solr,null,AVAILABLE}
   [junit4]   2> 1676256 INFO  (jetty-launcher-7895-thread-4) [     ] o.e.j.s.session DefaultSessionIdManager workerName=node0
   [junit4]   2> 1676256 INFO  (jetty-launcher-7895-thread-4) [     ] o.e.j.s.session No SessionScavenger set, using defaults
   [junit4]   2> 1676256 INFO  (jetty-launcher-7895-thread-4) [     ] o.e.j.s.session node0 Scavenging every 660000ms
   [junit4]   2> 1676257 INFO  (jetty-launcher-7895-thread-2) [     ] o.e.j.s.session DefaultSessionIdManager workerName=node0
   [junit4]   2> 1676257 INFO  (jetty-launcher-7895-thread-2) [     ] o.e.j.s.session No SessionScavenger set, using defaults
   [junit4]   2> 1676257 INFO  (jetty-launcher-7895-thread-4) [     ] o.e.j.s.h.ContextHandler Started o.e.j.s.ServletContextHandler@1009c8e6{/solr,null,AVAILABLE}
   [junit4]   2> 1676257 INFO  (jetty-launcher-7895-thread-2) [     ] o.e.j.s.session node0 Scavenging every 600000ms
   [junit4]   2> 1676257 INFO  (jetty-launcher-7895-thread-3) [     ] o.e.j.s.session DefaultSessionIdManager workerName=node0
   [junit4]   2> 1676257 INFO  (jetty-launcher-7895-thread-3) [     ] o.e.j.s.session No SessionScavenger set, using defaults
   [junit4]   2> 1676257 INFO  (jetty-launcher-7895-thread-3) [     ] o.e.j.s.session node0 Scavenging every 600000ms
   [junit4]   2> 1676258 INFO  (jetty-launcher-7895-thread-3) [     ] o.e.j.s.h.ContextHandler Started o.e.j.s.ServletContextHandler@48e9817{/solr,null,AVAILABLE}
   [junit4]   2> 1676258 INFO  (jetty-launcher-7895-thread-4) [     ] o.e.j.s.AbstractConnector Started ServerConnector@3d2fb7a4{HTTP/1.1,[http/1.1, h2c]}{127.0.0.1:40467}
   [junit4]   2> 1676258 INFO  (jetty-launcher-7895-thread-4) [     ] o.e.j.s.Server Started @1676318ms
   [junit4]   2> 1676258 INFO  (jetty-launcher-7895-thread-4) [     ] o.a.s.c.s.e.JettySolrRunner Jetty properties: {hostContext=/solr, hostPort=40467}
   [junit4]   2> 1676258 INFO  (jetty-launcher-7895-thread-2) [     ] o.e.j.s.h.ContextHandler Started o.e.j.s.ServletContextHandler@42af3913{/solr,null,AVAILABLE}
   [junit4]   2> 1676258 ERROR (jetty-launcher-7895-thread-4) [     ] o.a.s.u.StartupLoggingUtils Missing Java Option solr.log.dir. Logging may be missing or incomplete.
   [junit4]   2> 1676258 INFO  (jetty-launcher-7895-thread-4) [     ] o.a.s.s.SolrDispatchFilter Using logger factory org.apache.logging.slf4j.Log4jLoggerFactory
   [junit4]   2> 1676258 INFO  (jetty-launcher-7895-thread-4) [     ] o.a.s.s.SolrDispatchFilter  ___      _       Welcome to Apache Solr? version 8.3.0
   [junit4]   2> 1676259 INFO  (jetty-launcher-7895-thread-4) [     ] o.a.s.s.SolrDispatchFilter / __| ___| |_ _   Starting in cloud mode on port null
   [junit4]   2> 1676259 INFO  (jetty-launcher-7895-thread-4) [     ] o.a.s.s.SolrDispatchFilter \__ \/ _ \ | '_|  Install dir: null
   [junit4]   2> 1676259 INFO  (jetty-launcher-7895-thread-4) [     ] o.a.s.s.SolrDispatchFilter |___/\___/_|_|    Start time: 2019-09-10T05:16:30.657Z
   [junit4]   2> 1676259 INFO  (jetty-launcher-7895-thread-3) [     ] o.e.j.s.AbstractConnector Started ServerConnector@9a824b9{HTTP/1.1,[http/1.1, h2c]}{127.0.0.1:33977}
   [junit4]   2> 1676259 INFO  (jetty-launcher-7895-thread-3) [     ] o.e.j.s.Server Started @1676318ms
   [junit4]   2> 1676259 INFO  (jetty-launcher-7895-thread-3) [     ] o.a.s.c.s.e.JettySolrRunner Jetty properties: {hostContext=/solr, hostPort=33977}
   [junit4]   2> 1676259 ERROR (jetty-launcher-7895-thread-3) [     ] o.a.s.u.StartupLoggingUtils Missing Java Option solr.log.dir. Logging may be missing or incomplete.
   [junit4]   2> 1676259 INFO  (jetty-launcher-7895-thread-3) [     ] o.a.s.s.SolrDispatchFilter Using logger factory org.apache.logging.slf4j.Log4jLoggerFactory
   [junit4]   2> 1676259 INFO  (jetty-launcher-7895-thread-1) [     ] o.e.j.s.AbstractConnector Started ServerConnector@68368f72{HTTP/1.1,[http/1.1, h2c]}{127.0.0.1:42509}
   [junit4]   2> 1676259 INFO  (jetty-launcher-7895-thread-3) [     ] o.a.s.s.SolrDispatchFilter  ___      _       Welcome to Apache Solr? version 8.3.0
   [junit4]   2> 1676259 INFO  (jetty-launcher-7895-thread-1) [     ] o.e.j.s.Server Started @1676319ms
   [junit4]   2> 1676259 INFO  (jetty-launcher-7895-thread-3) [     ] o.a.s.s.SolrDispatchFilter / __| ___| |_ _   Starting in cloud mode on port null
   [junit4]   2> 1676259 INFO  (jetty-launcher-7895-thread-1) [     ] o.a.s.c.s.e.JettySolrRunner Jetty properties: {hostContext=/solr, hostPort=42509}
   [junit4]   2> 1676259 INFO  (jetty-launcher-7895-thread-3) [     ] o.a.s.s.SolrDispatchFilter \__ \/ _ \ | '_|  Install dir: null
   [junit4]   2> 1676259 INFO  (jetty-launcher-7895-thread-3) [     ] o.a.s.s.SolrDispatchFilter |___/\___/_|_|    Start time: 2019-09-10T05:16:30.657Z
   [junit4]   2> 1676259 ERROR (jetty-launcher-7895-thread-1) [     ] o.a.s.u.StartupLoggingUtils Missing Java Option solr.log.dir. Logging may be missing or incomplete.
   [junit4]   2> 1676259 INFO  (jetty-launcher-7895-thread-1) [     ] o.a.s.s.SolrDispatchFilter Using logger factory org.apache.logging.slf4j.Log4jLoggerFactory
   [junit4]   2> 1676259 INFO  (jetty-launcher-7895-thread-1) [     ] o.a.s.s.SolrDispatchFilter  ___      _       Welcome to Apache Solr? version 8.3.0
   [junit4]   2> 1676259 INFO  (jetty-launcher-7895-thread-1) [     ] o.a.s.s.SolrDispatchFilter / __| ___| |_ _   Starting in cloud mode on port null
   [junit4]   2> 1676259 INFO  (jetty-launcher-7895-thread-1) [     ] o.a.s.s.SolrDispatchFilter \__ \/ _ \ | '_|  Install dir: null
   [junit4]   2> 1676259 INFO  (jetty-launcher-7895-thread-1) [     ] o.a.s.s.SolrDispatchFilter |___/\___/_|_|    Start time: 2019-09-10T05:16:30.657Z
   [junit4]   2> 1676261 INFO  (jetty-launcher-7895-thread-3) [     ] o.a.s.c.c.ConnectionManager Waiting for client to connect to ZooKeeper
   [junit4]   2> 1676261 INFO  (jetty-launcher-7895-thread-2) [     ] o.e.j.s.AbstractConnector Started ServerConnector@7dc09299{HTTP/1.1,[http/1.1, h2c]}{127.0.0.1:46271}
   [junit4]   2> 1676261 INFO  (jetty-launcher-7895-thread-2) [     ] o.e.j.s.Server Started @1676321ms
   [junit4]   2> 1676261 INFO  (jetty-launcher-7895-thread-2) [     ] o.a.s.c.s.e.JettySolrRunner Jetty properties: {hostContext=/solr, hostPort=46271}
   [junit4]   2> 1676261 ERROR (jetty-launcher-7895-thread-2) [     ] o.a.s.u.StartupLoggingUtils Missing Java Option solr.log.dir. Logging may be missing or incomplete.
   [junit4]   2> 1676261 INFO  (jetty-launcher-7895-thread-2) [     ] o.a.s.s.SolrDispatchFilter Using logger factory org.apache.logging.slf4j.Log4jLoggerFactory
   [junit4]   2> 1676262 INFO  (jetty-launcher-7895-thread-2) [     ] o.a.s.s.SolrDispatchFilter  ___      _       Welcome to Apache Solr? version 8.3.0
   [junit4]   2> 1676262 INFO  (jetty-launcher-7895-thread-2) [     ] o.a.s.s.SolrDispatchFilter / __| ___| |_ _   Starting in cloud mode on port null
   [junit4]   2> 1676262 INFO  (jetty-launcher-7895-thread-2) [     ] o.a.s.s.SolrDispatchFilter \__ \/ _ \ | '_|  Install dir: null
   [junit4]   2> 1676262 INFO  (jetty-launcher-7895-thread-2) [     ] o.a.s.s.SolrDispatchFilter |___/\___/_|_|    Start time: 2019-09-10T05:16:30.660Z
   [junit4]   2> 1676263 INFO  (jetty-launcher-7895-thread-1) [     ] o.a.s.c.c.ConnectionManager Waiting for client to connect to ZooKeeper
   [junit4]   2> 1676263 INFO  (jetty-launcher-7895-thread-4) [     ] o.a.s.c.c.ConnectionManager Waiting for client to connect to ZooKeeper
   [junit4]   2> 1676264 INFO  (jetty-launcher-7895-thread-2) [     ] o.a.s.c.c.ConnectionManager Waiting for client to connect to ZooKeeper
   [junit4]   2> 1676264 INFO  (zkConnectionManagerCallback-7897-thread-1) [     ] o.a.s.c.c.ConnectionManager zkClient has connected
   [junit4]   2> 1676264 INFO  (jetty-launcher-7895-thread-3) [     ] o.a.s.c.c.ConnectionManager Client is connected to ZooKeeper
   [junit4]   2> 1676265 INFO  (jetty-launcher-7895-thread-3) [     ] o.a.s.s.SolrDispatchFilter solr.xml found in ZooKeeper. Loading...
   [junit4]   2> 1676265 INFO  (zkConnectionManagerCallback-7901-thread-1) [     ] o.a.s.c.c.ConnectionManager zkClient has connected
   [junit4]   2> 1676265 INFO  (jetty-launcher-7895-thread-4) [     ] o.a.s.c.c.ConnectionManager Client is connected to ZooKeeper
   [junit4]   2> 1676265 INFO  (zkConnectionManagerCallback-7899-thread-1) [     ] o.a.s.c.c.ConnectionManager zkClient has connected
   [junit4]   2> 1676266 INFO  (jetty-launcher-7895-thread-1) [     ] o.a.s.c.c.ConnectionManager Client is connected to ZooKeeper
   [junit4]   2> 1676266 INFO  (jetty-launcher-7895-thread-4) [     ] o.a.s.s.SolrDispatchFilter solr.xml found in ZooKeeper. Loading...
   [junit4]   2> 1676266 INFO  (zkConnectionManagerCallback-7903-thread-1) [     ] o.a.s.c.c.ConnectionManager zkClient has connected
   [junit4]   2> 1676266 INFO  (jetty-launcher-7895-thread-2) [     ] o.a.s.c.c.ConnectionManager Client is connected to ZooKeeper
   [junit4]   2> 1676273 INFO  (jetty-launcher-7895-thread-1) [     ] o.a.s.s.SolrDispatchFilter solr.xml found in ZooKeeper. Loading...
   [junit4]   2> 1676273 INFO  (jetty-launcher-7895-thread-2) [     ] o.a.s.s.SolrDispatchFilter solr.xml found in ZooKeeper. Loading...
   [junit4]   2> 1676532 INFO  (jetty-launcher-7895-thread-4) [     ] o.a.s.h.c.HttpShardHandlerFactory Host whitelist initialized: WhitelistHostChecker [whitelistHosts=null, whitelistHostCheckingEnabled=true]
   [junit4]   2> 1676533 WARN  (jetty-launcher-7895-thread-4) [     ] o.e.j.u.s.S.config Trusting all certificates configured for Client@1b7123bc[provider=null,keyStore=null,trustStore=null]
   [junit4]   2> 1676533 WARN  (jetty-launcher-7895-thread-4) [     ] o.e.j.u.s.S.config No Client EndPointIdentificationAlgorithm configured for Client@1b7123bc[provider=null,keyStore=null,trustStore=null]
   [junit4]   2> 1676536 WARN  (jetty-launcher-7895-thread-4) [     ] o.e.j.u.s.S.config Trusting all certificates configured for Client@491cdfb6[provider=null,keyStore=null,trustStore=null]
   [junit4]   2> 1676536 WARN  (jetty-launcher-7895-thread-4) [     ] o.e.j.u.s.S.config No Client EndPointIdentificationAlgorithm configured for Client@491cdfb6[provider=null,keyStore=null,trustStore=null]
   [junit4]   2> 1676537 INFO  (jetty-launcher-7895-thread-4) [     ] o.a.s.c.ZkContainer Zookeeper client=127.0.0.1:40611/solr
   [junit4]   2> 1676541 INFO  (jetty-launcher-7895-thread-4) [     ] o.a.s.c.c.ConnectionManager Waiting for client to connect to ZooKeeper
   [junit4]   2> 1676542 INFO  (zkConnectionManagerCallback-7912-thread-1) [     ] o.a.s.c.c.ConnectionManager zkClient has connected
   [junit4]   2> 1676542 INFO  (jetty-launcher-7895-thread-4) [     ] o.a.s.c.c.ConnectionManager Client is connected to ZooKeeper
   [junit4]   2> 1676617 INFO  (jetty-launcher-7895-thread-2) [     ] o.a.s.h.c.HttpShardHandlerFactory Host whitelist initialized: WhitelistHostChecker [whitelistHosts=null, whitelistHostCheckingEnabled=true]
   [junit4]   2> 1676618 WARN  (jetty-launcher-7895-thread-2) [     ] o.e.j.u.s.S.config Trusting all certificates configured for Client@692e69ef[provider=null,keyStore=null,trustStore=null]
   [junit4]   2> 1676618 WARN  (jetty-launcher-7895-thread-2) [     ] o.e.j.u.s.S.config No Client EndPointIdentificationAlgorithm configured for Client@692e69ef[provider=null,keyStore=null,trustStore=null]
   [junit4]   2> 1676622 WARN  (jetty-launcher-7895-thread-2) [     ] o.e.j.u.s.S.config Trusting all certificates configured for Client@78ba4b22[provider=null,keyStore=null,trustStore=null]
   [junit4]   2> 1676622 WARN  (jetty-launcher-7895-thread-2) [     ] o.e.j.u.s.S.config No Client EndPointIdentificationAlgorithm configured for Client@78ba4b22[provider=null,keyStore=null,trustStore=null]
   [junit4]   2> 1676624 INFO  (jetty-launcher-7895-thread-2) [     ] o.a.s.c.ZkContainer Zookeeper client=127.0.0.1:40611/solr
   [junit4]   2> 1676626 INFO  (jetty-launcher-7895-thread-2) [     ] o.a.s.c.c.ConnectionManager Waiting for client to connect to ZooKeeper
   [junit4]   2> 1676628 INFO  (zkConnectionManagerCallback-7919-thread-1) [     ] o.a.s.c.c.ConnectionManager zkClient has connected
   [junit4]   2> 1676628 INFO  (jetty-launcher-7895-thread-2) [     ] o.a.s.c.c.ConnectionManager Client is connected to ZooKeeper
   [junit4]   2> 1676647 INFO  (jetty-launcher-7895-thread-3) [     ] o.a.s.h.c.HttpShardHandlerFactory Host whitelist initialized: WhitelistHostChecker [whitelistHosts=null, whitelistHostCheckingEnabled=true]
   [junit4]   2> 1676648 WARN  (jetty-launcher-7895-thread-3) [     ] o.e.j.u.s.S.config Trusting all certificates configured for Client@59500dae[provider=null,keyStore=null,trustStore=null]
   [junit4]   2> 1676648 WARN  (jetty-launcher-7895-thread-3) [     ] o.e.j.u.s.S.config No Client EndPointIdentificationAlgorithm configured for Client@59500dae[provider=null,keyStore=null,trustStore=null]
   [junit4]   2> 1676653 WARN  (jetty-launcher-7895-thread-3) [     ] o.e.j.u.s.S.config Trusting all certificates configured for Client@c6eebcc[provider=null,keyStore=null,trustStore=null]
   [junit4]   2> 1676653 WARN  (jetty-launcher-7895-thread-3) [     ] o.e.j.u.s.S.config No Client EndPointIdentificationAlgorithm configured for Client@c6eebcc[provider=null,keyStore=null,trustStore=null]
   [junit4]   2> 1676655 INFO  (jetty-launcher-7895-thread-3) [     ] o.a.s.c.ZkContainer Zookeeper client=127.0.0.1:40611/solr
   [junit4]   2> 1676657 INFO  (jetty-launcher-7895-thread-3) [     ] o.a.s.c.c.ConnectionManager Waiting for client to connect to ZooKeeper
   [junit4]   2> 1676661 INFO  (zkConnectionManagerCallback-7925-thread-1) [     ] o.a.s.c.c.ConnectionManager zkClient has connected
   [junit4]   2> 1676661 INFO  (jetty-launcher-7895-thread-3) [     ] o.a.s.c.c.ConnectionManager Client is connected to ZooKeeper
   [junit4]   2> 1676689 INFO  (jetty-launcher-7895-thread-4) [n:127.0.0.1:40467_solr     ] o.a.s.c.c.ConnectionManager Waiting for client to connect to ZooKeeper
   [junit4]   2> 1676690 INFO  (zkConnectionManagerCallback-7927-thread-1) [     ] o.a.s.c.c.ConnectionManager zkClient has connected
   [junit4]   2> 1676690 INFO  (jetty-launcher-7895-thread-4) [n:127.0.0.1:40467_solr     ] o.a.s.c.c.ConnectionManager Client is connected to ZooKeeper
   [junit4]   2> 1676736 INFO  (jetty-launcher-7895-thread-1) [     ] o.a.s.h.c.HttpShardHandlerFactory Host whitelist initialized: WhitelistHostChecker [whitelistHosts=null, whitelistHostCheckingEnabled=true]
   [junit4]   2> 1676736 INFO  (jetty-launcher-7895-thread-2) [n:127.0.0.1:46271_solr     ] o.a.s.c.c.ConnectionManager Waiting for client to connect to ZooKeeper
   [junit4]   2> 1676737 INFO  (zkConnectionManagerCallback-7929-thread-1) [     ] o.a.s.c.c.ConnectionManager zkClient has connected
   [junit4]   2> 1676737 INFO  (jetty-launcher-7895-thread-2) [n:127.0.0.1:46271_solr     ] o.a.s.c.c.ConnectionManager Client is connected to ZooKeeper
   [junit4]   2> 1676737 WARN  (jetty-launcher-7895-thread-1) [     ] o.e.j.u.s.S.config Trusting all certificates configured for Client@1d4438fd[provider=null,keyStore=null,trustStore=null]
   [junit4]   2> 1676737 WARN  (jetty-launcher-7895-thread-1) [     ] o.e.j.u.s.S.config No Client EndPointIdentificationAlgorithm configured for Client@1d4438fd[provider=null,keyStore=null,trustStore=null]
   [junit4]   2> 1676754 WARN  (jetty-launcher-7895-thread-1) [     ] o.e.j.u.s.S.config Trusting all certificates configured for Client@7cb2e5d3[provider=null,keyStore=null,trustStore=null]
   [junit4]   2> 1676754 WARN  (jetty-launcher-7895-thread-1) [     ] o.e.j.u.s.S.config No Client EndPointIdentificationAlgorithm configured for Client@7cb2e5d3[provider=null,keyStore=null,trustStore=null]
   [junit4]   2> 1676755 INFO  (jetty-launcher-7895-thread-1) [     ] o.a.s.c.ZkContainer Zookeeper client=127.0.0.1:40611/solr
   [junit4]   2> 1676757 INFO  (jetty-launcher-7895-thread-1) [     ] o.a.s.c.c.ConnectionManager Waiting for client to connect to ZooKeeper
   [junit4]   2> 1676777 INFO  (zkConnectionManagerCallback-7939-thread-1) [     ] o.a.s.c.c.ConnectionManager zkClient has connected
   [junit4]   2> 1676777 INFO  (jetty-launcher-7895-thread-1) [     ] o.a.s.c.c.ConnectionManager Client is connected to ZooKeeper
   [junit4]   2> 1676839 INFO  (jetty-launcher-7895-thread-3) [n:127.0.0.1:33977_solr     ] o.a.s.c.c.ConnectionManager Waiting for client to connect to ZooKeeper
   [junit4]   2> 1676845 INFO  (zkConnectionManagerCallback-7941-thread-1) [     ] o.a.s.c.c.ConnectionManager zkClient has connected
   [junit4]   2> 1676846 INFO  (jetty-launcher-7895-thread-3) [n:127.0.0.1:33977_solr     ] o.a.s.c.c.ConnectionManager Client is connected to ZooKeeper
   [junit4]   2> 1676873 INFO  (jetty-launcher-7895-thread-3) [n:127.0.0.1:33977_solr     ] o.a.s.c.OverseerElectionContext I am going to be the leader 127.0.0.1:33977_solr
   [junit4]   2> 1676874 INFO  (jetty-launcher-7895-thread-3) [n:127.0.0.1:33977_solr     ] o.a.s.c.Overseer Overseer (id=72353435565752333-127.0.0.1:33977_solr-n_0000000000) starting
   [junit4]   2> 1676889 INFO  (jetty-launcher-7895-thread-4) [n:127.0.0.1:40467_solr     ] o.a.s.c.ZkController Register node as live in ZooKeeper:/live_nodes/127.0.0.1:40467_solr
   [junit4]   2> 1676889 INFO  (jetty-launcher-7895-thread-3) [n:127.0.0.1:33977_solr     ] o.a.s.c.c.ConnectionManager Waiting for client to connect to ZooKeeper
   [junit4]   2> 1676889 INFO  (zkConnectionManagerCallback-7948-thread-1) [     ] o.a.s.c.c.ConnectionManager zkClient has connected
   [junit4]   2> 1676889 INFO  (jetty-launcher-7895-thread-3) [n:127.0.0.1:33977_solr     ] o.a.s.c.c.ConnectionManager Client is connected to ZooKeeper
   [junit4]   2> 1676893 INFO  (jetty-launcher-7895-thread-3) [n:127.0.0.1:33977_solr     ] o.a.s.c.c.ZkStateReader Updated live nodes from ZooKeeper... (0) -> (1)
   [junit4]   2> 1676893 INFO  (zkCallback-7940-thread-1) [     ] o.a.s.c.c.ZkStateReader Updated live nodes from ZooKeeper... (0) -> (1)
   [junit4]   2> 1676894 INFO  (jetty-launcher-7895-thread-3) [n:127.0.0.1:33977_solr     ] o.a.s.c.s.i.ZkClientClusterStateProvider Cluster at 127.0.0.1:40611/solr ready
   [junit4]   2> 1676897 INFO  (zkCallback-7926-thread-1) [     ] o.a.s.c.c.ZkStateReader Updated live nodes from ZooKeeper... (0) -> (1)
   [junit4]   2> 1676901 INFO  (jetty-launcher-7895-thread-4) [n:127.0.0.1:40467_solr     ] o.a.s.c.c.ConnectionManager Waiting for client to connect to ZooKeeper
   [junit4]   2> 1676906 INFO  (OverseerStateUpdate-72353435565752333-127.0.0.1:33977_solr-n_0000000000) [n:127.0.0.1:33977_solr     ] o.a.s.c.Overseer Starting to work on the main queue : 127.0.0.1:33977_solr
   [junit4]   2> 1676910 INFO  (zkConnectionManagerCallback-7953-thread-1) [     ] o.a.s.c.c.ConnectionManager zkClient has connected
   [junit4]   2> 1676910 INFO  (jetty-launcher-7895-thread-3) [n:127.0.0.1:33977_solr     ] o.a.s.c.ZkController Publish node=127.0.0.1:33977_solr as DOWN
   [junit4]   2> 1676910 INFO  (jetty-launcher-7895-thread-4) [n:127.0.0.1:40467_solr     ] o.a.s.c.c.ConnectionManager Client is connected to ZooKeeper
   [junit4]   2> 1676911 INFO  (jetty-launcher-7895-thread-3) [n:127.0.0.1:33977_solr     ] o.a.s.c.TransientSolrCoreCacheDefault Allocating transient cache for 2147483647 transient cores
   [junit4]   2> 1676911 INFO  (jetty-launcher-7895-thread-3) [n:127.0.0.1:33977_solr     ] o.a.s.c.ZkController Register node as live in ZooKeeper:/live_nodes/127.0.0.1:33977_solr
   [junit4]   2> 1676915 INFO  (zkCallback-7926-thread-1) [     ] o.a.s.c.c.ZkStateReader Updated live nodes from ZooKeeper... (1) -> (2)
   [junit4]   2> 1676915 INFO  (zkCallback-7940-thread-1) [     ] o.a.s.c.c.ZkStateReader Updated live nodes from ZooKeeper... (1) -> (2)
   [junit4]   2> 1676915 INFO  (jetty-launcher-7895-thread-4) [n:127.0.0.1:40467_solr     ] o.a.s.c.c.ZkStateReader Updated live nodes from ZooKeeper... (0) -> (2)
   [junit4]   2> 1676916 INFO  (jetty-launcher-7895-thread-3) [n:127.0.0.1:33977_solr     ] o.a.s.c.PackageManager clusterprops.json changed , version -1
   [junit4]   2> 1676924 INFO  (zkCallback-7947-thread-1) [     ] o.a.s.c.c.ZkStateReader Updated live nodes from ZooKeeper... (1) -> (2)
   [junit4]   2> 1676929 INFO  (jetty-launcher-7895-thread-4) [n:127.0.0.1:40467_solr     ] o.a.s.c.s.i.ZkClientClusterStateProvider Cluster at 127.0.0.1:40611/solr ready
   [junit4]   2> 1676929 INFO  (jetty-launcher-7895-thread-4) [n:127.0.0.1:40467_solr     ] o.a.s.c.PackageManager clusterprops.json changed , version -1
   [junit4]   2> 1676941 INFO  (jetty-launcher-7895-thread-2) [n:127.0.0.1:46271_solr     ] o.a.s.c.c.ZkStateReader Updated live nodes from ZooKeeper... (0) -> (2)
   [junit4]   2> 1676948 INFO  (jetty-launcher-7895-thread-2) [n:127.0.0.1:46271_solr     ] o.a.s.c.ZkController Publish node=127.0.0.1:46271_solr as DOWN
   [junit4]   2> 1676949 INFO  (jetty-launcher-7895-thread-2) [n:127.0.0.1:46271_solr     ] o.a.s.c.TransientSolrCoreCacheDefault Allocating transient cache for 2147483647 transient cores
   [junit4]   2> 1676949 INFO  (jetty-launcher-7895-thread-2) [n:127.0.0.1:46271_solr     ] o.a.s.c.ZkController Register node as live in ZooKeeper:/live_nodes/127.0.0.1:46271_solr
   [junit4]   2> 1676951 INFO  (zkCallback-7940-thread-1) [     ] o.a.s.c.c.ZkStateReader Updated live nodes from ZooKeeper... (2) -> (3)
   [junit4]   2> 1676951 INFO  (zkCallback-7926-thread-1) [     ] o.a.s.c.c.ZkStateReader Updated live nodes from ZooKeeper... (2) -> (3)
   [junit4]   2> 1676957 INFO  (jetty-launcher-7895-thread-1) [n:127.0.0.1:42509_solr     ] o.a.s.c.c.ConnectionManager Waiting for client to connect to ZooKeeper
   [junit4]   2> 1676961 INFO  (zkCallback-7947-thread-1) [     ] o.a.s.c.c.ZkStateReader Updated live nodes from ZooKeeper... (2) -> (3)
   [junit4]   2> 1676962 INFO  (zkCallback-7952-thread-1) [     ] o.a.s.c.c.ZkStateReader Updated live nodes from ZooKeeper... (2) -> (3)
   [junit4]   2> 1676970 INFO  (jetty-launcher-7895-thread-4) [n:127.0.0.1:40467_solr     ] o.a.s.h.a.MetricsHistoryHandler No .system collection, keeping metrics history in memory.
   [junit4]   2> 1676971 INFO  (zkConnectionManagerCallback-7955-thread-1) [     ] o.a.s.c.c.ConnectionManager zkClient has connected
   [junit4]   2> 1676971 INFO  (jetty-launcher-7895-thread-1) [n:127.0.0.1:42509_solr     ] o.a.s.c.c.ConnectionManager Client is connected to ZooKeeper
   [junit4]   2> 1676972 INFO  (zkCallback-7928-thread-1) [     ] o.a.s.c.c.ZkStateReader Updated live nodes from ZooKeeper... (2) -> (3)
   [junit4]   2> 1676974 INFO  (jetty-launcher-7895-thread-2) [n:127.0.0.1:46271_solr     ] o.a.s.c.c.ConnectionManager Waiting for client to connect to ZooKeeper
   [junit4]   2> 1676975 INFO  (jetty-launcher-7895-thread-3) [n:127.0.0.1:33977_solr     ] o.a.s.h.a.MetricsHistoryHandler No .system collection, keeping metrics history in memory.
   [junit4]   2> 1676984 INFO  (jetty-launcher-7895-thread-1) [n:127.0.0.1:42509_solr     ] o.a.s.c.c.ZkStateReader Updated live nodes from ZooKeeper... (0) -> (3)
   [junit4]   2> 1676990 INFO  (zkConnectionManagerCallback-7961-thread-1) [     ] o.a.s.c.c.ConnectionManager zkClient has connected
   [junit4]   2> 1676990 INFO  (jetty-launcher-7895-thread-2) [n:127.0.0.1:46271_solr     ] o.a.s.c.c.ConnectionManager Client is connected to ZooKeeper
   [junit4]   2> 1676992 INFO  (jetty-launcher-7895-thread-2) [n:127.0.0.1:46271_solr     ] o.a.s.c.c.ZkStateReader Updated live nodes from ZooKeeper... (0) -> (3)
   [junit4]   2> 1676993 INFO  (jetty-launcher-7895-thread-1) [n:127.0.0.1:42509_solr     ] o.a.s.c.ZkController Publish node=127.0.0.1:42509_solr as DOWN
   [junit4]   2> 1676994 INFO  (jetty-launcher-7895-thread-2) [n:127.0.0.1:46271_solr     ] o.a.s.c.s.i.ZkClientClusterStateProvider Cluster at 127.0.0.1:40611/solr ready
   [junit4]   2> 1676994 INFO  (jetty-launcher-7895-thread-2) [n:127.0.0.1:46271_solr     ] o.a.s.c.PackageManager clusterprops.json changed , version -1
   [junit4]   2> 1676997 INFO  (jetty-launcher-7895-thread-1) [n:127.0.0.1:42509_solr     ] o.a.s.c.TransientSolrCoreCacheDefault Allocating transient cache for 2147483647 transient cores
   [junit4]   2> 1676997 INFO  (jetty-launcher-7895-thread-1) [n:127.0.0.1:42509_solr     ] o.a.s.c.ZkController Register node as live in ZooKeeper:/live_nodes/127.0.0.1:42509_solr
   [junit4]   2> 1677005 INFO  (zkCallback-7952-thread-1) [     ] o.a.s.c.c.ZkStateReader Updated live nodes from ZooKeeper... (3) -> (4)
   [junit4]   2> 1677005 INFO  (zkCallback-7928-thread-1) [     ] o.a.s.c.c.ZkStateReader Updated live nodes from ZooKeeper... (3) -> (4)
   [junit4]   2> 1677005 INFO  (zkCallback-7926-thread-1) [     ] o.a.s.c.c.ZkStateReader Updated live nodes from ZooKeeper... (3) -> (4)
   [junit4]   2> 1677006 INFO  (zkCallback-7940-thread-1) [     ] o.a.s.c.c.ZkStateReader Updated live nodes from ZooKeeper... (3) -> (4)
   [junit4]   2> 1677006 INFO  (zkCallback-7947-thread-1) [     ] o.a.s.c.c.ZkStateReader Updated live nodes from ZooKeeper... (3) -> (4)
   [junit4]   2> 1677006 INFO  (zkCallback-7960-thread-1) [     ] o.a.s.c.c.ZkStateReader Updated live nodes from ZooKeeper... (3) -> (4)
   [junit4]   2> 1677012 INFO  (jetty-launcher-7895-thread-1) [n:127.0.0.1:42509_solr     ] o.a.s.c.c.ConnectionManager Waiting for client to connect to ZooKeeper
   [junit4]   2> 1677013 INFO  (zkConnectionManagerCallback-7969-thread-1) [     ] o.a.s.c.c.ConnectionManager zkClient has connected
   [junit4]   2> 1677013 INFO  (jetty-launcher-7895-thread-1) [n:127.0.0.1:42509_solr     ] o.a.s.c.c.ConnectionManager Client is connected to ZooKeeper
   [junit4]   2> 1677017 INFO  (zkCallback-7954-thread-1) [     ] o.a.s.c.c.ZkStateReader Updated live nodes from ZooKeeper... (3) -> (4)
   [junit4]   2> 1677019 INFO  (jetty-launcher-7895-thread-1) [n:127.0.0.1:42509_solr     ] o.a.s.c.c.ZkStateReader Updated live nodes from ZooKeeper... (0) -> (4)
   [junit4]   2> 1677020 INFO  (jetty-launcher-7895-thread-1) [n:127.0.0.1:42509_solr     ] o.a.s.c.s.i.ZkClientClusterStateProvider Cluster at 127.0.0.1:40611/solr ready
   [junit4]   2> 1677020 INFO  (jetty-launcher-7895-thread-1) [n:127.0.0.1:42509_solr     ] o.a.s.c.PackageManager clusterprops.json changed , version -1
   [junit4]   2> 1677030 INFO  (jetty-launcher-7895-thread-2) [n:127.0.0.1:46271_solr     ] o.a.s.h.a.MetricsHistoryHandler No .system collection, keeping metrics history in memory.
   [junit4]   2> 1677053 INFO  (jetty-launcher-7895-thread-1) [n:127.0.0.1:42509_solr     ] o.a.s.h.a.MetricsHistoryHandler No .system collection, keeping metrics history in memory.
   [junit4]   2> 1677059 INFO  (jetty-launcher-7895-thread-4) [n:127.0.0.1:40467_solr     ] o.a.s.m.r.SolrJmxReporter JMX monitoring for 'solr_40467.solr.node' (registry 'solr.node') enabled at server: com.sun.jmx.mbeanserver.JmxMBeanServer@15291ab
   [junit4]   2> 1677076 INFO  (jetty-launcher-7895-thread-3) [n:127.0.0.1:33977_solr     ] o.a.s.m.r.SolrJmxReporter JMX monitoring for 'solr_33977.solr.node' (registry 'solr.node') enabled at server: com.sun.jmx.mbeanserver.JmxMBeanServer@15291ab
   [junit4]   2> 1677086 INFO  (jetty-launcher-7895-thread-2) [n:127.0.0.1:46271_solr     ] o.a.s.m.r.SolrJmxReporter JMX monitoring for 'solr_46271.solr.node' (registry 'solr.node') enabled at server: com.sun.jmx.mbeanserver.JmxMBeanServer@15291ab
   [junit4]   2> 1677094 INFO  (jetty-launcher-7895-thread-4) [n:127.0.0.1:40467_solr     ] o.a.s.m.r.SolrJmxReporter JMX monitoring for 'solr_40467.solr.jvm' (registry 'solr.jvm') enabled at server: com.sun.jmx.mbeanserver.JmxMBeanServer@15291ab
   [junit4]   2> 1677094 INFO  (jetty-launcher-7895-thread-4) [n:127.0.0.1:40467_solr     ] o.a.s.m.r.SolrJmxReporter JMX monitoring for 'solr_40467.solr.jetty' (registry 'solr.jetty') enabled at server: com.sun.jmx.mbeanserver.JmxMBeanServer@15291ab
   [junit4]   2> 1677096 INFO  (jetty-launcher-7895-thread-4) [n:127.0.0.1:40467_solr     ] o.a.s.c.CorePropertiesLocator Found 0 core definitions underneath /home/jenkins/jenkins-slave/workspace/Lucene-Solr-BadApples-Tests-8.x/solr/build/solr-core/test/J1/temp/solr.cloud.TestCloudConsistency_56E2E9FBED8CB3B0-001/tempDir-001/node4/.
   [junit4]   2> 1677098 INFO  (jetty-launcher-7895-thread-1) [n:127.0.0.1:42509_solr     ] o.a.s.m.r.SolrJmxReporter JMX monitoring for 'solr_42509.solr.node' (registry 'solr.node') enabled at server: com.sun.jmx.mbeanserver.JmxMBeanServer@15291ab
   [junit4]   2> 1677154 INFO  (jetty-launcher-7895-thread-2) [n:127.0.0.1:46271_solr     ] o.a.s.m.r.SolrJmxReporter JMX monitoring for 'solr_46271.solr.jvm' (registry 'solr.jvm') enabled at server: com.sun.jmx.mbeanserver.JmxMBeanServer@15291ab
   [junit4]   2> 1677155 INFO  (jetty-launcher-7895-thread-2) [n:127.0.0.1:46271_solr     ] o.a.s.m.r.SolrJmxReporter JMX monitoring for 'solr_46271.solr.jetty' (registry 'solr.jetty') enabled at server: com.sun.jmx.mbeanserver.JmxMBeanServer@15291ab
   [junit4]   2> 1677168 INFO  (jetty-launcher-7895-thread-2) [n:127.0.0.1:46271_solr     ] o.a.s.c.CorePropertiesLocator Found 0 core definitions underneath /home/jenkins/jenkins-slave/workspace/Lucene-Solr-BadApples-Tests-8.x/solr/build/solr-core/test/J1/temp/solr.cloud.TestCloudConsistency_56E2E9FBED8CB3B0-001/tempDir-001/node2/.
   [junit4]   2> 1677172 INFO  (jetty-launcher-7895-thread-3) [n:127.0.0.1:33977_solr     ] o.a.s.m.r.SolrJmxReporter JMX monitoring for 'solr_33977.solr.jvm' (registry 'solr.jvm') enabled at server: com.sun.jmx.mbeanserver.JmxMBeanServer@15291ab
   [junit4]   2> 1677173 INFO  (jetty-launcher-7895-thread-3) [n:127.0.0.1:33977_solr     ] o.a.s.m.r.SolrJmxReporter JMX monitoring for 'solr_33977.solr.jetty' (registry 'solr.jetty') enabled at server: com.sun.jmx.mbeanserver.JmxMBeanServer@15291ab
   [junit4]   2> 1677176 INFO  (jetty-launcher-7895-thread-3) [n:127.0.0.1:33977_solr     ] o.a.s.c.CorePropertiesLocator Found 0 core definitions underneath /home/jenkins/jenkins-slave/workspace/Lucene-Solr-BadApples-Tests-8.x/solr/build/solr-core/test/J1/temp/solr.cloud.TestCloudConsistency_56E2E9FBED8CB3B0-001/tempDir-001/node3/.
   [junit4]   2> 1677178 INFO  (jetty-launcher-7895-thread-1) [n:127.0.0.1:42509_solr     ] o.a.s.m.r.SolrJmxReporter JMX monitoring for 'solr_42509.solr.jvm' (registry 'solr.jvm') enabled at server: com.sun.jmx.mbeanserver.JmxMBeanServer@15291ab
   [junit4]   2> 1677178 INFO  (jetty-launcher-7895-thread-1) [n:127.0.0.1:42509_solr     ] o.a.s.m.r.SolrJmxReporter JMX monitoring for 'solr_42509.solr.jetty' (registry 'solr.jetty') enabled at server: com.sun.jmx.mbeanserver.JmxMBeanServer@15291ab
   [junit4]   2> 1677179 INFO  (jetty-launcher-7895-thread-1) [n:127.0.0.1:42509_solr     ] o.a.s.c.CorePropertiesLocator Found 0 core definitions underneath /home/jenkins/jenkins-slave/workspace/Lucene-Solr-BadApples-Tests-8.x/solr/build/solr-core/test/J1/temp/solr.cloud.TestCloudConsistency_56E2E9FBED8CB3B0-001/tempDir-001/node1/.
   [junit4]   2> 1677396 INFO  (TEST-TestCloudConsistency.testOutOfSyncReplicasCannotBecomeLeader-seed#[56E2E9FBED8CB3B0]) [     ] o.a.s.c.MiniSolrCloudCluster waitForAllNodes: numServers=4
   [junit4]   2> 1677397 INFO  (TEST-TestCloudConsistency.testOutOfSyncReplicasCannotBecomeLeader-seed#[56E2E9FBED8CB3B0]) [     ] o.a.s.c.c.ConnectionManager Waiting for client to connect to ZooKeeper
   [junit4]   2> 1677398 INFO  (zkConnectionManagerCallback-7976-thread-1) [     ] o.a.s.c.c.ConnectionManager zkClient has connected
   [junit4]   2> 1677399 INFO  (TEST-TestCloudConsistency.testOutOfSyncReplicasCannotBecomeLeader-seed#[56E2E9FBED8CB3B0]) [     ] o.a.s.c.c.ConnectionManager Client is connected to ZooKeeper
   [junit4]   2> 1677402 INFO  (TEST-TestCloudConsistency.testOutOfSyncReplicasCannotBecomeLeader-seed#[56E2E9FBED8CB3B0]) [     ] o.a.s.c.c.ZkStateReader Updated live nodes from ZooKeeper... (0) -> (4)
   [junit4]   2> 1677405 INFO  (TEST-TestCloudConsistency.testOutOfSyncReplicasCannotBecomeLeader-seed#[56E2E9FBED8CB3B0]) [     ] o.a.s.c.s.i.ZkClientClusterStateProvider Cluster at 127.0.0.1:40611/solr ready
   [junit4]   2> 1677413 INFO  (TEST-TestCloudConsistency.testOutOfSyncReplicasCannotBecomeLeader-seed#[56E2E9FBED8CB3B0]) [     ] o.a.s.c.CoreContainer Shutting down CoreContainer instance=40481786
   [junit4]   2> 1677413 INFO  (TEST-TestCloudConsistency.testOutOfSyncReplicasCannotBecomeLeader-seed#[56E2E9FBED8CB3B0]) [     ] o.a.s.c.ZkController Remove node as live in ZooKeeper:/live_nodes/127.0.0.1:40467_solr
   [junit4]   2> 1677417 INFO  (TEST-TestCloudConsistency.testOutOfSyncReplicasCannotBecomeLeader-seed#[56E2E9FBED8CB3B0]) [     ] o.a.s.c.ZkController Publish this node as DOWN...
   [junit4]   2> 1677418 INFO  (TEST-TestCloudConsistency.testOutOfSyncReplicasCannotBecomeLeader-seed#[56E2E9FBED8CB3B0]) [     ] o.a.s.c.ZkController Publish node=127.0.0.1:40467_solr as DOWN
   [junit4]   2> 1677420 INFO  (TEST-TestCloudConsistency.testOutOfSyncReplicasCannotBecomeLeader-seed#[56E2E9FBED8CB3B0]) [     ] o.a.s.c.TransientSolrCoreCacheDefault Allocating transient cache for 2147483647 transient cores
   [junit4]   2> 1677421 INFO  (TEST-TestCloudConsistency.testOutOfSyncReplicasCannotBecomeLeader-seed#[56E2E9FBED8CB3B0]) [     ] o.a.s.m.SolrMetricManager Closing metric reporters for registry=solr.node, tag=null
   [junit4]   2> 1677421 INFO  (TEST-TestCloudConsistency.testOutOfSyncReplicasCannotBecomeLeader-seed#[56E2E9FBED8CB3B0]) [     ] o.a.s.m.r.SolrJmxReporter Closing reporter [org.apache.solr.metrics.reporters.SolrJmxReporter@7dfd8376: rootName = solr_40467, domain = solr.node, service url = null, agent id = null] for registry solr.node / com.codahale.metrics.MetricRegistry@2cae93f7
   [junit4]   2> 1677430 INFO  (TEST-TestCloudConsistency.testOutOfSyncReplicasCannotBecomeLeader-seed#[56E2E9FBED8CB3B0]) [     ] o.a.s.m.SolrMetricManager Closing metric reporters for registry=solr.jvm, tag=null
   [junit4]   2> 1677430 INFO  (TEST-TestCloudConsistency.testOutOfSyncReplicasCannotBecomeLeader-seed#[56E2E9FBED8CB3B0]) [     ] o.a.s.m.r.SolrJmxReporter Closing reporter [org.apache.solr.metrics.reporters.SolrJmxReporter@6d8cc715: rootName = solr_40467, domain = solr.jvm, service url = null, agent id = null] for registry solr.jvm / com.codahale.metrics.MetricRegistry@6f7a802a
   [junit4]   2> 1677436 INFO  (TEST-TestCloudConsistency.testOutOfSyncReplicasCannotBecomeLeader-seed#[56E2E9FBED8CB3B0]) [     ] o.a.s.m.SolrMetricManager Closing metric reporters for registry=solr.jetty, tag=null
   [junit4]   2> 1677436 INFO  (TEST-TestCloudConsistency.testOutOfSyncReplicasCannotBecomeLeader-seed#[56E2E9FBED8CB3B0]) [     ] o.a.s.m.r.SolrJmxReporter Closing reporter [org.apache.solr.metrics.reporters.SolrJmxReporter@5e2be0d8: rootName = solr_40467, domain = solr.jetty, service url = null, agent id = null] for registry solr.jetty / com.codahale.metrics.MetricRegistry@57177f09
   [junit4]   2> 1677436 INFO  (TEST-TestCloudConsistency.testOutOfSyncReplicasCannotBecomeLeader-seed#[56E2E9FBED8CB3B0]) [     ] o.a.s.m.SolrMetricManager Closing metric reporters for registry=solr.cluster, tag=null
   [junit4]   2> 1677440 INFO  (zkCallback-7960-thread-1) [     ] o.a.s.c.c.ZkStateReader Updated live nodes from ZooKeeper... (4) -> (3)
   [junit4]   2> 1677440 INFO  (zkCallback-7940-thread-1) [     ] o.a.s.c.c.ZkStateReader Updated live nodes from ZooKeeper... (4) -> (3)
   [junit4]   2> 1677542 INFO  (zkCallback-7954-thread-1) [     ] o.a.s.c.c.ZkStateReader Updated live nodes from ZooKeeper... (4) -> (3)
   [junit4]   2> 1677542 INFO  (zkCallback-7947-thread-1) [     ] o.a.s.c.c.ZkStateReader Updated live nodes from ZooKeeper... (4) -> (3)
   [junit4]   2> 1677542 INFO  (zkCallback-7975-thread-1) [     ] o.a.s.c.c.ZkStateReader Updated live nodes from ZooKeeper... (4) -> (3)
   [junit4]   2> 1677542 INFO  (zkCallback-7968-thread-1) [     ] o.a.s.c.c.ZkStateReader Updated live nodes from ZooKeeper... (4) -> (3)
   [junit4]   2> 1677542 INFO  (zkCallback-7928-thread-1) [     ] o.a.s.c.c.ZkStateReader Updated live nodes from ZooKeeper... (4) -> (3)
   [junit4]   2> 1677543 INFO  (TEST-TestCloudConsistency.testOutOfSyncReplicasCannotBecomeLeader-seed#[56E2E9FBED8CB3B0]) [     ] o.e.j.s.AbstractConnector Stopped ServerConnector@3d2fb7a4{HTTP/1.1,[http/1.1, h2c]}{127.0.0.1:0}
   [junit4]   2> 1677544 INFO  (TEST-TestCloudConsistency.testOutOfSyncReplicasCannotBecomeLeader-seed#[56E2E9FBED8CB3B0]) [     ] o.e.j.s.h.ContextHandler Stopped o.e.j.s.ServletContextHandler@1009c8e6{/solr,null,UNAVAILABLE}
   [junit4]   2> 1677544 INFO  (TEST-TestCloudConsistency.testOutOfSyncReplicasCannotBecomeLeader-seed#[56E2E9FBED8CB3B0]) [     ] o.e.j.s.session node0 Stopped scavenging
   [junit4]   2> 1677545 INFO  (TEST-TestCloudConsistency.testOutOfSyncReplicasCannotBecomeLeader-seed#[56E2E9FBED8CB3B0]) [     ] o.a.s.c.s.e.JettySolrRunner Start Jetty (original configured port=0)
   [junit4]   2> 1677545 WARN  (TEST-TestCloudConsistency.testOutOfSyncReplicasCannotBecomeLeader-seed#[56E2E9FBED8CB3B0]) [     ] o.e.j.s.AbstractConnector Ignoring deprecated socket close linger time
   [junit4]   2> 1677546 INFO  (TEST-TestCloudConsistency.testOutOfSyncReplicasCannotBecomeLeader-seed#[56E2E9FBED8CB3B0]) [     ] o.a.s.c.s.e.JettySolrRunner Trying to start Jetty on port 0 try number 1 ...
   [junit4]   2> 1677546 INFO  (TEST-TestCloudConsistency.testOutOfSyncReplicasCannotBecomeLeader-seed#[56E2E9FBED8CB3B0]) [     ] o.e.j.s.Server jetty-9.4.19.v20190610; built: 2019-06-10T16:30:51.723Z; git: afcf563148970e98786327af5e07c261fda175d3; jvm 1.8.0_191-b12
   [junit4]   2> 1677547 INFO  (TEST-TestCloudConsistency.testOutOfSyncReplicasCannotBecomeLeader-seed#[56E2E9FBED8CB3B0]) [     ] o.e.j.s.session DefaultSessionIdManager workerName=node0
   [junit4]   2> 1677547 INFO  (TEST-TestCloudConsistency.testOutOfSyncReplicasCannotBecomeLeader-seed#[56E2E9FBED8CB3B0]) [     ] o.e.j.s.session No SessionScavenger set, using defaults
   [junit4]   2> 1677547 INFO  (TEST-TestCloudConsistency.testOutOfSyncReplicasCannotBecomeLeader-seed#[56E2E9FBED8CB3B0]) [     ] o.e.j.s.session node0 Scavenging every 600000ms
   [junit4]   2> 1677548 INFO  (TEST-TestCloudConsistency.testOutOfSyncReplicasCannotBecomeLeader-seed#[56E2E9FBED8CB3B0]) [     ] o.e.j.s.h.ContextHandler Started o.e.j.s.ServletContextHandler@5dde64a4{/solr,null,AVAILABLE}
   [junit4]   2> 1677548 INFO  (TEST-TestCloudConsistency.testOutOfSyncReplicasCannotBecomeLeader-seed#[56E2E9FBED8CB3B0]) [     ] o.e.j.s.AbstractConnector Started ServerConnector@369c5378{HTTP/1.1,[http/1.1, h2c]}{127.0.0.1:45239}
   [junit4]   2> 1677548 INFO  (TEST-TestCloudConsistency.testOutOfSyncReplicasCannotBecomeLeader-seed#[56E2E9FBED8CB3B0]) [     ] o.e.j.s.Server Started @1677608ms
   [junit4]   2> 1677548 INFO  (TEST-TestCloudConsistency.testOutOfSyncReplicasCannotBecomeLeader-seed#[56E2E9FBED8CB3B0]) [     ] o.a.s.c.s.e.JettySolrRunner Jetty properties: {hostContext=/solr, hostPort=40199}
   [junit4]   2> 1677548 ERROR (TEST-TestCloudConsistency.testOutOfSyncReplicasCannotBecomeLeader-seed#[56E2E9FBED8CB3B0]) [     ] o.a.s.u.StartupLoggingUtils Missing Java Option solr.log.dir. Logging may be missing or incomplete.
   [junit4]   2> 1677548 INFO  (TEST-TestCloudConsistency.testOutOfSyncReplicasCannotBecomeLeader-seed#[56E2E9FBED8CB3B0]) [     ] o.a.s.s.SolrDispatchFilter Using logger factory org.apache.logging.slf4j.Log4jLoggerFactory
   [junit4]   2> 1677548 INFO  (TEST-TestCloudConsistency.testOutOfSyncReplicasCannotBecomeLeader-seed#[56E2E9FBED8CB3B0]) [     ] o.a.s.s.SolrDispatchFilter  ___      _       Welcome to Apache Solr? version 8.3.0
   [junit4]   2> 1677549 INFO  (TEST-TestCloudConsistency.testOutOfSyncReplicasCannotBecomeLeader-seed#[56E2E9FBED8CB3B0]) [     ] o.a.s.s.SolrDispatchFilter / __| ___| |_ _   Starting in cloud mode on port null
   [junit4]   2> 1677549 INFO  (TEST-TestCloudConsistency.testOutOfSyncReplicasCannotBecomeLeader-seed#[56E2E9FBED8CB3B0]) [     ] o.a.s.s.SolrDispatchFilter \__ \/ _ \ | '_|  Install dir: null
   [junit4]   2> 1677549 INFO  (TEST-TestCloudConsistency.testOutOfSyncReplicasCannotBecomeLeader-seed#[56E2E9FBED8CB3B0]) [     ] o.a.s.s.SolrDispatchFilter |___/\___/_|_|    Start time: 2019-09-10T05:16:31.947Z
   [junit4]   2> 1677553 INFO  (TEST-TestCloudConsistency.testOutOfSyncReplicasCannotBecomeLeader-seed#[56E2E9FBED8CB3B0]) [     ] o.a.s.c.c.ConnectionManager Waiting for client to connect to ZooKeeper
   [junit4]   2> 1677554 INFO  (zkConnectionManagerCallback-7982-thread-1) [     ] o.a.s.c.c.ConnectionManager zkClient has connected
   [junit4]   2> 1677554 INFO  (TEST-TestCloudConsistency.testOutOfSyncReplicasCannotBecomeLeader-seed#[56E2E9FBED8CB3B0]) [     ] o.a.s.c.c.ConnectionManager Client is connected to ZooKeeper
   [junit4]   2> 1677554 INFO  (TEST-TestCloudConsistency.testOutOfSyncReplicasCannotBecomeLeader-seed#[56E2E9FBED8CB3B0]) [     ] o.a.s.s.SolrDispatchFilter solr.xml found in ZooKeeper. Loading...
   [junit4]   2> 1677935 INFO  (TEST-TestCloudConsistency.testOutOfSyncReplicasCannotBecomeLeader-seed#[56E2E9FBED8CB3B0]) [     ] o.a.s.h.c.HttpShardHandlerFactory Host whitelist initialized: WhitelistHostChecker [whitelistHosts=null, whitelistHostCheckingEnabled=true]
   [junit4]   2> 1677936 WARN  (TEST-TestCloudConsistency.testOutOfSyncReplicasCannotBecomeLeader-seed#[56E2E9FBED8CB3B0]) [     ] o.e.j.u.s.S.config Trusting all certificates configured for Client@6d4319af[provider=null,keyStore=null,trustStore=null]
   [junit4]   2> 1677937 WARN  (TEST-TestCloudConsistency.testOutOfSyncReplicasCannotBecomeLeader-seed#[56E2E9FBED8CB3B0]) [     ] o.e.j.u.s.S.config No Client EndPointIdentificationAlgorithm configured for Client@6d4319af[provider=null,keyStore=null,trustStore=null]
   [junit4]   2> 1677940 WARN  (TEST-TestCloudConsistency.testOutOfSyncReplicasCannotBecomeLeader-seed#[56E2E9FBED8CB3B0]) [     ] o.e.j.u.s.S.config Trusting all certificates configured for Client@275a9857[provider=null,keyStore=null,trustStore=null]
   [junit4]   2> 1677941 WARN  (TEST-TestCloudConsistency.testOutOfSyncReplicasCannotBecomeLeader-seed#[56E2E9FBED8CB3B0]) [     ] o.e.j.u.s.S.config No Client EndPointIdentificationAlgorithm configured for Client@275a9857[provider=null,keyStore=null,trustStore=null]
   [junit4]   2> 1677942 INFO  (TEST-TestCloudConsistency.testOutOfSyncReplicasCannotBecomeLeader-seed#[56E2E9FBED8CB3B0]) [     ] o.a.s.c.ZkContainer Zookeeper client=127.0.0.1:40611/solr
   [junit4]   2> 1677945 INFO  (TEST-TestCloudConsistency.testOutOfSyncReplicasCannotBecomeLeader-seed#[56E2E9FBED8CB3B0]) [     ] o.a.s.c.c.ConnectionManager Waiting for client to connect to ZooKeeper
   [junit4]   2> 1677949 INFO  (zkConnectionManagerCallback-7989-thread-1) [     ] o.a.s.c.c.ConnectionManager zkClient has connected
   [junit4]   2> 1677949 INFO  (TEST-TestCloudConsistency.testOutOfSyncReplicasCannotBecomeLeader-seed#[56E2E9FBED8CB3B0]) [     ] o.a.s.c.c.ConnectionManager Client is connected to ZooKeeper
   [junit4]   2> 1678053 INFO  (TEST-TestCloudConsistency.testOutOfSyncReplicasCannotBecomeLeader-seed#[56E2E9FBED8CB3B0]) [n:127.0.0.1:40199_solr     ] o.a.s.c.c.ConnectionManager Waiting for client to connect to ZooKeeper
   [junit4]   2> 1678054 INFO  (zkConnectionManagerCallback-7991-thread-1) [     ] o.a.s.c.c.ConnectionManager zkClient has connected
   [junit4]   2> 1678054 INFO  (TEST-TestCloudConsistency.testOutOfSyncReplicasCannotBecomeLeader-seed#[56E2E9FBED8CB3B0]) [n:127.0.0.1:40199_solr     ] o.a.s.c.c.ConnectionManager Client is connected to ZooKeeper
   [junit4]   2> 1678068 INFO  (TEST-TestCloudConsistency.testOutOfSyncReplicasCannotBecomeLeader-seed#[56E2E9FBED8CB3B0]) [n:127.0.0.1:40199_solr     ] o.a.s.c.c.ZkStateReader Updated live nodes from ZooKeeper... (0) -> (3)
   [junit4]   2> 1678078 INFO  (TEST-TestCloudConsistency.testOutOfSyncReplicasCannotBecomeLeader-seed#[56E2E9FBED8CB3B0]) [n:127.0.0.1:40199_solr     ] o.a.s.c.ZkController Publish node=127.0.0.1:40199_solr as DOWN
   [junit4]   2> 1678079 INFO  (TEST-TestCloudConsistency.testOutOfSyncReplicasCannotBecomeLeader-seed#[56E2E9FBED8CB3B0]) [n:127.0.0.1:40199_solr     ] o.a.s.c.TransientSolrCoreCacheDefault Allocating transient cache for 2147483647 transient cores
   [junit4]   2> 1678079 INFO  (TEST-TestCloudConsistency.testOutOfSyncReplicasCannotBecomeLeader-seed#[56E2E9FBED8CB3B0]) [n:127.0.0.1:40199_solr     ] o.a.s.c.ZkController Register node as live in ZooKeeper:/live_nodes/127.0.0.1:40199_solr
   [junit4]   2> 1678081 INFO  (zkCallback-7947-thread-1) [     ] o.a.s.c.c.ZkStateReader Updated live nodes from ZooKeeper... (3) -> (4)
   [junit4]   2> 1678082 INFO  (zkCallback-7940-thread-1) [     ] o.a.s.c.c.ZkStateReader Updated live nodes from ZooKeeper... (3) -> (4)
   [junit4]   2> 1678082 INFO  (zkCallback-7975-thread-1) [     ] o.a.s.c.c.ZkStateReader Updated live nodes from ZooKeeper... (3) -> (4)
   [junit4]   2> 1678082 INFO  (zkCallback-7954-thread-1) [     ] o.a.s.c.c.ZkStateReader Updated live nodes from ZooKeeper... (3) -> (4)
   [junit4]   2> 1678082 INFO  (zkCallback-7928-thread-1) [     ] o.a.s.c.c.ZkStateReader Updated live nodes from ZooKeeper... (3) -> (4)
   [junit4]   2> 1678082 INFO  (zkCallback-7960-thread-1) [     ] o.a.s.c.c.ZkStateReader Updated live nodes from ZooKeeper... (3) -> (4)
   [junit4]   2> 1678082 INFO  (zkCallback-7968-thread-1) [     ] o.a.s.c.c.ZkStateReader Updated live nodes from ZooKeeper... (3) -> (4)
   [junit4]   2> 1678083 INFO  (zkCallback-7990-thread-1) [     ] o.a.s.c.c.ZkStateReader Updated live nodes from ZooKeeper... (3) -> (4)
   [junit4]   2> 1678084 INFO  (TEST-TestCloudConsistency.testOutOfSyncReplicasCannotBecomeLeader-seed#[56E2E9FBED8CB3B0]) [n:127.0.0.1:40199_solr     ] o.a.s.c.c.ConnectionManager Waiting for client to connect to ZooKeeper
   [junit4]   2> 1678087 INFO  (zkConnectionManagerCallback-7998-thread-1) [     ] o.a.s.c.c.ConnectionManager zkClient has connected
   [junit4]   2> 1678087 INFO  (TEST-TestCloudConsistency.testOutOfSyncReplicasCannotBecomeLeader-seed#[56E2E9FBED8CB3B0]) [n:127.0.0.1:40199_solr     ] o.a.s.c.c.ConnectionManager Client is connected to ZooKeeper
   [junit4]   2> 1678089 INFO  (TEST-TestCloudConsistency.testOutOfSyncReplicasCannotBecomeLeader-seed#[56E2E9FBED8CB3B0]) [n:127.0.0.1:40199_solr     ] o.a.s.c.c.ZkStateReader Updated live nodes from ZooKeeper... (0) -> (4)
   [junit4]   2> 1678091 INFO  (TEST-TestCloudConsistency.testOutOfSyncReplicasCannotBecomeLeader-seed#[56E2E9FBED8CB3B0]) [n:127.0.0.1:40199_solr     ] o.a.s.c.s.i.ZkClientClusterStateProvider Cluster at 127.0.0.1:40611/solr ready
   [junit4]   2> 1678091 INFO  (TEST-TestCloudConsistency.testOutOfSyncReplicasCannotBecomeLeader-seed#[56E2E9FBED8CB3B0]) [n:127.0.0.1:40199_solr     ] o.a.s.c.PackageManager clusterprops.json changed , version -1
   [junit4]   2> 1678122 INFO  (TEST-TestCloudConsistency.testOutOfSyncReplicasCannotBecomeLeader-seed#[56E2E9FBED8CB3B0]) [n:127.0.0.1:40199_solr     ] o.a.s.h.a.MetricsHistoryHandler No .system collection, keeping metrics history in memory.
   [junit4]   2> 1678153 INFO  (TEST-TestCloudConsistency.testOutOfSyncReplicasCannotBecomeLeader-seed#[56E2E9FBED8CB3B0]) [n:127.0.0.1:40199_solr     ] o.a.s.m.r.SolrJmxReporter JMX monitoring for 'solr_40199.solr.node' (registry 'solr.node') enabled at server: com.sun.jmx.mbeanserver.JmxMBeanServer@15291ab
   [junit4]   2> 1678182 INFO  (TEST-TestCloudConsistency.testOutOfSyncReplicasCannotBecomeLeader-seed#[56E2E9FBED8CB3B0]) [n:127.0.0.1:40199_solr     ] o.a.s.m.r.SolrJmxReporter JMX monitoring for 'solr_40199.solr.jvm' (registry 'solr.jvm') enabled at server: com.sun.jmx.mbeanserver.JmxMBeanServer@15291ab
   [junit4]   2> 1678183 INFO  (TEST-TestCloudConsistency.testOutOfSyncReplicasCannotBecomeLeader-seed#[56E2E9FBED8CB3B0]) [n:127.0.0.1:40199_solr     ] o.a.s.m.r.SolrJmxReporter JMX monitoring for 'solr_40199.solr.jetty' (registry 'solr.jetty') enabled at server: com.sun.jmx.mbeanserver.JmxMBeanServer@15291ab
   [junit4]   2> 1678185 INFO  (TEST-TestCloudConsistency.testOutOfSyncReplicasCannotBecomeLeader-seed#[56E2E9FBED8CB3B0]) [n:127.0.0.1:40199_solr     ] o.a.s.c.CorePropertiesLocator Found 0 core definitions underneath /home/jenkins/jenkins-slave/workspace/Lucene-Solr-BadApples-Tests-8.x/solr/build/solr-core/test/J1/temp/solr.cloud.TestCloudConsistency_56E2E9FBED8CB3B0-001/tempDir-001/node4/.
   [junit4]   2> 1678261 INFO  (TEST-TestCloudConsistency.testOutOfSyncReplicasCannotBecomeLeader-seed#[56E2E9FBED8CB3B0]) [     ] o.a.s.c.TestCloudConsistency Adding proxy for URL: http://127.0.0.1:45239/solr. Proxy: http://127.0.0.1:40199/solr
   [junit4]   2> 1678262 INFO  (TEST-TestCloudConsistency.testOutOfSyncReplicasCannotBecomeLeader-seed#[56E2E9FBED8CB3B0]) [     ] o.a.s.c.CoreContainer Shutting down CoreContainer instance=1097294113
   [junit4]   2> 1678262 INFO  (TEST-TestCloudConsistency.testOutOfSyncReplicasCannotBecomeLeader-seed#[56E2E9FBED8CB3B0]) [     ] o.a.s.c.ZkController Remove node as live in ZooKeeper:/live_nodes/127.0.0.1:46271_solr
   [junit4]   2> 1678264 INFO  (TEST-TestCloudConsistency.testOutOfSyncReplicasCannotBecomeLeader-seed#[56E2E9FBED8CB3B0]) [     ] o.a.s.c.ZkController Publish this node as DOWN...
   [junit4]   2> 1678264 INFO  (TEST-TestCloudConsistency.testOutOfSyncReplicasCannotBecomeLeader-seed#[56E2E9FBED8CB3B0]) [     ] o.a.s.c.ZkController Publish node=127.0.0.1:46271_solr as DOWN
   [junit4]   2> 1678268 INFO  (TEST-TestCloudConsistency.testOutOfSyncReplicasCannotBecomeLeader-seed#[56E2E9FBED8CB3B0]) [     ] o.a.s.m.SolrMetricManager Closing metric reporters for registry=solr.node, tag=null
   [junit4]   2> 1678268 INFO  (TEST-TestCloudConsistency.testOutOfSyncReplicasCannotBecomeLeader-seed#[56E2E9FBED8CB3B0]) [     ] o.a.s.m.r.SolrJmxReporter Closing reporter [org.apache.solr.metrics.reporters.SolrJmxReporter@758485a5: rootName = solr_46271, domain = solr.node, service url = null, agent id = null] for registry solr.node / com.codahale.metrics.MetricRegistry@3dcdddb9
   [junit4]   2> 1678277 INFO  (TEST-TestCloudConsistency.testOutOfSyncReplicasCannotBecomeLeader-seed#[56E2E9FBED8CB3B0]) [     ] o.a.s.m.SolrMetricManager Closing metric reporters for registry=solr.jvm, tag=null
   [junit4]   2> 1678277 INFO  (TEST-TestCloudConsistency.testOutOfSyncReplicasCannotBecomeLeader-seed#[56E2E9FBED8CB3B0]) [     ] o.a.s.m.r.SolrJmxReporter Closing reporter [org.apache.solr.metrics.reporters.SolrJmxReporter@1357d9cb: rootName = solr_46271, domain = solr.jvm, service url = null, agent id = null] for registry solr.jvm / com.codahale.metrics.MetricRegistry@6f7a802a
   [junit4]   2> 1678282 INFO  (TEST-TestCloudConsistency.testOutOfSyncReplicasCannotBecomeLeader-seed#[56E2E9FBED8CB3B0]) [     ] o.a.s.m.SolrMetricManager Closing metric reporters for registry=solr.jetty, tag=null
   [junit4]   2> 1678282 INFO  (TEST-TestCloudConsistency.testOutOfSyncReplicasCannotBecomeLeader-seed#[56E2E9FBED8CB3B0]) [     ] o.a.s.m.r.SolrJmxReporter Closing reporter [org.apache.solr.metrics.reporters.SolrJmxReporter@7b962d5d: rootName = solr_46271, domain = solr.jetty, service url = null, agent id = null] for registry solr.jetty / com.codahale.metrics.MetricRegistry@57177f09
   [junit4]   2> 1678282 INFO  (TEST-TestCloudConsistency.testOutOfSyncReplicasCannotBecomeLeader-seed#[56E2E9FBED8CB3B0]) [     ] o.a.s.m.SolrMetricManager Closing metric reporters for registry=solr.cluster, tag=null
   [junit4]   2> 1678286 INFO  (zkCallback-7968-thread-1) [     ] o.a.s.c.c.ZkStateReader Updated live nodes from ZooKeeper... (4) -> (3)
   [junit4]   2> 1678387 INFO  (zkCallback-7954-thread-1) [     ] o.a.s.c.c.ZkStateReader Updated live nodes from ZooKeeper... (4) -> (3)
   [junit4]   2> 1678387 INFO  (zkCallback-7997-thread-1) [     ] o.a.s.c.c.ZkStateReader Updated live nodes from ZooKeeper... (4) -> (3)
   [junit4]   2> 1678387 INFO  (zkCallback-7947-thread-1) [     ] o.a.s.c.c.ZkStateReader Updated live nodes from ZooKeeper... (4) -> (3)
   [junit4]   2> 1678387 INFO  (zkCallback-7940-thread-1) [     ] o.a.s.c.c.ZkStateReader Updated live nodes from ZooKeeper... (4) -> (3)
   [junit4]   2> 1678387 INFO  (zkCallback-7990-thread-1) [     ] o.a.s.c.c.ZkStateReader Updated live nodes from ZooKeeper... (4) -> (3)
   [junit4]   2> 1678387 INFO  (zkCallback-7975-thread-1) [     ] o.a.s.c.c.ZkStateReader Updated live nodes from ZooKeeper... (4) -> (3)
   [junit4]   2> 1678489 INFO  (TEST-TestCloudConsistency.testOutOfSyncReplicasCannotBecomeLeader-seed#[56E2E9FBED8CB3B0]) [     ] o.e.j.s.AbstractConnector Stopped ServerConnector@7dc09299{HTTP/1.1,[http/1.1, h2c]}{127.0.0.1:0}
   [junit4]   2> 1678490 INFO  (TEST-TestCloudConsistency.testOutOfSyncReplicasCannotBecomeLeader-seed#[56E2E9FBED8CB3B0]) [     ] o.e.j.s.h.ContextHandler Stopped o.e.j.s.ServletContextHandler@42af3913{/solr,null,UNAVAILABLE}
   [junit4]   2> 1678490 INFO  (TEST-TestCloudConsistency.testOutOfSyncReplicasCannotBecomeLeader-seed#[56E2E9FBED8CB3B0]) [     ] o.e.j.s.session node0 Stopped scavenging
   [junit4]   2> 1678491 INFO  (TEST-TestCloudConsistency.testOutOfSyncReplicasCannotBecomeLeader-seed#[56E2E9FBED8CB3B0]) [     ] o.a.s.c.s.e.JettySolrRunner Start Jetty (original configured port=0)
   [junit4]   2> 1678491 WARN  (TEST-TestCloudConsistency.testOutOfSyncReplicasCannotBecomeLeader-seed#[56E2E9FBED8CB3B0]) [     ] o.e.j.s.AbstractConnector Ignoring deprecated socket close linger time
   [junit4]   2> 1678492 INFO  (TEST-TestCloudConsistency.testOutOfSyncReplicasCannotBecomeLeader-seed#[56E2E9FBED8CB3B0]) [     ] o.a.s.c.s.e.JettySolrRunner Trying to start Jetty on port 0 try number 1 ...
   [junit4]   2> 1678492 INFO  (TEST-TestCloudConsistency.testOutOfSyncReplicasCannotBecomeLeader-seed#[56E2E9FBED8CB3B0]) [     ] o.e.j.s.Server jetty-9.4.19.v20190610; built: 2019-06-10T16:30:51.723Z; git: afcf563148970e98786327af5e07c261fda175d3; jvm 1.8.0_191-b12
   [junit4]   2> 1678499 INFO  (TEST-TestCloudConsistency.testOutOfSyncReplicasCannotBecomeLeader-seed#[56E2E9FBED8CB3B0]) [     ] o.e.j.s.session DefaultSessionIdManager workerName=node0
   [junit4]   2> 1678499 INFO  (TEST-TestCloudConsistency.testOutOfSyncReplicasCannotBecomeLeader-seed#[56E2E9FBED8CB3B0]) [     ] o.e.j.s.session No SessionScavenger set, using defaults
   [junit4]   2> 1678499 INFO  (TEST-TestCloudConsistency.testOutOfSyncReplicasCannotBecomeLeader-seed#[56E2E9FBED8CB3B0]) [     ] o.e.j.s.session node0 Scavenging every 600000ms
   [junit4]   2> 1678500 INFO  (TEST-TestCloudConsistency.testOutOfSyncReplicasCannotBecomeLeader-seed#[56E2E9FBED8CB3B0]) [     ] o.e.j.s.h.ContextHandler Started o.e.j.s.ServletContextHandler@32c5c51c{/solr,null,AVAILABLE}
   [junit4]   2> 1678501 INFO  (TEST-TestCloudConsistency.testOutOfSyncReplicasCannotBecomeLeader-seed#[56E2E9FBED8CB3B0]) [     ] o.e.j.s.AbstractConnector Started ServerConnector@7c2f71f9{HTTP/1.1,[http/1.1, h2c]}{127.0.0.1:37559}
   [junit4]   2> 1678501 INFO  (TEST-TestCloudConsistency.testOutOfSyncReplicasCannotBecomeLeader-seed#[56E2E9FBED8CB3B0]) [     ] o.e.j.s.Server Started @1678561ms
   [junit4]   2> 1678501 INFO  (TEST-TestCloudConsistency.testOutOfSyncReplicasCannotBecomeLeader-seed#[56E2E9FBED8CB3B0]) [     ] o.a.s.c.s.e.JettySolrRunner Jetty properties: {hostContext=/solr, hostPort=38475}
   [junit4]   2> 1678502 ERROR (TEST-TestCloudConsistency.testOutOfSyncReplicasCannotBecomeLeader-seed#[56E2E9FBED8CB3B0]) [     ] o.a.s.u.StartupLoggingUtils Missing Java Option solr.log.dir. Logging may be missing or incomplete.
   [junit4]   2> 1678502 INFO  (TEST-TestCloudConsistency.testOutOfSyncReplicasCannotBecomeLeader-seed#[56E2E9FBED8CB3B0]) [     ] o.a.s.s.SolrDispatchFilter Using logger factory org.apache.logging.slf4j.Log4jLoggerFactory
   [junit4]   2> 1678502 INFO  (TEST-TestCloudConsistency.testOutOfSyncReplicasCannotBecomeLeader-seed#[56E2E9FBED8CB3B0]) [     ] o.a.s.s.SolrDispatchFilter  ___      _       Welcome to Apache Solr? version 8.3.0
   [junit4]   2> 1678502 INFO  (TEST-TestCloudConsistency.testOutOfSyncReplicasCannotBecomeLeader-seed#[56E2E9FBED8CB3B0]) [     ] o.a.s.s.SolrDispatchFilter / __| ___| |_ _   Starting in cloud mode on port null
   [junit4]   2> 1678502 INFO  (TEST-TestCloudConsistency.testOutOfSyncReplicasCannotBecomeLeader-seed#[56E2E9FBED8CB3B0]) [     ] o.a.s.s.SolrDispatchFilter \__ \/ _ \ | '_|  Install dir: null
   [junit4]   2> 1678502 INFO  (TEST-TestCloudConsistency.testOutOfSyncReplicasCannotBecomeLeader-seed#[56E2E9FBED8CB3B0]) [     ] o.a.s.s.SolrDispatchFilter |___/\___/_|_|    Start time: 2019-09-10T05:16:32.900Z
   [junit4]   2> 1678510 INFO  (TEST-TestCloudConsistency.testOutOfSyncReplicasCannotBecomeLeader-seed#[56E2E9FBED8CB3B0]) [     ] o.a.s.c.c.ConnectionManager Waiting for client to connect to ZooKeeper
   [junit4]   2> 1678512 INFO  (zkConnectionManagerCallback-8005-thread-1) [     ] o.a.s.c.c.ConnectionManager zkClient has connected
   [junit4]   2> 1678512 INFO  (TEST-TestCloudConsistency.testOutOfSyncReplicasCannotBecomeLeader-seed#[56E2E9FBED8CB3B0]) [     ] o.a.s.c.c.ConnectionManager Client is connected to ZooKeeper
   [junit4]   2> 1678513 INFO  (TEST-TestCloudConsistency.testOutOfSyncReplicasCannotBecomeLeader-seed#[56E2E9FBED8CB3B0]) [     ] o.a.s.s.SolrDispatchFilter solr.xml found in ZooKeeper. Loading...
   [junit4]   2> 1678729 INFO  (TEST-TestCloudConsistency.testOutOfSyncReplicasCannotBecomeLeader-seed#[56E2E9FBED8CB3B0]) [     ] o.a.s.h.c.HttpShardHandlerFactory Host whitelist initialized: WhitelistHostChecker [whitelistHosts=null, whitelistHostCheckingEnabled=true]
   [junit4]   2> 1678730 WARN  (TEST-TestCloudConsistency.testOutOfSyncReplicasCannotBecomeLeader-seed#[56E2E9FBED8CB3B0]) [     ] o.e.j.u.s.S.config Trusting all certificates configured for Client@7fc3a923[provider=null,keyStore=null,trustStore=null]
   [junit4]   2> 1678730 WARN  (TEST-TestCloudConsistency.testOutOfSyncReplicasCannotBecomeLeader-seed#[56E2E9FBED8CB3B0]) [     ] o.e.j.u.s.S.config No Client EndPointIdentificationAlgorithm configured for Client@7fc3a923[provider=null,keyStore=null,trustStore=null]
   [junit4]   2> 1678734 WARN  (TEST-TestCloudConsistency.testOutOfSyncReplicasCannotBecomeLeader-seed#[56E2E9FBED8CB3B0]) [     ] o.e.j.u.s.S.config Trusting all certificates configured for Client@4206aabf[provider=null,keyStore=null,trustStore=null]
   [junit4]   2> 1678734 WARN  (TEST-TestCloudConsistency.testOutOfSyncReplicasCannotBecomeLeader-seed#[56E2E9FBED8CB3B0]) [     ] o.e.j.u.s.S.config No Client EndPointIdentificationAlgorithm configured for Client@4206aabf[provider=null,keyStore=null,trustStore=null]
   [junit4]   2> 1678736 INFO  (TEST-TestCloudConsistency.testOutOfSyncReplicasCannotBecomeLeader-seed#[56E2E9FBED8CB3B0]) [     ] o.a.s.c.ZkContainer Zookeeper client=127.0.0.1:40611/solr
   [junit4]   2> 1678737 INFO  (TEST-TestCloudConsistency.testOutOfSyncReplicasCannotBecomeLeader-seed#[56E2E9FBED8CB3B0]) [     ] o.a.s.c.c.ConnectionManager Waiting for client to connect to ZooKeeper
   [junit4]   2> 1678740 INFO  (zkConnectionManagerCallback-8012-thread-1) [     ] o.a.s.c.c.ConnectionManager zkClient has connected
   [junit4]   2> 1678740 INFO  (TEST-TestCloudConsistency.testOutOfSyncReplicasCannotBecomeLeader-seed#[56E2E9FBED8CB3B0]) [     ] o.a.s.c.c.ConnectionManager Client is connected to ZooKeeper
   [junit4]   2> 1678843 INFO  (TEST-TestCloudConsistency.testOutOfSyncReplicasCannotBecomeLeader-seed#[56E2E9FBED8CB3B0]) [     ] o.a.s.c.c.ConnectionManager Waiting for client to connect to ZooKeeper
   [junit4]   2> 1678844 INFO  (zkConnectionManagerCallback-8014-thread-1) [     ] o.a.s.c.c.ConnectionManager zkClient has connected
   [junit4]   2> 1678844 INFO  (TEST-TestCloudConsistency.testOutOfSyncReplicasCannotBecomeLeader-seed#[56E2E9FBED8CB3B0]) [     ] o.a.s.c.c.ConnectionManager Client is connected to ZooKeeper
   [junit4]   2> 1678852 INFO  (TEST-TestCloudConsistency.testOutOfSyncReplicasCannotBecomeLeader-seed#[56E2E9FBED8CB3B0]) [     ] o.a.s.c.c.ZkStateReader Updated live nodes from ZooKeeper... (0) -> (3)
   [junit4]   2> 1678857 INFO  (TEST-TestCloudConsistency.testOutOfSyncReplicasCannotBecomeLeader-seed#[56E2E9FBED8CB3B0]) [     ] o.a.s.c.ZkController Publish node=127.0.0.1:38475_solr as DOWN
   [junit4]   2> 1678858 INFO  (TEST-TestCloudConsistency.testOutOfSyncReplicasCannotBecomeLeader-seed#[56E2E9FBED8CB3B0]) [     ] o.a.s.c.TransientSolrCoreCacheDefault Allocating transient cache for 2147483647 transient cores
   [junit4]   2> 1678858 INFO  (TEST-TestCloudConsistency.testOutOfSyncReplicasCannotBecomeLeader-seed#[56E2E9FBED8CB3B0]) [     ] o.a.s.c.ZkController Register node as live in ZooKeeper:/live_nodes/127.0.0.1:38475_solr
   [junit4]   2> 1678860 INFO  (zkCallback-7947-thread-1) [     ] o.a.s.c.c.ZkStateReader Updated live nodes from ZooKeeper... (3) -> (4)
   [junit4]   2> 1678860 INFO  (zkCallback-7968-thread-1) [     ] o.a.s.c.c.ZkStateReader Updated live nodes from ZooKeeper... (3) -> (4)
   [junit4]   2> 1678860 INFO  (zkCallback-7990-thread-1) [     ] o.a.s.c.c.ZkStateReader Updated live nodes from ZooKeeper... (3) -> (4)
   [junit4]   2> 1678860 INFO  (zkCallback-7997-thread-1) [     ] o.a.s.c.c.ZkStateReader Updated live nodes from ZooKeeper... (3) -> (4)
   [junit4]   2> 1678861 INFO  (zkCallback-7975-thread-1) [     ] o.a.s.c.c.ZkStateReader Updated live nodes from ZooKeeper... (3) -> (4)
   [junit4]   2> 1678861 INFO  (zkCallback-7954-thread-1) [     ] o.a.s.c.c.ZkStateReader Updated live nodes from ZooKeeper... (3) -> (4)
   [junit4]   2> 1678861 INFO  (zkCallback-7940-thread-1) [     ] o.a.s.c.c.ZkStateReader Updated live nodes from ZooKeeper... (3) -> (4)
   [junit4]   2> 1678862 INFO  (zkCallback-8013-thread-1) [     ] o.a.s.c.c.ZkStateReader Updated live nodes from ZooKeeper... (3) -> (4)
   [junit4]   2> 1678863 INFO  (TEST-TestCloudConsistency.testOutOfSyncReplicasCannotBecomeLeader-seed#[56E2E9FBED8CB3B0]) [     ] o.a.s.c.c.ConnectionManager Waiting for client to connect to ZooKeeper
   [junit4]   2> 1678864 INFO  (zkConnectionManagerCallback-8021-thread-1) [     ] o.a.s.c.c.ConnectionManager zkClient has connected
   [junit4]   2> 1678864 INFO  (TEST-TestCloudConsistency.testOutOfSyncReplicasCannotBecomeLeader-seed#[56E2E9FBED8CB3B0]) [     ] o.a.s.c.c.ConnectionManager Client is connected to ZooKeeper
   [junit4]   2> 1678866 INFO  (TEST-TestCloudConsistency.testOutOfSyncReplicasCannotBecomeLeader-seed#[56E2E9FBED8CB3B0]) [     ] o.a.s.c.c.ZkStateReader Updated live nodes from ZooKeeper... (0) -> (4)
   [junit4]   2> 1678869 INFO  (TEST-TestCloudConsistency.testOutOfSyncReplicasCannotBecomeLeader-seed#[56E2E9FBED8CB3B0]) [     ] o.a.s.c.s.i.ZkClientClusterStateProvider Cluster at 127.0.0.1:40611/solr ready
   [junit4]   2> 1678869 INFO  (TEST-TestCloudConsistency.testOutOfSyncReplicasCannotBecomeLeader-seed#[56E2E9FBED8CB3B0]) [     ] o.a.s.c.PackageManager clusterprops.json changed , version -1
   [junit4]   2> 1678898 INFO  (TEST-TestCloudConsistency.testOutOfSyncReplicasCannotBecomeLeader-seed#[56E2E9FBED8CB3B0]) [     ] o.a.s.h.a.MetricsHistoryHandler No .system collection, keeping metrics history in memory.
   [junit4]   2> 1678927 INFO  (TEST-TestCloudConsistency.testOutOfSyncReplicasCannotBecomeLeader-seed#[56E2E9FBED8CB3B0]) [     ] o.a.s.m.r.SolrJmxReporter JMX monitoring for 'solr_38475.solr.node' (registry 'solr.node') enabled at server: com.sun.jmx.mbeanserver.JmxMBeanServer@15291ab
   [junit4]   2> 1678945 INFO  (TEST-TestCloudConsistency.testOutOfSyncReplicasCannotBecomeLeader-seed#[56E2E9FBED8CB3B0]) [     ] o.a.s.m.r.SolrJmxReporter JMX monitoring for 'solr_38475.solr.jvm' (registry 'solr.jvm') enabled at server: com.sun.jmx.mbeanserver.JmxMBeanServer@15291ab
   [junit4]   2> 1678945 INFO  (TEST-TestCloudConsistency.testOutOfSyncReplicasCannotBecomeLeader-seed#[56E2E9FBED8CB3B0]) [     ] o.a.s.m.r.SolrJmxReporter JMX monitoring for 'solr_38475.solr.jetty' (registry 'solr.jetty') enabled at server: com.sun.jmx.mbeanserver.JmxMBeanServer@15291ab
   [junit4]   2> 1678948 INFO  (TEST-TestCloudConsistency.testOutOfSyncReplicasCannotBecomeLeader-seed#[56E2E9FBED8CB3B0]) [     ] o.a.s.c.CorePropertiesLocator Found 0 core definitions underneath /home/jenkins/jenkins-slave/workspace/Lucene-Solr-BadApples-Tests-8.x/solr/build/solr-core/test/J1/temp/solr.cloud.TestCloudConsistency_56E2E9FBED8CB3B0-001/tempDir-001/node2/.
   [junit4]   2> 1679026 INFO  (TEST-TestCloudConsistency.testOutOfSyncReplicasCannotBecomeLeader-seed#[56E2E9FBED8CB3B0]) [     ] o.a.s.c.TestCloudConsistency Adding proxy for URL: http://127.0.0.1:37559/solr. Proxy: http://127.0.0.1:38475/solr
   [junit4]   2> 1679026 INFO  (TEST-TestCloudConsistency.testOutOfSyncReplicasCannotBecomeLeader-seed#[56E2E9FBED8CB3B0]) [     ] o.a.s.c.CoreContainer Shutting down CoreContainer instance=390378639
   [junit4]   2> 1679026 INFO  (TEST-TestCloudConsistency.testOutOfSyncReplicasCannotBecomeLeader-seed#[56E2E9FBED8CB3B0]) [     ] o.a.s.c.ZkController Remove node as live in ZooKeeper:/live_nodes/127.0.0.1:42509_solr
   [junit4]   2> 1679027 INFO  (TEST-TestCloudConsistency.testOutOfSyncReplicasCannotBecomeLeader-seed#[56E2E9FBED8CB3B0]) [     ] o.a.s.c.ZkController Publish this node as DOWN...
   [junit4]   2> 1679027 INFO  (TEST-TestCloudConsistency.testOutOfSyncReplicasCannotBecomeLeader-seed#[56E2E9FBED8CB3B0]) [     ] o.a.s.c.ZkController Publish node=127.0.0.1:42509_solr as DOWN
   [junit4]   2> 1679030 INFO  (TEST-TestCloudConsistency.testOutOfSyncReplicasCannotBecomeLeader-seed#[56E2E9FBED8CB3B0]) [     ] o.a.s.m.SolrMetricManager Closing metric reporters for registry=solr.node, tag=null
   [junit4]   2> 1679030 INFO  (TEST-TestCloudConsistency.testOutOfSyncReplicasCannotBecomeLeader-seed#[56E2E9FBED8CB3B0]) [     ] o.a.s.m.r.SolrJmxReporter Closing reporter [org.apache.solr.metrics.reporters.SolrJmxReporter@531605b4: rootName = solr_42509, domain = solr.node, service url = null, agent id = null] for registry solr.node / com.codahale.metrics.MetricRegistry@5503c743
   [junit4]   2> 1679039 INFO  (TEST-TestCloudConsistency.testOutOfSyncReplicasCannotBecomeLeader-seed#[56E2E9FBED8CB3B0]) [     ] o.a.s.m.SolrMetricManager Closing metric reporters for registry=solr.jvm, tag=null
   [junit4]   2> 1679039 INFO  (TEST-TestCloudConsistency.testOutOfSyncReplicasCannotBecomeLeader-seed#[56E2E9FBED8CB3B0]) [     ] o.a.s.m.r.SolrJmxReporter Closing reporter [org.apache.solr.metrics.reporters.SolrJmxReporter@73541397: rootName = solr_42509, domain = solr.jvm, service url = null, agent id = null] for registry solr.jvm / com.codahale.metrics.MetricRegistry@6f7a802a
   [junit4]   2> 1679044 INFO  (TEST-TestCloudConsistency.testOutOfSyncReplicasCannotBecomeLeader-seed#[56E2E9FBED8CB3B0]) [     ] o.a.s.m.SolrMetricManager Closing metric reporters for registry=solr.jetty, tag=null
   [junit4]   2> 1679044 INFO  (TEST-TestCloudConsistency.testOutOfSyncReplicasCannotBecomeLeader-seed#[56E2E9FBED8CB3B0]) [     ] o.a.s.m.r.SolrJmxReporter Closing reporter [org.apache.solr.metrics.reporters.SolrJmxReporter@417990d5: rootName = solr_42509, domain = solr.jetty, service url = null, agent id = null] for registry solr.jetty / com.codahale.metrics.MetricRegistry@57177f09
   [junit4]   2> 1679044 INFO  (TEST-TestCloudConsistency.testOutOfSyncReplicasCannotBecomeLeader-seed#[56E2E9FBED8CB3B0]) [     ] o.a.s.m.SolrMetricManager Closing metric reporters for registry=solr.cluster, tag=null
   [junit4]   2> 1679050 INFO  (zkCallback-7997-thread-1) [     ] o.a.s.c.c.ZkStateReader Updated live nodes from ZooKeeper... (4) -> (3)
   [junit4]   2> 1679050 INFO  (zkCallback-7947-thread-1) [     ] o.a.s.c.c.ZkStateReader Updated live nodes from ZooKeeper... (4) -> (3)
   [junit4]   2> 1679050 INFO  (zkCallback-8013-thread-1) [     ] o.a.s.c.c.ZkStateReader Updated live nodes from ZooKeeper... (4) -> (3)
   [junit4]   2> 1679050 INFO  (zkCallback-7975-thread-1) [     ] o.a.s.c.c.ZkStateReader Updated live nodes from ZooKeeper... (4) -> (3)
   [junit4]   2> 1679050 INFO  (zkCallback-7990-thread-1) [     ] o.a.s.c.c.ZkStateReader Updated live nodes from ZooKeeper... (4) -> (3)
   [junit4]   2> 1679050 INFO  (zkCallback-7940-thread-1) [     ] o.a.s.c.c.ZkStateReader Updated live nodes from ZooKeeper... (4) -> (3)
   [junit4]   2> 1679052 INFO  (zkCallback-8020-thread-1) [     ] o.a.s.c.c.ZkStateReader Updated live nodes from ZooKeeper... (4) -> (3)
   [junit4]   2> 1679252 INFO  (TEST-TestCloudConsistency.testOutOfSyncReplicasCannotBecomeLeader-seed#[56E2E9FBED8CB3B0]) [     ] o.e.j.s.AbstractConnector Stopped ServerConnector@68368f72{HTTP/1.1,[http/1.1, h2c]}{127.0.0.1:0}
   [junit4]   2> 1679253 INFO  (TEST-TestCloudConsistency.testOutOfSyncReplicasCannotBecomeLeader-seed#[56E2E9FBED8CB3B0]) [     ] o.e.j.s.h.ContextHandler Stopped o.e.j.s.ServletContextHandler@4f8f12fa{/solr,null,UNAVAILABLE}
   [junit4]   2> 1679253 INFO  (TEST-TestCloudConsistency.testOutOfSyncReplicasCannotBecomeLeader-seed#[56E2E9FBED8CB3B0]) [     ] o.e.j.s.session node0 Stopped scavenging
   [junit4]   2> 1679254 INFO  (TEST-TestCloudConsistency.testOutOfSyncReplicasCannotBecomeLeader-seed#[56E2E9FBED8CB3B0]) [     ] o.a.s.c.s.e.JettySolrRunner Start Jetty (original configured port=0)
   [junit4]   2> 1679254 WARN  (TEST-TestCloudConsistency.testOutOfSyncReplicasCannotBecomeLeader-seed#[56E2E9FBED8CB3B0]) [     ] o.e.j.s.AbstractConnector Ignoring deprecated socket close linger time
   [junit4]   2> 1679255 INFO  (TEST-TestCloudConsistency.testOutOfSyncReplicasCannotBecomeLeader-seed#[56E2E9FBED8CB3B0]) [     ] o.a.s.c.s.e.JettySolrRunner Trying to start Jetty on port 0 try number 1 ...
   [junit4]   2> 1679255 INFO  (TEST-TestCloudConsistency.testOutOfSyncReplicasCannotBecomeLeader-seed#[56E2E9FBED8CB3B0]) [     ] o.e.j.s.Server jetty-9.4.19.v20190610; built: 2019-06-10T16:30:51.723Z; git: afcf563148970e98786327af5e07c261fda175d3; jvm 1.8.0_191-b12
   [junit4]   2> 1679256 INFO  (TEST-TestCloudConsistency.testOutOfSyncReplicasCannotBecomeLeader-seed#[56E2E9FBED8CB3B0]) [     ] o.e.j.s.session DefaultSessionIdManager workerName=node0
   [junit4]   2> 1679256 INFO  (TEST-TestCloudConsistency.testOutOfSyncReplicasCannotBecomeLeader-seed#[56E2E9FBED8CB3B0]) [     ] o.e.j.s.session No SessionScavenger set, using defaults
   [junit4]   2> 1679256 INFO  (TEST-TestCloudConsistency.testOutOfSyncReplicasCannotBecomeLeader-seed#[56E2E9FBED8CB3B0]) [     ] o.e.j.s.session node0 Scavenging every 660000ms
   [junit4]   2> 1679256 INFO  (TEST-TestCloudConsistency.testOutOfSyncReplicasCannotBecomeLeader-seed#[56E2E9FBED8CB3B0]) [     ] o.e.j.s.h.ContextHandler Started o.e.j.s.ServletContextHandler@37b0bbc8{/solr,null,AVAILABLE}
   [junit4]   2> 1679257 INFO  (TEST-TestCloudConsistency.testOutOfSyncReplicasCannotBecomeLeader-seed#[56E2E9FBED8CB3B0]) [     ] o.e.j.s.AbstractConnector Started ServerConnector@45359e0c{HTTP/1.1,[http/1.1, h2c]}{127.0.0.1:40785}
   [junit4]   2> 1679257 INFO  (TEST-TestCloudConsistency.testOutOfSyncReplicasCannotBecomeLeader-seed#[56E2E9FBED8CB3B0]) [     ] o.e.j.s.Server Started @1679316ms
   [junit4]   2> 1679257 INFO  (TEST-TestCloudConsistency.testOutOfSyncReplicasCannotBecomeLeader-seed#[56E2E9FBED8CB3B0]) [     ] o.a.s.c.s.e.JettySolrRunner Jetty properties: {hostContext=/solr, hostPort=44925}
   [junit4]   2> 1679257 ERROR (TEST-TestCloudConsistency.testOutOfSyncReplicasCannotBecomeLeader-seed#[56E2E9FBED8CB3B0]) [     ] o.a.s.u.StartupLoggingUtils Missing Java Option solr.log.dir. Logging may be missing or incomplete.
   [junit4]   2> 1679257 INFO  (TEST-TestCloudConsistency.testOutOfSyncReplicasCannotBecomeLeader-seed#[56E2E9FBED8CB3B0]) [     ] o.a.s.s.SolrDispatchFilter Using logger factory org.apache.logging.slf4j.Log4jLoggerFactory
   [junit4]   2> 1679257 INFO  (TEST-TestCloudConsistency.testOutOfSyncReplicasCannotBecomeLeader-seed#[56E2E9FBED8CB3B0]) [     ] o.a.s.s.SolrDispatchFilter  ___      _       Welcome to Apache Solr? version 8.3.0
   [junit4]   2> 1679257 INFO  (TEST-TestCloudConsistency.testOutOfSyncReplicasCannotBecomeLeader-seed#[56E2E9FBED8CB3B0]) [     ] o.a.s.s.SolrDispatchFilter / __| ___| |_ _   Starting in cloud mode on port null
   [junit4]   2> 1679257 INFO  (TEST-TestCloudConsistency.testOutOfSyncReplicasCannotBecomeLeader-seed#[56E2E9FBED8CB3B0]) [     ] o.a.s.s.SolrDispatchFilter \__ \/ _ \ | '_|  Install dir: null
   [junit4]   2> 1679257 INFO  (TEST-TestCloudConsistency.testOutOfSyncReplicasCannotBecomeLeader-seed#[56E2E9FBED8CB3B0]) [     ] o.a.s.s.SolrDispatchFilter |___/\___/_|_|    Start time: 2019-09-10T05:16:33.655Z
   [junit4]   2> 1679260 INFO  (TEST-TestCloudConsistency.testOutOfSyncReplicasCannotBecomeLeader-seed#[56E2E9FBED8CB3B0]) [     ] o.a.s.c.c.ConnectionManager Waiting for client to connect to ZooKeeper
   [junit4]   2> 1679261 INFO  (zkConnectionManagerCallback-8028-thread-1) [     ] o.a.s.c.c.ConnectionManager zkClient has connected
   [junit4]   2> 1679261 INFO  (TEST-TestCloudConsistency.testOutOfSyncReplicasCannotBecomeLeader-seed#[56E2E9FBED8CB3B0]) [     ] o.a.s.c.c.ConnectionManager Client is connected to ZooKeeper
   [junit4]   2> 1679261 INFO  (TEST-TestCloudConsistency.testOutOfSyncReplicasCannotBecomeLeader-seed#[56E2E9FBED8CB3B0]) [     ] o.a.s.s.SolrDispatchFilter solr.xml found in ZooKeeper. Loading...
   [junit4]   2> 1679439 INFO  (TEST-TestCloudConsistency.testOutOfSyncReplicasCannotBecomeLeader-seed#[56E2E9FBED8CB3B0]) [     ] o.a.s.h.c.HttpShardHandlerFactory Host whitelist initialized: WhitelistHostChecker [whitelistHosts=null, whitelistHostCheckingEnabled=true]
   [junit4]   2> 1679441 WARN  (TEST-TestCloudConsistency.testOutOfSyncReplicasCannotBecomeLeader-seed#[56E2E9FBED8CB3B0]) [     ] o.e.j.u.s.S.config Trusting all certificates configured for Client@cebca47[provider=null,keyStore=null,trustStore=null]
   [junit4]   2> 1679441 WARN  (TEST-TestCloudConsistency.testOutOfSyncReplicasCannotBecomeLeader-seed#[56E2E9FBED8CB3B0]) [     ] o.e.j.u.s.S.config No Client EndPointIdentificationAlgorithm configured for Client@cebca47[provider=null,keyStore=null,trustStore=null]
   [junit4]   2> 1679444 WARN  (TEST-TestCloudConsistency.testOutOfSyncReplicasCannotBecomeLeader-seed#[56E2E9FBED8CB3B0]) [     ] o.e.j.u.s.S.config Trusting all certificates configured for Client@6197a119[provider=null,keyStore=null,trustStore=null]
   [junit4]   2> 1679445 WARN  (TEST-TestCloudConsistency.testOutOfSyncReplicasCannotBecomeLeader-seed#[56E2E9FBED8CB3B0]) [     ] o.e.j.u.s.S.config No Client EndPointIdentificationAlgorithm configured for Client@6197a119[provider=null,keyStore=null,trustStore=null]
   [junit4]   2> 1679446 INFO  (TEST-TestCloudConsistency.testOutOfSyncReplicasCannotBecomeLeader-seed#[56E2E9FBED8CB3B0]) [     ] o.a.s.c.ZkContainer Zookeeper client=127.0.0.1:40611/solr
   [junit4]   2> 1679447 INFO  (TEST-TestCloudConsistency.testOutOfSyncReplicasCannotBecomeLeader-seed#[56E2E9FBED8CB3B0]) [     ] o.a.s.c.c.ConnectionManager Waiting for client to connect to ZooKeeper
   [junit4]   2> 1679448 INFO  (zkConnectionManagerCallback-8035-thread-1) [     ] o.a.s.c.c.ConnectionManager zkClient has connected
   [junit4]   2> 1679448 INFO  (TEST-TestCloudConsistency.testOutOfSyncReplicasCannotBecomeLeader-seed#[56E2E9FBED8CB3B0]) [     ] o.a.s.c.c.ConnectionManager Client is connected to ZooKeeper
   [junit4]   2> 1679551 INFO  (TEST-TestCloudConsistency.testOutOfSyncReplicasCannotBecomeLeader-seed#[56E2E9FBED8CB3B0]) [     ] o.a.s.c.c.ConnectionManager Waiting for client to connect to ZooKeeper
   [junit4]   2> 1679553 INFO  (zkConnectionManagerCallback-8037-thread-1) [     ] o.a.s.c.c.ConnectionManager zkClient has connected
   [junit4]   2> 1679553 INFO  (TEST-TestCloudConsistency.testOutOfSyncReplicasCannotBecomeLeader-seed#[56E2E9FBED8CB3B0]) [     ] o.a.s.c.c.ConnectionManager Client is connected to ZooKeeper
   [junit4]   2> 1679561 INFO  (TEST-TestCloudConsistency.testOutOfSyncReplicasCannotBecomeLeader-seed#[56E2E9FBED8CB3B0]) [     ] o.a.s.c.c.ZkStateReader Updated live nodes from ZooKeeper... (0) -> (3)
   [junit4]   2> 1679567 INFO  (TEST-TestCloudConsistency.testOutOfSyncReplicasCannotBecomeLeader-seed#[56E2E9FBED8CB3B0]) [     ] o.a.s.c.ZkController Publish node=127.0.0.1:44925_solr as DOWN
   [junit4]   2> 1679568 INFO  (TEST-TestCloudConsistency.testOutOfSyncReplicasCannotBecomeLeader-seed#[56E2E9FBED8CB3B0]) [     ] o.a.s.c.TransientSolrCoreCacheDefault Allocating transient cache for 2147483647 transient cores
   [junit4]   2> 1679568 INFO  (TEST-TestCloudConsistency.testOutOfSyncReplicasCannotBecomeLeader-seed#[56E2E9FBED8CB3B0]) [     ] o.a.s.c.ZkController Register node as live in ZooKeeper:/live_nodes/127.0.0.1:44925_solr
   [junit4]   2> 1679570 INFO  (zkCallback-7947-thread-1) [     ] o.a.s.c.c.ZkStateReader Updated live nodes from ZooKeeper... (3) -> (4)
   [junit4]   2> 1679570 INFO  (zkCallback-7997-thread-1) [     ] o.a.s.c.c.ZkStateReader Updated live nodes from ZooKeeper... (3) -> (4)
   [junit4]   2> 1679570 INFO  (zkCallback-7990-thread-2) [     ] o.a.s.c.c.ZkStateReader Updated live nodes from ZooKeeper... (3) -> (4)
   [junit4]   2> 1679570 INFO  (zkCallback-7975-thread-1) [     ] o.a.s.c.c.ZkStateReader Updated live nodes from ZooKeeper... (3) -> (4)
   [junit4]   2> 1679570 INFO  (zkCallback-7940-thread-1) [     ] o.a.s.c.c.ZkStateReader Updated live nodes from ZooKeeper... (3) -> (4)
   [junit4]  

[...truncated too long message...]

o not set property disallowed.ivy.jars.list as its length is 0.

-ivy-fail-disallowed-ivy-version:

ivy-fail:

ivy-configure:
[ivy:configure] :: loading settings :: file = /home/jenkins/jenkins-slave/workspace/Lucene-Solr-BadApples-Tests-8.x/lucene/top-level-ivy-settings.xml

resolve:

ivy-availability-check:
[loadresource] Do not set property disallowed.ivy.jars.list as its length is 0.

-ivy-fail-disallowed-ivy-version:

ivy-fail:

ivy-fail:

ivy-configure:
[ivy:configure] :: loading settings :: file = /home/jenkins/jenkins-slave/workspace/Lucene-Solr-BadApples-Tests-8.x/lucene/top-level-ivy-settings.xml

resolve:

ivy-availability-check:
[loadresource] Do not set property disallowed.ivy.jars.list as its length is 0.

-ivy-fail-disallowed-ivy-version:

ivy-fail:

ivy-configure:
[ivy:configure] :: loading settings :: file = /home/jenkins/jenkins-slave/workspace/Lucene-Solr-BadApples-Tests-8.x/lucene/top-level-ivy-settings.xml

resolve:

ivy-availability-check:
[loadresource] Do not set property disallowed.ivy.jars.list as its length is 0.

-ivy-fail-disallowed-ivy-version:

ivy-fail:

ivy-fail:

ivy-configure:
[ivy:configure] :: loading settings :: file = /home/jenkins/jenkins-slave/workspace/Lucene-Solr-BadApples-Tests-8.x/lucene/top-level-ivy-settings.xml

resolve:

ivy-availability-check:
[loadresource] Do not set property disallowed.ivy.jars.list as its length is 0.

-ivy-fail-disallowed-ivy-version:

ivy-fail:

ivy-fail:

ivy-configure:
[ivy:configure] :: loading settings :: file = /home/jenkins/jenkins-slave/workspace/Lucene-Solr-BadApples-Tests-8.x/lucene/top-level-ivy-settings.xml

resolve:

ivy-availability-check:
[loadresource] Do not set property disallowed.ivy.jars.list as its length is 0.

-ivy-fail-disallowed-ivy-version:

ivy-fail:

ivy-fail:

ivy-configure:
[ivy:configure] :: loading settings :: file = /home/jenkins/jenkins-slave/workspace/Lucene-Solr-BadApples-Tests-8.x/lucene/top-level-ivy-settings.xml

resolve:

ivy-availability-check:
[loadresource] Do not set property disallowed.ivy.jars.list as its length is 0.

-ivy-fail-disallowed-ivy-version:

ivy-fail:

ivy-fail:

ivy-configure:
[ivy:configure] :: loading settings :: file = /home/jenkins/jenkins-slave/workspace/Lucene-Solr-BadApples-Tests-8.x/lucene/top-level-ivy-settings.xml

resolve:

ivy-availability-check:
[loadresource] Do not set property disallowed.ivy.jars.list as its length is 0.

-ivy-fail-disallowed-ivy-version:

ivy-fail:

ivy-fail:

ivy-configure:
[ivy:configure] :: loading settings :: file = /home/jenkins/jenkins-slave/workspace/Lucene-Solr-BadApples-Tests-8.x/lucene/top-level-ivy-settings.xml

resolve:

ivy-availability-check:
[loadresource] Do not set property disallowed.ivy.jars.list as its length is 0.

-ivy-fail-disallowed-ivy-version:

ivy-fail:

ivy-fail:

ivy-configure:
[ivy:configure] :: loading settings :: file = /home/jenkins/jenkins-slave/workspace/Lucene-Solr-BadApples-Tests-8.x/lucene/top-level-ivy-settings.xml

resolve:

ivy-availability-check:
[loadresource] Do not set property disallowed.ivy.jars.list as its length is 0.

-ivy-fail-disallowed-ivy-version:

ivy-fail:

ivy-fail:

ivy-configure:
[ivy:configure] :: loading settings :: file = /home/jenkins/jenkins-slave/workspace/Lucene-Solr-BadApples-Tests-8.x/lucene/top-level-ivy-settings.xml

resolve:

ivy-availability-check:
[loadresource] Do not set property disallowed.ivy.jars.list as its length is 0.

-ivy-fail-disallowed-ivy-version:

ivy-fail:

ivy-fail:

ivy-configure:
[ivy:configure] :: loading settings :: file = /home/jenkins/jenkins-slave/workspace/Lucene-Solr-BadApples-Tests-8.x/lucene/top-level-ivy-settings.xml

resolve:

ivy-availability-check:
[loadresource] Do not set property disallowed.ivy.jars.list as its length is 0.

-ivy-fail-disallowed-ivy-version:

ivy-fail:

ivy-fail:

ivy-configure:
[ivy:configure] :: loading settings :: file = /home/jenkins/jenkins-slave/workspace/Lucene-Solr-BadApples-Tests-8.x/lucene/top-level-ivy-settings.xml

resolve:

ivy-availability-check:
[loadresource] Do not set property disallowed.ivy.jars.list as its length is 0.

-ivy-fail-disallowed-ivy-version:

ivy-fail:

ivy-fail:

ivy-configure:
[ivy:configure] :: loading settings :: file = /home/jenkins/jenkins-slave/workspace/Lucene-Solr-BadApples-Tests-8.x/lucene/top-level-ivy-settings.xml

resolve:

ivy-availability-check:
[loadresource] Do not set property disallowed.ivy.jars.list as its length is 0.

-ivy-fail-disallowed-ivy-version:

ivy-fail:

ivy-fail:

ivy-configure:
[ivy:configure] :: loading settings :: file = /home/jenkins/jenkins-slave/workspace/Lucene-Solr-BadApples-Tests-8.x/lucene/top-level-ivy-settings.xml

resolve:

jar-checksums:
    [mkdir] Created dir: /home/jenkins/jenkins-slave/workspace/Lucene-Solr-BadApples-Tests-8.x/solr/null1292646300
     [copy] Copying 249 files to /home/jenkins/jenkins-slave/workspace/Lucene-Solr-BadApples-Tests-8.x/solr/null1292646300
   [delete] Deleting directory /home/jenkins/jenkins-slave/workspace/Lucene-Solr-BadApples-Tests-8.x/solr/null1292646300

check-working-copy:
[ivy:cachepath] :: resolving dependencies :: #;working@lucene1-us-west
[ivy:cachepath] confs: [default]
[ivy:cachepath] found org.eclipse.jgit#org.eclipse.jgit;5.3.0.201903130848-r in public
[ivy:cachepath] found com.jcraft#jsch;0.1.54 in public
[ivy:cachepath] found com.jcraft#jzlib;1.1.1 in public
[ivy:cachepath] found com.googlecode.javaewah#JavaEWAH;1.1.6 in public
[ivy:cachepath] found org.slf4j#slf4j-api;1.7.2 in public
[ivy:cachepath] found org.bouncycastle#bcpg-jdk15on;1.60 in public
[ivy:cachepath] found org.bouncycastle#bcprov-jdk15on;1.60 in public
[ivy:cachepath] found org.bouncycastle#bcpkix-jdk15on;1.60 in public
[ivy:cachepath] found org.slf4j#slf4j-nop;1.7.2 in public
[ivy:cachepath] :: resolution report :: resolve 36ms :: artifacts dl 2ms
        ---------------------------------------------------------------------
        |                  |            modules            ||   artifacts   |
        |       conf       | number| search|dwnlded|evicted|| number|dwnlded|
        ---------------------------------------------------------------------
        |      default     |   9   |   0   |   0   |   0   ||   9   |   0   |
        ---------------------------------------------------------------------
[wc-checker] Initializing working copy...
[wc-checker] Checking working copy status...

-jenkins-base:

BUILD SUCCESSFUL
Total time: 120 minutes 33 seconds
Archiving artifacts
java.lang.InterruptedException: no matches found within 10000
        at hudson.FilePath$ValidateAntFileMask.hasMatch(FilePath.java:2847)
        at hudson.FilePath$ValidateAntFileMask.invoke(FilePath.java:2726)
        at hudson.FilePath$ValidateAntFileMask.invoke(FilePath.java:2707)
        at hudson.FilePath$FileCallableWrapper.call(FilePath.java:3086)
Also:   hudson.remoting.Channel$CallSiteStackTrace: Remote call to lucene
                at hudson.remoting.Channel.attachCallSiteStackTrace(Channel.java:1741)
                at hudson.remoting.UserRequest$ExceptionResponse.retrieve(UserRequest.java:357)
                at hudson.remoting.Channel.call(Channel.java:955)
                at hudson.FilePath.act(FilePath.java:1072)
                at hudson.FilePath.act(FilePath.java:1061)
                at hudson.FilePath.validateAntFileMask(FilePath.java:2705)
                at hudson.tasks.ArtifactArchiver.perform(ArtifactArchiver.java:243)
                at hudson.tasks.BuildStepCompatibilityLayer.perform(BuildStepCompatibilityLayer.java:81)
                at hudson.tasks.BuildStepMonitor$1.perform(BuildStepMonitor.java:20)
                at hudson.model.AbstractBuild$AbstractBuildExecution.perform(AbstractBuild.java:744)
                at hudson.model.AbstractBuild$AbstractBuildExecution.performAllBuildSteps(AbstractBuild.java:690)
                at hudson.model.Build$BuildExecution.post2(Build.java:186)
                at hudson.model.AbstractBuild$AbstractBuildExecution.post(AbstractBuild.java:635)
                at hudson.model.Run.execute(Run.java:1835)
                at hudson.model.FreeStyleBuild.run(FreeStyleBuild.java:43)
                at hudson.model.ResourceController.execute(ResourceController.java:97)
                at hudson.model.Executor.run(Executor.java:429)
Caused: hudson.FilePath$TunneledInterruptedException
        at hudson.FilePath$FileCallableWrapper.call(FilePath.java:3088)
        at hudson.remoting.UserRequest.perform(UserRequest.java:212)
        at hudson.remoting.UserRequest.perform(UserRequest.java:54)
        at hudson.remoting.Request$2.run(Request.java:369)
        at hudson.remoting.InterceptingExecutorService$1.call(InterceptingExecutorService.java:72)
        at java.util.concurrent.FutureTask.run(FutureTask.java:266)
        at java.util.concurrent.ThreadPoolExecutor.runWorker(ThreadPoolExecutor.java:1142)
        at java.util.concurrent.ThreadPoolExecutor$Worker.run(ThreadPoolExecutor.java:617)
        at java.lang.Thread.run(Thread.java:744)
Caused: java.lang.InterruptedException: java.lang.InterruptedException: no matches found within 10000
        at hudson.FilePath.act(FilePath.java:1074)
        at hudson.FilePath.act(FilePath.java:1061)
        at hudson.FilePath.validateAntFileMask(FilePath.java:2705)
        at hudson.tasks.ArtifactArchiver.perform(ArtifactArchiver.java:243)
        at hudson.tasks.BuildStepCompatibilityLayer.perform(BuildStepCompatibilityLayer.java:81)
        at hudson.tasks.BuildStepMonitor$1.perform(BuildStepMonitor.java:20)
        at hudson.model.AbstractBuild$AbstractBuildExecution.perform(AbstractBuild.java:744)
        at hudson.model.AbstractBuild$AbstractBuildExecution.performAllBuildSteps(AbstractBuild.java:690)
        at hudson.model.Build$BuildExecution.post2(Build.java:186)
        at hudson.model.AbstractBuild$AbstractBuildExecution.post(AbstractBuild.java:635)
        at hudson.model.Run.execute(Run.java:1835)
        at hudson.model.FreeStyleBuild.run(FreeStyleBuild.java:43)
        at hudson.model.ResourceController.execute(ResourceController.java:97)
        at hudson.model.Executor.run(Executor.java:429)
No artifacts found that match the file pattern "**/*.events,heapdumps/**,**/hs_err_pid*". Configuration error?
Recording test results
Build step 'Publish JUnit test result report' changed build result to UNSTABLE
Email was triggered for: Unstable (Test Failures)
Sending email for trigger: Unstable (Test Failures)


---------------------------------------------------------------------
To unsubscribe, e-mail: [hidden email]
For additional commands, e-mail: [hidden email]