[JENKINS] Lucene-Solr-BadApples-Tests-master - Build # 465 - Failure

classic Classic list List threaded Threaded
3 messages Options
Reply | Threaded
Open this post in threaded view
|

[JENKINS] Lucene-Solr-BadApples-Tests-master - Build # 465 - Failure

Apache Jenkins Server-2
Build: https://builds.apache.org/job/Lucene-Solr-BadApples-Tests-master/465/

1 tests failed.
FAILED:  org.apache.lucene.codecs.TestCodecLoadingDeadlock.testDeadlock

Error Message:
Process did not exit after 60 secs?

Stack Trace:
java.lang.AssertionError: Process did not exit after 60 secs?
        at __randomizedtesting.SeedInfo.seed([AC9CCD2E6495380:7A22DC6E013FE56]:0)
        at org.junit.Assert.fail(Assert.java:88)
        at org.apache.lucene.codecs.TestCodecLoadingDeadlock.testDeadlock(TestCodecLoadingDeadlock.java:82)
        at java.base/jdk.internal.reflect.NativeMethodAccessorImpl.invoke0(Native Method)
        at java.base/jdk.internal.reflect.NativeMethodAccessorImpl.invoke(NativeMethodAccessorImpl.java:62)
        at java.base/jdk.internal.reflect.DelegatingMethodAccessorImpl.invoke(DelegatingMethodAccessorImpl.java:43)
        at java.base/java.lang.reflect.Method.invoke(Method.java:566)
        at com.carrotsearch.randomizedtesting.RandomizedRunner.invoke(RandomizedRunner.java:1750)
        at com.carrotsearch.randomizedtesting.RandomizedRunner$8.evaluate(RandomizedRunner.java:938)
        at com.carrotsearch.randomizedtesting.rules.StatementAdapter.evaluate(StatementAdapter.java:36)
        at com.carrotsearch.randomizedtesting.ThreadLeakControl$StatementRunner.run(ThreadLeakControl.java:368)
        at com.carrotsearch.randomizedtesting.ThreadLeakControl.forkTimeoutingTask(ThreadLeakControl.java:817)
        at com.carrotsearch.randomizedtesting.ThreadLeakControl$3.evaluate(ThreadLeakControl.java:468)
        at com.carrotsearch.randomizedtesting.RandomizedRunner.runSingleTest(RandomizedRunner.java:947)
        at com.carrotsearch.randomizedtesting.RandomizedRunner$5.evaluate(RandomizedRunner.java:832)
        at com.carrotsearch.randomizedtesting.RandomizedRunner$6.evaluate(RandomizedRunner.java:883)
        at com.carrotsearch.randomizedtesting.RandomizedRunner$7.evaluate(RandomizedRunner.java:894)
        at com.carrotsearch.randomizedtesting.rules.StatementAdapter.evaluate(StatementAdapter.java:36)
        at com.carrotsearch.randomizedtesting.ThreadLeakControl$StatementRunner.run(ThreadLeakControl.java:368)
        at com.carrotsearch.randomizedtesting.ThreadLeakControl.forkTimeoutingTask(ThreadLeakControl.java:817)
        at com.carrotsearch.randomizedtesting.ThreadLeakControl$2.evaluate(ThreadLeakControl.java:404)
        at com.carrotsearch.randomizedtesting.RandomizedRunner.runSuite(RandomizedRunner.java:708)
        at com.carrotsearch.randomizedtesting.RandomizedRunner.access$200(RandomizedRunner.java:138)
        at com.carrotsearch.randomizedtesting.RandomizedRunner$2.run(RandomizedRunner.java:629)




Build Log:
[...truncated 1134 lines...]
   [junit4] Suite: org.apache.lucene.codecs.TestCodecLoadingDeadlock
   [junit4]   1> codec: FastDecompressionCompressingStoredFields, pf: Lucene50, dvf: Direct
   [junit4] FAILURE 60.2s J0 | TestCodecLoadingDeadlock.testDeadlock <<<
   [junit4]    > Throwable #1: java.lang.AssertionError: Process did not exit after 60 secs?
   [junit4]    > at __randomizedtesting.SeedInfo.seed([AC9CCD2E6495380:7A22DC6E013FE56]:0)
   [junit4]    > at org.apache.lucene.codecs.TestCodecLoadingDeadlock.testDeadlock(TestCodecLoadingDeadlock.java:82)
   [junit4]    > at java.base/jdk.internal.reflect.NativeMethodAccessorImpl.invoke0(Native Method)
   [junit4]    > at java.base/jdk.internal.reflect.NativeMethodAccessorImpl.invoke(NativeMethodAccessorImpl.java:62)
   [junit4]    > at java.base/jdk.internal.reflect.DelegatingMethodAccessorImpl.invoke(DelegatingMethodAccessorImpl.java:43)
   [junit4]    > at java.base/java.lang.reflect.Method.invoke(Method.java:566)
   [junit4] Completed [255/524 (1!)] on J0 in 60.21s, 1 test, 1 failure <<< FAILURES!

[...truncated 63766 lines...]
-ecj-javadoc-lint-tests:
    [mkdir] Created dir: /tmp/ecj518158574
 [ecj-lint] Compiling 48 source files to /tmp/ecj518158574
 [ecj-lint] invalid Class-Path header in manifest of jar file: /home/jenkins/.ivy2/cache/org.restlet.jee/org.restlet/jars/org.restlet-2.3.0.jar
 [ecj-lint] invalid Class-Path header in manifest of jar file: /home/jenkins/.ivy2/cache/org.restlet.jee/org.restlet.ext.servlet/jars/org.restlet.ext.servlet-2.3.0.jar
 [ecj-lint] ----------
 [ecj-lint] 1. ERROR in /home/jenkins/jenkins-slave/workspace/Lucene-Solr-BadApples-Tests-master/solr/contrib/dataimporthandler/src/test/org/apache/solr/handler/dataimport/MockInitialContextFactory.java (at line 23)
 [ecj-lint] import javax.naming.NamingException;
 [ecj-lint]       ^^^^^^^^^^^^^^^^^^^^^^^^^^^^
 [ecj-lint] The type javax.naming.NamingException is not accessible
 [ecj-lint] ----------
 [ecj-lint] 2. ERROR in /home/jenkins/jenkins-slave/workspace/Lucene-Solr-BadApples-Tests-master/solr/contrib/dataimporthandler/src/test/org/apache/solr/handler/dataimport/MockInitialContextFactory.java (at line 28)
 [ecj-lint] public class MockInitialContextFactory implements InitialContextFactory {
 [ecj-lint]             ^^^^^^^^^^^^^^^^^^^^^^^^^
 [ecj-lint] The type MockInitialContextFactory must implement the inherited abstract method InitialContextFactory.getInitialContext(Hashtable<?,?>)
 [ecj-lint] ----------
 [ecj-lint] 3. ERROR in /home/jenkins/jenkins-slave/workspace/Lucene-Solr-BadApples-Tests-master/solr/contrib/dataimporthandler/src/test/org/apache/solr/handler/dataimport/MockInitialContextFactory.java (at line 30)
 [ecj-lint] private final javax.naming.Context context;
 [ecj-lint]              ^^^^^^^^^^^^^^^^^^^^
 [ecj-lint] The type javax.naming.Context is not accessible
 [ecj-lint] ----------
 [ecj-lint] 4. ERROR in /home/jenkins/jenkins-slave/workspace/Lucene-Solr-BadApples-Tests-master/solr/contrib/dataimporthandler/src/test/org/apache/solr/handler/dataimport/MockInitialContextFactory.java (at line 33)
 [ecj-lint] context = mock(javax.naming.Context.class);
 [ecj-lint] ^^^^^^^
 [ecj-lint] context cannot be resolved to a variable
 [ecj-lint] ----------
 [ecj-lint] 5. ERROR in /home/jenkins/jenkins-slave/workspace/Lucene-Solr-BadApples-Tests-master/solr/contrib/dataimporthandler/src/test/org/apache/solr/handler/dataimport/MockInitialContextFactory.java (at line 33)
 [ecj-lint] context = mock(javax.naming.Context.class);
 [ecj-lint]               ^^^^^^^^^^^^^^^^^^^^
 [ecj-lint] The type javax.naming.Context is not accessible
 [ecj-lint] ----------
 [ecj-lint] 6. ERROR in /home/jenkins/jenkins-slave/workspace/Lucene-Solr-BadApples-Tests-master/solr/contrib/dataimporthandler/src/test/org/apache/solr/handler/dataimport/MockInitialContextFactory.java (at line 36)
 [ecj-lint] when(context.lookup(anyString())).thenAnswer(invocation -> objects.get(invocation.getArgument(0)));
 [ecj-lint]     ^^^^^^^
 [ecj-lint] context cannot be resolved
 [ecj-lint] ----------
 [ecj-lint] 7. ERROR in /home/jenkins/jenkins-slave/workspace/Lucene-Solr-BadApples-Tests-master/solr/contrib/dataimporthandler/src/test/org/apache/solr/handler/dataimport/MockInitialContextFactory.java (at line 38)
 [ecj-lint] } catch (NamingException e) {
 [ecj-lint]         ^^^^^^^^^^^^^^^
 [ecj-lint] NamingException cannot be resolved to a type
 [ecj-lint] ----------
 [ecj-lint] 8. ERROR in /home/jenkins/jenkins-slave/workspace/Lucene-Solr-BadApples-Tests-master/solr/contrib/dataimporthandler/src/test/org/apache/solr/handler/dataimport/MockInitialContextFactory.java (at line 45)
 [ecj-lint] public javax.naming.Context getInitialContext(Hashtable env) {
 [ecj-lint]       ^^^^^^^^^^^^^^^^^^^^
 [ecj-lint] The type javax.naming.Context is not accessible
 [ecj-lint] ----------
 [ecj-lint] 9. ERROR in /home/jenkins/jenkins-slave/workspace/Lucene-Solr-BadApples-Tests-master/solr/contrib/dataimporthandler/src/test/org/apache/solr/handler/dataimport/MockInitialContextFactory.java (at line 46)
 [ecj-lint] return context;
 [ecj-lint]       ^^^^^^^
 [ecj-lint] context cannot be resolved to a variable
 [ecj-lint] ----------
 [ecj-lint] 9 problems (9 errors)

BUILD FAILED
/home/jenkins/jenkins-slave/workspace/Lucene-Solr-BadApples-Tests-master/build.xml:643: The following error occurred while executing this line:
/home/jenkins/jenkins-slave/workspace/Lucene-Solr-BadApples-Tests-master/build.xml:101: The following error occurred while executing this line:
/home/jenkins/jenkins-slave/workspace/Lucene-Solr-BadApples-Tests-master/solr/build.xml:651: The following error occurred while executing this line:
/home/jenkins/jenkins-slave/workspace/Lucene-Solr-BadApples-Tests-master/solr/common-build.xml:479: The following error occurred while executing this line:
/home/jenkins/jenkins-slave/workspace/Lucene-Solr-BadApples-Tests-master/lucene/common-build.xml:2015: The following error occurred while executing this line:
/home/jenkins/jenkins-slave/workspace/Lucene-Solr-BadApples-Tests-master/lucene/common-build.xml:2048: Compile failed; see the compiler error output for details.

Total time: 179 minutes 53 seconds
Build step 'Invoke Ant' marked build as failure
Archiving artifacts
Recording test results
Email was triggered for: Failure - Any
Sending email for trigger: Failure - Any


---------------------------------------------------------------------
To unsubscribe, e-mail: [hidden email]
For additional commands, e-mail: [hidden email]
Reply | Threaded
Open this post in threaded view
|

[JENKINS] Lucene-Solr-BadApples-Tests-master - Build # 466 - Still Failing

Apache Jenkins Server-2
Build: https://builds.apache.org/job/Lucene-Solr-BadApples-Tests-master/466/

All tests passed

Build Log:
[...truncated 64019 lines...]
-ecj-javadoc-lint-src:
    [mkdir] Created dir: /tmp/ecj1276441538
 [ecj-lint] Compiling 1289 source files to /tmp/ecj1276441538
 [ecj-lint] Processing annotations
 [ecj-lint] Annotations processed
 [ecj-lint] Processing annotations
 [ecj-lint] No elements to process
 [ecj-lint] invalid Class-Path header in manifest of jar file: /home/jenkins/.ivy2/cache/org.restlet.jee/org.restlet/jars/org.restlet-2.3.0.jar
 [ecj-lint] invalid Class-Path header in manifest of jar file: /home/jenkins/.ivy2/cache/org.restlet.jee/org.restlet.ext.servlet/jars/org.restlet.ext.servlet-2.3.0.jar
 [ecj-lint] ----------
 [ecj-lint] 1. WARNING in /home/jenkins/jenkins-slave/workspace/Lucene-Solr-BadApples-Tests-master/solr/core/src/java/org/apache/solr/client/solrj/embedded/EmbeddedSolrServer.java (at line 219)
 [ecj-lint] return (NamedList<Object>) new JavaBinCodec(resolver).unmarshal(in);
 [ecj-lint]                           ^^^^^^^^^^^^^^^^^^^^^^^^^^
 [ecj-lint] Resource leak: '<unassigned Closeable value>' is never closed
 [ecj-lint] ----------
 [ecj-lint] ----------
 [ecj-lint] 2. WARNING in /home/jenkins/jenkins-slave/workspace/Lucene-Solr-BadApples-Tests-master/solr/core/src/java/org/apache/solr/cloud/RecoveryStrategy.java (at line 232)
 [ecj-lint] ReplicationHandler replicationHandler = (ReplicationHandler) handler;
 [ecj-lint]                   ^^^^^^^^^^^^^^^^^^
 [ecj-lint] Resource leak: 'replicationHandler' is never closed
 [ecj-lint] ----------
 [ecj-lint] 3. WARNING in /home/jenkins/jenkins-slave/workspace/Lucene-Solr-BadApples-Tests-master/solr/core/src/java/org/apache/solr/cloud/RecoveryStrategy.java (at line 628)
 [ecj-lint] PeerSyncWithLeader peerSyncWithLeader = new PeerSyncWithLeader(core,
 [ecj-lint]                   ^^^^^^^^^^^^^^^^^^
 [ecj-lint] Resource leak: 'peerSyncWithLeader' is never closed
 [ecj-lint] ----------
 [ecj-lint] ----------
 [ecj-lint] 4. WARNING in /home/jenkins/jenkins-slave/workspace/Lucene-Solr-BadApples-Tests-master/solr/core/src/java/org/apache/solr/cloud/SyncStrategy.java (at line 186)
 [ecj-lint] PeerSync peerSync = new PeerSync(core, syncWith, core.getUpdateHandler().getUpdateLog().getNumRecordsToKeep(), true, peerSyncOnlyWithActive, false);
 [ecj-lint]         ^^^^^^^^
 [ecj-lint] Resource leak: 'peerSync' is never closed
 [ecj-lint] ----------
 [ecj-lint] ----------
 [ecj-lint] 5. WARNING in /home/jenkins/jenkins-slave/workspace/Lucene-Solr-BadApples-Tests-master/solr/core/src/java/org/apache/solr/cloud/autoscaling/sim/SimCloudManager.java (at line 788)
 [ecj-lint] throw new UnsupportedOperationException("must add at least 1 node first");
 [ecj-lint] ^^^^^^^^^^^^^^^^^^^^^^^^^^^^^^^^^^^^^^^^^^^^^^^^^^^^^^^^^^^^^^^^^^^^^^^^^^
 [ecj-lint] Resource leak: 'queryRequest' is not closed at this location
 [ecj-lint] ----------
 [ecj-lint] 6. WARNING in /home/jenkins/jenkins-slave/workspace/Lucene-Solr-BadApples-Tests-master/solr/core/src/java/org/apache/solr/cloud/autoscaling/sim/SimCloudManager.java (at line 794)
 [ecj-lint] throw new UnsupportedOperationException("must add at least 1 node first");
 [ecj-lint] ^^^^^^^^^^^^^^^^^^^^^^^^^^^^^^^^^^^^^^^^^^^^^^^^^^^^^^^^^^^^^^^^^^^^^^^^^^
 [ecj-lint] Resource leak: 'queryRequest' is not closed at this location
 [ecj-lint] ----------
 [ecj-lint] ----------
 [ecj-lint] 7. WARNING in /home/jenkins/jenkins-slave/workspace/Lucene-Solr-BadApples-Tests-master/solr/core/src/java/org/apache/solr/core/CoreContainer.java (at line 726)
 [ecj-lint] SolrFieldCacheBean fieldCacheBean = new SolrFieldCacheBean();
 [ecj-lint]                   ^^^^^^^^^^^^^^
 [ecj-lint] Resource leak: 'fieldCacheBean' is never closed
 [ecj-lint] ----------
 [ecj-lint] ----------
 [ecj-lint] 8. ERROR in /home/jenkins/jenkins-slave/workspace/Lucene-Solr-BadApples-Tests-master/solr/core/src/java/org/apache/solr/core/SolrResourceLoader.java (at line 19)
 [ecj-lint] import javax.naming.Context;
 [ecj-lint]       ^^^^^^^^^^^^^^^^^^^^
 [ecj-lint] The type javax.naming.Context is not accessible
 [ecj-lint] ----------
 [ecj-lint] 9. ERROR in /home/jenkins/jenkins-slave/workspace/Lucene-Solr-BadApples-Tests-master/solr/core/src/java/org/apache/solr/core/SolrResourceLoader.java (at line 20)
 [ecj-lint] import javax.naming.InitialContext;
 [ecj-lint]       ^^^^^^^^^^^^^^^^^^^^^^^^^^^
 [ecj-lint] The type javax.naming.InitialContext is not accessible
 [ecj-lint] ----------
 [ecj-lint] 10. ERROR in /home/jenkins/jenkins-slave/workspace/Lucene-Solr-BadApples-Tests-master/solr/core/src/java/org/apache/solr/core/SolrResourceLoader.java (at line 21)
 [ecj-lint] import javax.naming.NamingException;
 [ecj-lint]       ^^^^^^^^^^^^^^^^^^^^^^^^^^^^
 [ecj-lint] The type javax.naming.NamingException is not accessible
 [ecj-lint] ----------
 [ecj-lint] 11. ERROR in /home/jenkins/jenkins-slave/workspace/Lucene-Solr-BadApples-Tests-master/solr/core/src/java/org/apache/solr/core/SolrResourceLoader.java (at line 22)
 [ecj-lint] import javax.naming.NoInitialContextException;
 [ecj-lint]       ^^^^^^^^^^^^^^^^^^^^^^^^^^^^^^^^^^^^^^
 [ecj-lint] The type javax.naming.NoInitialContextException is not accessible
 [ecj-lint] ----------
 [ecj-lint] 12. ERROR in /home/jenkins/jenkins-slave/workspace/Lucene-Solr-BadApples-Tests-master/solr/core/src/java/org/apache/solr/core/SolrResourceLoader.java (at line 776)
 [ecj-lint] Context c = new InitialContext();
 [ecj-lint] ^^^^^^^
 [ecj-lint] Context cannot be resolved to a type
 [ecj-lint] ----------
 [ecj-lint] 13. ERROR in /home/jenkins/jenkins-slave/workspace/Lucene-Solr-BadApples-Tests-master/solr/core/src/java/org/apache/solr/core/SolrResourceLoader.java (at line 776)
 [ecj-lint] Context c = new InitialContext();
 [ecj-lint]                ^^^^^^^^^^^^^^
 [ecj-lint] InitialContext cannot be resolved to a type
 [ecj-lint] ----------
 [ecj-lint] 14. ERROR in /home/jenkins/jenkins-slave/workspace/Lucene-Solr-BadApples-Tests-master/solr/core/src/java/org/apache/solr/core/SolrResourceLoader.java (at line 779)
 [ecj-lint] } catch (NoInitialContextException e) {
 [ecj-lint]         ^^^^^^^^^^^^^^^^^^^^^^^^^
 [ecj-lint] NoInitialContextException cannot be resolved to a type
 [ecj-lint] ----------
 [ecj-lint] 15. ERROR in /home/jenkins/jenkins-slave/workspace/Lucene-Solr-BadApples-Tests-master/solr/core/src/java/org/apache/solr/core/SolrResourceLoader.java (at line 781)
 [ecj-lint] } catch (NamingException e) {
 [ecj-lint]         ^^^^^^^^^^^^^^^
 [ecj-lint] NamingException cannot be resolved to a type
 [ecj-lint] ----------
 [ecj-lint] ----------
 [ecj-lint] 16. WARNING in /home/jenkins/jenkins-slave/workspace/Lucene-Solr-BadApples-Tests-master/solr/core/src/java/org/apache/solr/handler/CdcrRequestHandler.java (at line 741)
 [ecj-lint] ReplicationHandler replicationHandler = (ReplicationHandler) handler;
 [ecj-lint]                   ^^^^^^^^^^^^^^^^^^
 [ecj-lint] Resource leak: 'replicationHandler' is never closed
 [ecj-lint] ----------
 [ecj-lint] 17. WARNING in /home/jenkins/jenkins-slave/workspace/Lucene-Solr-BadApples-Tests-master/solr/core/src/java/org/apache/solr/handler/CdcrRequestHandler.java (at line 760)
 [ecj-lint] ReplicationHandler replicationHandler = (ReplicationHandler) handler;
 [ecj-lint]                   ^^^^^^^^^^^^^^^^^^
 [ecj-lint] Resource leak: 'replicationHandler' is never closed
 [ecj-lint] ----------
 [ecj-lint] ----------
 [ecj-lint] 18. WARNING in /home/jenkins/jenkins-slave/workspace/Lucene-Solr-BadApples-Tests-master/solr/core/src/java/org/apache/solr/handler/SolrConfigHandler.java (at line 819)
 [ecj-lint] new RuntimeLib(req.getCore().getCoreContainer()).init(new PluginInfo(info.tag, op.getDataMap()));
 [ecj-lint] ^^^^^^^^^^^^^^^^^^^^^^^^^^^^^^^^^^^^^^^^^^^^^^^^
 [ecj-lint] Resource leak: '<unassigned Closeable value>' is never closed
 [ecj-lint] ----------
 [ecj-lint] ----------
 [ecj-lint] 19. WARNING in /home/jenkins/jenkins-slave/workspace/Lucene-Solr-BadApples-Tests-master/solr/core/src/java/org/apache/solr/handler/admin/CollectionHandlerApi.java (at line 207)
 [ecj-lint] RuntimeLib lib = new RuntimeLib(handler.handler.coreContainer);
 [ecj-lint]           ^^^
 [ecj-lint] Resource leak: 'lib' is never closed
 [ecj-lint] ----------
 [ecj-lint] ----------
 [ecj-lint] 20. WARNING in /home/jenkins/jenkins-slave/workspace/Lucene-Solr-BadApples-Tests-master/solr/core/src/java/org/apache/solr/handler/admin/SegmentsInfoRequestHandler.java (at line 244)
 [ecj-lint] leafReader = ((FilterLeafReader)leafReader).getDelegate();
 [ecj-lint] ^^^^^^^^^^^^^^^^^^^^^^^^^^^^^^^^^^^^^^^^^^^^^^^^^^^^^^^^^
 [ecj-lint] Resource leak: 'leafReader' is not closed at this location
 [ecj-lint] ----------
 [ecj-lint] ----------
 [ecj-lint] 21. WARNING in /home/jenkins/jenkins-slave/workspace/Lucene-Solr-BadApples-Tests-master/solr/core/src/java/org/apache/solr/handler/component/HttpShardHandler.java (at line 148)
 [ecj-lint] return new JavaBinCodec(null, stringCache).setReadStringAsCharSeq(true);
 [ecj-lint]       ^^^^^^^^^^^^^^^^^^^^^^^^^^^^^^^^^^^
 [ecj-lint] Resource leak: '<unassigned Closeable value>' is never closed
 [ecj-lint] ----------
 [ecj-lint] ----------
 [ecj-lint] 22. WARNING in /home/jenkins/jenkins-slave/workspace/Lucene-Solr-BadApples-Tests-master/solr/core/src/java/org/apache/solr/handler/component/HttpShardHandlerFactory.java (at line 637)
 [ecj-lint] ZkController zkController = core == null ? null : core.getCoreContainer().getZkController();
 [ecj-lint]             ^^^^^^^^^^^^
 [ecj-lint] Resource leak: 'zkController' is never closed
 [ecj-lint] ----------
 [ecj-lint] ----------
 [ecj-lint] 23. WARNING in /home/jenkins/jenkins-slave/workspace/Lucene-Solr-BadApples-Tests-master/solr/core/src/java/org/apache/solr/handler/component/RealTimeGetComponent.java (at line 1118)
 [ecj-lint] PeerSyncWithLeader peerSync = new PeerSyncWithLeader(rb.req.getCore(), syncWithLeader, nVersions);
 [ecj-lint]                   ^^^^^^^^
 [ecj-lint] Resource leak: 'peerSync' is never closed
 [ecj-lint] ----------
 [ecj-lint] 24. WARNING in /home/jenkins/jenkins-slave/workspace/Lucene-Solr-BadApples-Tests-master/solr/core/src/java/org/apache/solr/handler/component/RealTimeGetComponent.java (at line 1140)
 [ecj-lint] PeerSync peerSync = new PeerSync(rb.req.getCore(), replicas, nVersions, cantReachIsSuccess);
 [ecj-lint]         ^^^^^^^^
 [ecj-lint] Resource leak: 'peerSync' is never closed
 [ecj-lint] ----------
 [ecj-lint] ----------
 [ecj-lint] 25. WARNING in /home/jenkins/jenkins-slave/workspace/Lucene-Solr-BadApples-Tests-master/solr/core/src/java/org/apache/solr/handler/loader/JavabinLoader.java (at line 137)
 [ecj-lint] new JavaBinCodec() {
 [ecj-lint]       SolrParams params;
 [ecj-lint]       AddUpdateCommand addCmd = null;
 [ecj-lint]
 [ecj-lint]       @Override
 [ecj-lint]       public List<Object> readIterator(DataInputInputStream fis) throws IOException {
 [ecj-lint]         while (true) {
 [ecj-lint]           Object o = readVal(fis);
 [ecj-lint]           if (o == END_OBJ) break;
 [ecj-lint]           if (o instanceof NamedList) {
 [ecj-lint]             params = ((NamedList) o).toSolrParams();
 [ecj-lint]           } else {
 [ecj-lint]             try {
 [ecj-lint]               if (o instanceof byte[]) {
 [ecj-lint]                 if (params != null) req.setParams(params);
 [ecj-lint]                 byte[] buf = (byte[]) o;
 [ecj-lint]                 contentStreamLoader.load(req, rsp, new ContentStreamBase.ByteArrayStream(buf, null), processor);
 [ecj-lint]               } else {
 [ecj-lint]                 throw new RuntimeException("unsupported type ");
 [ecj-lint]               }
 [ecj-lint]             } catch (Exception e) {
 [ecj-lint]               throw new RuntimeException(e);
 [ecj-lint]             } finally {
 [ecj-lint]               params = null;
 [ecj-lint]               req.setParams(old);
 [ecj-lint]             }
 [ecj-lint]           }
 [ecj-lint]         }
 [ecj-lint]         return Collections.emptyList();
 [ecj-lint]       }
 [ecj-lint]
 [ecj-lint]     }.unmarshal(in);
 [ecj-lint] ^^^^^^^^^^^^^^^^^^^^^^^^^^^^^^^^^^^^^^^^^^^^^^^^^^^^^^^^^^^^^^^^^^^^^^^^^^^^^^^^^^^^^^^^^^^^^^^^^^^^^^^^^^^^^^^^^^^^^^^^^^^^^^^^^^^^^^^^^^^^^^^^^^^^^^^^^^^^^^^^^^^^^^^^^^^^^^^^^^^^^^^^^^^^^^^^^^^^^^^^^^^^^^^^^^^^^^^^^^^^^^^^^^^^^^^^^^^^^^^^^^^^^^^^^^^^^^^^^^^^^^^^^^^^^^^^^^^^^^^^^^^^^^^^^^^^^^^^^^^^^^^^^^^^^^^^^^^^^^^^^^^^^^^^^^^^^^^^^^^^^^^^^^^^^^^^^^^^^^^^^^^^^^^^^^^^^^^^^^^^^^^^^^^^^^^^^^^^^^^^^^^^^^^^^^^^^^^^^^^^^^^^^^^^^^^^^^^^^^^^^^^^^^^^^^^^^^^^^^^^^^^^^^^^^^^^^^^^^^^^^^^^^^^^^^^^^^^^^^^^^^^^^^^^^^^^^^^^^^^^^^^^^^^^^^^^^^^^^^^^^^^^^^^^^^^^^^^^^^^^^^^^^^^^^^^^^^^^^^^^^^^^^^^^^^^^^^^^^^^^^^^^^^^^^^^^^^^^^^^^^^^^^^^^^^^^^^^^^^^^^^^^^^^^^^^^^^^^^^^^^^^^^^^^^^^^^^^^^^^^^^^^^^^^^^^^^^^^^^^^^^^^^^^^^^^^^^^^^^^^^^^^^^^^^^^^^^^^^^^^^^^^^^^^^^^^^^^^^^^^^^^^^^^^^^^^^^^^^^^^^^^^^^^^^^^^^^^^^^^^^^^^^^^^^^^^^^^^^^^^^^^^^^^^^^^^^^^^^^^^^^^^^^^^^^^^^^^^^^^^^^^^^^^^^^^^^^^^^^^^^^^^^^^^^^^^^^^^^^^^^^^^^^^^^^^^^^^^^^^^^^^^^^^^^^^^^^^^^^^^^^^^^^^^^^^^^^^^^^^^^^^^^^^^^^^^^^^^^^^^^^^^^^^^^^^^^^^^^^^^^^^^^^^^^^^^^^^^^^^^^^^^^^
 [ecj-lint] Resource leak: '<unassigned Closeable value>' is never closed
 [ecj-lint] ----------
 [ecj-lint] ----------
 [ecj-lint] 26. INFO in /home/jenkins/jenkins-slave/workspace/Lucene-Solr-BadApples-Tests-master/solr/core/src/java/org/apache/solr/logging/log4j2/Log4j2Watcher.java (at line 187)
 [ecj-lint] if (logger == root || root.equals(logger) || isRootLogger(name) || "".equals(name)) {
 [ecj-lint]                                  ^^^^^^
 [ecj-lint] Unlikely argument type for equals(): Map.Entry<String,LoggerConfig> seems to be unrelated to Logger
 [ecj-lint] ----------
 [ecj-lint] ----------
 [ecj-lint] 27. WARNING in /home/jenkins/jenkins-slave/workspace/Lucene-Solr-BadApples-Tests-master/solr/core/src/java/org/apache/solr/search/CacheConfig.java (at line 147)
 [ecj-lint] MemClassLoader memClassLoader = (MemClassLoader) loader;
 [ecj-lint]               ^^^^^^^^^^^^^^
 [ecj-lint] Resource leak: 'memClassLoader' is never closed
 [ecj-lint] ----------
 [ecj-lint] ----------
 [ecj-lint] 28. WARNING in /home/jenkins/jenkins-slave/workspace/Lucene-Solr-BadApples-Tests-master/solr/core/src/java/org/apache/solr/update/SolrIndexSplitter.java (at line 258)
 [ecj-lint] HardlinkCopyDirectoryWrapper hardLinkedDir = new HardlinkCopyDirectoryWrapper(splitDir);
 [ecj-lint]                             ^^^^^^^^^^^^^
 [ecj-lint] Resource leak: 'hardLinkedDir' is never closed
 [ecj-lint] ----------
 [ecj-lint] ----------
 [ecj-lint] 29. WARNING in /home/jenkins/jenkins-slave/workspace/Lucene-Solr-BadApples-Tests-master/solr/core/src/java/org/apache/solr/util/FileUtils.java (at line 52)
 [ecj-lint] try (FileChannel in = new FileInputStream(src).getChannel();
 [ecj-lint]                      ^^^^^^^^^^^^^^^^^^^^^^^^
 [ecj-lint] Resource leak: '<unassigned Closeable value>' is never closed
 [ecj-lint] ----------
 [ecj-lint] 30. WARNING in /home/jenkins/jenkins-slave/workspace/Lucene-Solr-BadApples-Tests-master/solr/core/src/java/org/apache/solr/util/FileUtils.java (at line 53)
 [ecj-lint] FileChannel out = new FileOutputStream(destination).getChannel()) {
 [ecj-lint]                  ^^^^^^^^^^^^^^^^^^^^^^^^^^^^^^^^^
 [ecj-lint] Resource leak: '<unassigned Closeable value>' is never closed
 [ecj-lint] ----------
 [ecj-lint] ----------
 [ecj-lint] 31. WARNING in /home/jenkins/jenkins-slave/workspace/Lucene-Solr-BadApples-Tests-master/solr/core/src/java/org/apache/solr/util/SolrCLI.java (at line 1146)
 [ecj-lint] SnapshotCloudManager snapshotCloudManager = new SnapshotCloudManager(simCloudManager, config);
 [ecj-lint]                     ^^^^^^^^^^^^^^^^^^^^
 [ecj-lint] Resource leak: 'snapshotCloudManager' is never closed
 [ecj-lint] ----------
 [ecj-lint] ----------
 [ecj-lint] 32. WARNING in /home/jenkins/jenkins-slave/workspace/Lucene-Solr-BadApples-Tests-master/solr/core/src/java/org/apache/solr/util/TestInjection.java (at line 263)
 [ecj-lint] timers.remove(this);
 [ecj-lint]              ^^^^
 [ecj-lint] Unlikely argument type new TimerTask(){} for remove(Object) on a Collection<Timer>
 [ecj-lint] ----------
 [ecj-lint] 32 problems (8 errors, 23 warnings, 1 info)

BUILD FAILED
/home/jenkins/jenkins-slave/workspace/Lucene-Solr-BadApples-Tests-master/build.xml:643: The following error occurred while executing this line:
/home/jenkins/jenkins-slave/workspace/Lucene-Solr-BadApples-Tests-master/build.xml:101: The following error occurred while executing this line:
/home/jenkins/jenkins-slave/workspace/Lucene-Solr-BadApples-Tests-master/solr/build.xml:645: The following error occurred while executing this line:
/home/jenkins/jenkins-slave/workspace/Lucene-Solr-BadApples-Tests-master/lucene/common-build.xml:2009: The following error occurred while executing this line:
/home/jenkins/jenkins-slave/workspace/Lucene-Solr-BadApples-Tests-master/lucene/common-build.xml:2048: Compile failed; see the compiler error output for details.

Total time: 185 minutes 6 seconds
Build step 'Invoke Ant' marked build as failure
Archiving artifacts
Recording test results
Email was triggered for: Failure - Any
Sending email for trigger: Failure - Any


---------------------------------------------------------------------
To unsubscribe, e-mail: [hidden email]
For additional commands, e-mail: [hidden email]
Reply | Threaded
Open this post in threaded view
|

[JENKINS] Lucene-Solr-BadApples-Tests-master - Build # 467 - Unstable

Apache Jenkins Server-2
Build: https://builds.apache.org/job/Lucene-Solr-BadApples-Tests-master/467/

1 tests failed.
FAILED:  org.apache.lucene.search.TestDiversifiedTopDocsCollector.testInvalidArguments

Error Message:
Expected value of starting position is between 0 and 5, got -1

Stack Trace:
java.lang.IllegalArgumentException: Expected value of starting position is between 0 and 5, got -1
        at __randomizedtesting.SeedInfo.seed([76441B4280D419EE:27A311A02269C72E]:0)
        at org.apache.lucene.search.TopDocsCollector.topDocs(TopDocsCollector.java:144)
        at org.apache.lucene.search.TopDocsCollector.topDocs(TopDocsCollector.java:115)
        at org.apache.lucene.search.TestDiversifiedTopDocsCollector.testInvalidArguments(TestDiversifiedTopDocsCollector.java:96)
        at java.base/jdk.internal.reflect.NativeMethodAccessorImpl.invoke0(Native Method)
        at java.base/jdk.internal.reflect.NativeMethodAccessorImpl.invoke(NativeMethodAccessorImpl.java:62)
        at java.base/jdk.internal.reflect.DelegatingMethodAccessorImpl.invoke(DelegatingMethodAccessorImpl.java:43)
        at java.base/java.lang.reflect.Method.invoke(Method.java:566)
        at com.carrotsearch.randomizedtesting.RandomizedRunner.invoke(RandomizedRunner.java:1750)
        at com.carrotsearch.randomizedtesting.RandomizedRunner$8.evaluate(RandomizedRunner.java:938)
        at com.carrotsearch.randomizedtesting.RandomizedRunner$9.evaluate(RandomizedRunner.java:974)
        at com.carrotsearch.randomizedtesting.RandomizedRunner$10.evaluate(RandomizedRunner.java:988)
        at org.apache.lucene.util.TestRuleSetupTeardownChained$1.evaluate(TestRuleSetupTeardownChained.java:49)
        at org.apache.lucene.util.AbstractBeforeAfterRule$1.evaluate(AbstractBeforeAfterRule.java:45)
        at org.apache.lucene.util.TestRuleThreadAndTestName$1.evaluate(TestRuleThreadAndTestName.java:48)
        at org.apache.lucene.util.TestRuleIgnoreAfterMaxFailures$1.evaluate(TestRuleIgnoreAfterMaxFailures.java:64)
        at org.apache.lucene.util.TestRuleMarkFailure$1.evaluate(TestRuleMarkFailure.java:47)
        at com.carrotsearch.randomizedtesting.rules.StatementAdapter.evaluate(StatementAdapter.java:36)
        at com.carrotsearch.randomizedtesting.ThreadLeakControl$StatementRunner.run(ThreadLeakControl.java:368)
        at com.carrotsearch.randomizedtesting.ThreadLeakControl.forkTimeoutingTask(ThreadLeakControl.java:817)
        at com.carrotsearch.randomizedtesting.ThreadLeakControl$3.evaluate(ThreadLeakControl.java:468)
        at com.carrotsearch.randomizedtesting.RandomizedRunner.runSingleTest(RandomizedRunner.java:947)
        at com.carrotsearch.randomizedtesting.RandomizedRunner$5.evaluate(RandomizedRunner.java:832)
        at com.carrotsearch.randomizedtesting.RandomizedRunner$6.evaluate(RandomizedRunner.java:883)
        at com.carrotsearch.randomizedtesting.RandomizedRunner$7.evaluate(RandomizedRunner.java:894)
        at org.apache.lucene.util.AbstractBeforeAfterRule$1.evaluate(AbstractBeforeAfterRule.java:45)
        at com.carrotsearch.randomizedtesting.rules.StatementAdapter.evaluate(StatementAdapter.java:36)
        at org.apache.lucene.util.TestRuleStoreClassName$1.evaluate(TestRuleStoreClassName.java:41)
        at com.carrotsearch.randomizedtesting.rules.NoShadowingOrOverridesOnMethodsRule$1.evaluate(NoShadowingOrOverridesOnMethodsRule.java:40)
        at com.carrotsearch.randomizedtesting.rules.NoShadowingOrOverridesOnMethodsRule$1.evaluate(NoShadowingOrOverridesOnMethodsRule.java:40)
        at com.carrotsearch.randomizedtesting.rules.StatementAdapter.evaluate(StatementAdapter.java:36)
        at com.carrotsearch.randomizedtesting.rules.StatementAdapter.evaluate(StatementAdapter.java:36)
        at org.apache.lucene.util.TestRuleAssertionsRequired$1.evaluate(TestRuleAssertionsRequired.java:53)
        at org.apache.lucene.util.TestRuleMarkFailure$1.evaluate(TestRuleMarkFailure.java:47)
        at org.apache.lucene.util.TestRuleIgnoreAfterMaxFailures$1.evaluate(TestRuleIgnoreAfterMaxFailures.java:64)
        at org.apache.lucene.util.TestRuleIgnoreTestSuites$1.evaluate(TestRuleIgnoreTestSuites.java:54)
        at com.carrotsearch.randomizedtesting.rules.StatementAdapter.evaluate(StatementAdapter.java:36)
        at com.carrotsearch.randomizedtesting.ThreadLeakControl$StatementRunner.run(ThreadLeakControl.java:368)
        at java.base/java.lang.Thread.run(Thread.java:834)




Build Log:
[...truncated 8880 lines...]
   [junit4] Suite: org.apache.lucene.search.TestDiversifiedTopDocsCollector
   [junit4]   2> NOTE: reproduce with: ant test  -Dtestcase=TestDiversifiedTopDocsCollector -Dtests.method=testInvalidArguments -Dtests.seed=76441B4280D419EE -Dtests.multiplier=2 -Dtests.slow=true -Dtests.badapples=true -Dtests.locale=lo -Dtests.timezone=Asia/Pyongyang -Dtests.asserts=true -Dtests.file.encoding=UTF-8
   [junit4] ERROR   0.88s J1 | TestDiversifiedTopDocsCollector.testInvalidArguments <<<
   [junit4]    > Throwable #1: java.lang.IllegalArgumentException: Expected value of starting position is between 0 and 5, got -1
   [junit4]    > at __randomizedtesting.SeedInfo.seed([76441B4280D419EE:27A311A02269C72E]:0)
   [junit4]    > at org.apache.lucene.search.TopDocsCollector.topDocs(TopDocsCollector.java:144)
   [junit4]    > at org.apache.lucene.search.TopDocsCollector.topDocs(TopDocsCollector.java:115)
   [junit4]    > at org.apache.lucene.search.TestDiversifiedTopDocsCollector.testInvalidArguments(TestDiversifiedTopDocsCollector.java:96)
   [junit4]    > at java.base/jdk.internal.reflect.NativeMethodAccessorImpl.invoke0(Native Method)
   [junit4]    > at java.base/jdk.internal.reflect.NativeMethodAccessorImpl.invoke(NativeMethodAccessorImpl.java:62)
   [junit4]    > at java.base/jdk.internal.reflect.DelegatingMethodAccessorImpl.invoke(DelegatingMethodAccessorImpl.java:43)
   [junit4]    > at java.base/java.lang.reflect.Method.invoke(Method.java:566)
   [junit4]    > at java.base/java.lang.Thread.run(Thread.java:834)
   [junit4]   2> NOTE: test params are: codec=Asserting(Lucene80): {song=PostingsFormat(name=Asserting), year=PostingsFormat(name=Asserting), artistName=FSTOrd50, id=TestBloomFilteredLucenePostings(BloomFilteringPostingsFormat(Lucene50(blocksize=128)))}, docValues:{song=DocValuesFormat(name=Lucene80), weeks=DocValuesFormat(name=Lucene80), artist=DocValuesFormat(name=Lucene80), year=DocValuesFormat(name=Lucene80), weeksAtNumberOne=DocValuesFormat(name=Lucene80), artistName=DocValuesFormat(name=Asserting), id=DocValuesFormat(name=Lucene80)}, maxPointsInLeafNode=1382, maxMBSortInHeap=6.990462327242365, sim=Asserting(org.apache.lucene.search.similarities.AssertingSimilarity@3c23b59e), locale=lo, timezone=Asia/Pyongyang
   [junit4]   2> NOTE: Linux 4.15.0-54-generic amd64/Oracle Corporation 11.0.1 (64-bit)/cpus=4,threads=1,free=196904760,total=264241152
   [junit4]   2> NOTE: All tests run in this JVM: [TestPKIndexSplitter, TestDiversifiedTopDocsCollector]
   [junit4] Completed [4/16 (1!)] on J1 in 3.78s, 4 tests, 1 error <<< FAILURES!

[...truncated 58899 lines...]
[asciidoctor:convert] asciidoctor: ERROR: about-this-guide.adoc: line 1: invalid part, must have at least one section (e.g., chapter, appendix, etc.)
[asciidoctor:convert] asciidoctor: ERROR: solr-glossary.adoc: line 1: invalid part, must have at least one section (e.g., chapter, appendix, etc.)
     [java] Processed 2595 links (2121 relative) to 3660 anchors in 260 files
     [echo] Validated Links & Anchors via: /home/jenkins/jenkins-slave/workspace/Lucene-Solr-BadApples-Tests-master/solr/build/solr-ref-guide/bare-bones-html/

-documentation-lint:
    [jtidy] FIXME: Broken HTML checks were disabled, as jtidy can't handle HTML5.
     [echo] Checking for broken links...
     [exec]
     [exec] Crawl/parse...
     [exec]
     [exec] Verify...
     [echo] Checking for malformed docs...

jar-checksums:

resolve:

ivy-availability-check:
[loadresource] Do not set property disallowed.ivy.jars.list as its length is 0.

-ivy-fail-disallowed-ivy-version:

ivy-fail:

ivy-configure:
[ivy:configure] :: loading settings :: file = /home/jenkins/jenkins-slave/workspace/Lucene-Solr-BadApples-Tests-master/lucene/top-level-ivy-settings.xml

resolve:

ivy-availability-check:
[loadresource] Do not set property disallowed.ivy.jars.list as its length is 0.

-ivy-fail-disallowed-ivy-version:

ivy-fail:

ivy-configure:
[ivy:configure] :: loading settings :: file = /home/jenkins/jenkins-slave/workspace/Lucene-Solr-BadApples-Tests-master/lucene/top-level-ivy-settings.xml

resolve:

resolve:

ivy-availability-check:
[loadresource] Do not set property disallowed.ivy.jars.list as its length is 0.

-ivy-fail-disallowed-ivy-version:

ivy-fail:

ivy-configure:
[ivy:configure] :: loading settings :: file = /home/jenkins/jenkins-slave/workspace/Lucene-Solr-BadApples-Tests-master/lucene/top-level-ivy-settings.xml

resolve:

ivy-availability-check:
[loadresource] Do not set property disallowed.ivy.jars.list as its length is 0.

-ivy-fail-disallowed-ivy-version:

ivy-fail:

ivy-configure:
[ivy:configure] :: loading settings :: file = /home/jenkins/jenkins-slave/workspace/Lucene-Solr-BadApples-Tests-master/lucene/top-level-ivy-settings.xml

resolve:

ivy-availability-check:
[loadresource] Do not set property disallowed.ivy.jars.list as its length is 0.

-ivy-fail-disallowed-ivy-version:

ivy-fail:

ivy-configure:
[ivy:configure] :: loading settings :: file = /home/jenkins/jenkins-slave/workspace/Lucene-Solr-BadApples-Tests-master/lucene/top-level-ivy-settings.xml

resolve:

ivy-availability-check:
[loadresource] Do not set property disallowed.ivy.jars.list as its length is 0.

-ivy-fail-disallowed-ivy-version:

ivy-fail:

ivy-configure:
[ivy:configure] :: loading settings :: file = /home/jenkins/jenkins-slave/workspace/Lucene-Solr-BadApples-Tests-master/lucene/top-level-ivy-settings.xml

resolve:

ivy-availability-check:
[loadresource] Do not set property disallowed.ivy.jars.list as its length is 0.

-ivy-fail-disallowed-ivy-version:

ivy-fail:

ivy-configure:
[ivy:configure] :: loading settings :: file = /home/jenkins/jenkins-slave/workspace/Lucene-Solr-BadApples-Tests-master/lucene/top-level-ivy-settings.xml

resolve:

ivy-availability-check:
[loadresource] Do not set property disallowed.ivy.jars.list as its length is 0.

-ivy-fail-disallowed-ivy-version:

ivy-fail:

ivy-configure:
[ivy:configure] :: loading settings :: file = /home/jenkins/jenkins-slave/workspace/Lucene-Solr-BadApples-Tests-master/lucene/top-level-ivy-settings.xml

resolve:

ivy-availability-check:
[loadresource] Do not set property disallowed.ivy.jars.list as its length is 0.

-ivy-fail-disallowed-ivy-version:

ivy-fail:

ivy-configure:
[ivy:configure] :: loading settings :: file = /home/jenkins/jenkins-slave/workspace/Lucene-Solr-BadApples-Tests-master/lucene/top-level-ivy-settings.xml

resolve:

ivy-availability-check:
[loadresource] Do not set property disallowed.ivy.jars.list as its length is 0.

-ivy-fail-disallowed-ivy-version:

ivy-fail:

ivy-configure:
[ivy:configure] :: loading settings :: file = /home/jenkins/jenkins-slave/workspace/Lucene-Solr-BadApples-Tests-master/lucene/top-level-ivy-settings.xml

resolve:

ivy-availability-check:
[loadresource] Do not set property disallowed.ivy.jars.list as its length is 0.

-ivy-fail-disallowed-ivy-version:

ivy-fail:

ivy-configure:
[ivy:configure] :: loading settings :: file = /home/jenkins/jenkins-slave/workspace/Lucene-Solr-BadApples-Tests-master/lucene/top-level-ivy-settings.xml

resolve:

ivy-availability-check:
[loadresource] Do not set property disallowed.ivy.jars.list as its length is 0.

-ivy-fail-disallowed-ivy-version:

ivy-fail:

ivy-configure:
[ivy:configure] :: loading settings :: file = /home/jenkins/jenkins-slave/workspace/Lucene-Solr-BadApples-Tests-master/lucene/top-level-ivy-settings.xml

resolve:

ivy-availability-check:
[loadresource] Do not set property disallowed.ivy.jars.list as its length is 0.

-ivy-fail-disallowed-ivy-version:

ivy-fail:

ivy-configure:
[ivy:configure] :: loading settings :: file = /home/jenkins/jenkins-slave/workspace/Lucene-Solr-BadApples-Tests-master/lucene/top-level-ivy-settings.xml

resolve:

ivy-availability-check:
[loadresource] Do not set property disallowed.ivy.jars.list as its length is 0.

-ivy-fail-disallowed-ivy-version:

ivy-fail:

ivy-configure:
[ivy:configure] :: loading settings :: file = /home/jenkins/jenkins-slave/workspace/Lucene-Solr-BadApples-Tests-master/lucene/top-level-ivy-settings.xml

resolve:

ivy-availability-check:
[loadresource] Do not set property disallowed.ivy.jars.list as its length is 0.

-ivy-fail-disallowed-ivy-version:

ivy-fail:

ivy-configure:
[ivy:configure] :: loading settings :: file = /home/jenkins/jenkins-slave/workspace/Lucene-Solr-BadApples-Tests-master/lucene/top-level-ivy-settings.xml

resolve:

ivy-availability-check:
[loadresource] Do not set property disallowed.ivy.jars.list as its length is 0.

-ivy-fail-disallowed-ivy-version:

ivy-fail:

ivy-configure:
[ivy:configure] :: loading settings :: file = /home/jenkins/jenkins-slave/workspace/Lucene-Solr-BadApples-Tests-master/lucene/top-level-ivy-settings.xml

resolve:

ivy-availability-check:
[loadresource] Do not set property disallowed.ivy.jars.list as its length is 0.

-ivy-fail-disallowed-ivy-version:

ivy-fail:

ivy-configure:
[ivy:configure] :: loading settings :: file = /home/jenkins/jenkins-slave/workspace/Lucene-Solr-BadApples-Tests-master/lucene/top-level-ivy-settings.xml

resolve:

ivy-availability-check:
[loadresource] Do not set property disallowed.ivy.jars.list as its length is 0.

-ivy-fail-disallowed-ivy-version:

ivy-fail:

ivy-configure:
[ivy:configure] :: loading settings :: file = /home/jenkins/jenkins-slave/workspace/Lucene-Solr-BadApples-Tests-master/lucene/top-level-ivy-settings.xml

resolve:

ivy-availability-check:
[loadresource] Do not set property disallowed.ivy.jars.list as its length is 0.

-ivy-fail-disallowed-ivy-version:

ivy-fail:

ivy-configure:
[ivy:configure] :: loading settings :: file = /home/jenkins/jenkins-slave/workspace/Lucene-Solr-BadApples-Tests-master/lucene/top-level-ivy-settings.xml

resolve:

ivy-availability-check:
[loadresource] Do not set property disallowed.ivy.jars.list as its length is 0.

-ivy-fail-disallowed-ivy-version:

ivy-fail:

ivy-configure:
[ivy:configure] :: loading settings :: file = /home/jenkins/jenkins-slave/workspace/Lucene-Solr-BadApples-Tests-master/lucene/top-level-ivy-settings.xml

resolve:

ivy-availability-check:
[loadresource] Do not set property disallowed.ivy.jars.list as its length is 0.

-ivy-fail-disallowed-ivy-version:

ivy-fail:

ivy-configure:
[ivy:configure] :: loading settings :: file = /home/jenkins/jenkins-slave/workspace/Lucene-Solr-BadApples-Tests-master/lucene/top-level-ivy-settings.xml

resolve:

ivy-availability-check:
[loadresource] Do not set property disallowed.ivy.jars.list as its length is 0.

-ivy-fail-disallowed-ivy-version:

ivy-fail:

ivy-configure:
[ivy:configure] :: loading settings :: file = /home/jenkins/jenkins-slave/workspace/Lucene-Solr-BadApples-Tests-master/lucene/top-level-ivy-settings.xml

resolve:

ivy-availability-check:
[loadresource] Do not set property disallowed.ivy.jars.list as its length is 0.

-ivy-fail-disallowed-ivy-version:

ivy-fail:

ivy-configure:
[ivy:configure] :: loading settings :: file = /home/jenkins/jenkins-slave/workspace/Lucene-Solr-BadApples-Tests-master/lucene/top-level-ivy-settings.xml

resolve:

ivy-availability-check:
[loadresource] Do not set property disallowed.ivy.jars.list as its length is 0.

-ivy-fail-disallowed-ivy-version:

ivy-fail:

ivy-configure:
[ivy:configure] :: loading settings :: file = /home/jenkins/jenkins-slave/workspace/Lucene-Solr-BadApples-Tests-master/lucene/top-level-ivy-settings.xml

resolve:

ivy-availability-check:
[loadresource] Do not set property disallowed.ivy.jars.list as its length is 0.

-ivy-fail-disallowed-ivy-version:

ivy-fail:

ivy-configure:
[ivy:configure] :: loading settings :: file = /home/jenkins/jenkins-slave/workspace/Lucene-Solr-BadApples-Tests-master/lucene/top-level-ivy-settings.xml

resolve:

ivy-availability-check:
[loadresource] Do not set property disallowed.ivy.jars.list as its length is 0.

-ivy-fail-disallowed-ivy-version:

ivy-fail:

ivy-configure:
[ivy:configure] :: loading settings :: file = /home/jenkins/jenkins-slave/workspace/Lucene-Solr-BadApples-Tests-master/lucene/top-level-ivy-settings.xml

resolve:

ivy-availability-check:
[loadresource] Do not set property disallowed.ivy.jars.list as its length is 0.

-ivy-fail-disallowed-ivy-version:

ivy-fail:

ivy-configure:
[ivy:configure] :: loading settings :: file = /home/jenkins/jenkins-slave/workspace/Lucene-Solr-BadApples-Tests-master/lucene/top-level-ivy-settings.xml

resolve:

ivy-availability-check:
[loadresource] Do not set property disallowed.ivy.jars.list as its length is 0.

-ivy-fail-disallowed-ivy-version:

ivy-fail:

ivy-configure:
[ivy:configure] :: loading settings :: file = /home/jenkins/jenkins-slave/workspace/Lucene-Solr-BadApples-Tests-master/lucene/top-level-ivy-settings.xml

common.resolve:

resolve:

ivy-availability-check:
[loadresource] Do not set property disallowed.ivy.jars.list as its length is 0.

-ivy-fail-disallowed-ivy-version:

ivy-fail:

ivy-configure:
[ivy:configure] :: loading settings :: file = /home/jenkins/jenkins-slave/workspace/Lucene-Solr-BadApples-Tests-master/lucene/top-level-ivy-settings.xml

resolve:

ivy-availability-check:
[loadresource] Do not set property disallowed.ivy.jars.list as its length is 0.

-ivy-fail-disallowed-ivy-version:

ivy-fail:

ivy-configure:
[ivy:configure] :: loading settings :: file = /home/jenkins/jenkins-slave/workspace/Lucene-Solr-BadApples-Tests-master/lucene/top-level-ivy-settings.xml

resolve:

ivy-availability-check:
[loadresource] Do not set property disallowed.ivy.jars.list as its length is 0.

-ivy-fail-disallowed-ivy-version:

ivy-fail:

ivy-configure:
[ivy:configure] :: loading settings :: file = /home/jenkins/jenkins-slave/workspace/Lucene-Solr-BadApples-Tests-master/lucene/top-level-ivy-settings.xml

resolve:

ivy-availability-check:
[loadresource] Do not set property disallowed.ivy.jars.list as its length is 0.

-ivy-fail-disallowed-ivy-version:

ivy-fail:

ivy-configure:
[ivy:configure] :: loading settings :: file = /home/jenkins/jenkins-slave/workspace/Lucene-Solr-BadApples-Tests-master/lucene/top-level-ivy-settings.xml

resolve:

ivy-availability-check:
[loadresource] Do not set property disallowed.ivy.jars.list as its length is 0.

-ivy-fail-disallowed-ivy-version:

ivy-fail:

ivy-configure:
[ivy:configure] :: loading settings :: file = /home/jenkins/jenkins-slave/workspace/Lucene-Solr-BadApples-Tests-master/lucene/top-level-ivy-settings.xml

resolve:

jar-checksums:
    [mkdir] Created dir: /home/jenkins/jenkins-slave/workspace/Lucene-Solr-BadApples-Tests-master/lucene/null641300077
     [copy] Copying 38 files to /home/jenkins/jenkins-slave/workspace/Lucene-Solr-BadApples-Tests-master/lucene/null641300077
   [delete] Deleting directory /home/jenkins/jenkins-slave/workspace/Lucene-Solr-BadApples-Tests-master/lucene/null641300077

resolve-example:

ivy-availability-check:
[loadresource] Do not set property disallowed.ivy.jars.list as its length is 0.

-ivy-fail-disallowed-ivy-version:

ivy-fail:

ivy-configure:
[ivy:configure] :: loading settings :: file = /home/jenkins/jenkins-slave/workspace/Lucene-Solr-BadApples-Tests-master/lucene/top-level-ivy-settings.xml

resolve:

resolve-server:

ivy-availability-check:
[loadresource] Do not set property disallowed.ivy.jars.list as its length is 0.

-ivy-fail-disallowed-ivy-version:

ivy-fail:

ivy-fail:

ivy-configure:
[ivy:configure] :: loading settings :: file = /home/jenkins/jenkins-slave/workspace/Lucene-Solr-BadApples-Tests-master/lucene/top-level-ivy-settings.xml

resolve:

resolve:

ivy-availability-check:
[loadresource] Do not set property disallowed.ivy.jars.list as its length is 0.

-ivy-fail-disallowed-ivy-version:

ivy-fail:

ivy-fail:

ivy-configure:
[ivy:configure] :: loading settings :: file = /home/jenkins/jenkins-slave/workspace/Lucene-Solr-BadApples-Tests-master/lucene/top-level-ivy-settings.xml

resolve:

ivy-availability-check:
[loadresource] Do not set property disallowed.ivy.jars.list as its length is 0.

-ivy-fail-disallowed-ivy-version:

ivy-fail:

ivy-fail:

ivy-configure:
[ivy:configure] :: loading settings :: file = /home/jenkins/jenkins-slave/workspace/Lucene-Solr-BadApples-Tests-master/lucene/top-level-ivy-settings.xml

resolve:

ivy-availability-check:
[loadresource] Do not set property disallowed.ivy.jars.list as its length is 0.

-ivy-fail-disallowed-ivy-version:

ivy-fail:

ivy-configure:
[ivy:configure] :: loading settings :: file = /home/jenkins/jenkins-slave/workspace/Lucene-Solr-BadApples-Tests-master/lucene/top-level-ivy-settings.xml

resolve:

ivy-availability-check:
[loadresource] Do not set property disallowed.ivy.jars.list as its length is 0.

-ivy-fail-disallowed-ivy-version:

ivy-fail:

ivy-fail:

ivy-configure:
[ivy:configure] :: loading settings :: file = /home/jenkins/jenkins-slave/workspace/Lucene-Solr-BadApples-Tests-master/lucene/top-level-ivy-settings.xml

resolve:

ivy-availability-check:
[loadresource] Do not set property disallowed.ivy.jars.list as its length is 0.

-ivy-fail-disallowed-ivy-version:

ivy-fail:

ivy-configure:
[ivy:configure] :: loading settings :: file = /home/jenkins/jenkins-slave/workspace/Lucene-Solr-BadApples-Tests-master/lucene/top-level-ivy-settings.xml

resolve:

ivy-availability-check:
[loadresource] Do not set property disallowed.ivy.jars.list as its length is 0.

-ivy-fail-disallowed-ivy-version:

ivy-fail:

ivy-fail:

ivy-configure:
[ivy:configure] :: loading settings :: file = /home/jenkins/jenkins-slave/workspace/Lucene-Solr-BadApples-Tests-master/lucene/top-level-ivy-settings.xml

resolve:

ivy-availability-check:
[loadresource] Do not set property disallowed.ivy.jars.list as its length is 0.

-ivy-fail-disallowed-ivy-version:

ivy-fail:

ivy-fail:

ivy-configure:
[ivy:configure] :: loading settings :: file = /home/jenkins/jenkins-slave/workspace/Lucene-Solr-BadApples-Tests-master/lucene/top-level-ivy-settings.xml

resolve:

ivy-availability-check:
[loadresource] Do not set property disallowed.ivy.jars.list as its length is 0.

-ivy-fail-disallowed-ivy-version:

ivy-fail:

ivy-fail:

ivy-configure:
[ivy:configure] :: loading settings :: file = /home/jenkins/jenkins-slave/workspace/Lucene-Solr-BadApples-Tests-master/lucene/top-level-ivy-settings.xml

resolve:

ivy-availability-check:
[loadresource] Do not set property disallowed.ivy.jars.list as its length is 0.

-ivy-fail-disallowed-ivy-version:

ivy-fail:

ivy-fail:

ivy-configure:
[ivy:configure] :: loading settings :: file = /home/jenkins/jenkins-slave/workspace/Lucene-Solr-BadApples-Tests-master/lucene/top-level-ivy-settings.xml

resolve:

ivy-availability-check:
[loadresource] Do not set property disallowed.ivy.jars.list as its length is 0.

-ivy-fail-disallowed-ivy-version:

ivy-fail:

ivy-fail:

ivy-configure:
[ivy:configure] :: loading settings :: file = /home/jenkins/jenkins-slave/workspace/Lucene-Solr-BadApples-Tests-master/lucene/top-level-ivy-settings.xml

resolve:

ivy-availability-check:
[loadresource] Do not set property disallowed.ivy.jars.list as its length is 0.

-ivy-fail-disallowed-ivy-version:

ivy-fail:

ivy-fail:

ivy-configure:
[ivy:configure] :: loading settings :: file = /home/jenkins/jenkins-slave/workspace/Lucene-Solr-BadApples-Tests-master/lucene/top-level-ivy-settings.xml

resolve:

ivy-availability-check:
[loadresource] Do not set property disallowed.ivy.jars.list as its length is 0.

-ivy-fail-disallowed-ivy-version:

ivy-fail:

ivy-fail:

ivy-configure:
[ivy:configure] :: loading settings :: file = /home/jenkins/jenkins-slave/workspace/Lucene-Solr-BadApples-Tests-master/lucene/top-level-ivy-settings.xml

resolve:

ivy-availability-check:
[loadresource] Do not set property disallowed.ivy.jars.list as its length is 0.

-ivy-fail-disallowed-ivy-version:

ivy-fail:

ivy-fail:

ivy-configure:
[ivy:configure] :: loading settings :: file = /home/jenkins/jenkins-slave/workspace/Lucene-Solr-BadApples-Tests-master/lucene/top-level-ivy-settings.xml

resolve:

ivy-availability-check:
[loadresource] Do not set property disallowed.ivy.jars.list as its length is 0.

-ivy-fail-disallowed-ivy-version:

ivy-fail:

ivy-fail:

ivy-configure:
[ivy:configure] :: loading settings :: file = /home/jenkins/jenkins-slave/workspace/Lucene-Solr-BadApples-Tests-master/lucene/top-level-ivy-settings.xml

resolve:

ivy-availability-check:
[loadresource] Do not set property disallowed.ivy.jars.list as its length is 0.

-ivy-fail-disallowed-ivy-version:

ivy-fail:

ivy-fail:

ivy-configure:
[ivy:configure] :: loading settings :: file = /home/jenkins/jenkins-slave/workspace/Lucene-Solr-BadApples-Tests-master/lucene/top-level-ivy-settings.xml

resolve:

ivy-availability-check:
[loadresource] Do not set property disallowed.ivy.jars.list as its length is 0.

-ivy-fail-disallowed-ivy-version:

ivy-fail:

ivy-fail:

ivy-configure:
[ivy:configure] :: loading settings :: file = /home/jenkins/jenkins-slave/workspace/Lucene-Solr-BadApples-Tests-master/lucene/top-level-ivy-settings.xml

resolve:

jar-checksums:
    [mkdir] Created dir: /home/jenkins/jenkins-slave/workspace/Lucene-Solr-BadApples-Tests-master/solr/null1284979085
     [copy] Copying 249 files to /home/jenkins/jenkins-slave/workspace/Lucene-Solr-BadApples-Tests-master/solr/null1284979085
   [delete] Deleting directory /home/jenkins/jenkins-slave/workspace/Lucene-Solr-BadApples-Tests-master/solr/null1284979085

check-working-copy:
[ivy:cachepath] :: resolving dependencies :: #;working@lucene1-us-west
[ivy:cachepath] confs: [default]
[ivy:cachepath] found org.eclipse.jgit#org.eclipse.jgit;5.3.0.201903130848-r in public
[ivy:cachepath] found com.jcraft#jsch;0.1.54 in public
[ivy:cachepath] found com.jcraft#jzlib;1.1.1 in public
[ivy:cachepath] found com.googlecode.javaewah#JavaEWAH;1.1.6 in public
[ivy:cachepath] found org.slf4j#slf4j-api;1.7.2 in public
[ivy:cachepath] found org.bouncycastle#bcpg-jdk15on;1.60 in public
[ivy:cachepath] found org.bouncycastle#bcprov-jdk15on;1.60 in public
[ivy:cachepath] found org.bouncycastle#bcpkix-jdk15on;1.60 in public
[ivy:cachepath] found org.slf4j#slf4j-nop;1.7.2 in public
[ivy:cachepath] :: resolution report :: resolve 33ms :: artifacts dl 2ms
        ---------------------------------------------------------------------
        |                  |            modules            ||   artifacts   |
        |       conf       | number| search|dwnlded|evicted|| number|dwnlded|
        ---------------------------------------------------------------------
        |      default     |   9   |   0   |   0   |   0   ||   9   |   0   |
        ---------------------------------------------------------------------
[wc-checker] Initializing working copy...
[wc-checker] Checking working copy status...

-jenkins-base:

BUILD SUCCESSFUL
Total time: 110 minutes 17 seconds
Archiving artifacts
java.lang.InterruptedException: no matches found within 10000
        at hudson.FilePath$ValidateAntFileMask.hasMatch(FilePath.java:2847)
        at hudson.FilePath$ValidateAntFileMask.invoke(FilePath.java:2726)
        at hudson.FilePath$ValidateAntFileMask.invoke(FilePath.java:2707)
        at hudson.FilePath$FileCallableWrapper.call(FilePath.java:3086)
Also:   hudson.remoting.Channel$CallSiteStackTrace: Remote call to lucene
                at hudson.remoting.Channel.attachCallSiteStackTrace(Channel.java:1741)
                at hudson.remoting.UserRequest$ExceptionResponse.retrieve(UserRequest.java:357)
                at hudson.remoting.Channel.call(Channel.java:955)
                at hudson.FilePath.act(FilePath.java:1072)
                at hudson.FilePath.act(FilePath.java:1061)
                at hudson.FilePath.validateAntFileMask(FilePath.java:2705)
                at hudson.tasks.ArtifactArchiver.perform(ArtifactArchiver.java:243)
                at hudson.tasks.BuildStepCompatibilityLayer.perform(BuildStepCompatibilityLayer.java:81)
                at hudson.tasks.BuildStepMonitor$1.perform(BuildStepMonitor.java:20)
                at hudson.model.AbstractBuild$AbstractBuildExecution.perform(AbstractBuild.java:744)
                at hudson.model.AbstractBuild$AbstractBuildExecution.performAllBuildSteps(AbstractBuild.java:690)
                at hudson.model.Build$BuildExecution.post2(Build.java:186)
                at hudson.model.AbstractBuild$AbstractBuildExecution.post(AbstractBuild.java:635)
                at hudson.model.Run.execute(Run.java:1835)
                at hudson.model.FreeStyleBuild.run(FreeStyleBuild.java:43)
                at hudson.model.ResourceController.execute(ResourceController.java:97)
                at hudson.model.Executor.run(Executor.java:429)
Caused: hudson.FilePath$TunneledInterruptedException
        at hudson.FilePath$FileCallableWrapper.call(FilePath.java:3088)
        at hudson.remoting.UserRequest.perform(UserRequest.java:212)
        at hudson.remoting.UserRequest.perform(UserRequest.java:54)
        at hudson.remoting.Request$2.run(Request.java:369)
        at hudson.remoting.InterceptingExecutorService$1.call(InterceptingExecutorService.java:72)
        at java.util.concurrent.FutureTask.run(FutureTask.java:266)
        at java.util.concurrent.ThreadPoolExecutor.runWorker(ThreadPoolExecutor.java:1142)
        at java.util.concurrent.ThreadPoolExecutor$Worker.run(ThreadPoolExecutor.java:617)
        at java.lang.Thread.run(Thread.java:744)
Caused: java.lang.InterruptedException: java.lang.InterruptedException: no matches found within 10000
        at hudson.FilePath.act(FilePath.java:1074)
        at hudson.FilePath.act(FilePath.java:1061)
        at hudson.FilePath.validateAntFileMask(FilePath.java:2705)
        at hudson.tasks.ArtifactArchiver.perform(ArtifactArchiver.java:243)
        at hudson.tasks.BuildStepCompatibilityLayer.perform(BuildStepCompatibilityLayer.java:81)
        at hudson.tasks.BuildStepMonitor$1.perform(BuildStepMonitor.java:20)
        at hudson.model.AbstractBuild$AbstractBuildExecution.perform(AbstractBuild.java:744)
        at hudson.model.AbstractBuild$AbstractBuildExecution.performAllBuildSteps(AbstractBuild.java:690)
        at hudson.model.Build$BuildExecution.post2(Build.java:186)
        at hudson.model.AbstractBuild$AbstractBuildExecution.post(AbstractBuild.java:635)
        at hudson.model.Run.execute(Run.java:1835)
        at hudson.model.FreeStyleBuild.run(FreeStyleBuild.java:43)
        at hudson.model.ResourceController.execute(ResourceController.java:97)
        at hudson.model.Executor.run(Executor.java:429)
No artifacts found that match the file pattern "**/*.events,heapdumps/**,**/hs_err_pid*". Configuration error?
Recording test results
Build step 'Publish JUnit test result report' changed build result to UNSTABLE
Email was triggered for: Unstable (Test Failures)
Sending email for trigger: Unstable (Test Failures)


---------------------------------------------------------------------
To unsubscribe, e-mail: [hidden email]
For additional commands, e-mail: [hidden email]