[JENKINS] Lucene-Solr-NightlyTests-master - Build # 1955 - Failure

classic Classic list List threaded Threaded
5 messages Options
Reply | Threaded
Open this post in threaded view
|

[JENKINS] Lucene-Solr-NightlyTests-master - Build # 1955 - Failure

Apache Jenkins Server-2
Build: https://builds.apache.org/job/Lucene-Solr-NightlyTests-master/1955/

No tests ran.

Build Log:
[...truncated 25 lines...]
ERROR: Failed to check out http://svn.apache.org/repos/asf/lucene/test-data
org.tmatesoft.svn.core.SVNException: svn: E175002: connection refused by the server
svn: E175002: OPTIONS request failed on '/repos/asf/lucene/test-data'
        at org.tmatesoft.svn.core.internal.wc.SVNErrorManager.error(SVNErrorManager.java:112)
        at org.tmatesoft.svn.core.internal.wc.SVNErrorManager.error(SVNErrorManager.java:96)
        at org.tmatesoft.svn.core.internal.io.dav.http.HTTPConnection.request(HTTPConnection.java:765)
        at org.tmatesoft.svn.core.internal.io.dav.http.HTTPConnection.request(HTTPConnection.java:352)
        at org.tmatesoft.svn.core.internal.io.dav.http.HTTPConnection.request(HTTPConnection.java:340)
        at org.tmatesoft.svn.core.internal.io.dav.DAVConnection.performHttpRequest(DAVConnection.java:910)
        at org.tmatesoft.svn.core.internal.io.dav.DAVConnection.exchangeCapabilities(DAVConnection.java:702)
        at org.tmatesoft.svn.core.internal.io.dav.DAVConnection.open(DAVConnection.java:113)
        at org.tmatesoft.svn.core.internal.io.dav.DAVRepository.openConnection(DAVRepository.java:1035)
        at org.tmatesoft.svn.core.internal.io.dav.DAVRepository.getLatestRevision(DAVRepository.java:164)
        at org.tmatesoft.svn.core.internal.wc2.ng.SvnNgRepositoryAccess.getRevisionNumber(SvnNgRepositoryAccess.java:119)
        at org.tmatesoft.svn.core.internal.wc2.SvnRepositoryAccess.getLocations(SvnRepositoryAccess.java:178)
        at org.tmatesoft.svn.core.internal.wc2.ng.SvnNgRepositoryAccess.createRepositoryFor(SvnNgRepositoryAccess.java:43)
        at org.tmatesoft.svn.core.internal.wc2.ng.SvnNgAbstractUpdate.checkout(SvnNgAbstractUpdate.java:831)
        at org.tmatesoft.svn.core.internal.wc2.ng.SvnNgCheckout.run(SvnNgCheckout.java:26)
        at org.tmatesoft.svn.core.internal.wc2.ng.SvnNgCheckout.run(SvnNgCheckout.java:11)
        at org.tmatesoft.svn.core.internal.wc2.ng.SvnNgOperationRunner.run(SvnNgOperationRunner.java:20)
        at org.tmatesoft.svn.core.internal.wc2.SvnOperationRunner.run(SvnOperationRunner.java:21)
        at org.tmatesoft.svn.core.wc2.SvnOperationFactory.run(SvnOperationFactory.java:1239)
        at org.tmatesoft.svn.core.wc2.SvnOperation.run(SvnOperation.java:294)
        at hudson.scm.subversion.CheckoutUpdater$SubversionUpdateTask.perform(CheckoutUpdater.java:133)
        at hudson.scm.subversion.WorkspaceUpdater$UpdateTask.delegateTo(WorkspaceUpdater.java:168)
        at hudson.scm.subversion.WorkspaceUpdater$UpdateTask.delegateTo(WorkspaceUpdater.java:176)
        at hudson.scm.subversion.UpdateUpdater$TaskImpl.perform(UpdateUpdater.java:134)
        at hudson.scm.subversion.WorkspaceUpdater$UpdateTask.delegateTo(WorkspaceUpdater.java:168)
        at hudson.scm.SubversionSCM$CheckOutTask.perform(SubversionSCM.java:1041)
        at hudson.scm.SubversionSCM$CheckOutTask.invoke(SubversionSCM.java:1017)
        at hudson.scm.SubversionSCM$CheckOutTask.invoke(SubversionSCM.java:990)
        at hudson.FilePath$FileCallableWrapper.call(FilePath.java:3086)
        at hudson.remoting.UserRequest.perform(UserRequest.java:212)
        at hudson.remoting.UserRequest.perform(UserRequest.java:54)
        at hudson.remoting.Request$2.run(Request.java:369)
        at hudson.remoting.InterceptingExecutorService$1.call(InterceptingExecutorService.java:72)
        at java.util.concurrent.FutureTask.run(FutureTask.java:266)
        at java.util.concurrent.ThreadPoolExecutor.runWorker(ThreadPoolExecutor.java:1142)
        at java.util.concurrent.ThreadPoolExecutor$Worker.run(ThreadPoolExecutor.java:617)
        at java.lang.Thread.run(Thread.java:744)
Caused by: java.net.ConnectException: Connection refused
        at java.net.PlainSocketImpl.socketConnect(Native Method)
        at java.net.AbstractPlainSocketImpl.doConnect(AbstractPlainSocketImpl.java:345)
        at java.net.AbstractPlainSocketImpl.connectToAddress(AbstractPlainSocketImpl.java:206)
        at java.net.AbstractPlainSocketImpl.connect(AbstractPlainSocketImpl.java:188)
        at java.net.SocksSocketImpl.connect(SocksSocketImpl.java:392)
        at java.net.Socket.connect(Socket.java:589)
        at org.tmatesoft.svn.core.internal.util.SVNSocketConnection.run(SVNSocketConnection.java:57)
        at java.util.concurrent.Executors$RunnableAdapter.call(Executors.java:511)
        ... 4 more
java.net.ConnectException: Connection refused
        at java.net.PlainSocketImpl.socketConnect(Native Method)
        at java.net.AbstractPlainSocketImpl.doConnect(AbstractPlainSocketImpl.java:345)
        at java.net.AbstractPlainSocketImpl.connectToAddress(AbstractPlainSocketImpl.java:206)
        at java.net.AbstractPlainSocketImpl.connect(AbstractPlainSocketImpl.java:188)
        at java.net.SocksSocketImpl.connect(SocksSocketImpl.java:392)
        at java.net.Socket.connect(Socket.java:589)
        at org.tmatesoft.svn.core.internal.util.SVNSocketConnection.run(SVNSocketConnection.java:57)
        at java.util.concurrent.Executors$RunnableAdapter.call(Executors.java:511)
Caused: org.tmatesoft.svn.core.SVNException: svn: E175002: connection refused by the server
svn: E175002: OPTIONS request failed on '/repos/asf/lucene/test-data'
        at org.tmatesoft.svn.core.internal.wc.SVNErrorManager.error(SVNErrorManager.java:112)
        at org.tmatesoft.svn.core.internal.wc.SVNErrorManager.error(SVNErrorManager.java:96)
        at org.tmatesoft.svn.core.internal.io.dav.http.HTTPConnection.request(HTTPConnection.java:765)
        at org.tmatesoft.svn.core.internal.io.dav.http.HTTPConnection.request(HTTPConnection.java:352)
        at org.tmatesoft.svn.core.internal.io.dav.http.HTTPConnection.request(HTTPConnection.java:340)
        at org.tmatesoft.svn.core.internal.io.dav.DAVConnection.performHttpRequest(DAVConnection.java:910)
        at org.tmatesoft.svn.core.internal.io.dav.DAVConnection.exchangeCapabilities(DAVConnection.java:702)
        at org.tmatesoft.svn.core.internal.io.dav.DAVConnection.open(DAVConnection.java:113)
        at org.tmatesoft.svn.core.internal.io.dav.DAVRepository.openConnection(DAVRepository.java:1035)
        at org.tmatesoft.svn.core.internal.io.dav.DAVRepository.getLatestRevision(DAVRepository.java:164)
        at org.tmatesoft.svn.core.internal.wc2.ng.SvnNgRepositoryAccess.getRevisionNumber(SvnNgRepositoryAccess.java:119)
        at org.tmatesoft.svn.core.internal.wc2.SvnRepositoryAccess.getLocations(SvnRepositoryAccess.java:178)
        at org.tmatesoft.svn.core.internal.wc2.ng.SvnNgRepositoryAccess.createRepositoryFor(SvnNgRepositoryAccess.java:43)
        at org.tmatesoft.svn.core.internal.wc2.ng.SvnNgAbstractUpdate.checkout(SvnNgAbstractUpdate.java:831)
        at org.tmatesoft.svn.core.internal.wc2.ng.SvnNgCheckout.run(SvnNgCheckout.java:26)
        at org.tmatesoft.svn.core.internal.wc2.ng.SvnNgCheckout.run(SvnNgCheckout.java:11)
        at org.tmatesoft.svn.core.internal.wc2.ng.SvnNgOperationRunner.run(SvnNgOperationRunner.java:20)
        at org.tmatesoft.svn.core.internal.wc2.SvnOperationRunner.run(SvnOperationRunner.java:21)
        at org.tmatesoft.svn.core.wc2.SvnOperationFactory.run(SvnOperationFactory.java:1239)
        at org.tmatesoft.svn.core.wc2.SvnOperation.run(SvnOperation.java:294)
        at hudson.scm.subversion.CheckoutUpdater$SubversionUpdateTask.perform(CheckoutUpdater.java:133)
Also:   hudson.remoting.Channel$CallSiteStackTrace: Remote call to lucene
                at hudson.remoting.Channel.attachCallSiteStackTrace(Channel.java:1741)
                at hudson.remoting.UserRequest$ExceptionResponse.retrieve(UserRequest.java:357)
                at hudson.remoting.Channel.call(Channel.java:955)
                at hudson.FilePath.act(FilePath.java:1072)
                at hudson.FilePath.act(FilePath.java:1061)
                at hudson.scm.SubversionSCM.checkout(SubversionSCM.java:937)
                at hudson.scm.SubversionSCM.checkout(SubversionSCM.java:864)
                at org.jenkinsci.plugins.multiplescms.MultiSCM.checkout(MultiSCM.java:143)
                at hudson.scm.SCM.checkout(SCM.java:504)
                at hudson.model.AbstractProject.checkout(AbstractProject.java:1208)
                at hudson.model.AbstractBuild$AbstractBuildExecution.defaultCheckout(AbstractBuild.java:574)
                at jenkins.scm.SCMCheckoutStrategy.checkout(SCMCheckoutStrategy.java:86)
                at hudson.model.AbstractBuild$AbstractBuildExecution.run(AbstractBuild.java:499)
                at hudson.model.Run.execute(Run.java:1810)
                at hudson.model.FreeStyleBuild.run(FreeStyleBuild.java:43)
                at hudson.model.ResourceController.execute(ResourceController.java:97)
                at hudson.model.Executor.run(Executor.java:429)
Caused: java.io.IOException: Failed to check out http://svn.apache.org/repos/asf/lucene/test-data
        at hudson.scm.subversion.CheckoutUpdater$SubversionUpdateTask.perform(CheckoutUpdater.java:144)
        at hudson.scm.subversion.WorkspaceUpdater$UpdateTask.delegateTo(WorkspaceUpdater.java:168)
        at hudson.scm.subversion.WorkspaceUpdater$UpdateTask.delegateTo(WorkspaceUpdater.java:176)
        at hudson.scm.subversion.UpdateUpdater$TaskImpl.perform(UpdateUpdater.java:134)
        at hudson.scm.subversion.WorkspaceUpdater$UpdateTask.delegateTo(WorkspaceUpdater.java:168)
        at hudson.scm.SubversionSCM$CheckOutTask.perform(SubversionSCM.java:1041)
        at hudson.scm.SubversionSCM$CheckOutTask.invoke(SubversionSCM.java:1017)
        at hudson.scm.SubversionSCM$CheckOutTask.invoke(SubversionSCM.java:990)
        at hudson.FilePath$FileCallableWrapper.call(FilePath.java:3086)
        at hudson.remoting.UserRequest.perform(UserRequest.java:212)
        at hudson.remoting.UserRequest.perform(UserRequest.java:54)
        at hudson.remoting.Request$2.run(Request.java:369)
        at hudson.remoting.InterceptingExecutorService$1.call(InterceptingExecutorService.java:72)
        at java.util.concurrent.FutureTask.run(FutureTask.java:266)
        at java.util.concurrent.ThreadPoolExecutor.runWorker(ThreadPoolExecutor.java:1142)
        at java.util.concurrent.ThreadPoolExecutor$Worker.run(ThreadPoolExecutor.java:617)
        at java.lang.Thread.run(Thread.java:744)
Retrying after 10 seconds
No credentials specified
 > git rev-parse --is-inside-work-tree # timeout=10
Fetching changes from the remote Git repository
 > git config remote.origin.url https://gitbox.apache.org/repos/asf/lucene-solr.git # timeout=10
Fetching upstream changes from https://gitbox.apache.org/repos/asf/lucene-solr.git
 > git --version # timeout=10
 > git fetch --tags --progress https://gitbox.apache.org/repos/asf/lucene-solr.git +refs/heads/*:refs/remotes/origin/*
 > git rev-parse refs/remotes/origin/master^{commit} # timeout=10
 > git rev-parse refs/remotes/origin/origin/master^{commit} # timeout=10
Checking out Revision 9510e06612520b3dd9eaa8ed34ad063ab58954db (refs/remotes/origin/master)
 > git config core.sparsecheckout # timeout=10
 > git checkout -f 9510e06612520b3dd9eaa8ed34ad063ab58954db
Commit message: "SOLR-13742: temporarily disable this assertion while I investigate jenkins failures (the test passes local beasting)."
Cleaning workspace
 > git rev-parse --verify HEAD # timeout=10
Resetting working tree
 > git reset --hard # timeout=10
 > git clean -fdx # timeout=10
Checking out a fresh workspace because /home/jenkins/jenkins-slave/workspace/Lucene-Solr-NightlyTests-master/test-data doesn't exist
Cleaning local Directory test-data
Checking out http://svn.apache.org/repos/asf/lucene/test-data at revision '2019-09-09T00:43:55.058 +0000'
ERROR: Failed to check out http://svn.apache.org/repos/asf/lucene/test-data
org.tmatesoft.svn.core.SVNException: svn: E175002: connection refused by the server
svn: E175002: OPTIONS request failed on '/repos/asf/lucene/test-data'
        at org.tmatesoft.svn.core.internal.wc.SVNErrorManager.error(SVNErrorManager.java:112)
        at org.tmatesoft.svn.core.internal.wc.SVNErrorManager.error(SVNErrorManager.java:96)
        at org.tmatesoft.svn.core.internal.io.dav.http.HTTPConnection.request(HTTPConnection.java:765)
        at org.tmatesoft.svn.core.internal.io.dav.http.HTTPConnection.request(HTTPConnection.java:352)
        at org.tmatesoft.svn.core.internal.io.dav.http.HTTPConnection.request(HTTPConnection.java:340)
        at org.tmatesoft.svn.core.internal.io.dav.DAVConnection.performHttpRequest(DAVConnection.java:910)
        at org.tmatesoft.svn.core.internal.io.dav.DAVConnection.exchangeCapabilities(DAVConnection.java:702)
        at org.tmatesoft.svn.core.internal.io.dav.DAVConnection.open(DAVConnection.java:113)
        at org.tmatesoft.svn.core.internal.io.dav.DAVRepository.openConnection(DAVRepository.java:1035)
        at org.tmatesoft.svn.core.internal.io.dav.DAVRepository.getLatestRevision(DAVRepository.java:164)
        at org.tmatesoft.svn.core.internal.wc2.ng.SvnNgRepositoryAccess.getRevisionNumber(SvnNgRepositoryAccess.java:119)
        at org.tmatesoft.svn.core.internal.wc2.SvnRepositoryAccess.getLocations(SvnRepositoryAccess.java:178)
        at org.tmatesoft.svn.core.internal.wc2.ng.SvnNgRepositoryAccess.createRepositoryFor(SvnNgRepositoryAccess.java:43)
        at org.tmatesoft.svn.core.internal.wc2.ng.SvnNgAbstractUpdate.checkout(SvnNgAbstractUpdate.java:831)
        at org.tmatesoft.svn.core.internal.wc2.ng.SvnNgCheckout.run(SvnNgCheckout.java:26)
        at org.tmatesoft.svn.core.internal.wc2.ng.SvnNgCheckout.run(SvnNgCheckout.java:11)
        at org.tmatesoft.svn.core.internal.wc2.ng.SvnNgOperationRunner.run(SvnNgOperationRunner.java:20)
        at org.tmatesoft.svn.core.internal.wc2.SvnOperationRunner.run(SvnOperationRunner.java:21)
        at org.tmatesoft.svn.core.wc2.SvnOperationFactory.run(SvnOperationFactory.java:1239)
        at org.tmatesoft.svn.core.wc2.SvnOperation.run(SvnOperation.java:294)
        at hudson.scm.subversion.CheckoutUpdater$SubversionUpdateTask.perform(CheckoutUpdater.java:133)
        at hudson.scm.subversion.WorkspaceUpdater$UpdateTask.delegateTo(WorkspaceUpdater.java:168)
        at hudson.scm.subversion.WorkspaceUpdater$UpdateTask.delegateTo(WorkspaceUpdater.java:176)
        at hudson.scm.subversion.UpdateUpdater$TaskImpl.perform(UpdateUpdater.java:134)
        at hudson.scm.subversion.WorkspaceUpdater$UpdateTask.delegateTo(WorkspaceUpdater.java:168)
        at hudson.scm.SubversionSCM$CheckOutTask.perform(SubversionSCM.java:1041)
        at hudson.scm.SubversionSCM$CheckOutTask.invoke(SubversionSCM.java:1017)
        at hudson.scm.SubversionSCM$CheckOutTask.invoke(SubversionSCM.java:990)
        at hudson.FilePath$FileCallableWrapper.call(FilePath.java:3086)
        at hudson.remoting.UserRequest.perform(UserRequest.java:212)
        at hudson.remoting.UserRequest.perform(UserRequest.java:54)
        at hudson.remoting.Request$2.run(Request.java:369)
        at hudson.remoting.InterceptingExecutorService$1.call(InterceptingExecutorService.java:72)
        at java.util.concurrent.FutureTask.run(FutureTask.java:266)
        at java.util.concurrent.ThreadPoolExecutor.runWorker(ThreadPoolExecutor.java:1142)
        at java.util.concurrent.ThreadPoolExecutor$Worker.run(ThreadPoolExecutor.java:617)
        at java.lang.Thread.run(Thread.java:744)
Caused by: java.net.ConnectException: Connection refused
        at java.net.PlainSocketImpl.socketConnect(Native Method)
        at java.net.AbstractPlainSocketImpl.doConnect(AbstractPlainSocketImpl.java:345)
        at java.net.AbstractPlainSocketImpl.connectToAddress(AbstractPlainSocketImpl.java:206)
        at java.net.AbstractPlainSocketImpl.connect(AbstractPlainSocketImpl.java:188)
        at java.net.SocksSocketImpl.connect(SocksSocketImpl.java:392)
        at java.net.Socket.connect(Socket.java:589)
        at org.tmatesoft.svn.core.internal.util.SVNSocketConnection.run(SVNSocketConnection.java:57)
        at java.util.concurrent.Executors$RunnableAdapter.call(Executors.java:511)
        ... 4 more
java.net.ConnectException: Connection refused
        at java.net.PlainSocketImpl.socketConnect(Native Method)
        at java.net.AbstractPlainSocketImpl.doConnect(AbstractPlainSocketImpl.java:345)
        at java.net.AbstractPlainSocketImpl.connectToAddress(AbstractPlainSocketImpl.java:206)
        at java.net.AbstractPlainSocketImpl.connect(AbstractPlainSocketImpl.java:188)
        at java.net.SocksSocketImpl.connect(SocksSocketImpl.java:392)
        at java.net.Socket.connect(Socket.java:589)
        at org.tmatesoft.svn.core.internal.util.SVNSocketConnection.run(SVNSocketConnection.java:57)
        at java.util.concurrent.Executors$RunnableAdapter.call(Executors.java:511)
Caused: org.tmatesoft.svn.core.SVNException: svn: E175002: connection refused by the server
svn: E175002: OPTIONS request failed on '/repos/asf/lucene/test-data'
        at org.tmatesoft.svn.core.internal.wc.SVNErrorManager.error(SVNErrorManager.java:112)
        at org.tmatesoft.svn.core.internal.wc.SVNErrorManager.error(SVNErrorManager.java:96)
        at org.tmatesoft.svn.core.internal.io.dav.http.HTTPConnection.request(HTTPConnection.java:765)
        at org.tmatesoft.svn.core.internal.io.dav.http.HTTPConnection.request(HTTPConnection.java:352)
        at org.tmatesoft.svn.core.internal.io.dav.http.HTTPConnection.request(HTTPConnection.java:340)
        at org.tmatesoft.svn.core.internal.io.dav.DAVConnection.performHttpRequest(DAVConnection.java:910)
        at org.tmatesoft.svn.core.internal.io.dav.DAVConnection.exchangeCapabilities(DAVConnection.java:702)
        at org.tmatesoft.svn.core.internal.io.dav.DAVConnection.open(DAVConnection.java:113)
        at org.tmatesoft.svn.core.internal.io.dav.DAVRepository.openConnection(DAVRepository.java:1035)
        at org.tmatesoft.svn.core.internal.io.dav.DAVRepository.getLatestRevision(DAVRepository.java:164)
        at org.tmatesoft.svn.core.internal.wc2.ng.SvnNgRepositoryAccess.getRevisionNumber(SvnNgRepositoryAccess.java:119)
        at org.tmatesoft.svn.core.internal.wc2.SvnRepositoryAccess.getLocations(SvnRepositoryAccess.java:178)
        at org.tmatesoft.svn.core.internal.wc2.ng.SvnNgRepositoryAccess.createRepositoryFor(SvnNgRepositoryAccess.java:43)
        at org.tmatesoft.svn.core.internal.wc2.ng.SvnNgAbstractUpdate.checkout(SvnNgAbstractUpdate.java:831)
        at org.tmatesoft.svn.core.internal.wc2.ng.SvnNgCheckout.run(SvnNgCheckout.java:26)
        at org.tmatesoft.svn.core.internal.wc2.ng.SvnNgCheckout.run(SvnNgCheckout.java:11)
        at org.tmatesoft.svn.core.internal.wc2.ng.SvnNgOperationRunner.run(SvnNgOperationRunner.java:20)
        at org.tmatesoft.svn.core.internal.wc2.SvnOperationRunner.run(SvnOperationRunner.java:21)
        at org.tmatesoft.svn.core.wc2.SvnOperationFactory.run(SvnOperationFactory.java:1239)
        at org.tmatesoft.svn.core.wc2.SvnOperation.run(SvnOperation.java:294)
        at hudson.scm.subversion.CheckoutUpdater$SubversionUpdateTask.perform(CheckoutUpdater.java:133)
Also:   hudson.remoting.Channel$CallSiteStackTrace: Remote call to lucene
                at hudson.remoting.Channel.attachCallSiteStackTrace(Channel.java:1741)
                at hudson.remoting.UserRequest$ExceptionResponse.retrieve(UserRequest.java:357)
                at hudson.remoting.Channel.call(Channel.java:955)
                at hudson.FilePath.act(FilePath.java:1072)
                at hudson.FilePath.act(FilePath.java:1061)
                at hudson.scm.SubversionSCM.checkout(SubversionSCM.java:937)
                at hudson.scm.SubversionSCM.checkout(SubversionSCM.java:864)
                at org.jenkinsci.plugins.multiplescms.MultiSCM.checkout(MultiSCM.java:143)
                at hudson.scm.SCM.checkout(SCM.java:504)
                at hudson.model.AbstractProject.checkout(AbstractProject.java:1208)
                at hudson.model.AbstractBuild$AbstractBuildExecution.defaultCheckout(AbstractBuild.java:574)
                at jenkins.scm.SCMCheckoutStrategy.checkout(SCMCheckoutStrategy.java:86)
                at hudson.model.AbstractBuild$AbstractBuildExecution.run(AbstractBuild.java:499)
                at hudson.model.Run.execute(Run.java:1810)
                at hudson.model.FreeStyleBuild.run(FreeStyleBuild.java:43)
                at hudson.model.ResourceController.execute(ResourceController.java:97)
                at hudson.model.Executor.run(Executor.java:429)
Caused: java.io.IOException: Failed to check out http://svn.apache.org/repos/asf/lucene/test-data
        at hudson.scm.subversion.CheckoutUpdater$SubversionUpdateTask.perform(CheckoutUpdater.java:144)
        at hudson.scm.subversion.WorkspaceUpdater$UpdateTask.delegateTo(WorkspaceUpdater.java:168)
        at hudson.scm.subversion.WorkspaceUpdater$UpdateTask.delegateTo(WorkspaceUpdater.java:176)
        at hudson.scm.subversion.UpdateUpdater$TaskImpl.perform(UpdateUpdater.java:134)
        at hudson.scm.subversion.WorkspaceUpdater$UpdateTask.delegateTo(WorkspaceUpdater.java:168)
        at hudson.scm.SubversionSCM$CheckOutTask.perform(SubversionSCM.java:1041)
        at hudson.scm.SubversionSCM$CheckOutTask.invoke(SubversionSCM.java:1017)
        at hudson.scm.SubversionSCM$CheckOutTask.invoke(SubversionSCM.java:990)
        at hudson.FilePath$FileCallableWrapper.call(FilePath.java:3086)
        at hudson.remoting.UserRequest.perform(UserRequest.java:212)
        at hudson.remoting.UserRequest.perform(UserRequest.java:54)
        at hudson.remoting.Request$2.run(Request.java:369)
        at hudson.remoting.InterceptingExecutorService$1.call(InterceptingExecutorService.java:72)
        at java.util.concurrent.FutureTask.run(FutureTask.java:266)
        at java.util.concurrent.ThreadPoolExecutor.runWorker(ThreadPoolExecutor.java:1142)
        at java.util.concurrent.ThreadPoolExecutor$Worker.run(ThreadPoolExecutor.java:617)
        at java.lang.Thread.run(Thread.java:744)
Retrying after 10 seconds
No credentials specified
 > git rev-parse --is-inside-work-tree # timeout=10
Fetching changes from the remote Git repository
 > git config remote.origin.url https://gitbox.apache.org/repos/asf/lucene-solr.git # timeout=10
Fetching upstream changes from https://gitbox.apache.org/repos/asf/lucene-solr.git
 > git --version # timeout=10
 > git fetch --tags --progress https://gitbox.apache.org/repos/asf/lucene-solr.git +refs/heads/*:refs/remotes/origin/*
 > git rev-parse refs/remotes/origin/master^{commit} # timeout=10
 > git rev-parse refs/remotes/origin/origin/master^{commit} # timeout=10
Checking out Revision 9510e06612520b3dd9eaa8ed34ad063ab58954db (refs/remotes/origin/master)
 > git config core.sparsecheckout # timeout=10
 > git checkout -f 9510e06612520b3dd9eaa8ed34ad063ab58954db
Commit message: "SOLR-13742: temporarily disable this assertion while I investigate jenkins failures (the test passes local beasting)."
Cleaning workspace
 > git rev-parse --verify HEAD # timeout=10
Resetting working tree
 > git reset --hard # timeout=10
 > git clean -fdx # timeout=10
Checking out a fresh workspace because /home/jenkins/jenkins-slave/workspace/Lucene-Solr-NightlyTests-master/test-data doesn't exist
Cleaning local Directory test-data
Checking out http://svn.apache.org/repos/asf/lucene/test-data at revision '2019-09-09T00:43:55.058 +0000'
ERROR: Failed to check out http://svn.apache.org/repos/asf/lucene/test-data
org.tmatesoft.svn.core.SVNException: svn: E175002: connection refused by the server
svn: E175002: OPTIONS request failed on '/repos/asf/lucene/test-data'
        at org.tmatesoft.svn.core.internal.wc.SVNErrorManager.error(SVNErrorManager.java:112)
        at org.tmatesoft.svn.core.internal.wc.SVNErrorManager.error(SVNErrorManager.java:96)
        at org.tmatesoft.svn.core.internal.io.dav.http.HTTPConnection.request(HTTPConnection.java:765)
        at org.tmatesoft.svn.core.internal.io.dav.http.HTTPConnection.request(HTTPConnection.java:352)
        at org.tmatesoft.svn.core.internal.io.dav.http.HTTPConnection.request(HTTPConnection.java:340)
        at org.tmatesoft.svn.core.internal.io.dav.DAVConnection.performHttpRequest(DAVConnection.java:910)
        at org.tmatesoft.svn.core.internal.io.dav.DAVConnection.exchangeCapabilities(DAVConnection.java:702)
        at org.tmatesoft.svn.core.internal.io.dav.DAVConnection.open(DAVConnection.java:113)
        at org.tmatesoft.svn.core.internal.io.dav.DAVRepository.openConnection(DAVRepository.java:1035)
        at org.tmatesoft.svn.core.internal.io.dav.DAVRepository.getLatestRevision(DAVRepository.java:164)
        at org.tmatesoft.svn.core.internal.wc2.ng.SvnNgRepositoryAccess.getRevisionNumber(SvnNgRepositoryAccess.java:119)
        at org.tmatesoft.svn.core.internal.wc2.SvnRepositoryAccess.getLocations(SvnRepositoryAccess.java:178)
        at org.tmatesoft.svn.core.internal.wc2.ng.SvnNgRepositoryAccess.createRepositoryFor(SvnNgRepositoryAccess.java:43)
        at org.tmatesoft.svn.core.internal.wc2.ng.SvnNgAbstractUpdate.checkout(SvnNgAbstractUpdate.java:831)
        at org.tmatesoft.svn.core.internal.wc2.ng.SvnNgCheckout.run(SvnNgCheckout.java:26)
        at org.tmatesoft.svn.core.internal.wc2.ng.SvnNgCheckout.run(SvnNgCheckout.java:11)
        at org.tmatesoft.svn.core.internal.wc2.ng.SvnNgOperationRunner.run(SvnNgOperationRunner.java:20)
        at org.tmatesoft.svn.core.internal.wc2.SvnOperationRunner.run(SvnOperationRunner.java:21)
        at org.tmatesoft.svn.core.wc2.SvnOperationFactory.run(SvnOperationFactory.java:1239)
        at org.tmatesoft.svn.core.wc2.SvnOperation.run(SvnOperation.java:294)
        at hudson.scm.subversion.CheckoutUpdater$SubversionUpdateTask.perform(CheckoutUpdater.java:133)
        at hudson.scm.subversion.WorkspaceUpdater$UpdateTask.delegateTo(WorkspaceUpdater.java:168)
        at hudson.scm.subversion.WorkspaceUpdater$UpdateTask.delegateTo(WorkspaceUpdater.java:176)
        at hudson.scm.subversion.UpdateUpdater$TaskImpl.perform(UpdateUpdater.java:134)
        at hudson.scm.subversion.WorkspaceUpdater$UpdateTask.delegateTo(WorkspaceUpdater.java:168)
        at hudson.scm.SubversionSCM$CheckOutTask.perform(SubversionSCM.java:1041)
        at hudson.scm.SubversionSCM$CheckOutTask.invoke(SubversionSCM.java:1017)
        at hudson.scm.SubversionSCM$CheckOutTask.invoke(SubversionSCM.java:990)
        at hudson.FilePath$FileCallableWrapper.call(FilePath.java:3086)
        at hudson.remoting.UserRequest.perform(UserRequest.java:212)
        at hudson.remoting.UserRequest.perform(UserRequest.java:54)
        at hudson.remoting.Request$2.run(Request.java:369)
        at hudson.remoting.InterceptingExecutorService$1.call(InterceptingExecutorService.java:72)
        at java.util.concurrent.FutureTask.run(FutureTask.java:266)
        at java.util.concurrent.ThreadPoolExecutor.runWorker(ThreadPoolExecutor.java:1142)
        at java.util.concurrent.ThreadPoolExecutor$Worker.run(ThreadPoolExecutor.java:617)
        at java.lang.Thread.run(Thread.java:744)
Caused by: java.net.ConnectException: Connection refused
        at java.net.PlainSocketImpl.socketConnect(Native Method)
        at java.net.AbstractPlainSocketImpl.doConnect(AbstractPlainSocketImpl.java:345)
        at java.net.AbstractPlainSocketImpl.connectToAddress(AbstractPlainSocketImpl.java:206)
        at java.net.AbstractPlainSocketImpl.connect(AbstractPlainSocketImpl.java:188)
        at java.net.SocksSocketImpl.connect(SocksSocketImpl.java:392)
        at java.net.Socket.connect(Socket.java:589)
        at org.tmatesoft.svn.core.internal.util.SVNSocketConnection.run(SVNSocketConnection.java:57)
        at java.util.concurrent.Executors$RunnableAdapter.call(Executors.java:511)
        ... 4 more
java.net.ConnectException: Connection refused
        at java.net.PlainSocketImpl.socketConnect(Native Method)
        at java.net.AbstractPlainSocketImpl.doConnect(AbstractPlainSocketImpl.java:345)
        at java.net.AbstractPlainSocketImpl.connectToAddress(AbstractPlainSocketImpl.java:206)
        at java.net.AbstractPlainSocketImpl.connect(AbstractPlainSocketImpl.java:188)
        at java.net.SocksSocketImpl.connect(SocksSocketImpl.java:392)
        at java.net.Socket.connect(Socket.java:589)
        at org.tmatesoft.svn.core.internal.util.SVNSocketConnection.run(SVNSocketConnection.java:57)
        at java.util.concurrent.Executors$RunnableAdapter.call(Executors.java:511)
Caused: org.tmatesoft.svn.core.SVNException: svn: E175002: connection refused by the server
svn: E175002: OPTIONS request failed on '/repos/asf/lucene/test-data'
        at org.tmatesoft.svn.core.internal.wc.SVNErrorManager.error(SVNErrorManager.java:112)
        at org.tmatesoft.svn.core.internal.wc.SVNErrorManager.error(SVNErrorManager.java:96)
        at org.tmatesoft.svn.core.internal.io.dav.http.HTTPConnection.request(HTTPConnection.java:765)
        at org.tmatesoft.svn.core.internal.io.dav.http.HTTPConnection.request(HTTPConnection.java:352)
        at org.tmatesoft.svn.core.internal.io.dav.http.HTTPConnection.request(HTTPConnection.java:340)
        at org.tmatesoft.svn.core.internal.io.dav.DAVConnection.performHttpRequest(DAVConnection.java:910)
        at org.tmatesoft.svn.core.internal.io.dav.DAVConnection.exchangeCapabilities(DAVConnection.java:702)
        at org.tmatesoft.svn.core.internal.io.dav.DAVConnection.open(DAVConnection.java:113)
        at org.tmatesoft.svn.core.internal.io.dav.DAVRepository.openConnection(DAVRepository.java:1035)
        at org.tmatesoft.svn.core.internal.io.dav.DAVRepository.getLatestRevision(DAVRepository.java:164)
        at org.tmatesoft.svn.core.internal.wc2.ng.SvnNgRepositoryAccess.getRevisionNumber(SvnNgRepositoryAccess.java:119)
        at org.tmatesoft.svn.core.internal.wc2.SvnRepositoryAccess.getLocations(SvnRepositoryAccess.java:178)
        at org.tmatesoft.svn.core.internal.wc2.ng.SvnNgRepositoryAccess.createRepositoryFor(SvnNgRepositoryAccess.java:43)
        at org.tmatesoft.svn.core.internal.wc2.ng.SvnNgAbstractUpdate.checkout(SvnNgAbstractUpdate.java:831)
        at org.tmatesoft.svn.core.internal.wc2.ng.SvnNgCheckout.run(SvnNgCheckout.java:26)
        at org.tmatesoft.svn.core.internal.wc2.ng.SvnNgCheckout.run(SvnNgCheckout.java:11)
        at org.tmatesoft.svn.core.internal.wc2.ng.SvnNgOperationRunner.run(SvnNgOperationRunner.java:20)
        at org.tmatesoft.svn.core.internal.wc2.SvnOperationRunner.run(SvnOperationRunner.java:21)
        at org.tmatesoft.svn.core.wc2.SvnOperationFactory.run(SvnOperationFactory.java:1239)
        at org.tmatesoft.svn.core.wc2.SvnOperation.run(SvnOperation.java:294)
        at hudson.scm.subversion.CheckoutUpdater$SubversionUpdateTask.perform(CheckoutUpdater.java:133)
Also:   hudson.remoting.Channel$CallSiteStackTrace: Remote call to lucene
                at hudson.remoting.Channel.attachCallSiteStackTrace(Channel.java:1741)
                at hudson.remoting.UserRequest$ExceptionResponse.retrieve(UserRequest.java:357)
                at hudson.remoting.Channel.call(Channel.java:955)
                at hudson.FilePath.act(FilePath.java:1072)
                at hudson.FilePath.act(FilePath.java:1061)
                at hudson.scm.SubversionSCM.checkout(SubversionSCM.java:937)
                at hudson.scm.SubversionSCM.checkout(SubversionSCM.java:864)
                at org.jenkinsci.plugins.multiplescms.MultiSCM.checkout(MultiSCM.java:143)
                at hudson.scm.SCM.checkout(SCM.java:504)
                at hudson.model.AbstractProject.checkout(AbstractProject.java:1208)
                at hudson.model.AbstractBuild$AbstractBuildExecution.defaultCheckout(AbstractBuild.java:574)
                at jenkins.scm.SCMCheckoutStrategy.checkout(SCMCheckoutStrategy.java:86)
                at hudson.model.AbstractBuild$AbstractBuildExecution.run(AbstractBuild.java:499)
                at hudson.model.Run.execute(Run.java:1810)
                at hudson.model.FreeStyleBuild.run(FreeStyleBuild.java:43)
                at hudson.model.ResourceController.execute(ResourceController.java:97)
                at hudson.model.Executor.run(Executor.java:429)
Caused: java.io.IOException: Failed to check out http://svn.apache.org/repos/asf/lucene/test-data
        at hudson.scm.subversion.CheckoutUpdater$SubversionUpdateTask.perform(CheckoutUpdater.java:144)
        at hudson.scm.subversion.WorkspaceUpdater$UpdateTask.delegateTo(WorkspaceUpdater.java:168)
        at hudson.scm.subversion.WorkspaceUpdater$UpdateTask.delegateTo(WorkspaceUpdater.java:176)
        at hudson.scm.subversion.UpdateUpdater$TaskImpl.perform(UpdateUpdater.java:134)
        at hudson.scm.subversion.WorkspaceUpdater$UpdateTask.delegateTo(WorkspaceUpdater.java:168)
        at hudson.scm.SubversionSCM$CheckOutTask.perform(SubversionSCM.java:1041)
        at hudson.scm.SubversionSCM$CheckOutTask.invoke(SubversionSCM.java:1017)
        at hudson.scm.SubversionSCM$CheckOutTask.invoke(SubversionSCM.java:990)
        at hudson.FilePath$FileCallableWrapper.call(FilePath.java:3086)
        at hudson.remoting.UserRequest.perform(UserRequest.java:212)
        at hudson.remoting.UserRequest.perform(UserRequest.java:54)
        at hudson.remoting.Request$2.run(Request.java:369)
        at hudson.remoting.InterceptingExecutorService$1.call(InterceptingExecutorService.java:72)
        at java.util.concurrent.FutureTask.run(FutureTask.java:266)
        at java.util.concurrent.ThreadPoolExecutor.runWorker(ThreadPoolExecutor.java:1142)
        at java.util.concurrent.ThreadPoolExecutor$Worker.run(ThreadPoolExecutor.java:617)
        at java.lang.Thread.run(Thread.java:744)
Archiving artifacts
Recording test results
ERROR: Step ‘Publish JUnit test result report’ failed: No test report files were found. Configuration error?
Email was triggered for: Failure - Any
Sending email for trigger: Failure - Any


---------------------------------------------------------------------
To unsubscribe, e-mail: [hidden email]
For additional commands, e-mail: [hidden email]
Reply | Threaded
Open this post in threaded view
|

[JENKINS] Lucene-Solr-NightlyTests-master - Build # 1956 - Still Failing

Apache Jenkins Server-2
Build: https://builds.apache.org/job/Lucene-Solr-NightlyTests-master/1956/

5 tests failed.
FAILED:  org.apache.lucene.util.packed.TestPackedInts.testPackedLongValues

Error Message:
Test abandoned because suite timeout was reached.

Stack Trace:
java.lang.Exception: Test abandoned because suite timeout was reached.
        at __randomizedtesting.SeedInfo.seed([D12FE76E4E70426D]:0)


FAILED:  junit.framework.TestSuite.org.apache.lucene.util.packed.TestPackedInts

Error Message:
Suite timeout exceeded (>= 7200000 msec).

Stack Trace:
java.lang.Exception: Suite timeout exceeded (>= 7200000 msec).
        at __randomizedtesting.SeedInfo.seed([D12FE76E4E70426D]:0)


FAILED:  org.apache.solr.cloud.api.collections.ShardSplitTest.testSplitWithChaosMonkey

Error Message:
Address already in use

Stack Trace:
java.net.BindException: Address already in use
        at __randomizedtesting.SeedInfo.seed([CAF547D8F23317BB:41D29409B335BC3F]:0)
        at java.base/sun.nio.ch.Net.bind0(Native Method)
        at java.base/sun.nio.ch.Net.bind(Net.java:461)
        at java.base/sun.nio.ch.Net.bind(Net.java:453)
        at java.base/sun.nio.ch.ServerSocketChannelImpl.bind(ServerSocketChannelImpl.java:227)
        at java.base/sun.nio.ch.ServerSocketAdaptor.bind(ServerSocketAdaptor.java:80)
        at org.eclipse.jetty.server.ServerConnector.openAcceptChannel(ServerConnector.java:342)
        at org.eclipse.jetty.server.ServerConnector.open(ServerConnector.java:308)
        at org.eclipse.jetty.server.AbstractNetworkConnector.doStart(AbstractNetworkConnector.java:80)
        at org.eclipse.jetty.server.ServerConnector.doStart(ServerConnector.java:236)
        at org.eclipse.jetty.util.component.AbstractLifeCycle.start(AbstractLifeCycle.java:68)
        at org.eclipse.jetty.server.Server.doStart(Server.java:396)
        at org.eclipse.jetty.util.component.AbstractLifeCycle.start(AbstractLifeCycle.java:68)
        at org.apache.solr.client.solrj.embedded.JettySolrRunner.retryOnPortBindFailure(JettySolrRunner.java:569)
        at org.apache.solr.client.solrj.embedded.JettySolrRunner.start(JettySolrRunner.java:508)
        at org.apache.solr.client.solrj.embedded.JettySolrRunner.start(JettySolrRunner.java:476)
        at org.apache.solr.cloud.api.collections.ShardSplitTest.testSplitWithChaosMonkey(ShardSplitTest.java:499)
        at java.base/jdk.internal.reflect.NativeMethodAccessorImpl.invoke0(Native Method)
        at java.base/jdk.internal.reflect.NativeMethodAccessorImpl.invoke(NativeMethodAccessorImpl.java:62)
        at java.base/jdk.internal.reflect.DelegatingMethodAccessorImpl.invoke(DelegatingMethodAccessorImpl.java:43)
        at java.base/java.lang.reflect.Method.invoke(Method.java:566)
        at com.carrotsearch.randomizedtesting.RandomizedRunner.invoke(RandomizedRunner.java:1750)
        at com.carrotsearch.randomizedtesting.RandomizedRunner$8.evaluate(RandomizedRunner.java:938)
        at com.carrotsearch.randomizedtesting.RandomizedRunner$9.evaluate(RandomizedRunner.java:974)
        at com.carrotsearch.randomizedtesting.RandomizedRunner$10.evaluate(RandomizedRunner.java:988)
        at org.apache.solr.BaseDistributedSearchTestCase$ShardsRepeatRule$ShardsFixedStatement.callStatement(BaseDistributedSearchTestCase.java:1082)
        at org.apache.solr.BaseDistributedSearchTestCase$ShardsRepeatRule$ShardsStatement.evaluate(BaseDistributedSearchTestCase.java:1054)
        at com.carrotsearch.randomizedtesting.rules.SystemPropertiesRestoreRule$1.evaluate(SystemPropertiesRestoreRule.java:57)
        at org.apache.lucene.util.TestRuleSetupTeardownChained$1.evaluate(TestRuleSetupTeardownChained.java:49)
        at org.apache.lucene.util.AbstractBeforeAfterRule$1.evaluate(AbstractBeforeAfterRule.java:45)
        at org.apache.lucene.util.TestRuleThreadAndTestName$1.evaluate(TestRuleThreadAndTestName.java:48)
        at org.apache.lucene.util.TestRuleIgnoreAfterMaxFailures$1.evaluate(TestRuleIgnoreAfterMaxFailures.java:64)
        at org.apache.lucene.util.TestRuleMarkFailure$1.evaluate(TestRuleMarkFailure.java:47)
        at com.carrotsearch.randomizedtesting.rules.StatementAdapter.evaluate(StatementAdapter.java:36)
        at com.carrotsearch.randomizedtesting.ThreadLeakControl$StatementRunner.run(ThreadLeakControl.java:368)
        at com.carrotsearch.randomizedtesting.ThreadLeakControl.forkTimeoutingTask(ThreadLeakControl.java:817)
        at com.carrotsearch.randomizedtesting.ThreadLeakControl$3.evaluate(ThreadLeakControl.java:468)
        at com.carrotsearch.randomizedtesting.RandomizedRunner.runSingleTest(RandomizedRunner.java:947)
        at com.carrotsearch.randomizedtesting.RandomizedRunner$5.evaluate(RandomizedRunner.java:832)
        at com.carrotsearch.randomizedtesting.RandomizedRunner$6.evaluate(RandomizedRunner.java:883)
        at com.carrotsearch.randomizedtesting.RandomizedRunner$7.evaluate(RandomizedRunner.java:894)
        at com.carrotsearch.randomizedtesting.rules.StatementAdapter.evaluate(StatementAdapter.java:36)
        at com.carrotsearch.randomizedtesting.rules.SystemPropertiesRestoreRule$1.evaluate(SystemPropertiesRestoreRule.java:57)
        at org.apache.lucene.util.AbstractBeforeAfterRule$1.evaluate(AbstractBeforeAfterRule.java:45)
        at com.carrotsearch.randomizedtesting.rules.StatementAdapter.evaluate(StatementAdapter.java:36)
        at org.apache.lucene.util.TestRuleStoreClassName$1.evaluate(TestRuleStoreClassName.java:41)
        at com.carrotsearch.randomizedtesting.rules.NoShadowingOrOverridesOnMethodsRule$1.evaluate(NoShadowingOrOverridesOnMethodsRule.java:40)
        at com.carrotsearch.randomizedtesting.rules.NoShadowingOrOverridesOnMethodsRule$1.evaluate(NoShadowingOrOverridesOnMethodsRule.java:40)
        at com.carrotsearch.randomizedtesting.rules.StatementAdapter.evaluate(StatementAdapter.java:36)
        at com.carrotsearch.randomizedtesting.rules.StatementAdapter.evaluate(StatementAdapter.java:36)
        at org.apache.lucene.util.TestRuleAssertionsRequired$1.evaluate(TestRuleAssertionsRequired.java:53)
        at org.apache.lucene.util.TestRuleMarkFailure$1.evaluate(TestRuleMarkFailure.java:47)
        at org.apache.lucene.util.TestRuleIgnoreAfterMaxFailures$1.evaluate(TestRuleIgnoreAfterMaxFailures.java:64)
        at org.apache.lucene.util.TestRuleIgnoreTestSuites$1.evaluate(TestRuleIgnoreTestSuites.java:54)
        at com.carrotsearch.randomizedtesting.rules.StatementAdapter.evaluate(StatementAdapter.java:36)
        at com.carrotsearch.randomizedtesting.ThreadLeakControl$StatementRunner.run(ThreadLeakControl.java:368)
        at java.base/java.lang.Thread.run(Thread.java:834)


FAILED:  junit.framework.TestSuite.org.apache.solr.cloud.api.collections.ShardSplitTest

Error Message:
10 threads leaked from SUITE scope at org.apache.solr.cloud.api.collections.ShardSplitTest:     1) Thread[id=4808, name=qtp1659353078-4808, state=TIMED_WAITING, group=TGRP-ShardSplitTest]         at java.base@11.0.1/jdk.internal.misc.Unsafe.park(Native Method)         at java.base@11.0.1/java.util.concurrent.locks.LockSupport.parkNanos(LockSupport.java:234)         at java.base@11.0.1/java.util.concurrent.locks.AbstractQueuedSynchronizer$ConditionObject.awaitNanos(AbstractQueuedSynchronizer.java:2123)         at app//org.eclipse.jetty.util.BlockingArrayQueue.poll(BlockingArrayQueue.java:392)         at app//org.eclipse.jetty.util.thread.QueuedThreadPool$Runner.idleJobPoll(QueuedThreadPool.java:850)         at app//org.eclipse.jetty.util.thread.QueuedThreadPool$Runner.run(QueuedThreadPool.java:889)         at java.base@11.0.1/java.lang.Thread.run(Thread.java:834)    2) Thread[id=4804, name=qtp1659353078-4804, state=RUNNABLE, group=TGRP-ShardSplitTest]         at java.base@11.0.1/sun.nio.ch.EPoll.wait(Native Method)         at java.base@11.0.1/sun.nio.ch.EPollSelectorImpl.doSelect(EPollSelectorImpl.java:120)         at java.base@11.0.1/sun.nio.ch.SelectorImpl.lockAndDoSelect(SelectorImpl.java:124)         at java.base@11.0.1/sun.nio.ch.SelectorImpl.select(SelectorImpl.java:141)         at app//org.eclipse.jetty.io.ManagedSelector$SelectorProducer.select(ManagedSelector.java:464)         at app//org.eclipse.jetty.io.ManagedSelector$SelectorProducer.produce(ManagedSelector.java:401)         at app//org.eclipse.jetty.util.thread.strategy.EatWhatYouKill.produceTask(EatWhatYouKill.java:357)         at app//org.eclipse.jetty.util.thread.strategy.EatWhatYouKill.doProduce(EatWhatYouKill.java:181)         at app//org.eclipse.jetty.util.thread.strategy.EatWhatYouKill.tryProduce(EatWhatYouKill.java:168)         at app//org.eclipse.jetty.util.thread.strategy.EatWhatYouKill.produce(EatWhatYouKill.java:132)         at app//org.eclipse.jetty.io.ManagedSelector$$Lambda$202/0x00000001004bf440.run(Unknown Source)         at app//org.eclipse.jetty.util.thread.QueuedThreadPool.runJob(QueuedThreadPool.java:781)         at app//org.eclipse.jetty.util.thread.QueuedThreadPool$Runner.run(QueuedThreadPool.java:917)         at java.base@11.0.1/java.lang.Thread.run(Thread.java:834)    3) Thread[id=4805, name=qtp1659353078-4805-acceptor-0@5246def3-ServerConnector@98522c4{HTTP/1.1,[http/1.1, h2c]}{127.0.0.1:40218}, state=RUNNABLE, group=TGRP-ShardSplitTest]         at java.base@11.0.1/sun.nio.ch.ServerSocketChannelImpl.accept0(Native Method)         at java.base@11.0.1/sun.nio.ch.ServerSocketChannelImpl.accept(ServerSocketChannelImpl.java:533)         at java.base@11.0.1/sun.nio.ch.ServerSocketChannelImpl.accept(ServerSocketChannelImpl.java:285)         at app//org.eclipse.jetty.server.ServerConnector.accept(ServerConnector.java:385)         at app//org.eclipse.jetty.server.AbstractConnector$Acceptor.run(AbstractConnector.java:648)         at app//org.eclipse.jetty.util.thread.QueuedThreadPool.runJob(QueuedThreadPool.java:781)         at app//org.eclipse.jetty.util.thread.QueuedThreadPool$Runner.run(QueuedThreadPool.java:917)         at java.base@11.0.1/java.lang.Thread.run(Thread.java:834)    4) Thread[id=4809, name=qtp1659353078-4809, state=TIMED_WAITING, group=TGRP-ShardSplitTest]         at java.base@11.0.1/jdk.internal.misc.Unsafe.park(Native Method)         at java.base@11.0.1/java.util.concurrent.locks.LockSupport.parkNanos(LockSupport.java:234)         at java.base@11.0.1/java.util.concurrent.locks.AbstractQueuedSynchronizer$ConditionObject.awaitNanos(AbstractQueuedSynchronizer.java:2123)         at app//org.eclipse.jetty.util.BlockingArrayQueue.poll(BlockingArrayQueue.java:392)         at app//org.eclipse.jetty.util.thread.QueuedThreadPool$Runner.idleJobPoll(QueuedThreadPool.java:850)         at app//org.eclipse.jetty.util.thread.QueuedThreadPool$Runner.run(QueuedThreadPool.java:889)         at java.base@11.0.1/java.lang.Thread.run(Thread.java:834)    5) Thread[id=4803, name=qtp1659353078-4803, state=RUNNABLE, group=TGRP-ShardSplitTest]         at java.base@11.0.1/sun.nio.ch.EPoll.wait(Native Method)         at java.base@11.0.1/sun.nio.ch.EPollSelectorImpl.doSelect(EPollSelectorImpl.java:120)         at java.base@11.0.1/sun.nio.ch.SelectorImpl.lockAndDoSelect(SelectorImpl.java:124)         at java.base@11.0.1/sun.nio.ch.SelectorImpl.select(SelectorImpl.java:141)         at app//org.eclipse.jetty.io.ManagedSelector$SelectorProducer.select(ManagedSelector.java:464)         at app//org.eclipse.jetty.io.ManagedSelector$SelectorProducer.produce(ManagedSelector.java:401)         at app//org.eclipse.jetty.util.thread.strategy.EatWhatYouKill.produceTask(EatWhatYouKill.java:357)         at app//org.eclipse.jetty.util.thread.strategy.EatWhatYouKill.doProduce(EatWhatYouKill.java:181)         at app//org.eclipse.jetty.util.thread.strategy.EatWhatYouKill.tryProduce(EatWhatYouKill.java:168)         at app//org.eclipse.jetty.util.thread.strategy.EatWhatYouKill.produce(EatWhatYouKill.java:132)         at app//org.eclipse.jetty.io.ManagedSelector$$Lambda$202/0x00000001004bf440.run(Unknown Source)         at app//org.eclipse.jetty.util.thread.QueuedThreadPool.runJob(QueuedThreadPool.java:781)         at app//org.eclipse.jetty.util.thread.QueuedThreadPool$Runner.run(QueuedThreadPool.java:917)         at java.base@11.0.1/java.lang.Thread.run(Thread.java:834)    6) Thread[id=4806, name=qtp1659353078-4806, state=TIMED_WAITING, group=TGRP-ShardSplitTest]         at java.base@11.0.1/jdk.internal.misc.Unsafe.park(Native Method)         at java.base@11.0.1/java.util.concurrent.locks.LockSupport.parkNanos(LockSupport.java:234)         at java.base@11.0.1/java.util.concurrent.locks.AbstractQueuedSynchronizer$ConditionObject.awaitNanos(AbstractQueuedSynchronizer.java:2123)         at app//org.eclipse.jetty.util.BlockingArrayQueue.poll(BlockingArrayQueue.java:392)         at app//org.eclipse.jetty.util.thread.QueuedThreadPool$Runner.idleJobPoll(QueuedThreadPool.java:850)         at app//org.eclipse.jetty.util.thread.QueuedThreadPool$Runner.run(QueuedThreadPool.java:889)         at java.base@11.0.1/java.lang.Thread.run(Thread.java:834)    7) Thread[id=4811, name=Session-HouseKeeper-7f7ea5bd, state=TIMED_WAITING, group=TGRP-ShardSplitTest]         at java.base@11.0.1/jdk.internal.misc.Unsafe.park(Native Method)         at java.base@11.0.1/java.util.concurrent.locks.LockSupport.parkNanos(LockSupport.java:234)         at java.base@11.0.1/java.util.concurrent.locks.AbstractQueuedSynchronizer$ConditionObject.awaitNanos(AbstractQueuedSynchronizer.java:2123)         at java.base@11.0.1/java.util.concurrent.ScheduledThreadPoolExecutor$DelayedWorkQueue.take(ScheduledThreadPoolExecutor.java:1182)         at java.base@11.0.1/java.util.concurrent.ScheduledThreadPoolExecutor$DelayedWorkQueue.take(ScheduledThreadPoolExecutor.java:899)         at java.base@11.0.1/java.util.concurrent.ThreadPoolExecutor.getTask(ThreadPoolExecutor.java:1054)         at java.base@11.0.1/java.util.concurrent.ThreadPoolExecutor.runWorker(ThreadPoolExecutor.java:1114)         at java.base@11.0.1/java.util.concurrent.ThreadPoolExecutor$Worker.run(ThreadPoolExecutor.java:628)         at java.base@11.0.1/java.lang.Thread.run(Thread.java:834)    8) Thread[id=4852, name=Connector-Scheduler-98522c4, state=WAITING, group=TGRP-ShardSplitTest]         at java.base@11.0.1/jdk.internal.misc.Unsafe.park(Native Method)         at java.base@11.0.1/java.util.concurrent.locks.LockSupport.park(LockSupport.java:194)         at java.base@11.0.1/java.util.concurrent.locks.AbstractQueuedSynchronizer$ConditionObject.await(AbstractQueuedSynchronizer.java:2081)         at java.base@11.0.1/java.util.concurrent.ScheduledThreadPoolExecutor$DelayedWorkQueue.take(ScheduledThreadPoolExecutor.java:1170)         at java.base@11.0.1/java.util.concurrent.ScheduledThreadPoolExecutor$DelayedWorkQueue.take(ScheduledThreadPoolExecutor.java:899)         at java.base@11.0.1/java.util.concurrent.ThreadPoolExecutor.getTask(ThreadPoolExecutor.java:1054)         at java.base@11.0.1/java.util.concurrent.ThreadPoolExecutor.runWorker(ThreadPoolExecutor.java:1114)         at java.base@11.0.1/java.util.concurrent.ThreadPoolExecutor$Worker.run(ThreadPoolExecutor.java:628)         at java.base@11.0.1/java.lang.Thread.run(Thread.java:834)    9) Thread[id=4807, name=qtp1659353078-4807, state=TIMED_WAITING, group=TGRP-ShardSplitTest]         at java.base@11.0.1/jdk.internal.misc.Unsafe.park(Native Method)         at java.base@11.0.1/java.util.concurrent.locks.LockSupport.parkNanos(LockSupport.java:234)         at java.base@11.0.1/java.util.concurrent.locks.AbstractQueuedSynchronizer$ConditionObject.awaitNanos(AbstractQueuedSynchronizer.java:2123)         at app//org.eclipse.jetty.util.BlockingArrayQueue.poll(BlockingArrayQueue.java:392)         at app//org.eclipse.jetty.util.thread.QueuedThreadPool$Runner.idleJobPoll(QueuedThreadPool.java:850)         at app//org.eclipse.jetty.util.thread.QueuedThreadPool$Runner.run(QueuedThreadPool.java:889)         at java.base@11.0.1/java.lang.Thread.run(Thread.java:834)   10) Thread[id=4810, name=qtp1659353078-4810, state=TIMED_WAITING, group=TGRP-ShardSplitTest]         at java.base@11.0.1/jdk.internal.misc.Unsafe.park(Native Method)         at java.base@11.0.1/java.util.concurrent.locks.LockSupport.parkNanos(LockSupport.java:234)         at java.base@11.0.1/java.util.concurrent.locks.AbstractQueuedSynchronizer$ConditionObject.awaitNanos(AbstractQueuedSynchronizer.java:2123)         at app//org.eclipse.jetty.util.BlockingArrayQueue.poll(BlockingArrayQueue.java:392)         at app//org.eclipse.jetty.util.thread.QueuedThreadPool$Runner.idleJobPoll(QueuedThreadPool.java:850)         at app//org.eclipse.jetty.util.thread.QueuedThreadPool$Runner.run(QueuedThreadPool.java:889)         at java.base@11.0.1/java.lang.Thread.run(Thread.java:834)

Stack Trace:
com.carrotsearch.randomizedtesting.ThreadLeakError: 10 threads leaked from SUITE scope at org.apache.solr.cloud.api.collections.ShardSplitTest:
   1) Thread[id=4808, name=qtp1659353078-4808, state=TIMED_WAITING, group=TGRP-ShardSplitTest]
        at java.base@11.0.1/jdk.internal.misc.Unsafe.park(Native Method)
        at java.base@11.0.1/java.util.concurrent.locks.LockSupport.parkNanos(LockSupport.java:234)
        at java.base@11.0.1/java.util.concurrent.locks.AbstractQueuedSynchronizer$ConditionObject.awaitNanos(AbstractQueuedSynchronizer.java:2123)
        at app//org.eclipse.jetty.util.BlockingArrayQueue.poll(BlockingArrayQueue.java:392)
        at app//org.eclipse.jetty.util.thread.QueuedThreadPool$Runner.idleJobPoll(QueuedThreadPool.java:850)
        at app//org.eclipse.jetty.util.thread.QueuedThreadPool$Runner.run(QueuedThreadPool.java:889)
        at java.base@11.0.1/java.lang.Thread.run(Thread.java:834)
   2) Thread[id=4804, name=qtp1659353078-4804, state=RUNNABLE, group=TGRP-ShardSplitTest]
        at java.base@11.0.1/sun.nio.ch.EPoll.wait(Native Method)
        at java.base@11.0.1/sun.nio.ch.EPollSelectorImpl.doSelect(EPollSelectorImpl.java:120)
        at java.base@11.0.1/sun.nio.ch.SelectorImpl.lockAndDoSelect(SelectorImpl.java:124)
        at java.base@11.0.1/sun.nio.ch.SelectorImpl.select(SelectorImpl.java:141)
        at app//org.eclipse.jetty.io.ManagedSelector$SelectorProducer.select(ManagedSelector.java:464)
        at app//org.eclipse.jetty.io.ManagedSelector$SelectorProducer.produce(ManagedSelector.java:401)
        at app//org.eclipse.jetty.util.thread.strategy.EatWhatYouKill.produceTask(EatWhatYouKill.java:357)
        at app//org.eclipse.jetty.util.thread.strategy.EatWhatYouKill.doProduce(EatWhatYouKill.java:181)
        at app//org.eclipse.jetty.util.thread.strategy.EatWhatYouKill.tryProduce(EatWhatYouKill.java:168)
        at app//org.eclipse.jetty.util.thread.strategy.EatWhatYouKill.produce(EatWhatYouKill.java:132)
        at app//org.eclipse.jetty.io.ManagedSelector$$Lambda$202/0x00000001004bf440.run(Unknown Source)
        at app//org.eclipse.jetty.util.thread.QueuedThreadPool.runJob(QueuedThreadPool.java:781)
        at app//org.eclipse.jetty.util.thread.QueuedThreadPool$Runner.run(QueuedThreadPool.java:917)
        at java.base@11.0.1/java.lang.Thread.run(Thread.java:834)
   3) Thread[id=4805, name=qtp1659353078-4805-acceptor-0@5246def3-ServerConnector@98522c4{HTTP/1.1,[http/1.1, h2c]}{127.0.0.1:40218}, state=RUNNABLE, group=TGRP-ShardSplitTest]
        at java.base@11.0.1/sun.nio.ch.ServerSocketChannelImpl.accept0(Native Method)
        at java.base@11.0.1/sun.nio.ch.ServerSocketChannelImpl.accept(ServerSocketChannelImpl.java:533)
        at java.base@11.0.1/sun.nio.ch.ServerSocketChannelImpl.accept(ServerSocketChannelImpl.java:285)
        at app//org.eclipse.jetty.server.ServerConnector.accept(ServerConnector.java:385)
        at app//org.eclipse.jetty.server.AbstractConnector$Acceptor.run(AbstractConnector.java:648)
        at app//org.eclipse.jetty.util.thread.QueuedThreadPool.runJob(QueuedThreadPool.java:781)
        at app//org.eclipse.jetty.util.thread.QueuedThreadPool$Runner.run(QueuedThreadPool.java:917)
        at java.base@11.0.1/java.lang.Thread.run(Thread.java:834)
   4) Thread[id=4809, name=qtp1659353078-4809, state=TIMED_WAITING, group=TGRP-ShardSplitTest]
        at java.base@11.0.1/jdk.internal.misc.Unsafe.park(Native Method)
        at java.base@11.0.1/java.util.concurrent.locks.LockSupport.parkNanos(LockSupport.java:234)
        at java.base@11.0.1/java.util.concurrent.locks.AbstractQueuedSynchronizer$ConditionObject.awaitNanos(AbstractQueuedSynchronizer.java:2123)
        at app//org.eclipse.jetty.util.BlockingArrayQueue.poll(BlockingArrayQueue.java:392)
        at app//org.eclipse.jetty.util.thread.QueuedThreadPool$Runner.idleJobPoll(QueuedThreadPool.java:850)
        at app//org.eclipse.jetty.util.thread.QueuedThreadPool$Runner.run(QueuedThreadPool.java:889)
        at java.base@11.0.1/java.lang.Thread.run(Thread.java:834)
   5) Thread[id=4803, name=qtp1659353078-4803, state=RUNNABLE, group=TGRP-ShardSplitTest]
        at java.base@11.0.1/sun.nio.ch.EPoll.wait(Native Method)
        at java.base@11.0.1/sun.nio.ch.EPollSelectorImpl.doSelect(EPollSelectorImpl.java:120)
        at java.base@11.0.1/sun.nio.ch.SelectorImpl.lockAndDoSelect(SelectorImpl.java:124)
        at java.base@11.0.1/sun.nio.ch.SelectorImpl.select(SelectorImpl.java:141)
        at app//org.eclipse.jetty.io.ManagedSelector$SelectorProducer.select(ManagedSelector.java:464)
        at app//org.eclipse.jetty.io.ManagedSelector$SelectorProducer.produce(ManagedSelector.java:401)
        at app//org.eclipse.jetty.util.thread.strategy.EatWhatYouKill.produceTask(EatWhatYouKill.java:357)
        at app//org.eclipse.jetty.util.thread.strategy.EatWhatYouKill.doProduce(EatWhatYouKill.java:181)
        at app//org.eclipse.jetty.util.thread.strategy.EatWhatYouKill.tryProduce(EatWhatYouKill.java:168)
        at app//org.eclipse.jetty.util.thread.strategy.EatWhatYouKill.produce(EatWhatYouKill.java:132)
        at app//org.eclipse.jetty.io.ManagedSelector$$Lambda$202/0x00000001004bf440.run(Unknown Source)
        at app//org.eclipse.jetty.util.thread.QueuedThreadPool.runJob(QueuedThreadPool.java:781)
        at app//org.eclipse.jetty.util.thread.QueuedThreadPool$Runner.run(QueuedThreadPool.java:917)
        at java.base@11.0.1/java.lang.Thread.run(Thread.java:834)
   6) Thread[id=4806, name=qtp1659353078-4806, state=TIMED_WAITING, group=TGRP-ShardSplitTest]
        at java.base@11.0.1/jdk.internal.misc.Unsafe.park(Native Method)
        at java.base@11.0.1/java.util.concurrent.locks.LockSupport.parkNanos(LockSupport.java:234)
        at java.base@11.0.1/java.util.concurrent.locks.AbstractQueuedSynchronizer$ConditionObject.awaitNanos(AbstractQueuedSynchronizer.java:2123)
        at app//org.eclipse.jetty.util.BlockingArrayQueue.poll(BlockingArrayQueue.java:392)
        at app//org.eclipse.jetty.util.thread.QueuedThreadPool$Runner.idleJobPoll(QueuedThreadPool.java:850)
        at app//org.eclipse.jetty.util.thread.QueuedThreadPool$Runner.run(QueuedThreadPool.java:889)
        at java.base@11.0.1/java.lang.Thread.run(Thread.java:834)
   7) Thread[id=4811, name=Session-HouseKeeper-7f7ea5bd, state=TIMED_WAITING, group=TGRP-ShardSplitTest]
        at java.base@11.0.1/jdk.internal.misc.Unsafe.park(Native Method)
        at java.base@11.0.1/java.util.concurrent.locks.LockSupport.parkNanos(LockSupport.java:234)
        at java.base@11.0.1/java.util.concurrent.locks.AbstractQueuedSynchronizer$ConditionObject.awaitNanos(AbstractQueuedSynchronizer.java:2123)
        at java.base@11.0.1/java.util.concurrent.ScheduledThreadPoolExecutor$DelayedWorkQueue.take(ScheduledThreadPoolExecutor.java:1182)
        at java.base@11.0.1/java.util.concurrent.ScheduledThreadPoolExecutor$DelayedWorkQueue.take(ScheduledThreadPoolExecutor.java:899)
        at java.base@11.0.1/java.util.concurrent.ThreadPoolExecutor.getTask(ThreadPoolExecutor.java:1054)
        at java.base@11.0.1/java.util.concurrent.ThreadPoolExecutor.runWorker(ThreadPoolExecutor.java:1114)
        at java.base@11.0.1/java.util.concurrent.ThreadPoolExecutor$Worker.run(ThreadPoolExecutor.java:628)
        at java.base@11.0.1/java.lang.Thread.run(Thread.java:834)
   8) Thread[id=4852, name=Connector-Scheduler-98522c4, state=WAITING, group=TGRP-ShardSplitTest]
        at java.base@11.0.1/jdk.internal.misc.Unsafe.park(Native Method)
        at java.base@11.0.1/java.util.concurrent.locks.LockSupport.park(LockSupport.java:194)
        at java.base@11.0.1/java.util.concurrent.locks.AbstractQueuedSynchronizer$ConditionObject.await(AbstractQueuedSynchronizer.java:2081)
        at java.base@11.0.1/java.util.concurrent.ScheduledThreadPoolExecutor$DelayedWorkQueue.take(ScheduledThreadPoolExecutor.java:1170)
        at java.base@11.0.1/java.util.concurrent.ScheduledThreadPoolExecutor$DelayedWorkQueue.take(ScheduledThreadPoolExecutor.java:899)
        at java.base@11.0.1/java.util.concurrent.ThreadPoolExecutor.getTask(ThreadPoolExecutor.java:1054)
        at java.base@11.0.1/java.util.concurrent.ThreadPoolExecutor.runWorker(ThreadPoolExecutor.java:1114)
        at java.base@11.0.1/java.util.concurrent.ThreadPoolExecutor$Worker.run(ThreadPoolExecutor.java:628)
        at java.base@11.0.1/java.lang.Thread.run(Thread.java:834)
   9) Thread[id=4807, name=qtp1659353078-4807, state=TIMED_WAITING, group=TGRP-ShardSplitTest]
        at java.base@11.0.1/jdk.internal.misc.Unsafe.park(Native Method)
        at java.base@11.0.1/java.util.concurrent.locks.LockSupport.parkNanos(LockSupport.java:234)
        at java.base@11.0.1/java.util.concurrent.locks.AbstractQueuedSynchronizer$ConditionObject.awaitNanos(AbstractQueuedSynchronizer.java:2123)
        at app//org.eclipse.jetty.util.BlockingArrayQueue.poll(BlockingArrayQueue.java:392)
        at app//org.eclipse.jetty.util.thread.QueuedThreadPool$Runner.idleJobPoll(QueuedThreadPool.java:850)
        at app//org.eclipse.jetty.util.thread.QueuedThreadPool$Runner.run(QueuedThreadPool.java:889)
        at java.base@11.0.1/java.lang.Thread.run(Thread.java:834)
  10) Thread[id=4810, name=qtp1659353078-4810, state=TIMED_WAITING, group=TGRP-ShardSplitTest]
        at java.base@11.0.1/jdk.internal.misc.Unsafe.park(Native Method)
        at java.base@11.0.1/java.util.concurrent.locks.LockSupport.parkNanos(LockSupport.java:234)
        at java.base@11.0.1/java.util.concurrent.locks.AbstractQueuedSynchronizer$ConditionObject.awaitNanos(AbstractQueuedSynchronizer.java:2123)
        at app//org.eclipse.jetty.util.BlockingArrayQueue.poll(BlockingArrayQueue.java:392)
        at app//org.eclipse.jetty.util.thread.QueuedThreadPool$Runner.idleJobPoll(QueuedThreadPool.java:850)
        at app//org.eclipse.jetty.util.thread.QueuedThreadPool$Runner.run(QueuedThreadPool.java:889)
        at java.base@11.0.1/java.lang.Thread.run(Thread.java:834)
        at __randomizedtesting.SeedInfo.seed([CAF547D8F23317BB]:0)


FAILED:  junit.framework.TestSuite.org.apache.solr.cloud.api.collections.ShardSplitTest

Error Message:
There are still zombie threads that couldn't be terminated:    1) Thread[id=4808, name=qtp1659353078-4808, state=TIMED_WAITING, group=TGRP-ShardSplitTest]         at java.base@11.0.1/jdk.internal.misc.Unsafe.park(Native Method)         at java.base@11.0.1/java.util.concurrent.locks.LockSupport.parkNanos(LockSupport.java:234)         at java.base@11.0.1/java.util.concurrent.locks.AbstractQueuedSynchronizer$ConditionObject.awaitNanos(AbstractQueuedSynchronizer.java:2123)         at app//org.eclipse.jetty.util.BlockingArrayQueue.poll(BlockingArrayQueue.java:392)         at app//org.eclipse.jetty.util.thread.QueuedThreadPool$Runner.idleJobPoll(QueuedThreadPool.java:850)         at app//org.eclipse.jetty.util.thread.QueuedThreadPool$Runner.run(QueuedThreadPool.java:889)         at java.base@11.0.1/java.lang.Thread.run(Thread.java:834)    2) Thread[id=4804, name=qtp1659353078-4804, state=RUNNABLE, group=TGRP-ShardSplitTest]         at java.base@11.0.1/sun.nio.ch.EPoll.wait(Native Method)         at java.base@11.0.1/sun.nio.ch.EPollSelectorImpl.doSelect(EPollSelectorImpl.java:120)         at java.base@11.0.1/sun.nio.ch.SelectorImpl.lockAndDoSelect(SelectorImpl.java:124)         at java.base@11.0.1/sun.nio.ch.SelectorImpl.select(SelectorImpl.java:141)         at app//org.eclipse.jetty.io.ManagedSelector$SelectorProducer.select(ManagedSelector.java:464)         at app//org.eclipse.jetty.io.ManagedSelector$SelectorProducer.produce(ManagedSelector.java:401)         at app//org.eclipse.jetty.util.thread.strategy.EatWhatYouKill.produceTask(EatWhatYouKill.java:357)         at app//org.eclipse.jetty.util.thread.strategy.EatWhatYouKill.doProduce(EatWhatYouKill.java:181)         at app//org.eclipse.jetty.util.thread.strategy.EatWhatYouKill.tryProduce(EatWhatYouKill.java:168)         at app//org.eclipse.jetty.util.thread.strategy.EatWhatYouKill.produce(EatWhatYouKill.java:132)         at app//org.eclipse.jetty.io.ManagedSelector$$Lambda$202/0x00000001004bf440.run(Unknown Source)         at app//org.eclipse.jetty.util.thread.QueuedThreadPool.runJob(QueuedThreadPool.java:781)         at app//org.eclipse.jetty.util.thread.QueuedThreadPool$Runner.run(QueuedThreadPool.java:917)         at java.base@11.0.1/java.lang.Thread.run(Thread.java:834)    3) Thread[id=4805, name=qtp1659353078-4805, state=TIMED_WAITING, group=TGRP-ShardSplitTest]         at java.base@11.0.1/jdk.internal.misc.Unsafe.park(Native Method)         at java.base@11.0.1/java.util.concurrent.locks.LockSupport.parkNanos(LockSupport.java:234)         at java.base@11.0.1/java.util.concurrent.locks.AbstractQueuedSynchronizer$ConditionObject.awaitNanos(AbstractQueuedSynchronizer.java:2123)         at app//org.eclipse.jetty.util.BlockingArrayQueue.poll(BlockingArrayQueue.java:392)         at app//org.eclipse.jetty.util.thread.QueuedThreadPool$Runner.idleJobPoll(QueuedThreadPool.java:850)         at app//org.eclipse.jetty.util.thread.QueuedThreadPool$Runner.run(QueuedThreadPool.java:889)         at java.base@11.0.1/java.lang.Thread.run(Thread.java:834)    4) Thread[id=4809, name=qtp1659353078-4809, state=TIMED_WAITING, group=TGRP-ShardSplitTest]         at java.base@11.0.1/jdk.internal.misc.Unsafe.park(Native Method)         at java.base@11.0.1/java.util.concurrent.locks.LockSupport.parkNanos(LockSupport.java:234)         at java.base@11.0.1/java.util.concurrent.locks.AbstractQueuedSynchronizer$ConditionObject.awaitNanos(AbstractQueuedSynchronizer.java:2123)         at app//org.eclipse.jetty.util.BlockingArrayQueue.poll(BlockingArrayQueue.java:392)         at app//org.eclipse.jetty.util.thread.QueuedThreadPool$Runner.idleJobPoll(QueuedThreadPool.java:850)         at app//org.eclipse.jetty.util.thread.QueuedThreadPool$Runner.run(QueuedThreadPool.java:889)         at java.base@11.0.1/java.lang.Thread.run(Thread.java:834)    5) Thread[id=4803, name=qtp1659353078-4803, state=RUNNABLE, group=TGRP-ShardSplitTest]         at java.base@11.0.1/sun.nio.ch.EPoll.wait(Native Method)         at java.base@11.0.1/sun.nio.ch.EPollSelectorImpl.doSelect(EPollSelectorImpl.java:120)         at java.base@11.0.1/sun.nio.ch.SelectorImpl.lockAndDoSelect(SelectorImpl.java:124)         at java.base@11.0.1/sun.nio.ch.SelectorImpl.select(SelectorImpl.java:141)         at app//org.eclipse.jetty.io.ManagedSelector$SelectorProducer.select(ManagedSelector.java:464)         at app//org.eclipse.jetty.io.ManagedSelector$SelectorProducer.produce(ManagedSelector.java:401)         at app//org.eclipse.jetty.util.thread.strategy.EatWhatYouKill.produceTask(EatWhatYouKill.java:357)         at app//org.eclipse.jetty.util.thread.strategy.EatWhatYouKill.doProduce(EatWhatYouKill.java:181)         at app//org.eclipse.jetty.util.thread.strategy.EatWhatYouKill.tryProduce(EatWhatYouKill.java:168)         at app//org.eclipse.jetty.util.thread.strategy.EatWhatYouKill.produce(EatWhatYouKill.java:132)         at app//org.eclipse.jetty.io.ManagedSelector$$Lambda$202/0x00000001004bf440.run(Unknown Source)         at app//org.eclipse.jetty.util.thread.QueuedThreadPool.runJob(QueuedThreadPool.java:781)         at app//org.eclipse.jetty.util.thread.QueuedThreadPool$Runner.run(QueuedThreadPool.java:917)         at java.base@11.0.1/java.lang.Thread.run(Thread.java:834)    6) Thread[id=4806, name=qtp1659353078-4806, state=TIMED_WAITING, group=TGRP-ShardSplitTest]         at java.base@11.0.1/jdk.internal.misc.Unsafe.park(Native Method)         at java.base@11.0.1/java.util.concurrent.locks.LockSupport.parkNanos(LockSupport.java:234)         at java.base@11.0.1/java.util.concurrent.locks.AbstractQueuedSynchronizer$ConditionObject.awaitNanos(AbstractQueuedSynchronizer.java:2123)         at app//org.eclipse.jetty.util.BlockingArrayQueue.poll(BlockingArrayQueue.java:392)         at app//org.eclipse.jetty.util.thread.QueuedThreadPool$Runner.idleJobPoll(QueuedThreadPool.java:850)         at app//org.eclipse.jetty.util.thread.QueuedThreadPool$Runner.run(QueuedThreadPool.java:889)         at java.base@11.0.1/java.lang.Thread.run(Thread.java:834)    7) Thread[id=4811, name=Session-HouseKeeper-7f7ea5bd, state=TIMED_WAITING, group=TGRP-ShardSplitTest]         at java.base@11.0.1/jdk.internal.misc.Unsafe.park(Native Method)         at java.base@11.0.1/java.util.concurrent.locks.LockSupport.parkNanos(LockSupport.java:234)         at java.base@11.0.1/java.util.concurrent.locks.AbstractQueuedSynchronizer$ConditionObject.awaitNanos(AbstractQueuedSynchronizer.java:2123)         at java.base@11.0.1/java.util.concurrent.ScheduledThreadPoolExecutor$DelayedWorkQueue.take(ScheduledThreadPoolExecutor.java:1182)         at java.base@11.0.1/java.util.concurrent.ScheduledThreadPoolExecutor$DelayedWorkQueue.take(ScheduledThreadPoolExecutor.java:899)         at java.base@11.0.1/java.util.concurrent.ThreadPoolExecutor.getTask(ThreadPoolExecutor.java:1054)         at java.base@11.0.1/java.util.concurrent.ThreadPoolExecutor.runWorker(ThreadPoolExecutor.java:1114)         at java.base@11.0.1/java.util.concurrent.ThreadPoolExecutor$Worker.run(ThreadPoolExecutor.java:628)         at java.base@11.0.1/java.lang.Thread.run(Thread.java:834)    8) Thread[id=4852, name=Connector-Scheduler-98522c4, state=WAITING, group=TGRP-ShardSplitTest]         at java.base@11.0.1/jdk.internal.misc.Unsafe.park(Native Method)         at java.base@11.0.1/java.util.concurrent.locks.LockSupport.park(LockSupport.java:194)         at java.base@11.0.1/java.util.concurrent.locks.AbstractQueuedSynchronizer$ConditionObject.await(AbstractQueuedSynchronizer.java:2081)         at java.base@11.0.1/java.util.concurrent.ScheduledThreadPoolExecutor$DelayedWorkQueue.take(ScheduledThreadPoolExecutor.java:1170)         at java.base@11.0.1/java.util.concurrent.ScheduledThreadPoolExecutor$DelayedWorkQueue.take(ScheduledThreadPoolExecutor.java:899)         at java.base@11.0.1/java.util.concurrent.ThreadPoolExecutor.getTask(ThreadPoolExecutor.java:1054)         at java.base@11.0.1/java.util.concurrent.ThreadPoolExecutor.runWorker(ThreadPoolExecutor.java:1114)         at java.base@11.0.1/java.util.concurrent.ThreadPoolExecutor$Worker.run(ThreadPoolExecutor.java:628)         at java.base@11.0.1/java.lang.Thread.run(Thread.java:834)    9) Thread[id=4807, name=qtp1659353078-4807, state=TIMED_WAITING, group=TGRP-ShardSplitTest]         at java.base@11.0.1/jdk.internal.misc.Unsafe.park(Native Method)         at java.base@11.0.1/java.util.concurrent.locks.LockSupport.parkNanos(LockSupport.java:234)         at java.base@11.0.1/java.util.concurrent.locks.AbstractQueuedSynchronizer$ConditionObject.awaitNanos(AbstractQueuedSynchronizer.java:2123)         at app//org.eclipse.jetty.util.BlockingArrayQueue.poll(BlockingArrayQueue.java:392)         at app//org.eclipse.jetty.util.thread.QueuedThreadPool$Runner.idleJobPoll(QueuedThreadPool.java:850)         at app//org.eclipse.jetty.util.thread.QueuedThreadPool$Runner.run(QueuedThreadPool.java:889)         at java.base@11.0.1/java.lang.Thread.run(Thread.java:834)   10) Thread[id=4810, name=qtp1659353078-4810, state=TIMED_WAITING, group=TGRP-ShardSplitTest]         at java.base@11.0.1/jdk.internal.misc.Unsafe.park(Native Method)         at java.base@11.0.1/java.util.concurrent.locks.LockSupport.parkNanos(LockSupport.java:234)         at java.base@11.0.1/java.util.concurrent.locks.AbstractQueuedSynchronizer$ConditionObject.awaitNanos(AbstractQueuedSynchronizer.java:2123)         at app//org.eclipse.jetty.util.BlockingArrayQueue.poll(BlockingArrayQueue.java:392)         at app//org.eclipse.jetty.util.thread.QueuedThreadPool$Runner.idleJobPoll(QueuedThreadPool.java:850)         at app//org.eclipse.jetty.util.thread.QueuedThreadPool$Runner.run(QueuedThreadPool.java:889)         at java.base@11.0.1/java.lang.Thread.run(Thread.java:834)

Stack Trace:
com.carrotsearch.randomizedtesting.ThreadLeakError: There are still zombie threads that couldn't be terminated:
   1) Thread[id=4808, name=qtp1659353078-4808, state=TIMED_WAITING, group=TGRP-ShardSplitTest]
        at java.base@11.0.1/jdk.internal.misc.Unsafe.park(Native Method)
        at java.base@11.0.1/java.util.concurrent.locks.LockSupport.parkNanos(LockSupport.java:234)
        at java.base@11.0.1/java.util.concurrent.locks.AbstractQueuedSynchronizer$ConditionObject.awaitNanos(AbstractQueuedSynchronizer.java:2123)
        at app//org.eclipse.jetty.util.BlockingArrayQueue.poll(BlockingArrayQueue.java:392)
        at app//org.eclipse.jetty.util.thread.QueuedThreadPool$Runner.idleJobPoll(QueuedThreadPool.java:850)
        at app//org.eclipse.jetty.util.thread.QueuedThreadPool$Runner.run(QueuedThreadPool.java:889)
        at java.base@11.0.1/java.lang.Thread.run(Thread.java:834)
   2) Thread[id=4804, name=qtp1659353078-4804, state=RUNNABLE, group=TGRP-ShardSplitTest]
        at java.base@11.0.1/sun.nio.ch.EPoll.wait(Native Method)
        at java.base@11.0.1/sun.nio.ch.EPollSelectorImpl.doSelect(EPollSelectorImpl.java:120)
        at java.base@11.0.1/sun.nio.ch.SelectorImpl.lockAndDoSelect(SelectorImpl.java:124)
        at java.base@11.0.1/sun.nio.ch.SelectorImpl.select(SelectorImpl.java:141)
        at app//org.eclipse.jetty.io.ManagedSelector$SelectorProducer.select(ManagedSelector.java:464)
        at app//org.eclipse.jetty.io.ManagedSelector$SelectorProducer.produce(ManagedSelector.java:401)
        at app//org.eclipse.jetty.util.thread.strategy.EatWhatYouKill.produceTask(EatWhatYouKill.java:357)
        at app//org.eclipse.jetty.util.thread.strategy.EatWhatYouKill.doProduce(EatWhatYouKill.java:181)
        at app//org.eclipse.jetty.util.thread.strategy.EatWhatYouKill.tryProduce(EatWhatYouKill.java:168)
        at app//org.eclipse.jetty.util.thread.strategy.EatWhatYouKill.produce(EatWhatYouKill.java:132)
        at app//org.eclipse.jetty.io.ManagedSelector$$Lambda$202/0x00000001004bf440.run(Unknown Source)
        at app//org.eclipse.jetty.util.thread.QueuedThreadPool.runJob(QueuedThreadPool.java:781)
        at app//org.eclipse.jetty.util.thread.QueuedThreadPool$Runner.run(QueuedThreadPool.java:917)
        at java.base@11.0.1/java.lang.Thread.run(Thread.java:834)
   3) Thread[id=4805, name=qtp1659353078-4805, state=TIMED_WAITING, group=TGRP-ShardSplitTest]
        at java.base@11.0.1/jdk.internal.misc.Unsafe.park(Native Method)
        at java.base@11.0.1/java.util.concurrent.locks.LockSupport.parkNanos(LockSupport.java:234)
        at java.base@11.0.1/java.util.concurrent.locks.AbstractQueuedSynchronizer$ConditionObject.awaitNanos(AbstractQueuedSynchronizer.java:2123)
        at app//org.eclipse.jetty.util.BlockingArrayQueue.poll(BlockingArrayQueue.java:392)
        at app//org.eclipse.jetty.util.thread.QueuedThreadPool$Runner.idleJobPoll(QueuedThreadPool.java:850)
        at app//org.eclipse.jetty.util.thread.QueuedThreadPool$Runner.run(QueuedThreadPool.java:889)
        at java.base@11.0.1/java.lang.Thread.run(Thread.java:834)
   4) Thread[id=4809, name=qtp1659353078-4809, state=TIMED_WAITING, group=TGRP-ShardSplitTest]
        at java.base@11.0.1/jdk.internal.misc.Unsafe.park(Native Method)
        at java.base@11.0.1/java.util.concurrent.locks.LockSupport.parkNanos(LockSupport.java:234)
        at java.base@11.0.1/java.util.concurrent.locks.AbstractQueuedSynchronizer$ConditionObject.awaitNanos(AbstractQueuedSynchronizer.java:2123)
        at app//org.eclipse.jetty.util.BlockingArrayQueue.poll(BlockingArrayQueue.java:392)
        at app//org.eclipse.jetty.util.thread.QueuedThreadPool$Runner.idleJobPoll(QueuedThreadPool.java:850)
        at app//org.eclipse.jetty.util.thread.QueuedThreadPool$Runner.run(QueuedThreadPool.java:889)
        at java.base@11.0.1/java.lang.Thread.run(Thread.java:834)
   5) Thread[id=4803, name=qtp1659353078-4803, state=RUNNABLE, group=TGRP-ShardSplitTest]
        at java.base@11.0.1/sun.nio.ch.EPoll.wait(Native Method)
        at java.base@11.0.1/sun.nio.ch.EPollSelectorImpl.doSelect(EPollSelectorImpl.java:120)
        at java.base@11.0.1/sun.nio.ch.SelectorImpl.lockAndDoSelect(SelectorImpl.java:124)
        at java.base@11.0.1/sun.nio.ch.SelectorImpl.select(SelectorImpl.java:141)
        at app//org.eclipse.jetty.io.ManagedSelector$SelectorProducer.select(ManagedSelector.java:464)
        at app//org.eclipse.jetty.io.ManagedSelector$SelectorProducer.produce(ManagedSelector.java:401)
        at app//org.eclipse.jetty.util.thread.strategy.EatWhatYouKill.produceTask(EatWhatYouKill.java:357)
        at app//org.eclipse.jetty.util.thread.strategy.EatWhatYouKill.doProduce(EatWhatYouKill.java:181)
        at app//org.eclipse.jetty.util.thread.strategy.EatWhatYouKill.tryProduce(EatWhatYouKill.java:168)
        at app//org.eclipse.jetty.util.thread.strategy.EatWhatYouKill.produce(EatWhatYouKill.java:132)
        at app//org.eclipse.jetty.io.ManagedSelector$$Lambda$202/0x00000001004bf440.run(Unknown Source)
        at app//org.eclipse.jetty.util.thread.QueuedThreadPool.runJob(QueuedThreadPool.java:781)
        at app//org.eclipse.jetty.util.thread.QueuedThreadPool$Runner.run(QueuedThreadPool.java:917)
        at java.base@11.0.1/java.lang.Thread.run(Thread.java:834)
   6) Thread[id=4806, name=qtp1659353078-4806, state=TIMED_WAITING, group=TGRP-ShardSplitTest]
        at java.base@11.0.1/jdk.internal.misc.Unsafe.park(Native Method)
        at java.base@11.0.1/java.util.concurrent.locks.LockSupport.parkNanos(LockSupport.java:234)
        at java.base@11.0.1/java.util.concurrent.locks.AbstractQueuedSynchronizer$ConditionObject.awaitNanos(AbstractQueuedSynchronizer.java:2123)
        at app//org.eclipse.jetty.util.BlockingArrayQueue.poll(BlockingArrayQueue.java:392)
        at app//org.eclipse.jetty.util.thread.QueuedThreadPool$Runner.idleJobPoll(QueuedThreadPool.java:850)
        at app//org.eclipse.jetty.util.thread.QueuedThreadPool$Runner.run(QueuedThreadPool.java:889)
        at java.base@11.0.1/java.lang.Thread.run(Thread.java:834)
   7) Thread[id=4811, name=Session-HouseKeeper-7f7ea5bd, state=TIMED_WAITING, group=TGRP-ShardSplitTest]
        at java.base@11.0.1/jdk.internal.misc.Unsafe.park(Native Method)
        at java.base@11.0.1/java.util.concurrent.locks.LockSupport.parkNanos(LockSupport.java:234)
        at java.base@11.0.1/java.util.concurrent.locks.AbstractQueuedSynchronizer$ConditionObject.awaitNanos(AbstractQueuedSynchronizer.java:2123)
        at java.base@11.0.1/java.util.concurrent.ScheduledThreadPoolExecutor$DelayedWorkQueue.take(ScheduledThreadPoolExecutor.java:1182)
        at java.base@11.0.1/java.util.concurrent.ScheduledThreadPoolExecutor$DelayedWorkQueue.take(ScheduledThreadPoolExecutor.java:899)
        at java.base@11.0.1/java.util.concurrent.ThreadPoolExecutor.getTask(ThreadPoolExecutor.java:1054)
        at java.base@11.0.1/java.util.concurrent.ThreadPoolExecutor.runWorker(ThreadPoolExecutor.java:1114)
        at java.base@11.0.1/java.util.concurrent.ThreadPoolExecutor$Worker.run(ThreadPoolExecutor.java:628)
        at java.base@11.0.1/java.lang.Thread.run(Thread.java:834)
   8) Thread[id=4852, name=Connector-Scheduler-98522c4, state=WAITING, group=TGRP-ShardSplitTest]
        at java.base@11.0.1/jdk.internal.misc.Unsafe.park(Native Method)
        at java.base@11.0.1/java.util.concurrent.locks.LockSupport.park(LockSupport.java:194)
        at java.base@11.0.1/java.util.concurrent.locks.AbstractQueuedSynchronizer$ConditionObject.await(AbstractQueuedSynchronizer.java:2081)
        at java.base@11.0.1/java.util.concurrent.ScheduledThreadPoolExecutor$DelayedWorkQueue.take(ScheduledThreadPoolExecutor.java:1170)
        at java.base@11.0.1/java.util.concurrent.ScheduledThreadPoolExecutor$DelayedWorkQueue.take(ScheduledThreadPoolExecutor.java:899)
        at java.base@11.0.1/java.util.concurrent.ThreadPoolExecutor.getTask(ThreadPoolExecutor.java:1054)
        at java.base@11.0.1/java.util.concurrent.ThreadPoolExecutor.runWorker(ThreadPoolExecutor.java:1114)
        at java.base@11.0.1/java.util.concurrent.ThreadPoolExecutor$Worker.run(ThreadPoolExecutor.java:628)
        at java.base@11.0.1/java.lang.Thread.run(Thread.java:834)
   9) Thread[id=4807, name=qtp1659353078-4807, state=TIMED_WAITING, group=TGRP-ShardSplitTest]
        at java.base@11.0.1/jdk.internal.misc.Unsafe.park(Native Method)
        at java.base@11.0.1/java.util.concurrent.locks.LockSupport.parkNanos(LockSupport.java:234)
        at java.base@11.0.1/java.util.concurrent.locks.AbstractQueuedSynchronizer$ConditionObject.awaitNanos(AbstractQueuedSynchronizer.java:2123)
        at app//org.eclipse.jetty.util.BlockingArrayQueue.poll(BlockingArrayQueue.java:392)
        at app//org.eclipse.jetty.util.thread.QueuedThreadPool$Runner.idleJobPoll(QueuedThreadPool.java:850)
        at app//org.eclipse.jetty.util.thread.QueuedThreadPool$Runner.run(QueuedThreadPool.java:889)
        at java.base@11.0.1/java.lang.Thread.run(Thread.java:834)
  10) Thread[id=4810, name=qtp1659353078-4810, state=TIMED_WAITING, group=TGRP-ShardSplitTest]
        at java.base@11.0.1/jdk.internal.misc.Unsafe.park(Native Method)
        at java.base@11.0.1/java.util.concurrent.locks.LockSupport.parkNanos(LockSupport.java:234)
        at java.base@11.0.1/java.util.concurrent.locks.AbstractQueuedSynchronizer$ConditionObject.awaitNanos(AbstractQueuedSynchronizer.java:2123)
        at app//org.eclipse.jetty.util.BlockingArrayQueue.poll(BlockingArrayQueue.java:392)
        at app//org.eclipse.jetty.util.thread.QueuedThreadPool$Runner.idleJobPoll(QueuedThreadPool.java:850)
        at app//org.eclipse.jetty.util.thread.QueuedThreadPool$Runner.run(QueuedThreadPool.java:889)
        at java.base@11.0.1/java.lang.Thread.run(Thread.java:834)
        at __randomizedtesting.SeedInfo.seed([CAF547D8F23317BB]:0)




Build Log:
[...truncated 2041 lines...]
   [junit4] Suite: org.apache.lucene.util.packed.TestPackedInts
   [junit4]   2> sep. 10, 2019 6:17:49 P. M. com.carrotsearch.randomizedtesting.ThreadLeakControl$2 evaluate
   [junit4]   2> WARNING: Suite execution timed out: org.apache.lucene.util.packed.TestPackedInts
   [junit4]   2>    1) Thread[id=9004, name=TEST-TestPackedInts.testPackedLongValues-seed#[D12FE76E4E70426D], state=RUNNABLE, group=TGRP-TestPackedInts]
   [junit4]   2>         at java.base@11.0.1/java.lang.reflect.Array.get(Native Method)
   [junit4]   2>         at app//org.apache.lucene.util.RamUsageTester$1.get(RamUsageTester.java:210)
   [junit4]   2>         at java.base@11.0.1/java.util.AbstractList$Itr.next(AbstractList.java:371)
   [junit4]   2>         at java.base@11.0.1/java.util.AbstractCollection.toArray(AbstractCollection.java:144)
   [junit4]   2>         at java.base@11.0.1/java.util.ArrayList.addAll(ArrayList.java:701)
   [junit4]   2>         at app//org.apache.lucene.util.RamUsageTester$Accumulator.accumulateArray(RamUsageTester.java:60)
   [junit4]   2>         at app//org.apache.lucene.util.RamUsageTester.handleArray(RamUsageTester.java:220)
   [junit4]   2>         at app//org.apache.lucene.util.RamUsageTester.measureObjectSize(RamUsageTester.java:121)
   [junit4]   2>         at app//org.apache.lucene.util.RamUsageTester.sizeOf(RamUsageTester.java:76)
   [junit4]   2>         at app//org.apache.lucene.util.RamUsageTester.sizeOf(RamUsageTester.java:81)
   [junit4]   2>         at app//org.apache.lucene.util.packed.TestPackedInts.testPackedLongValues(TestPackedInts.java:1030)
   [junit4]   2>         at java.base@11.0.1/jdk.internal.reflect.NativeMethodAccessorImpl.invoke0(Native Method)
   [junit4]   2>         at java.base@11.0.1/jdk.internal.reflect.NativeMethodAccessorImpl.invoke(NativeMethodAccessorImpl.java:62)
   [junit4]   2>         at java.base@11.0.1/jdk.internal.reflect.DelegatingMethodAccessorImpl.invoke(DelegatingMethodAccessorImpl.java:43)
   [junit4]   2>         at java.base@11.0.1/java.lang.reflect.Method.invoke(Method.java:566)
   [junit4]   2>         at app//com.carrotsearch.randomizedtesting.RandomizedRunner.invoke(RandomizedRunner.java:1750)
   [junit4]   2>         at app//com.carrotsearch.randomizedtesting.RandomizedRunner$8.evaluate(RandomizedRunner.java:938)
   [junit4]   2>         at app//com.carrotsearch.randomizedtesting.RandomizedRunner$9.evaluate(RandomizedRunner.java:974)
   [junit4]   2>         at app//com.carrotsearch.randomizedtesting.RandomizedRunner$10.evaluate(RandomizedRunner.java:988)
   [junit4]   2>         at app//org.apache.lucene.util.TestRuleSetupTeardownChained$1.evaluate(TestRuleSetupTeardownChained.java:49)
   [junit4]   2>         at app//org.apache.lucene.util.AbstractBeforeAfterRule$1.evaluate(AbstractBeforeAfterRule.java:45)
   [junit4]   2>         at app//org.apache.lucene.util.TestRuleThreadAndTestName$1.evaluate(TestRuleThreadAndTestName.java:48)
   [junit4]   2>         at app//org.apache.lucene.util.TestRuleIgnoreAfterMaxFailures$1.evaluate(TestRuleIgnoreAfterMaxFailures.java:64)
   [junit4]   2>         at app//org.apache.lucene.util.TestRuleMarkFailure$1.evaluate(TestRuleMarkFailure.java:47)
   [junit4]   2>         at app//com.carrotsearch.randomizedtesting.rules.StatementAdapter.evaluate(StatementAdapter.java:36)
   [junit4]   2>         at app//com.carrotsearch.randomizedtesting.ThreadLeakControl$StatementRunner.run(ThreadLeakControl.java:368)
   [junit4]   2>         at app//com.carrotsearch.randomizedtesting.ThreadLeakControl.forkTimeoutingTask(ThreadLeakControl.java:817)
   [junit4]   2>         at app//com.carrotsearch.randomizedtesting.ThreadLeakControl$3.evaluate(ThreadLeakControl.java:468)
   [junit4]   2>         at app//com.carrotsearch.randomizedtesting.RandomizedRunner.runSingleTest(RandomizedRunner.java:947)
   [junit4]   2>         at app//com.carrotsearch.randomizedtesting.RandomizedRunner$5.evaluate(RandomizedRunner.java:832)
   [junit4]   2>         at app//com.carrotsearch.randomizedtesting.RandomizedRunner$6.evaluate(RandomizedRunner.java:883)
   [junit4]   2>         at app//com.carrotsearch.randomizedtesting.RandomizedRunner$7.evaluate(RandomizedRunner.java:894)
   [junit4]   2>         at app//org.apache.lucene.util.AbstractBeforeAfterRule$1.evaluate(AbstractBeforeAfterRule.java:45)
   [junit4]   2>         at app//com.carrotsearch.randomizedtesting.rules.StatementAdapter.evaluate(StatementAdapter.java:36)
   [junit4]   2>         at app//org.apache.lucene.util.TestRuleStoreClassName$1.evaluate(TestRuleStoreClassName.java:41)
   [junit4]   2>         at app//com.carrotsearch.randomizedtesting.rules.NoShadowingOrOverridesOnMethodsRule$1.evaluate(NoShadowingOrOverridesOnMethodsRule.java:40)
   [junit4]   2>         at app//com.carrotsearch.randomizedtesting.rules.NoShadowingOrOverridesOnMethodsRule$1.evaluate(NoShadowingOrOverridesOnMethodsRule.java:40)
   [junit4]   2>         at app//com.carrotsearch.randomizedtesting.rules.StatementAdapter.evaluate(StatementAdapter.java:36)
   [junit4]   2>         at app//com.carrotsearch.randomizedtesting.rules.StatementAdapter.evaluate(StatementAdapter.java:36)
   [junit4]   2>         at app//org.apache.lucene.util.TestRuleAssertionsRequired$1.evaluate(TestRuleAssertionsRequired.java:53)
   [junit4]   2>         at app//org.apache.lucene.util.TestRuleMarkFailure$1.evaluate(TestRuleMarkFailure.java:47)
   [junit4]   2>         at app//org.apache.lucene.util.TestRuleIgnoreAfterMaxFailures$1.evaluate(TestRuleIgnoreAfterMaxFailures.java:64)
   [junit4]   2>         at app//org.apache.lucene.util.TestRuleIgnoreTestSuites$1.evaluate(TestRuleIgnoreTestSuites.java:54)
   [junit4]   2>         at app//com.carrotsearch.randomizedtesting.rules.StatementAdapter.evaluate(StatementAdapter.java:36)
   [junit4]   2>         at app//com.carrotsearch.randomizedtesting.ThreadLeakControl$StatementRunner.run(ThreadLeakControl.java:368)
   [junit4]   2>         at java.base@11.0.1/java.lang.Thread.run(Thread.java:834)
   [junit4]   2>    2) Thread[id=11, name=JUnit4-serializer-daemon, state=TIMED_WAITING, group=main]
   [junit4]   2>         at java.base@11.0.1/java.lang.Thread.sleep(Native Method)
   [junit4]   2>         at app//com.carrotsearch.ant.tasks.junit4.events.Serializer$1.run(Serializer.java:50)
   [junit4]   2>    3) Thread[id=1, name=main, state=WAITING, group=main]
   [junit4]   2>         at java.base@11.0.1/java.lang.Object.wait(Native Method)
   [junit4]   2>         at java.base@11.0.1/java.lang.Thread.join(Thread.java:1305)
   [junit4]   2>         at java.base@11.0.1/java.lang.Thread.join(Thread.java:1379)
   [junit4]   2>         at app//com.carrotsearch.randomizedtesting.RandomizedRunner.runSuite(RandomizedRunner.java:639)
   [junit4]   2>         at app//com.carrotsearch.randomizedtesting.RandomizedRunner.run(RandomizedRunner.java:496)
   [junit4]   2>         at app//com.carrotsearch.ant.tasks.junit4.slave.SlaveMain.execute(SlaveMain.java:269)
   [junit4]   2>         at app//com.carrotsearch.ant.tasks.junit4.slave.SlaveMain.main(SlaveMain.java:394)
   [junit4]   2>         at app//com.carrotsearch.ant.tasks.junit4.slave.SlaveMainSafe.main(SlaveMainSafe.java:13)
   [junit4]   2>    4) Thread[id=9003, name=SUITE-TestPackedInts-seed#[D12FE76E4E70426D], state=RUNNABLE, group=TGRP-TestPackedInts]
   [junit4]   2>         at java.base/java.lang.Thread.getStackTrace(Thread.java:1606)
   [junit4]   2>         at com.carrotsearch.randomizedtesting.ThreadLeakControl$4.run(ThreadLeakControl.java:696)
   [junit4]   2>         at com.carrotsearch.randomizedtesting.ThreadLeakControl$4.run(ThreadLeakControl.java:693)
   [junit4]   2>         at java.base/java.security.AccessController.doPrivileged(Native Method)
   [junit4]   2>         at com.carrotsearch.randomizedtesting.ThreadLeakControl.getStackTrace(ThreadLeakControl.java:693)
   [junit4]   2>         at com.carrotsearch.randomizedtesting.ThreadLeakControl.getThreadsWithTraces(ThreadLeakControl.java:709)
   [junit4]   2>         at com.carrotsearch.randomizedtesting.ThreadLeakControl.formatThreadStacksFull(ThreadLeakControl.java:689)
   [junit4]   2>         at com.carrotsearch.randomizedtesting.ThreadLeakControl.access$1000(ThreadLeakControl.java:65)
   [junit4]   2>         at com.carrotsearch.randomizedtesting.ThreadLeakControl$2.evaluate(ThreadLeakControl.java:415)
   [junit4]   2>         at com.carrotsearch.randomizedtesting.RandomizedRunner.runSuite(RandomizedRunner.java:708)
   [junit4]   2>         at com.carrotsearch.randomizedtesting.RandomizedRunner.access$200(RandomizedRunner.java:138)
   [junit4]   2>         at com.carrotsearch.randomizedtesting.RandomizedRunner$2.run(RandomizedRunner.java:629)
   [junit4]   2> NOTE: download the large Jenkins line-docs file by running 'ant get-jenkins-line-docs' in the lucene directory.
   [junit4]   2> NOTE: reproduce with: ant test  -Dtestcase=TestPackedInts -Dtests.method=testPackedLongValues -Dtests.seed=D12FE76E4E70426D -Dtests.multiplier=2 -Dtests.nightly=true -Dtests.slow=true -Dtests.linedocsfile=/home/jenkins/jenkins-slave/workspace/Lucene-Solr-NightlyTests-master/test-data/enwiki.random.lines.txt -Dtests.locale=es-GT -Dtests.timezone=Pacific/Enderbury -Dtests.asserts=true -Dtests.file.encoding=ISO-8859-1
   [junit4] ERROR   7110s J1 | TestPackedInts.testPackedLongValues <<<
   [junit4]    > Throwable #1: java.lang.Exception: Test abandoned because suite timeout was reached.
   [junit4]    > at __randomizedtesting.SeedInfo.seed([D12FE76E4E70426D]:0)
   [junit4]   2> sep. 10, 2019 6:17:49 P. M. com.carrotsearch.randomizedtesting.ThreadLeakControl checkThreadLeaks
   [junit4]   2> WARNING: Will linger awaiting termination of 1 leaked thread(s).
   [junit4]   2> sep. 10, 2019 6:18:09 P. M. com.carrotsearch.randomizedtesting.ThreadLeakControl checkThreadLeaks
   [junit4]   2> SEVERE: 1 thread leaked from SUITE scope at org.apache.lucene.util.packed.TestPackedInts:
   [junit4]   2>    1) Thread[id=9004, name=TEST-TestPackedInts.testPackedLongValues-seed#[D12FE76E4E70426D], state=RUNNABLE, group=TGRP-TestPackedInts]
   [junit4]   2>         at java.base@11.0.1/java.security.AccessController.doPrivileged(Native Method)
   [junit4]   2>         at app//org.apache.lucene.util.RamUsageEstimator.shallowSizeOfInstance(RamUsageEstimator.java:559)
   [junit4]   2>         at app//org.apache.lucene.util.RamUsageEstimator.shallowSizeOf(RamUsageEstimator.java:536)
   [junit4]   2>         at app//org.apache.lucene.util.RamUsageTester.handleOther(RamUsageTester.java:146)
   [junit4]   2>         at app//org.apache.lucene.util.RamUsageTester.measureObjectSize(RamUsageTester.java:123)
   [junit4]   2>         at app//org.apache.lucene.util.RamUsageTester.sizeOf(RamUsageTester.java:76)
   [junit4]   2>         at app//org.apache.lucene.util.RamUsageTester.sizeOf(RamUsageTester.java:81)
   [junit4]   2>         at app//org.apache.lucene.util.packed.TestPackedInts.testPackedLongValues(TestPackedInts.java:1030)
   [junit4]   2>         at java.base@11.0.1/jdk.internal.reflect.NativeMethodAccessorImpl.invoke0(Native Method)
   [junit4]   2>         at java.base@11.0.1/jdk.internal.reflect.NativeMethodAccessorImpl.invoke(NativeMethodAccessorImpl.java:62)
   [junit4]   2>         at java.base@11.0.1/jdk.internal.reflect.DelegatingMethodAccessorImpl.invoke(DelegatingMethodAccessorImpl.java:43)
   [junit4]   2>         at java.base@11.0.1/java.lang.reflect.Method.invoke(Method.java:566)
   [junit4]   2>         at app//com.carrotsearch.randomizedtesting.RandomizedRunner.invoke(RandomizedRunner.java:1750)
   [junit4]   2>         at app//com.carrotsearch.randomizedtesting.RandomizedRunner$8.evaluate(RandomizedRunner.java:938)
   [junit4]   2>         at app//com.carrotsearch.randomizedtesting.RandomizedRunner$9.evaluate(RandomizedRunner.java:974)
   [junit4]   2>         at app//com.carrotsearch.randomizedtesting.RandomizedRunner$10.evaluate(RandomizedRunner.java:988)
   [junit4]   2>         at app//org.apache.lucene.util.TestRuleSetupTeardownChained$1.evaluate(TestRuleSetupTeardownChained.java:49)
   [junit4]   2>         at app//org.apache.lucene.util.AbstractBeforeAfterRule$1.evaluate(AbstractBeforeAfterRule.java:45)
   [junit4]   2>         at app//org.apache.lucene.util.TestRuleThreadAndTestName$1.evaluate(TestRuleThreadAndTestName.java:48)
   [junit4]   2>         at app//org.apache.lucene.util.TestRuleIgnoreAfterMaxFailures$1.evaluate(TestRuleIgnoreAfterMaxFailures.java:64)
   [junit4]   2>         at app//org.apache.lucene.util.TestRuleMarkFailure$1.evaluate(TestRuleMarkFailure.java:47)
   [junit4]   2>         at app//com.carrotsearch.randomizedtesting.rules.StatementAdapter.evaluate(StatementAdapter.java:36)
   [junit4]   2>         at app//com.carrotsearch.randomizedtesting.ThreadLeakControl$StatementRunner.run(ThreadLeakControl.java:368)
   [junit4]   2>         at app//com.carrotsearch.randomizedtesting.ThreadLeakControl.forkTimeoutingTask(ThreadLeakControl.java:817)
   [junit4]   2>         at app//com.carrotsearch.randomizedtesting.ThreadLeakControl$3.evaluate(ThreadLeakControl.java:468)
   [junit4]   2>         at app//com.carrotsearch.randomizedtesting.RandomizedRunner.runSingleTest(RandomizedRunner.java:947)
   [junit4]   2>         at app//com.carrotsearch.randomizedtesting.RandomizedRunner$5.evaluate(RandomizedRunner.java:832)
   [junit4]   2>         at app//com.carrotsearch.randomizedtesting.RandomizedRunner$6.evaluate(RandomizedRunner.java:883)
   [junit4]   2>         at app//com.carrotsearch.randomizedtesting.RandomizedRunner$7.evaluate(RandomizedRunner.java:894)
   [junit4]   2>         at app//org.apache.lucene.util.AbstractBeforeAfterRule$1.evaluate(AbstractBeforeAfterRule.java:45)
   [junit4]   2>         at app//com.carrotsearch.randomizedtesting.rules.StatementAdapter.evaluate(StatementAdapter.java:36)
   [junit4]   2>         at app//org.apache.lucene.util.TestRuleStoreClassName$1.evaluate(TestRuleStoreClassName.java:41)
   [junit4]   2>         at app//com.carrotsearch.randomizedtesting.rules.NoShadowingOrOverridesOnMethodsRule$1.evaluate(NoShadowingOrOverridesOnMethodsRule.java:40)
   [junit4]   2>         at app//com.carrotsearch.randomizedtesting.rules.NoShadowingOrOverridesOnMethodsRule$1.evaluate(NoShadowingOrOverridesOnMethodsRule.java:40)
   [junit4]   2>         at app//com.carrotsearch.randomizedtesting.rules.StatementAdapter.evaluate(StatementAdapter.java:36)
   [junit4]   2>         at app//com.carrotsearch.randomizedtesting.rules.StatementAdapter.evaluate(StatementAdapter.java:36)
   [junit4]   2>         at app//org.apache.lucene.util.TestRuleAssertionsRequired$1.evaluate(TestRuleAssertionsRequired.java:53)
   [junit4]   2>         at app//org.apache.lucene.util.TestRuleMarkFailure$1.evaluate(TestRuleMarkFailure.java:47)
   [junit4]   2>         at app//org.apache.lucene.util.TestRuleIgnoreAfterMaxFailures$1.evaluate(TestRuleIgnoreAfterMaxFailures.java:64)
   [junit4]   2>         at app//org.apache.lucene.util.TestRuleIgnoreTestSuites$1.evaluate(TestRuleIgnoreTestSuites.java:54)
   [junit4]   2>         at app//com.carrotsearch.randomizedtesting.rules.StatementAdapter.evaluate(StatementAdapter.java:36)
   [junit4]   2>         at app//com.carrotsearch.randomizedtesting.ThreadLeakControl$StatementRunner.run(ThreadLeakControl.java:368)
   [junit4]   2>         at java.base@11.0.1/java.lang.Thread.run(Thread.java:834)
   [junit4]   2> sep. 10, 2019 6:18:09 P. M. com.carrotsearch.randomizedtesting.ThreadLeakControl tryToInterruptAll
   [junit4]   2> INFO: Starting to interrupt leaked threads:
   [junit4]   2>    1) Thread[id=9004, name=TEST-TestPackedInts.testPackedLongValues-seed#[D12FE76E4E70426D], state=RUNNABLE, group=TGRP-TestPackedInts]
   [junit4]   2> sep. 10, 2019 6:18:12 P. M. com.carrotsearch.randomizedtesting.ThreadLeakControl tryToInterruptAll
   [junit4]   2> SEVERE: There are still zombie threads that couldn't be terminated:
   [junit4]   2>    1) Thread[id=9004, name=TEST-TestPackedInts.testPackedLongValues-seed#[D12FE76E4E70426D], state=RUNNABLE, group=TGRP-TestPackedInts]
   [junit4]   2>         at java.base@11.0.1/java.security.AccessController.doPrivileged(Native Method)
   [junit4]   2>         at app//org.apache.lucene.util.RamUsageEstimator.shallowSizeOfInstance(RamUsageEstimator.java:559)
   [junit4]   2>         at app//org.apache.lucene.util.RamUsageEstimator.shallowSizeOf(RamUsageEstimator.java:536)
   [junit4]   2>         at app//org.apache.lucene.util.RamUsageTester.handleOther(RamUsageTester.java:146)
   [junit4]   2>         at app//org.apache.lucene.util.RamUsageTester.measureObjectSize(RamUsageTester.java:123)
   [junit4]   2>         at app//org.apache.lucene.util.RamUsageTester.sizeOf(RamUsageTester.java:76)
   [junit4]   2>         at app//org.apache.lucene.util.RamUsageTester.sizeOf(RamUsageTester.java:81)
   [junit4]   2>         at app//org.apache.lucene.util.packed.TestPackedInts.testPackedLongValues(TestPackedInts.java:1030)
   [junit4]   2>         at java.base@11.0.1/jdk.internal.reflect.NativeMethodAccessorImpl.invoke0(Native Method)
   [junit4]   2>         at java.base@11.0.1/jdk.internal.reflect.NativeMethodAccessorImpl.invoke(NativeMethodAccessorImpl.java:62)
   [junit4]   2>         at java.base@11.0.1/jdk.internal.reflect.DelegatingMethodAccessorImpl.invoke(DelegatingMethodAccessorImpl.java:43)
   [junit4]   2>         at java.base@11.0.1/java.lang.reflect.Method.invoke(Method.java:566)
   [junit4]   2>         at app//com.carrotsearch.randomizedtesting.RandomizedRunner.invoke(RandomizedRunner.java:1750)
   [junit4]   2>         at app//com.carrotsearch.randomizedtesting.RandomizedRunner$8.evaluate(RandomizedRunner.java:938)
   [junit4]   2>         at app//com.carrotsearch.randomizedtesting.RandomizedRunner$9.evaluate(RandomizedRunner.java:974)
   [junit4]   2>         at app//com.carrotsearch.randomizedtesting.RandomizedRunner$10.evaluate(RandomizedRunner.java:988)
   [junit4]   2>         at app//org.apache.lucene.util.TestRuleSetupTeardownChained$1.evaluate(TestRuleSetupTeardownChained.java:49)
   [junit4]   2>         at app//org.apache.lucene.util.AbstractBeforeAfterRule$1.evaluate(AbstractBeforeAfterRule.java:45)
   [junit4]   2>         at app//org.apache.lucene.util.TestRuleThreadAndTestName$1.evaluate(TestRuleThreadAndTestName.java:48)
   [junit4]   2>         at app//org.apache.lucene.util.TestRuleIgnoreAfterMaxFailures$1.evaluate(TestRuleIgnoreAfterMaxFailures.java:64)
   [junit4]   2>         at app//org.apache.lucene.util.TestRuleMarkFailure$1.evaluate(TestRuleMarkFailure.java:47)
   [junit4]   2>         at app//com.carrotsearch.randomizedtesting.rules.StatementAdapter.evaluate(StatementAdapter.java:36)
   [junit4]   2>         at app//com.carrotsearch.randomizedtesting.ThreadLeakControl$StatementRunner.run(ThreadLeakControl.java:368)
   [junit4]   2>         at app//com.carrotsearch.randomizedtesting.ThreadLeakControl.forkTimeoutingTask(ThreadLeakControl.java:817)
   [junit4]   2>         at app//com.carrotsearch.randomizedtesting.ThreadLeakControl$3.evaluate(ThreadLeakControl.java:468)
   [junit4]   2>         at app//com.carrotsearch.randomizedtesting.RandomizedRunner.runSingleTest(RandomizedRunner.java:947)
   [junit4]   2>         at app//com.carrotsearch.randomizedtesting.RandomizedRunner$5.evaluate(RandomizedRunner.java:832)
   [junit4]   2>         at app//com.carrotsearch.randomizedtesting.RandomizedRunner$6.evaluate(RandomizedRunner.java:883)
   [junit4]   2>         at app//com.carrotsearch.randomizedtesting.RandomizedRunner$7.evaluate(RandomizedRunner.java:894)
   [junit4]   2>         at app//org.apache.lucene.util.AbstractBeforeAfterRule$1.evaluate(AbstractBeforeAfterRule.java:45)
   [junit4]   2>         at app//com.carrotsearch.randomizedtesting.rules.StatementAdapter.evaluate(StatementAdapter.java:36)
   [junit4]   2>         at app//org.apache.lucene.util.TestRuleStoreClassName$1.evaluate(TestRuleStoreClassName.java:41)
   [junit4]   2>         at app//com.carrotsearch.randomizedtesting.rules.NoShadowingOrOverridesOnMethodsRule$1.evaluate(NoShadowingOrOverridesOnMethodsRule.java:40)
   [junit4]   2>         at app//com.carrotsearch.randomizedtesting.rules.NoShadowingOrOverridesOnMethodsRule$1.evaluate(NoShadowingOrOverridesOnMethodsRule.java:40)
   [junit4]   2>         at app//com.carrotsearch.randomizedtesting.rules.StatementAdapter.evaluate(StatementAdapter.java:36)
   [junit4]   2>         at app//com.carrotsearch.randomizedtesting.rules.StatementAdapter.evaluate(StatementAdapter.java:36)
   [junit4]   2>         at app//org.apache.lucene.util.TestRuleAssertionsRequired$1.evaluate(TestRuleAssertionsRequired.java:53)
   [junit4]   2>         at app//org.apache.lucene.util.TestRuleMarkFailure$1.evaluate(TestRuleMarkFailure.java:47)
   [junit4]   2>         at app//org.apache.lucene.util.TestRuleIgnoreAfterMaxFailures$1.evaluate(TestRuleIgnoreAfterMaxFailures.java:64)
   [junit4]   2>         at app//org.apache.lucene.util.TestRuleIgnoreTestSuites$1.evaluate(TestRuleIgnoreTestSuites.java:54)
   [junit4]   2>         at app//com.carrotsearch.randomizedtesting.rules.StatementAdapter.evaluate(StatementAdapter.java:36)
   [junit4]   2>         at app//com.carrotsearch.randomizedtesting.ThreadLeakControl$StatementRunner.run(ThreadLeakControl.java:368)
   [junit4]   2>         at java.base@11.0.1/java.lang.Thread.run(Thread.java:834)
   [junit4]   2> NOTE: test params are: codec=Asserting(Lucene80): {}, docValues:{}, maxPointsInLeafNode=1417, maxMBSortInHeap=5.2215392024783025, sim=Asserting(org.apache.lucene.search.similarities.AssertingSimilarity@5af496f5), locale=es-GT, timezone=Pacific/Enderbury
   [junit4]   2> NOTE: Linux 4.4.0-112-generic amd64/Oracle Corporation 11.0.1 (64-bit)/cpus=4,threads=2,free=388134352,total=536870912
   [junit4]   2> NOTE: All tests run in this JVM: [TestDeterminizeLexicon, TestSortedSetDocValues, TestSort, TestSimpleSearchEquivalence, TestIndexWriterThreadsToSegments, TestGeoEncodingUtils, TestFieldType, TestUsageTrackingFilterCachingPolicy, TestIndexWriterMaxDocs, TestIndexWriterDeleteByQuery, TestLogMergePolicy, TestTieredMergePolicy, TestMatchesIterator, TestParallelCompositeReader, TestUniqueTermCount, TestByteBlockPool, TestScoreCachingWrappingScorer, TestSpanNotQuery, TestCodecHoldsOpenFiles, TestDisjunctionScoreBlockBoundaryPropagator, TestRollingUpdates, TestIndexCommit, TestFeatureField, TestMaxPosition, TestDuelingCodecs, TestSearchWithThreads, TestDocumentWriter, TestIndexWriterForceMerge, TestConstantScoreQuery, TestNot, TestLatLonPointDistanceSort, TestDemo, TestSpanFirstQuery, TestGraphTokenFilter, TestIntroSorter, TestIndexedDISI, TestIndependenceSaturated, TestAutomatonQuery, TestMathUtil, TestDoc, TestAllFilesHaveChecksumFooter, TestTimSorter, TestMixedCodecs, TestCompiledAutomaton, TestMutableValues, TestIntRangeFieldQueries, TestBooleanQueryVisitSubscorers, TestSumDocFreq, TestNeverDelete, TestMultiFields, TestFixedLengthBytesRefArray, TestBasicModelG, TestLucene80NormsFormatMergeInstance, TestStandardAnalyzer, TestLatLonPointQueries, TestDemoParallelLeafReader, FiniteStringsIteratorTest, TestDistributionLL, TestBasics, TestCodecUtil, TestSegmentMerger, TestSegmentTermEnum, TestBoostQuery, TestPackedInts]
   [junit4]   2> NOTE: download the large Jenkins line-docs file by running 'ant get-jenkins-line-docs' in the lucene directory.
   [junit4]   2> NOTE: reproduce with: ant test  -Dtestcase=TestPackedInts -Dtests.seed=D12FE76E4E70426D -Dtests.multiplier=2 -Dtests.nightly=true -Dtests.slow=true -Dtests.linedocsfile=/home/jenkins/jenkins-slave/workspace/Lucene-Solr-NightlyTests-master/test-data/enwiki.random.lines.txt -Dtests.locale=es-GT -Dtests.timezone=Pacific/Enderbury -Dtests.asserts=true -Dtests.file.encoding=ISO-8859-1
   [junit4] ERROR   0.00s J1 | TestPackedInts (suite) <<<
   [junit4]    > Throwable #1: java.lang.Exception: Suite timeout exceeded (>= 7200000 msec).
   [junit4]    > at __randomizedtesting.SeedInfo.seed([D12FE76E4E70426D]:0)
   [junit4] Completed [414/524 (1!)] on J1 in 7223.71s, 25 tests, 2 errors, 2 skipped <<< FAILURES!

[...truncated 12151 lines...]
   [junit4] Suite: org.apache.solr.cloud.api.collections.ShardSplitTest
   [junit4]   2> 585889 INFO  (SUITE-ShardSplitTest-seed#[CAF547D8F23317BB]-worker) [     ] o.a.s.SolrTestCaseJ4 Created dataDir: /home/jenkins/jenkins-slave/workspace/Lucene-Solr-NightlyTests-master/checkout/solr/build/solr-core/test/J1/temp/solr.cloud.api.collections.ShardSplitTest_CAF547D8F23317BB-001/data-dir-15-001
   [junit4]   2> 585889 INFO  (SUITE-ShardSplitTest-seed#[CAF547D8F23317BB]-worker) [     ] o.a.s.SolrTestCaseJ4 Using PointFields (NUMERIC_POINTS_SYSPROP=true) w/NUMERIC_DOCVALUES_SYSPROP=false
   [junit4]   2> 585890 INFO  (SUITE-ShardSplitTest-seed#[CAF547D8F23317BB]-worker) [     ] o.a.s.SolrTestCaseJ4 Randomized ssl (false) and clientAuth (false) via: @org.apache.solr.SolrTestCaseJ4$SuppressSSL(bugUrl="https://issues.apache.org/jira/browse/SOLR-5776")
   [junit4]   2> 585890 INFO  (SUITE-ShardSplitTest-seed#[CAF547D8F23317BB]-worker) [     ] o.a.s.SolrTestCaseJ4 SecureRandom sanity checks: test.solr.allowed.securerandom=null & java.security.egd=file:/dev/./urandom
   [junit4]   2> 585890 INFO  (SUITE-ShardSplitTest-seed#[CAF547D8F23317BB]-worker) [     ] o.a.s.BaseDistributedSearchTestCase Setting hostContext system property: /cf_/x
   [junit4]   2> 585910 INFO  (TEST-ShardSplitTest.testSplitStaticIndexReplication-seed#[CAF547D8F23317BB]) [     ] o.a.s.c.ZkTestServer STARTING ZK TEST SERVER
   [junit4]   2> 585911 INFO  (ZkTestServer Run Thread) [     ] o.a.s.c.ZkTestServer client port:0.0.0.0/0.0.0.0:0
   [junit4]   2> 585911 INFO  (ZkTestServer Run Thread) [     ] o.a.s.c.ZkTestServer Starting server
   [junit4]   2> 586019 INFO  (TEST-ShardSplitTest.testSplitStaticIndexReplication-seed#[CAF547D8F23317BB]) [     ] o.a.s.c.ZkTestServer start zk server on port:42191
   [junit4]   2> 586019 INFO  (TEST-ShardSplitTest.testSplitStaticIndexReplication-seed#[CAF547D8F23317BB]) [     ] o.a.s.c.ZkTestServer waitForServerUp: 127.0.0.1:42191
   [junit4]   2> 586019 INFO  (TEST-ShardSplitTest.testSplitStaticIndexReplication-seed#[CAF547D8F23317BB]) [     ] o.a.s.c.ZkTestServer parse host and port list: 127.0.0.1:42191
   [junit4]   2> 586019 INFO  (TEST-ShardSplitTest.testSplitStaticIndexReplication-seed#[CAF547D8F23317BB]) [     ] o.a.s.c.ZkTestServer connecting to 127.0.0.1 42191
   [junit4]   2> 586022 INFO  (TEST-ShardSplitTest.testSplitStaticIndexReplication-seed#[CAF547D8F23317BB]) [     ] o.a.s.c.c.ConnectionManager Waiting for client to connect to ZooKeeper
   [junit4]   2> 586041 INFO  (zkConnectionManagerCallback-596-thread-1) [     ] o.a.s.c.c.ConnectionManager zkClient has connected
   [junit4]   2> 586041 INFO  (TEST-ShardSplitTest.testSplitStaticIndexReplication-seed#[CAF547D8F23317BB]) [     ] o.a.s.c.c.ConnectionManager Client is connected to ZooKeeper
   [junit4]   2> 586091 INFO  (TEST-ShardSplitTest.testSplitStaticIndexReplication-seed#[CAF547D8F23317BB]) [     ] o.a.s.c.c.ConnectionManager Waiting for client to connect to ZooKeeper
   [junit4]   2> 586109 INFO  (zkConnectionManagerCallback-598-thread-1) [     ] o.a.s.c.c.ConnectionManager zkClient has connected
   [junit4]   2> 586109 INFO  (TEST-ShardSplitTest.testSplitStaticIndexReplication-seed#[CAF547D8F23317BB]) [     ] o.a.s.c.c.ConnectionManager Client is connected to ZooKeeper
   [junit4]   2> 586111 INFO  (TEST-ShardSplitTest.testSplitStaticIndexReplication-seed#[CAF547D8F23317BB]) [     ] o.a.s.c.ZkTestServer put /home/jenkins/jenkins-slave/workspace/Lucene-Solr-NightlyTests-master/checkout/solr/core/src/test-files/solr/collection1/conf/solrconfig-tlog.xml to /configs/conf1/solrconfig.xml
   [junit4]   2> 586128 INFO  (TEST-ShardSplitTest.testSplitStaticIndexReplication-seed#[CAF547D8F23317BB]) [     ] o.a.s.c.ZkTestServer put /home/jenkins/jenkins-slave/workspace/Lucene-Solr-NightlyTests-master/checkout/solr/core/src/test-files/solr/collection1/conf/schema15.xml to /configs/conf1/schema.xml
   [junit4]   2> 586129 INFO  (TEST-ShardSplitTest.testSplitStaticIndexReplication-seed#[CAF547D8F23317BB]) [     ] o.a.s.c.ZkTestServer put /home/jenkins/jenkins-slave/workspace/Lucene-Solr-NightlyTests-master/checkout/solr/core/src/test-files/solr/collection1/conf/solrconfig.snippet.randomindexconfig.xml to /configs/conf1/solrconfig.snippet.randomindexconfig.xml
   [junit4]   2> 586131 INFO  (TEST-ShardSplitTest.testSplitStaticIndexReplication-seed#[CAF547D8F23317BB]) [     ] o.a.s.c.ZkTestServer put /home/jenkins/jenkins-slave/workspace/Lucene-Solr-NightlyTests-master/checkout/solr/core/src/test-files/solr/collection1/conf/stopwords.txt to /configs/conf1/stopwords.txt
   [junit4]   2> 586131 INFO  (TEST-ShardSplitTest.testSplitStaticIndexReplication-seed#[CAF547D8F23317BB]) [     ] o.a.s.c.ZkTestServer put /home/jenkins/jenkins-slave/workspace/Lucene-Solr-NightlyTests-master/checkout/solr/core/src/test-files/solr/collection1/conf/protwords.txt to /configs/conf1/protwords.txt
   [junit4]   2> 586145 INFO  (TEST-ShardSplitTest.testSplitStaticIndexReplication-seed#[CAF547D8F23317BB]) [     ] o.a.s.c.ZkTestServer put /home/jenkins/jenkins-slave/workspace/Lucene-Solr-NightlyTests-master/checkout/solr/core/src/test-files/solr/collection1/conf/currency.xml to /configs/conf1/currency.xml
   [junit4]   2> 586146 INFO  (TEST-ShardSplitTest.testSplitStaticIndexReplication-seed#[CAF547D8F23317BB]) [     ] o.a.s.c.ZkTestServer put /home/jenkins/jenkins-slave/workspace/Lucene-Solr-NightlyTests-master/checkout/solr/core/src/test-files/solr/collection1/conf/enumsConfig.xml to /configs/conf1/enumsConfig.xml
   [junit4]   2> 586147 INFO  (TEST-ShardSplitTest.testSplitStaticIndexReplication-seed#[CAF547D8F23317BB]) [     ] o.a.s.c.ZkTestServer put /home/jenkins/jenkins-slave/workspace/Lucene-Solr-NightlyTests-master/checkout/solr/core/src/test-files/solr/collection1/conf/open-exchange-rates.json to /configs/conf1/open-exchange-rates.json
   [junit4]   2> 586165 INFO  (TEST-ShardSplitTest.testSplitStaticIndexReplication-seed#[CAF547D8F23317BB]) [     ] o.a.s.c.ZkTestServer put /home/jenkins/jenkins-slave/workspace/Lucene-Solr-NightlyTests-master/checkout/solr/core/src/test-files/solr/collection1/conf/mapping-ISOLatin1Accent.txt to /configs/conf1/mapping-ISOLatin1Accent.txt
   [junit4]   2> 586166 INFO  (TEST-ShardSplitTest.testSplitStaticIndexReplication-seed#[CAF547D8F23317BB]) [     ] o.a.s.c.ZkTestServer put /home/jenkins/jenkins-slave/workspace/Lucene-Solr-NightlyTests-master/checkout/solr/core/src/test-files/solr/collection1/conf/old_synonyms.txt to /configs/conf1/old_synonyms.txt
   [junit4]   2> 586167 INFO  (TEST-ShardSplitTest.testSplitStaticIndexReplication-seed#[CAF547D8F23317BB]) [     ] o.a.s.c.ZkTestServer put /home/jenkins/jenkins-slave/workspace/Lucene-Solr-NightlyTests-master/checkout/solr/core/src/test-files/solr/collection1/conf/synonyms.txt to /configs/conf1/synonyms.txt
   [junit4]   2> 586168 INFO  (TEST-ShardSplitTest.testSplitStaticIndexReplication-seed#[CAF547D8F23317BB]) [     ] o.a.s.c.AbstractFullDistribZkTestBase Will use NRT replicas unless explicitly asked otherwise
   [junit4]   2> 587483 WARN  (TEST-ShardSplitTest.testSplitStaticIndexReplication-seed#[CAF547D8F23317BB]) [     ] o.e.j.s.AbstractConnector Ignoring deprecated socket close linger time
   [junit4]   2> 587484 INFO  (TEST-ShardSplitTest.testSplitStaticIndexReplication-seed#[CAF547D8F23317BB]) [     ] o.a.s.c.s.e.JettySolrRunner Start Jetty (original configured port=0)
   [junit4]   2> 587484 INFO  (TEST-ShardSplitTest.testSplitStaticIndexReplication-seed#[CAF547D8F23317BB]) [     ] o.a.s.c.s.e.JettySolrRunner Trying to start Jetty on port 0 try number 1 ...
   [junit4]   2> 587484 INFO  (TEST-ShardSplitTest.testSplitStaticIndexReplication-seed#[CAF547D8F23317BB]) [     ] o.e.j.s.Server jetty-9.4.19.v20190610; built: 2019-06-10T16:30:51.723Z; git: afcf563148970e98786327af5e07c261fda175d3; jvm 11.0.1+13-LTS
   [junit4]   2> 587485 INFO  (TEST-ShardSplitTest.testSplitStaticIndexReplication-seed#[CAF547D8F23317BB]) [     ] o.e.j.s.session DefaultSessionIdManager workerName=node0
   [junit4]   2> 587485 INFO  (TEST-ShardSplitTest.testSplitStaticIndexReplication-seed#[CAF547D8F23317BB]) [     ] o.e.j.s.session No SessionScavenger set, using defaults
   [junit4]   2> 587485 INFO  (TEST-ShardSplitTest.testSplitStaticIndexReplication-seed#[CAF547D8F23317BB]) [     ] o.e.j.s.session node0 Scavenging every 600000ms
   [junit4]   2> 587500 INFO  (TEST-ShardSplitTest.testSplitStaticIndexReplication-seed#[CAF547D8F23317BB]) [     ] o.e.j.s.h.ContextHandler Started o.e.j.s.ServletContextHandler@3570ea27{/cf_/x,null,AVAILABLE}
   [junit4]   2> 587519 INFO  (TEST-ShardSplitTest.testSplitStaticIndexReplication-seed#[CAF547D8F23317BB]) [     ] o.e.j.s.AbstractConnector Started ServerConnector@1c48d82d{HTTP/1.1,[http/1.1, h2c]}{127.0.0.1:46803}
   [junit4]   2> 587519 INFO  (TEST-ShardSplitTest.testSplitStaticIndexReplication-seed#[CAF547D8F23317BB]) [     ] o.e.j.s.Server Started @587645ms
   [junit4]   2> 587519 INFO  (TEST-ShardSplitTest.testSplitStaticIndexReplication-seed#[CAF547D8F23317BB]) [     ] o.a.s.c.s.e.JettySolrRunner Jetty properties: {hostContext=/cf_/x, solr.data.dir=/home/jenkins/jenkins-slave/workspace/Lucene-Solr-NightlyTests-master/checkout/solr/build/solr-core/test/J1/temp/solr.cloud.api.collections.ShardSplitTest_CAF547D8F23317BB-001/tempDir-001/control/data, hostPort=46803, coreRootDirectory=/home/jenkins/jenkins-slave/workspace/Lucene-Solr-NightlyTests-master/checkout/solr/build/solr-core/test/J1/temp/solr.cloud.api.collections.ShardSplitTest_CAF547D8F23317BB-001/control-001/cores}
   [junit4]   2> 587519 ERROR (TEST-ShardSplitTest.testSplitStaticIndexReplication-seed#[CAF547D8F23317BB]) [     ] o.a.s.u.StartupLoggingUtils Missing Java Option solr.log.dir. Logging may be missing or incomplete.
   [junit4]   2> 587519 INFO  (TEST-ShardSplitTest.testSplitStaticIndexReplication-seed#[CAF547D8F23317BB]) [     ] o.a.s.s.SolrDispatchFilter Using logger factory org.apache.logging.slf4j.Log4jLoggerFactory
   [junit4]   2> 587519 INFO  (TEST-ShardSplitTest.testSplitStaticIndexReplication-seed#[CAF547D8F23317BB]) [     ] o.a.s.s.SolrDispatchFilter  ___      _       Welcome to Apache Solr? version 9.0.0
   [junit4]   2> 587519 INFO  (TEST-ShardSplitTest.testSplitStaticIndexReplication-seed#[CAF547D8F23317BB]) [     ] o.a.s.s.SolrDispatchFilter / __| ___| |_ _   Starting in cloud mode on port null
   [junit4]   2> 587519 INFO  (TEST-ShardSplitTest.testSplitStaticIndexReplication-seed#[CAF547D8F23317BB]) [     ] o.a.s.s.SolrDispatchFilter \__ \/ _ \ | '_|  Install dir: null
   [junit4]   2> 587519 INFO  (TEST-ShardSplitTest.testSplitStaticIndexReplication-seed#[CAF547D8F23317BB]) [     ] o.a.s.s.SolrDispatchFilter |___/\___/_|_|    Start time: 2019-09-10T09:01:04.057709Z
   [junit4]   2> 587527 INFO  (TEST-ShardSplitTest.testSplitStaticIndexReplication-seed#[CAF547D8F23317BB]) [     ] o.a.s.c.c.ConnectionManager Waiting for client to connect to ZooKeeper
   [junit4]   2> 587529 INFO  (zkConnectionManagerCallback-600-thread-1) [     ] o.a.s.c.c.ConnectionManager zkClient has connected
   [junit4]   2> 587529 INFO  (TEST-ShardSplitTest.testSplitStaticIndexReplication-seed#[CAF547D8F23317BB]) [     ] o.a.s.c.c.ConnectionManager Client is connected to ZooKeeper
   [junit4]   2> 587656 INFO  (TEST-ShardSplitTest.testSplitStaticIndexReplication-seed#[CAF547D8F23317BB]) [     ] o.a.s.s.SolrDispatchFilter Loading solr.xml from SolrHome (not found in ZooKeeper)
   [junit4]   2> 587656 INFO  (TEST-ShardSplitTest.testSplitStaticIndexReplication-seed#[CAF547D8F23317BB]) [     ] o.a.s.c.SolrXmlConfig Loading container configuration from /home/jenkins/jenkins-slave/workspace/Lucene-Solr-NightlyTests-master/checkout/solr/build/solr-core/test/J1/temp/solr.cloud.api.collections.ShardSplitTest_CAF547D8F23317BB-001/control-001/solr.xml
   [junit4]   2> 587694 INFO  (TEST-ShardSplitTest.testSplitStaticIndexReplication-seed#[CAF547D8F23317BB]) [     ] o.a.s.c.SolrXmlConfig Configuration parameter autoReplicaFailoverWorkLoopDelay is ignored
   [junit4]   2> 587695 INFO  (TEST-ShardSplitTest.testSplitStaticIndexReplication-seed#[CAF547D8F23317BB]) [     ] o.a.s.c.SolrXmlConfig Configuration parameter autoReplicaFailoverBadNodeExpiration is ignored
   [junit4]   2> 587709 INFO  (TEST-ShardSplitTest.testSplitStaticIndexReplication-seed#[CAF547D8F23317BB]) [     ] o.a.s.c.SolrXmlConfig MBean server found: com.sun.jmx.mbeanserver.JmxMBeanServer@25376e2a, but no JMX reporters were configured - adding default JMX reporter.
   [junit4]   2> 588077 INFO  (TEST-ShardSplitTest.testSplitStaticIndexReplication-seed#[CAF547D8F23317BB]) [     ] o.a.s.h.c.HttpShardHandlerFactory Host whitelist initialized: WhitelistHostChecker [whitelistHosts=null, whitelistHostCheckingEnabled=false]
   [junit4]   2> 588095 WARN  (TEST-ShardSplitTest.testSplitStaticIndexReplication-seed#[CAF547D8F23317BB]) [     ] o.e.j.u.s.S.config Trusting all certificates configured for Client@6b4ba962[provider=null,keyStore=null,trustStore=null]
   [junit4]   2> 588095 WARN  (TEST-ShardSplitTest.testSplitStaticIndexReplication-seed#[CAF547D8F23317BB]) [     ] o.e.j.u.s.S.config No Client EndPointIdentificationAlgorithm configured for Client@6b4ba962[provider=null,keyStore=null,trustStore=null]
   [junit4]   2> 588111 WARN  (TEST-ShardSplitTest.testSplitStaticIndexReplication-seed#[CAF547D8F23317BB]) [     ] o.e.j.u.s.S.config Trusting all certificates configured for Client@576e74ca[provider=null,keyStore=null,trustStore=null]
   [junit4]   2> 588111 WARN  (TEST-ShardSplitTest.testSplitStaticIndexReplication-seed#[CAF547D8F23317BB]) [     ] o.e.j.u.s.S.config No Client EndPointIdentificationAlgorithm configured for Client@576e74ca[provider=null,keyStore=null,trustStore=null]
   [junit4]   2> 588112 INFO  (TEST-ShardSplitTest.testSplitStaticIndexReplication-seed#[CAF547D8F23317BB]) [     ] o.a.s.c.ZkContainer Zookeeper client=127.0.0.1:42191/solr
   [junit4]   2> 588113 INFO  (TEST-ShardSplitTest.testSplitStaticIndexReplication-seed#[CAF547D8F23317BB]) [     ] o.a.s.c.c.ConnectionManager Waiting for client to connect to ZooKeeper
   [junit4]   2> 588146 INFO  (zkConnectionManagerCallback-607-thread-1) [     ] o.a.s.c.c.ConnectionManager zkClient has connected
   [junit4]   2> 588147 INFO  (TEST-ShardSplitTest.testSplitStaticIndexReplication-seed#[CAF547D8F23317BB]) [     ] o.a.s.c.c.ConnectionManager Client is connected to ZooKeeper
   [junit4]   2> 588291 INFO  (TEST-ShardSplitTest.testSplitStaticIndexReplication-seed#[CAF547D8F23317BB]) [n:127.0.0.1:46803_cf_%2Fx     ] o.a.s.c.c.ConnectionManager Waiting for client to connect to ZooKeeper
   [junit4]   2> 588342 INFO  (zkConnectionManagerCallback-609-thread-1) [     ] o.a.s.c.c.ConnectionManager zkClient has connected
   [junit4]   2> 588342 INFO  (TEST-ShardSplitTest.testSplitStaticIndexReplication-seed#[CAF547D8F23317BB]) [n:127.0.0.1:46803_cf_%2Fx     ] o.a.s.c.c.ConnectionManager Client is connected to ZooKeeper
   [junit4]   2> 588983 INFO  (TEST-ShardSplitTest.testSplitStaticIndexReplication-seed#[CAF547D8F23317BB]) [n:127.0.0.1:46803_cf_%2Fx     ] o.a.s.c.OverseerElectionContext I am going to be the leader 127.0.0.1:46803_cf_%2Fx
   [junit4]   2> 588984 INFO  (TEST-ShardSplitTest.testSplitStaticIndexReplication-seed#[CAF547D8F23317BB]) [n:127.0.0.1:46803_cf_%2Fx     ] o.a.s.c.Overseer Overseer (id=75363456854523908-127.0.0.1:46803_cf_%2Fx-n_0000000000) starting
   [junit4]   2> 589281 INFO  (TEST-ShardSplitTest.testSplitStaticIndexReplication-seed#[CAF547D8F23317BB]) [n:127.0.0.1:46803_cf_%2Fx     ] o.a.s.c.c.ConnectionManager Waiting for client to connect to ZooKeeper
   [junit4]   2> 589333 INFO  (zkConnectionManagerCallback-616-thread-1) [     ] o.a.s.c.c.ConnectionManager zkClient has connected
   [junit4]   2> 589333 INFO  (TEST-ShardSplitTest.testSplitStaticIndexReplication-seed#[CAF547D8F23317BB]) [n:127.0.0.1:46803_cf_%2Fx     ] o.a.s.c.c.ConnectionManager Client is connected to ZooKeeper
   [junit4]   2> 589336 INFO  (TEST-ShardSplitTest.testSplitStaticIndexReplication-seed#[CAF547D8F23317BB]) [n:127.0.0.1:46803_cf_%2Fx     ] o.a.s.c.s.i.ZkClientClusterStateProvider Cluster at 127.0.0.1:42191/solr ready
   [junit4]   2> 589337 INFO  (OverseerStateUpdate-75363456854523908-127.0.0.1:46803_cf_%2Fx-n_0000000000) [n:127.0.0.1:46803_cf_%2Fx     ] o.a.s.c.Overseer Starting to work on the main queue : 127.0.0.1:46803_cf_%2Fx
   [junit4]   2> 589341 DEBUG (OverseerCollectionConfigSetProcessor-75363456854523908-127.0.0.1:46803_cf_%2Fx-n_0000000000) [n:127.0.0.1:46803_cf_%2Fx     ] o.a.s.c.OverseerTaskProcessor Process current queue of overseer operations
   [junit4]   2> 589342 DEBUG (OverseerCollectionConfigSetProcessor-75363456854523908-127.0.0.1:46803_cf_%2Fx-n_0000000000) [n:127.0.0.1:46803_cf_%2Fx     ] o.a.s.c.OverseerTaskProcessor Cleaning up work-queue. #Running tasks: 0 #Completed tasks: 0
   [junit4]   2> 589342 DEBUG (OverseerCollectionConfigSetProcessor-75363456854523908-127.0.0.1:46803_cf_%2Fx-n_0000000000) [n:127.0.0.1:46803_cf_%2Fx     ] o.a.s.c.OverseerTaskProcessor RunningTasks: []
   [junit4]   2> 589342 DEBUG (OverseerCollectionConfigSetProcessor-75363456854523908-127.0.0.1:46803_cf_%2Fx-n_0000000000) [n:127.0.0.1:46803_cf_%2Fx     ] o.a.s.c.OverseerTaskProcessor BlockedTasks: []
   [junit4]   2> 589342 DEBUG (OverseerCollectionConfigSetProcessor-75363456854523908-127.0.0.1:46803_cf_%2Fx-n_0000000000) [n:127.0.0.1:46803_cf_%2Fx     ] o.a.s.c.OverseerTaskProcessor CompletedTasks: []
   [junit4]   2> 589342 INFO  (OverseerCollectionConfigSetProcessor-75363456854523908-127.0.0.1:46803_cf_%2Fx-n_0000000000) [n:127.0.0.1:46803_cf_%2Fx     ] o.a.s.c.OverseerTaskProcessor RunningZKTasks: []
   [junit4]   2> 589343 INFO  (TEST-ShardSplitTest.testSplitStaticIndexReplication-seed#[CAF547D8F23317BB]) [n:127.0.0.1:46803_cf_%2Fx     ] o.a.s.c.ZkController Register node as live in ZooKeeper:/live_nodes/127.0.0.1:46803_cf_%2Fx
   [junit4]   2> 589366 INFO  (TEST-ShardSplitTest.testSplitStaticIndexReplication-seed#[CAF547D8F23317BB]) [n:127.0.0.1:46803_cf_%2Fx     ] o.a.s.c.PackageManager clusterprops.json changed , version 0
   [junit4]   2> 589389 INFO  (zkCallback-608-thread-1) [     ] o.a.s.c.c.ZkStateReader Updated live nodes from ZooKeeper... (0) -> (1)
   [junit4]   2> 589389 INFO  (zkCallback-615-thread-1) [     ] o.a.s.c.c.ZkStateReader Updated live nodes from ZooKeeper... (0) -> (1)
   [junit4]   2> 589468 INFO  (TEST-ShardSplitTest.testSplitStaticIndexReplication-seed#[CAF547D8F23317BB]) [n:127.0.0.1:46803_cf_%2Fx     ] o.a.s.h.a.MetricsHistoryHandler No .system collection, keeping metrics history in memory.
   [junit4]   2> 589534 INFO  (TEST-ShardSplitTest.testSplitStaticIndexReplication-seed#[CAF547D8F23317BB]) [n:127.0.0.1:46803_cf_%2Fx     ] o.a.s.m.r.SolrJmxReporter JMX monitoring for 'solr.node' (registry 'solr.node') enabled at server: com.sun.jmx.mbeanserver.JmxMBeanServer@25376e2a
   [junit4]   2> 589551 INFO  (TEST-ShardSplitTest.testSplitStaticIndexReplication-seed#[CAF547D8F23317BB]) [n:127.0.0.1:46803_cf_%2Fx     ] o.a.s.m.r.SolrJmxReporter JMX monitoring for 'solr.jvm' (registry 'solr.jvm') enabled at server: com.sun.jmx.mbeanserver.JmxMBeanServer@25376e2a
   [junit4]   2> 589552 INFO  (TEST-ShardSplitTest.testSplitStaticIndexReplication-seed#[CAF547D8F23317BB]) [n:127.0.0.1:46803_cf_%2Fx     ] o.a.s.m.r.SolrJmxReporter JMX monitoring for 'solr.jetty' (registry 'solr.jetty') enabled at server: com.sun.jmx.mbeanserver.JmxMBeanServer@25376e2a
   [junit4]   2> 589553 INFO  (TEST-ShardSplitTest.testSplitStaticIndexReplication-seed#[CAF547D8F23317BB]) [n:127.0.0.1:46803_cf_%2Fx     ] o.a.s.c.CorePropertiesLocator

[...truncated too long message...]

 [junit4]    >         at java.base@11.0.1/java.lang.Thread.run(Thread.java:834)
   [junit4]    >    7) Thread[id=4811, name=Session-HouseKeeper-7f7ea5bd, state=TIMED_WAITING, group=TGRP-ShardSplitTest]
   [junit4]    >         at java.base@11.0.1/jdk.internal.misc.Unsafe.park(Native Method)
   [junit4]    >         at java.base@11.0.1/java.util.concurrent.locks.LockSupport.parkNanos(LockSupport.java:234)
   [junit4]    >         at java.base@11.0.1/java.util.concurrent.locks.AbstractQueuedSynchronizer$ConditionObject.awaitNanos(AbstractQueuedSynchronizer.java:2123)
   [junit4]    >         at java.base@11.0.1/java.util.concurrent.ScheduledThreadPoolExecutor$DelayedWorkQueue.take(ScheduledThreadPoolExecutor.java:1182)
   [junit4]    >         at java.base@11.0.1/java.util.concurrent.ScheduledThreadPoolExecutor$DelayedWorkQueue.take(ScheduledThreadPoolExecutor.java:899)
   [junit4]    >         at java.base@11.0.1/java.util.concurrent.ThreadPoolExecutor.getTask(ThreadPoolExecutor.java:1054)
   [junit4]    >         at java.base@11.0.1/java.util.concurrent.ThreadPoolExecutor.runWorker(ThreadPoolExecutor.java:1114)
   [junit4]    >         at java.base@11.0.1/java.util.concurrent.ThreadPoolExecutor$Worker.run(ThreadPoolExecutor.java:628)
   [junit4]    >         at java.base@11.0.1/java.lang.Thread.run(Thread.java:834)
   [junit4]    >    8) Thread[id=4852, name=Connector-Scheduler-98522c4, state=WAITING, group=TGRP-ShardSplitTest]
   [junit4]    >         at java.base@11.0.1/jdk.internal.misc.Unsafe.park(Native Method)
   [junit4]    >         at java.base@11.0.1/java.util.concurrent.locks.LockSupport.park(LockSupport.java:194)
   [junit4]    >         at java.base@11.0.1/java.util.concurrent.locks.AbstractQueuedSynchronizer$ConditionObject.await(AbstractQueuedSynchronizer.java:2081)
   [junit4]    >         at java.base@11.0.1/java.util.concurrent.ScheduledThreadPoolExecutor$DelayedWorkQueue.take(ScheduledThreadPoolExecutor.java:1170)
   [junit4]    >         at java.base@11.0.1/java.util.concurrent.ScheduledThreadPoolExecutor$DelayedWorkQueue.take(ScheduledThreadPoolExecutor.java:899)
   [junit4]    >         at java.base@11.0.1/java.util.concurrent.ThreadPoolExecutor.getTask(ThreadPoolExecutor.java:1054)
   [junit4]    >         at java.base@11.0.1/java.util.concurrent.ThreadPoolExecutor.runWorker(ThreadPoolExecutor.java:1114)
   [junit4]    >         at java.base@11.0.1/java.util.concurrent.ThreadPoolExecutor$Worker.run(ThreadPoolExecutor.java:628)
   [junit4]    >         at java.base@11.0.1/java.lang.Thread.run(Thread.java:834)
   [junit4]    >    9) Thread[id=4807, name=qtp1659353078-4807, state=TIMED_WAITING, group=TGRP-ShardSplitTest]
   [junit4]    >         at java.base@11.0.1/jdk.internal.misc.Unsafe.park(Native Method)
   [junit4]    >         at java.base@11.0.1/java.util.concurrent.locks.LockSupport.parkNanos(LockSupport.java:234)
   [junit4]    >         at java.base@11.0.1/java.util.concurrent.locks.AbstractQueuedSynchronizer$ConditionObject.awaitNanos(AbstractQueuedSynchronizer.java:2123)
   [junit4]    >         at app//org.eclipse.jetty.util.BlockingArrayQueue.poll(BlockingArrayQueue.java:392)
   [junit4]    >         at app//org.eclipse.jetty.util.thread.QueuedThreadPool$Runner.idleJobPoll(QueuedThreadPool.java:850)
   [junit4]    >         at app//org.eclipse.jetty.util.thread.QueuedThreadPool$Runner.run(QueuedThreadPool.java:889)
   [junit4]    >         at java.base@11.0.1/java.lang.Thread.run(Thread.java:834)
   [junit4]    >   10) Thread[id=4810, name=qtp1659353078-4810, state=TIMED_WAITING, group=TGRP-ShardSplitTest]
   [junit4]    >         at java.base@11.0.1/jdk.internal.misc.Unsafe.park(Native Method)
   [junit4]    >         at java.base@11.0.1/java.util.concurrent.locks.LockSupport.parkNanos(LockSupport.java:234)
   [junit4]    >         at java.base@11.0.1/java.util.concurrent.locks.AbstractQueuedSynchronizer$ConditionObject.awaitNanos(AbstractQueuedSynchronizer.java:2123)
   [junit4]    >         at app//org.eclipse.jetty.util.BlockingArrayQueue.poll(BlockingArrayQueue.java:392)
   [junit4]    >         at app//org.eclipse.jetty.util.thread.QueuedThreadPool$Runner.idleJobPoll(QueuedThreadPool.java:850)
   [junit4]    >         at app//org.eclipse.jetty.util.thread.QueuedThreadPool$Runner.run(QueuedThreadPool.java:889)
   [junit4]    >         at java.base@11.0.1/java.lang.Thread.run(Thread.java:834)
   [junit4]    > at __randomizedtesting.SeedInfo.seed([CAF547D8F23317BB]:0)
   [junit4] Completed [182/876 (1!)] on J1 in 927.96s, 11 tests, 3 errors <<< FAILURES!

[...truncated 51131 lines...]
-ecj-javadoc-lint-tests:
    [mkdir] Created dir: /tmp/ecj496935458
 [ecj-lint] Compiling 48 source files to /tmp/ecj496935458
 [ecj-lint] invalid Class-Path header in manifest of jar file: /home/jenkins/.ivy2/cache/org.restlet.jee/org.restlet/jars/org.restlet-2.3.0.jar
 [ecj-lint] invalid Class-Path header in manifest of jar file: /home/jenkins/.ivy2/cache/org.restlet.jee/org.restlet.ext.servlet/jars/org.restlet.ext.servlet-2.3.0.jar
 [ecj-lint] ----------
 [ecj-lint] 1. ERROR in /home/jenkins/jenkins-slave/workspace/Lucene-Solr-NightlyTests-master/checkout/solr/contrib/dataimporthandler/src/test/org/apache/solr/handler/dataimport/MockInitialContextFactory.java (at line 23)
 [ecj-lint] import javax.naming.NamingException;
 [ecj-lint]       ^^^^^^^^^^^^^^^^^^^^^^^^^^^^
 [ecj-lint] The type javax.naming.NamingException is not accessible
 [ecj-lint] ----------
 [ecj-lint] 2. ERROR in /home/jenkins/jenkins-slave/workspace/Lucene-Solr-NightlyTests-master/checkout/solr/contrib/dataimporthandler/src/test/org/apache/solr/handler/dataimport/MockInitialContextFactory.java (at line 28)
 [ecj-lint] public class MockInitialContextFactory implements InitialContextFactory {
 [ecj-lint]             ^^^^^^^^^^^^^^^^^^^^^^^^^
 [ecj-lint] The type MockInitialContextFactory must implement the inherited abstract method InitialContextFactory.getInitialContext(Hashtable<?,?>)
 [ecj-lint] ----------
 [ecj-lint] 3. ERROR in /home/jenkins/jenkins-slave/workspace/Lucene-Solr-NightlyTests-master/checkout/solr/contrib/dataimporthandler/src/test/org/apache/solr/handler/dataimport/MockInitialContextFactory.java (at line 30)
 [ecj-lint] private final javax.naming.Context context;
 [ecj-lint]              ^^^^^^^^^^^^^^^^^^^^
 [ecj-lint] The type javax.naming.Context is not accessible
 [ecj-lint] ----------
 [ecj-lint] 4. ERROR in /home/jenkins/jenkins-slave/workspace/Lucene-Solr-NightlyTests-master/checkout/solr/contrib/dataimporthandler/src/test/org/apache/solr/handler/dataimport/MockInitialContextFactory.java (at line 33)
 [ecj-lint] context = mock(javax.naming.Context.class);
 [ecj-lint] ^^^^^^^
 [ecj-lint] context cannot be resolved to a variable
 [ecj-lint] ----------
 [ecj-lint] 5. ERROR in /home/jenkins/jenkins-slave/workspace/Lucene-Solr-NightlyTests-master/checkout/solr/contrib/dataimporthandler/src/test/org/apache/solr/handler/dataimport/MockInitialContextFactory.java (at line 33)
 [ecj-lint] context = mock(javax.naming.Context.class);
 [ecj-lint]               ^^^^^^^^^^^^^^^^^^^^
 [ecj-lint] The type javax.naming.Context is not accessible
 [ecj-lint] ----------
 [ecj-lint] 6. ERROR in /home/jenkins/jenkins-slave/workspace/Lucene-Solr-NightlyTests-master/checkout/solr/contrib/dataimporthandler/src/test/org/apache/solr/handler/dataimport/MockInitialContextFactory.java (at line 36)
 [ecj-lint] when(context.lookup(anyString())).thenAnswer(invocation -> objects.get(invocation.getArgument(0)));
 [ecj-lint]     ^^^^^^^
 [ecj-lint] context cannot be resolved
 [ecj-lint] ----------
 [ecj-lint] 7. ERROR in /home/jenkins/jenkins-slave/workspace/Lucene-Solr-NightlyTests-master/checkout/solr/contrib/dataimporthandler/src/test/org/apache/solr/handler/dataimport/MockInitialContextFactory.java (at line 38)
 [ecj-lint] } catch (NamingException e) {
 [ecj-lint]         ^^^^^^^^^^^^^^^
 [ecj-lint] NamingException cannot be resolved to a type
 [ecj-lint] ----------
 [ecj-lint] 8. ERROR in /home/jenkins/jenkins-slave/workspace/Lucene-Solr-NightlyTests-master/checkout/solr/contrib/dataimporthandler/src/test/org/apache/solr/handler/dataimport/MockInitialContextFactory.java (at line 45)
 [ecj-lint] public javax.naming.Context getInitialContext(Hashtable env) {
 [ecj-lint]       ^^^^^^^^^^^^^^^^^^^^
 [ecj-lint] The type javax.naming.Context is not accessible
 [ecj-lint] ----------
 [ecj-lint] 9. ERROR in /home/jenkins/jenkins-slave/workspace/Lucene-Solr-NightlyTests-master/checkout/solr/contrib/dataimporthandler/src/test/org/apache/solr/handler/dataimport/MockInitialContextFactory.java (at line 46)
 [ecj-lint] return context;
 [ecj-lint]       ^^^^^^^
 [ecj-lint] context cannot be resolved to a variable
 [ecj-lint] ----------
 [ecj-lint] 9 problems (9 errors)

BUILD FAILED
/home/jenkins/jenkins-slave/workspace/Lucene-Solr-NightlyTests-master/checkout/build.xml:652: The following error occurred while executing this line:
/home/jenkins/jenkins-slave/workspace/Lucene-Solr-NightlyTests-master/checkout/build.xml:101: The following error occurred while executing this line:
/home/jenkins/jenkins-slave/workspace/Lucene-Solr-NightlyTests-master/checkout/solr/build.xml:651: The following error occurred while executing this line:
/home/jenkins/jenkins-slave/workspace/Lucene-Solr-NightlyTests-master/checkout/solr/common-build.xml:479: The following error occurred while executing this line:
/home/jenkins/jenkins-slave/workspace/Lucene-Solr-NightlyTests-master/checkout/lucene/common-build.xml:2015: The following error occurred while executing this line:
/home/jenkins/jenkins-slave/workspace/Lucene-Solr-NightlyTests-master/checkout/lucene/common-build.xml:2048: Compile failed; see the compiler error output for details.

Total time: 456 minutes 44 seconds
Build step 'Invoke Ant' marked build as failure
Archiving artifacts
Recording test results
Email was triggered for: Failure - Any
Sending email for trigger: Failure - Any


---------------------------------------------------------------------
To unsubscribe, e-mail: [hidden email]
For additional commands, e-mail: [hidden email]
Reply | Threaded
Open this post in threaded view
|

[JENKINS] Lucene-Solr-NightlyTests-master - Build # 1957 - Still Failing

Apache Jenkins Server-2
Build: https://builds.apache.org/job/Lucene-Solr-NightlyTests-master/1957/

No tests ran.

Build Log:
[...truncated 25 lines...]
ERROR: Failed to check out http://svn.apache.org/repos/asf/lucene/test-data
org.tmatesoft.svn.core.SVNException: svn: E175002: connection refused by the server
svn: E175002: OPTIONS request failed on '/repos/asf/lucene/test-data'
        at org.tmatesoft.svn.core.internal.wc.SVNErrorManager.error(SVNErrorManager.java:112)
        at org.tmatesoft.svn.core.internal.wc.SVNErrorManager.error(SVNErrorManager.java:96)
        at org.tmatesoft.svn.core.internal.io.dav.http.HTTPConnection.request(HTTPConnection.java:765)
        at org.tmatesoft.svn.core.internal.io.dav.http.HTTPConnection.request(HTTPConnection.java:352)
        at org.tmatesoft.svn.core.internal.io.dav.http.HTTPConnection.request(HTTPConnection.java:340)
        at org.tmatesoft.svn.core.internal.io.dav.DAVConnection.performHttpRequest(DAVConnection.java:910)
        at org.tmatesoft.svn.core.internal.io.dav.DAVConnection.exchangeCapabilities(DAVConnection.java:702)
        at org.tmatesoft.svn.core.internal.io.dav.DAVConnection.open(DAVConnection.java:113)
        at org.tmatesoft.svn.core.internal.io.dav.DAVRepository.openConnection(DAVRepository.java:1035)
        at org.tmatesoft.svn.core.internal.io.dav.DAVRepository.getLatestRevision(DAVRepository.java:164)
        at org.tmatesoft.svn.core.internal.wc2.ng.SvnNgRepositoryAccess.getRevisionNumber(SvnNgRepositoryAccess.java:119)
        at org.tmatesoft.svn.core.internal.wc2.SvnRepositoryAccess.getLocations(SvnRepositoryAccess.java:178)
        at org.tmatesoft.svn.core.internal.wc2.ng.SvnNgRepositoryAccess.createRepositoryFor(SvnNgRepositoryAccess.java:43)
        at org.tmatesoft.svn.core.internal.wc2.ng.SvnNgAbstractUpdate.checkout(SvnNgAbstractUpdate.java:831)
        at org.tmatesoft.svn.core.internal.wc2.ng.SvnNgCheckout.run(SvnNgCheckout.java:26)
        at org.tmatesoft.svn.core.internal.wc2.ng.SvnNgCheckout.run(SvnNgCheckout.java:11)
        at org.tmatesoft.svn.core.internal.wc2.ng.SvnNgOperationRunner.run(SvnNgOperationRunner.java:20)
        at org.tmatesoft.svn.core.internal.wc2.SvnOperationRunner.run(SvnOperationRunner.java:21)
        at org.tmatesoft.svn.core.wc2.SvnOperationFactory.run(SvnOperationFactory.java:1239)
        at org.tmatesoft.svn.core.wc2.SvnOperation.run(SvnOperation.java:294)
        at hudson.scm.subversion.CheckoutUpdater$SubversionUpdateTask.perform(CheckoutUpdater.java:133)
        at hudson.scm.subversion.WorkspaceUpdater$UpdateTask.delegateTo(WorkspaceUpdater.java:168)
        at hudson.scm.subversion.WorkspaceUpdater$UpdateTask.delegateTo(WorkspaceUpdater.java:176)
        at hudson.scm.subversion.UpdateUpdater$TaskImpl.perform(UpdateUpdater.java:134)
        at hudson.scm.subversion.WorkspaceUpdater$UpdateTask.delegateTo(WorkspaceUpdater.java:168)
        at hudson.scm.SubversionSCM$CheckOutTask.perform(SubversionSCM.java:1041)
        at hudson.scm.SubversionSCM$CheckOutTask.invoke(SubversionSCM.java:1017)
        at hudson.scm.SubversionSCM$CheckOutTask.invoke(SubversionSCM.java:990)
        at hudson.FilePath$FileCallableWrapper.call(FilePath.java:3086)
        at hudson.remoting.UserRequest.perform(UserRequest.java:212)
        at hudson.remoting.UserRequest.perform(UserRequest.java:54)
        at hudson.remoting.Request$2.run(Request.java:369)
        at hudson.remoting.InterceptingExecutorService$1.call(InterceptingExecutorService.java:72)
        at java.util.concurrent.FutureTask.run(FutureTask.java:266)
        at java.util.concurrent.ThreadPoolExecutor.runWorker(ThreadPoolExecutor.java:1142)
        at java.util.concurrent.ThreadPoolExecutor$Worker.run(ThreadPoolExecutor.java:617)
        at java.lang.Thread.run(Thread.java:744)
Caused by: java.net.ConnectException: Connection refused
        at java.net.PlainSocketImpl.socketConnect(Native Method)
        at java.net.AbstractPlainSocketImpl.doConnect(AbstractPlainSocketImpl.java:345)
        at java.net.AbstractPlainSocketImpl.connectToAddress(AbstractPlainSocketImpl.java:206)
        at java.net.AbstractPlainSocketImpl.connect(AbstractPlainSocketImpl.java:188)
        at java.net.SocksSocketImpl.connect(SocksSocketImpl.java:392)
        at java.net.Socket.connect(Socket.java:589)
        at org.tmatesoft.svn.core.internal.util.SVNSocketConnection.run(SVNSocketConnection.java:57)
        at java.util.concurrent.Executors$RunnableAdapter.call(Executors.java:511)
        ... 4 more
java.net.ConnectException: Connection refused
        at java.net.PlainSocketImpl.socketConnect(Native Method)
        at java.net.AbstractPlainSocketImpl.doConnect(AbstractPlainSocketImpl.java:345)
        at java.net.AbstractPlainSocketImpl.connectToAddress(AbstractPlainSocketImpl.java:206)
        at java.net.AbstractPlainSocketImpl.connect(AbstractPlainSocketImpl.java:188)
        at java.net.SocksSocketImpl.connect(SocksSocketImpl.java:392)
        at java.net.Socket.connect(Socket.java:589)
        at org.tmatesoft.svn.core.internal.util.SVNSocketConnection.run(SVNSocketConnection.java:57)
        at java.util.concurrent.Executors$RunnableAdapter.call(Executors.java:511)
Caused: org.tmatesoft.svn.core.SVNException: svn: E175002: connection refused by the server
svn: E175002: OPTIONS request failed on '/repos/asf/lucene/test-data'
        at org.tmatesoft.svn.core.internal.wc.SVNErrorManager.error(SVNErrorManager.java:112)
        at org.tmatesoft.svn.core.internal.wc.SVNErrorManager.error(SVNErrorManager.java:96)
        at org.tmatesoft.svn.core.internal.io.dav.http.HTTPConnection.request(HTTPConnection.java:765)
        at org.tmatesoft.svn.core.internal.io.dav.http.HTTPConnection.request(HTTPConnection.java:352)
        at org.tmatesoft.svn.core.internal.io.dav.http.HTTPConnection.request(HTTPConnection.java:340)
        at org.tmatesoft.svn.core.internal.io.dav.DAVConnection.performHttpRequest(DAVConnection.java:910)
        at org.tmatesoft.svn.core.internal.io.dav.DAVConnection.exchangeCapabilities(DAVConnection.java:702)
        at org.tmatesoft.svn.core.internal.io.dav.DAVConnection.open(DAVConnection.java:113)
        at org.tmatesoft.svn.core.internal.io.dav.DAVRepository.openConnection(DAVRepository.java:1035)
        at org.tmatesoft.svn.core.internal.io.dav.DAVRepository.getLatestRevision(DAVRepository.java:164)
        at org.tmatesoft.svn.core.internal.wc2.ng.SvnNgRepositoryAccess.getRevisionNumber(SvnNgRepositoryAccess.java:119)
        at org.tmatesoft.svn.core.internal.wc2.SvnRepositoryAccess.getLocations(SvnRepositoryAccess.java:178)
        at org.tmatesoft.svn.core.internal.wc2.ng.SvnNgRepositoryAccess.createRepositoryFor(SvnNgRepositoryAccess.java:43)
        at org.tmatesoft.svn.core.internal.wc2.ng.SvnNgAbstractUpdate.checkout(SvnNgAbstractUpdate.java:831)
        at org.tmatesoft.svn.core.internal.wc2.ng.SvnNgCheckout.run(SvnNgCheckout.java:26)
        at org.tmatesoft.svn.core.internal.wc2.ng.SvnNgCheckout.run(SvnNgCheckout.java:11)
        at org.tmatesoft.svn.core.internal.wc2.ng.SvnNgOperationRunner.run(SvnNgOperationRunner.java:20)
        at org.tmatesoft.svn.core.internal.wc2.SvnOperationRunner.run(SvnOperationRunner.java:21)
        at org.tmatesoft.svn.core.wc2.SvnOperationFactory.run(SvnOperationFactory.java:1239)
        at org.tmatesoft.svn.core.wc2.SvnOperation.run(SvnOperation.java:294)
        at hudson.scm.subversion.CheckoutUpdater$SubversionUpdateTask.perform(CheckoutUpdater.java:133)
Also:   hudson.remoting.Channel$CallSiteStackTrace: Remote call to lucene
                at hudson.remoting.Channel.attachCallSiteStackTrace(Channel.java:1741)
                at hudson.remoting.UserRequest$ExceptionResponse.retrieve(UserRequest.java:357)
                at hudson.remoting.Channel.call(Channel.java:955)
                at hudson.FilePath.act(FilePath.java:1072)
                at hudson.FilePath.act(FilePath.java:1061)
                at hudson.scm.SubversionSCM.checkout(SubversionSCM.java:937)
                at hudson.scm.SubversionSCM.checkout(SubversionSCM.java:864)
                at org.jenkinsci.plugins.multiplescms.MultiSCM.checkout(MultiSCM.java:143)
                at hudson.scm.SCM.checkout(SCM.java:504)
                at hudson.model.AbstractProject.checkout(AbstractProject.java:1208)
                at hudson.model.AbstractBuild$AbstractBuildExecution.defaultCheckout(AbstractBuild.java:574)
                at jenkins.scm.SCMCheckoutStrategy.checkout(SCMCheckoutStrategy.java:86)
                at hudson.model.AbstractBuild$AbstractBuildExecution.run(AbstractBuild.java:499)
                at hudson.model.Run.execute(Run.java:1810)
                at hudson.model.FreeStyleBuild.run(FreeStyleBuild.java:43)
                at hudson.model.ResourceController.execute(ResourceController.java:97)
                at hudson.model.Executor.run(Executor.java:429)
Caused: java.io.IOException: Failed to check out http://svn.apache.org/repos/asf/lucene/test-data
        at hudson.scm.subversion.CheckoutUpdater$SubversionUpdateTask.perform(CheckoutUpdater.java:144)
        at hudson.scm.subversion.WorkspaceUpdater$UpdateTask.delegateTo(WorkspaceUpdater.java:168)
        at hudson.scm.subversion.WorkspaceUpdater$UpdateTask.delegateTo(WorkspaceUpdater.java:176)
        at hudson.scm.subversion.UpdateUpdater$TaskImpl.perform(UpdateUpdater.java:134)
        at hudson.scm.subversion.WorkspaceUpdater$UpdateTask.delegateTo(WorkspaceUpdater.java:168)
        at hudson.scm.SubversionSCM$CheckOutTask.perform(SubversionSCM.java:1041)
        at hudson.scm.SubversionSCM$CheckOutTask.invoke(SubversionSCM.java:1017)
        at hudson.scm.SubversionSCM$CheckOutTask.invoke(SubversionSCM.java:990)
        at hudson.FilePath$FileCallableWrapper.call(FilePath.java:3086)
        at hudson.remoting.UserRequest.perform(UserRequest.java:212)
        at hudson.remoting.UserRequest.perform(UserRequest.java:54)
        at hudson.remoting.Request$2.run(Request.java:369)
        at hudson.remoting.InterceptingExecutorService$1.call(InterceptingExecutorService.java:72)
        at java.util.concurrent.FutureTask.run(FutureTask.java:266)
        at java.util.concurrent.ThreadPoolExecutor.runWorker(ThreadPoolExecutor.java:1142)
        at java.util.concurrent.ThreadPoolExecutor$Worker.run(ThreadPoolExecutor.java:617)
        at java.lang.Thread.run(Thread.java:744)
Retrying after 10 seconds
No credentials specified
 > git rev-parse --is-inside-work-tree # timeout=10
Fetching changes from the remote Git repository
 > git config remote.origin.url https://gitbox.apache.org/repos/asf/lucene-solr.git # timeout=10
Fetching upstream changes from https://gitbox.apache.org/repos/asf/lucene-solr.git
 > git --version # timeout=10
 > git fetch --tags --progress https://gitbox.apache.org/repos/asf/lucene-solr.git +refs/heads/*:refs/remotes/origin/*
 > git rev-parse refs/remotes/origin/master^{commit} # timeout=10
 > git rev-parse refs/remotes/origin/origin/master^{commit} # timeout=10
Checking out Revision 2843f2f9fc4666c301189ec3aec98ca7ded5b901 (refs/remotes/origin/master)
 > git config core.sparsecheckout # timeout=10
 > git checkout -f 2843f2f9fc4666c301189ec3aec98ca7ded5b901
Commit message: "ant precommit GitHub action for all PRs (#870)"
Cleaning workspace
 > git rev-parse --verify HEAD # timeout=10
Resetting working tree
 > git reset --hard # timeout=10
 > git clean -fdx # timeout=10
Checking out a fresh workspace because /home/jenkins/jenkins-slave/workspace/Lucene-Solr-NightlyTests-master/test-data doesn't exist
Cleaning local Directory test-data
Checking out http://svn.apache.org/repos/asf/lucene/test-data at revision '2019-09-11T00:35:44.227 +0000'
ERROR: Failed to check out http://svn.apache.org/repos/asf/lucene/test-data
org.tmatesoft.svn.core.SVNException: svn: E175002: connection refused by the server
svn: E175002: OPTIONS request failed on '/repos/asf/lucene/test-data'
        at org.tmatesoft.svn.core.internal.wc.SVNErrorManager.error(SVNErrorManager.java:112)
        at org.tmatesoft.svn.core.internal.wc.SVNErrorManager.error(SVNErrorManager.java:96)
        at org.tmatesoft.svn.core.internal.io.dav.http.HTTPConnection.request(HTTPConnection.java:765)
        at org.tmatesoft.svn.core.internal.io.dav.http.HTTPConnection.request(HTTPConnection.java:352)
        at org.tmatesoft.svn.core.internal.io.dav.http.HTTPConnection.request(HTTPConnection.java:340)
        at org.tmatesoft.svn.core.internal.io.dav.DAVConnection.performHttpRequest(DAVConnection.java:910)
        at org.tmatesoft.svn.core.internal.io.dav.DAVConnection.exchangeCapabilities(DAVConnection.java:702)
        at org.tmatesoft.svn.core.internal.io.dav.DAVConnection.open(DAVConnection.java:113)
        at org.tmatesoft.svn.core.internal.io.dav.DAVRepository.openConnection(DAVRepository.java:1035)
        at org.tmatesoft.svn.core.internal.io.dav.DAVRepository.getLatestRevision(DAVRepository.java:164)
        at org.tmatesoft.svn.core.internal.wc2.ng.SvnNgRepositoryAccess.getRevisionNumber(SvnNgRepositoryAccess.java:119)
        at org.tmatesoft.svn.core.internal.wc2.SvnRepositoryAccess.getLocations(SvnRepositoryAccess.java:178)
        at org.tmatesoft.svn.core.internal.wc2.ng.SvnNgRepositoryAccess.createRepositoryFor(SvnNgRepositoryAccess.java:43)
        at org.tmatesoft.svn.core.internal.wc2.ng.SvnNgAbstractUpdate.checkout(SvnNgAbstractUpdate.java:831)
        at org.tmatesoft.svn.core.internal.wc2.ng.SvnNgCheckout.run(SvnNgCheckout.java:26)
        at org.tmatesoft.svn.core.internal.wc2.ng.SvnNgCheckout.run(SvnNgCheckout.java:11)
        at org.tmatesoft.svn.core.internal.wc2.ng.SvnNgOperationRunner.run(SvnNgOperationRunner.java:20)
        at org.tmatesoft.svn.core.internal.wc2.SvnOperationRunner.run(SvnOperationRunner.java:21)
        at org.tmatesoft.svn.core.wc2.SvnOperationFactory.run(SvnOperationFactory.java:1239)
        at org.tmatesoft.svn.core.wc2.SvnOperation.run(SvnOperation.java:294)
        at hudson.scm.subversion.CheckoutUpdater$SubversionUpdateTask.perform(CheckoutUpdater.java:133)
        at hudson.scm.subversion.WorkspaceUpdater$UpdateTask.delegateTo(WorkspaceUpdater.java:168)
        at hudson.scm.subversion.WorkspaceUpdater$UpdateTask.delegateTo(WorkspaceUpdater.java:176)
        at hudson.scm.subversion.UpdateUpdater$TaskImpl.perform(UpdateUpdater.java:134)
        at hudson.scm.subversion.WorkspaceUpdater$UpdateTask.delegateTo(WorkspaceUpdater.java:168)
        at hudson.scm.SubversionSCM$CheckOutTask.perform(SubversionSCM.java:1041)
        at hudson.scm.SubversionSCM$CheckOutTask.invoke(SubversionSCM.java:1017)
        at hudson.scm.SubversionSCM$CheckOutTask.invoke(SubversionSCM.java:990)
        at hudson.FilePath$FileCallableWrapper.call(FilePath.java:3086)
        at hudson.remoting.UserRequest.perform(UserRequest.java:212)
        at hudson.remoting.UserRequest.perform(UserRequest.java:54)
        at hudson.remoting.Request$2.run(Request.java:369)
        at hudson.remoting.InterceptingExecutorService$1.call(InterceptingExecutorService.java:72)
        at java.util.concurrent.FutureTask.run(FutureTask.java:266)
        at java.util.concurrent.ThreadPoolExecutor.runWorker(ThreadPoolExecutor.java:1142)
        at java.util.concurrent.ThreadPoolExecutor$Worker.run(ThreadPoolExecutor.java:617)
        at java.lang.Thread.run(Thread.java:744)
Caused by: java.net.ConnectException: Connection refused
        at java.net.PlainSocketImpl.socketConnect(Native Method)
        at java.net.AbstractPlainSocketImpl.doConnect(AbstractPlainSocketImpl.java:345)
        at java.net.AbstractPlainSocketImpl.connectToAddress(AbstractPlainSocketImpl.java:206)
        at java.net.AbstractPlainSocketImpl.connect(AbstractPlainSocketImpl.java:188)
        at java.net.SocksSocketImpl.connect(SocksSocketImpl.java:392)
        at java.net.Socket.connect(Socket.java:589)
        at org.tmatesoft.svn.core.internal.util.SVNSocketConnection.run(SVNSocketConnection.java:57)
        at java.util.concurrent.Executors$RunnableAdapter.call(Executors.java:511)
        ... 4 more
java.net.ConnectException: Connection refused
        at java.net.PlainSocketImpl.socketConnect(Native Method)
        at java.net.AbstractPlainSocketImpl.doConnect(AbstractPlainSocketImpl.java:345)
        at java.net.AbstractPlainSocketImpl.connectToAddress(AbstractPlainSocketImpl.java:206)
        at java.net.AbstractPlainSocketImpl.connect(AbstractPlainSocketImpl.java:188)
        at java.net.SocksSocketImpl.connect(SocksSocketImpl.java:392)
        at java.net.Socket.connect(Socket.java:589)
        at org.tmatesoft.svn.core.internal.util.SVNSocketConnection.run(SVNSocketConnection.java:57)
        at java.util.concurrent.Executors$RunnableAdapter.call(Executors.java:511)
Caused: org.tmatesoft.svn.core.SVNException: svn: E175002: connection refused by the server
svn: E175002: OPTIONS request failed on '/repos/asf/lucene/test-data'
        at org.tmatesoft.svn.core.internal.wc.SVNErrorManager.error(SVNErrorManager.java:112)
        at org.tmatesoft.svn.core.internal.wc.SVNErrorManager.error(SVNErrorManager.java:96)
        at org.tmatesoft.svn.core.internal.io.dav.http.HTTPConnection.request(HTTPConnection.java:765)
        at org.tmatesoft.svn.core.internal.io.dav.http.HTTPConnection.request(HTTPConnection.java:352)
        at org.tmatesoft.svn.core.internal.io.dav.http.HTTPConnection.request(HTTPConnection.java:340)
        at org.tmatesoft.svn.core.internal.io.dav.DAVConnection.performHttpRequest(DAVConnection.java:910)
        at org.tmatesoft.svn.core.internal.io.dav.DAVConnection.exchangeCapabilities(DAVConnection.java:702)
        at org.tmatesoft.svn.core.internal.io.dav.DAVConnection.open(DAVConnection.java:113)
        at org.tmatesoft.svn.core.internal.io.dav.DAVRepository.openConnection(DAVRepository.java:1035)
        at org.tmatesoft.svn.core.internal.io.dav.DAVRepository.getLatestRevision(DAVRepository.java:164)
        at org.tmatesoft.svn.core.internal.wc2.ng.SvnNgRepositoryAccess.getRevisionNumber(SvnNgRepositoryAccess.java:119)
        at org.tmatesoft.svn.core.internal.wc2.SvnRepositoryAccess.getLocations(SvnRepositoryAccess.java:178)
        at org.tmatesoft.svn.core.internal.wc2.ng.SvnNgRepositoryAccess.createRepositoryFor(SvnNgRepositoryAccess.java:43)
        at org.tmatesoft.svn.core.internal.wc2.ng.SvnNgAbstractUpdate.checkout(SvnNgAbstractUpdate.java:831)
        at org.tmatesoft.svn.core.internal.wc2.ng.SvnNgCheckout.run(SvnNgCheckout.java:26)
        at org.tmatesoft.svn.core.internal.wc2.ng.SvnNgCheckout.run(SvnNgCheckout.java:11)
        at org.tmatesoft.svn.core.internal.wc2.ng.SvnNgOperationRunner.run(SvnNgOperationRunner.java:20)
        at org.tmatesoft.svn.core.internal.wc2.SvnOperationRunner.run(SvnOperationRunner.java:21)
        at org.tmatesoft.svn.core.wc2.SvnOperationFactory.run(SvnOperationFactory.java:1239)
        at org.tmatesoft.svn.core.wc2.SvnOperation.run(SvnOperation.java:294)
        at hudson.scm.subversion.CheckoutUpdater$SubversionUpdateTask.perform(CheckoutUpdater.java:133)
Also:   hudson.remoting.Channel$CallSiteStackTrace: Remote call to lucene
                at hudson.remoting.Channel.attachCallSiteStackTrace(Channel.java:1741)
                at hudson.remoting.UserRequest$ExceptionResponse.retrieve(UserRequest.java:357)
                at hudson.remoting.Channel.call(Channel.java:955)
                at hudson.FilePath.act(FilePath.java:1072)
                at hudson.FilePath.act(FilePath.java:1061)
                at hudson.scm.SubversionSCM.checkout(SubversionSCM.java:937)
                at hudson.scm.SubversionSCM.checkout(SubversionSCM.java:864)
                at org.jenkinsci.plugins.multiplescms.MultiSCM.checkout(MultiSCM.java:143)
                at hudson.scm.SCM.checkout(SCM.java:504)
                at hudson.model.AbstractProject.checkout(AbstractProject.java:1208)
                at hudson.model.AbstractBuild$AbstractBuildExecution.defaultCheckout(AbstractBuild.java:574)
                at jenkins.scm.SCMCheckoutStrategy.checkout(SCMCheckoutStrategy.java:86)
                at hudson.model.AbstractBuild$AbstractBuildExecution.run(AbstractBuild.java:499)
                at hudson.model.Run.execute(Run.java:1810)
                at hudson.model.FreeStyleBuild.run(FreeStyleBuild.java:43)
                at hudson.model.ResourceController.execute(ResourceController.java:97)
                at hudson.model.Executor.run(Executor.java:429)
Caused: java.io.IOException: Failed to check out http://svn.apache.org/repos/asf/lucene/test-data
        at hudson.scm.subversion.CheckoutUpdater$SubversionUpdateTask.perform(CheckoutUpdater.java:144)
        at hudson.scm.subversion.WorkspaceUpdater$UpdateTask.delegateTo(WorkspaceUpdater.java:168)
        at hudson.scm.subversion.WorkspaceUpdater$UpdateTask.delegateTo(WorkspaceUpdater.java:176)
        at hudson.scm.subversion.UpdateUpdater$TaskImpl.perform(UpdateUpdater.java:134)
        at hudson.scm.subversion.WorkspaceUpdater$UpdateTask.delegateTo(WorkspaceUpdater.java:168)
        at hudson.scm.SubversionSCM$CheckOutTask.perform(SubversionSCM.java:1041)
        at hudson.scm.SubversionSCM$CheckOutTask.invoke(SubversionSCM.java:1017)
        at hudson.scm.SubversionSCM$CheckOutTask.invoke(SubversionSCM.java:990)
        at hudson.FilePath$FileCallableWrapper.call(FilePath.java:3086)
        at hudson.remoting.UserRequest.perform(UserRequest.java:212)
        at hudson.remoting.UserRequest.perform(UserRequest.java:54)
        at hudson.remoting.Request$2.run(Request.java:369)
        at hudson.remoting.InterceptingExecutorService$1.call(InterceptingExecutorService.java:72)
        at java.util.concurrent.FutureTask.run(FutureTask.java:266)
        at java.util.concurrent.ThreadPoolExecutor.runWorker(ThreadPoolExecutor.java:1142)
        at java.util.concurrent.ThreadPoolExecutor$Worker.run(ThreadPoolExecutor.java:617)
        at java.lang.Thread.run(Thread.java:744)
Retrying after 10 seconds
No credentials specified
 > git rev-parse --is-inside-work-tree # timeout=10
Fetching changes from the remote Git repository
 > git config remote.origin.url https://gitbox.apache.org/repos/asf/lucene-solr.git # timeout=10
Fetching upstream changes from https://gitbox.apache.org/repos/asf/lucene-solr.git
 > git --version # timeout=10
 > git fetch --tags --progress https://gitbox.apache.org/repos/asf/lucene-solr.git +refs/heads/*:refs/remotes/origin/*
 > git rev-parse refs/remotes/origin/master^{commit} # timeout=10
 > git rev-parse refs/remotes/origin/origin/master^{commit} # timeout=10
Checking out Revision 2843f2f9fc4666c301189ec3aec98ca7ded5b901 (refs/remotes/origin/master)
 > git config core.sparsecheckout # timeout=10
 > git checkout -f 2843f2f9fc4666c301189ec3aec98ca7ded5b901
Commit message: "ant precommit GitHub action for all PRs (#870)"
Cleaning workspace
 > git rev-parse --verify HEAD # timeout=10
Resetting working tree
 > git reset --hard # timeout=10
 > git clean -fdx # timeout=10
Checking out a fresh workspace because /home/jenkins/jenkins-slave/workspace/Lucene-Solr-NightlyTests-master/test-data doesn't exist
Cleaning local Directory test-data
Checking out http://svn.apache.org/repos/asf/lucene/test-data at revision '2019-09-11T00:35:44.227 +0000'
ERROR: Failed to check out http://svn.apache.org/repos/asf/lucene/test-data
org.tmatesoft.svn.core.SVNException: svn: E175002: connection refused by the server
svn: E175002: OPTIONS request failed on '/repos/asf/lucene/test-data'
        at org.tmatesoft.svn.core.internal.wc.SVNErrorManager.error(SVNErrorManager.java:112)
        at org.tmatesoft.svn.core.internal.wc.SVNErrorManager.error(SVNErrorManager.java:96)
        at org.tmatesoft.svn.core.internal.io.dav.http.HTTPConnection.request(HTTPConnection.java:765)
        at org.tmatesoft.svn.core.internal.io.dav.http.HTTPConnection.request(HTTPConnection.java:352)
        at org.tmatesoft.svn.core.internal.io.dav.http.HTTPConnection.request(HTTPConnection.java:340)
        at org.tmatesoft.svn.core.internal.io.dav.DAVConnection.performHttpRequest(DAVConnection.java:910)
        at org.tmatesoft.svn.core.internal.io.dav.DAVConnection.exchangeCapabilities(DAVConnection.java:702)
        at org.tmatesoft.svn.core.internal.io.dav.DAVConnection.open(DAVConnection.java:113)
        at org.tmatesoft.svn.core.internal.io.dav.DAVRepository.openConnection(DAVRepository.java:1035)
        at org.tmatesoft.svn.core.internal.io.dav.DAVRepository.getLatestRevision(DAVRepository.java:164)
        at org.tmatesoft.svn.core.internal.wc2.ng.SvnNgRepositoryAccess.getRevisionNumber(SvnNgRepositoryAccess.java:119)
        at org.tmatesoft.svn.core.internal.wc2.SvnRepositoryAccess.getLocations(SvnRepositoryAccess.java:178)
        at org.tmatesoft.svn.core.internal.wc2.ng.SvnNgRepositoryAccess.createRepositoryFor(SvnNgRepositoryAccess.java:43)
        at org.tmatesoft.svn.core.internal.wc2.ng.SvnNgAbstractUpdate.checkout(SvnNgAbstractUpdate.java:831)
        at org.tmatesoft.svn.core.internal.wc2.ng.SvnNgCheckout.run(SvnNgCheckout.java:26)
        at org.tmatesoft.svn.core.internal.wc2.ng.SvnNgCheckout.run(SvnNgCheckout.java:11)
        at org.tmatesoft.svn.core.internal.wc2.ng.SvnNgOperationRunner.run(SvnNgOperationRunner.java:20)
        at org.tmatesoft.svn.core.internal.wc2.SvnOperationRunner.run(SvnOperationRunner.java:21)
        at org.tmatesoft.svn.core.wc2.SvnOperationFactory.run(SvnOperationFactory.java:1239)
        at org.tmatesoft.svn.core.wc2.SvnOperation.run(SvnOperation.java:294)
        at hudson.scm.subversion.CheckoutUpdater$SubversionUpdateTask.perform(CheckoutUpdater.java:133)
        at hudson.scm.subversion.WorkspaceUpdater$UpdateTask.delegateTo(WorkspaceUpdater.java:168)
        at hudson.scm.subversion.WorkspaceUpdater$UpdateTask.delegateTo(WorkspaceUpdater.java:176)
        at hudson.scm.subversion.UpdateUpdater$TaskImpl.perform(UpdateUpdater.java:134)
        at hudson.scm.subversion.WorkspaceUpdater$UpdateTask.delegateTo(WorkspaceUpdater.java:168)
        at hudson.scm.SubversionSCM$CheckOutTask.perform(SubversionSCM.java:1041)
        at hudson.scm.SubversionSCM$CheckOutTask.invoke(SubversionSCM.java:1017)
        at hudson.scm.SubversionSCM$CheckOutTask.invoke(SubversionSCM.java:990)
        at hudson.FilePath$FileCallableWrapper.call(FilePath.java:3086)
        at hudson.remoting.UserRequest.perform(UserRequest.java:212)
        at hudson.remoting.UserRequest.perform(UserRequest.java:54)
        at hudson.remoting.Request$2.run(Request.java:369)
        at hudson.remoting.InterceptingExecutorService$1.call(InterceptingExecutorService.java:72)
        at java.util.concurrent.FutureTask.run(FutureTask.java:266)
        at java.util.concurrent.ThreadPoolExecutor.runWorker(ThreadPoolExecutor.java:1142)
        at java.util.concurrent.ThreadPoolExecutor$Worker.run(ThreadPoolExecutor.java:617)
        at java.lang.Thread.run(Thread.java:744)
Caused by: java.net.ConnectException: Connection refused
        at java.net.PlainSocketImpl.socketConnect(Native Method)
        at java.net.AbstractPlainSocketImpl.doConnect(AbstractPlainSocketImpl.java:345)
        at java.net.AbstractPlainSocketImpl.connectToAddress(AbstractPlainSocketImpl.java:206)
        at java.net.AbstractPlainSocketImpl.connect(AbstractPlainSocketImpl.java:188)
        at java.net.SocksSocketImpl.connect(SocksSocketImpl.java:392)
        at java.net.Socket.connect(Socket.java:589)
        at org.tmatesoft.svn.core.internal.util.SVNSocketConnection.run(SVNSocketConnection.java:57)
        at java.util.concurrent.Executors$RunnableAdapter.call(Executors.java:511)
        ... 4 more
java.net.ConnectException: Connection refused
        at java.net.PlainSocketImpl.socketConnect(Native Method)
        at java.net.AbstractPlainSocketImpl.doConnect(AbstractPlainSocketImpl.java:345)
        at java.net.AbstractPlainSocketImpl.connectToAddress(AbstractPlainSocketImpl.java:206)
        at java.net.AbstractPlainSocketImpl.connect(AbstractPlainSocketImpl.java:188)
        at java.net.SocksSocketImpl.connect(SocksSocketImpl.java:392)
        at java.net.Socket.connect(Socket.java:589)
        at org.tmatesoft.svn.core.internal.util.SVNSocketConnection.run(SVNSocketConnection.java:57)
        at java.util.concurrent.Executors$RunnableAdapter.call(Executors.java:511)
Caused: org.tmatesoft.svn.core.SVNException: svn: E175002: connection refused by the server
svn: E175002: OPTIONS request failed on '/repos/asf/lucene/test-data'
        at org.tmatesoft.svn.core.internal.wc.SVNErrorManager.error(SVNErrorManager.java:112)
        at org.tmatesoft.svn.core.internal.wc.SVNErrorManager.error(SVNErrorManager.java:96)
        at org.tmatesoft.svn.core.internal.io.dav.http.HTTPConnection.request(HTTPConnection.java:765)
        at org.tmatesoft.svn.core.internal.io.dav.http.HTTPConnection.request(HTTPConnection.java:352)
        at org.tmatesoft.svn.core.internal.io.dav.http.HTTPConnection.request(HTTPConnection.java:340)
        at org.tmatesoft.svn.core.internal.io.dav.DAVConnection.performHttpRequest(DAVConnection.java:910)
        at org.tmatesoft.svn.core.internal.io.dav.DAVConnection.exchangeCapabilities(DAVConnection.java:702)
        at org.tmatesoft.svn.core.internal.io.dav.DAVConnection.open(DAVConnection.java:113)
        at org.tmatesoft.svn.core.internal.io.dav.DAVRepository.openConnection(DAVRepository.java:1035)
        at org.tmatesoft.svn.core.internal.io.dav.DAVRepository.getLatestRevision(DAVRepository.java:164)
        at org.tmatesoft.svn.core.internal.wc2.ng.SvnNgRepositoryAccess.getRevisionNumber(SvnNgRepositoryAccess.java:119)
        at org.tmatesoft.svn.core.internal.wc2.SvnRepositoryAccess.getLocations(SvnRepositoryAccess.java:178)
        at org.tmatesoft.svn.core.internal.wc2.ng.SvnNgRepositoryAccess.createRepositoryFor(SvnNgRepositoryAccess.java:43)
        at org.tmatesoft.svn.core.internal.wc2.ng.SvnNgAbstractUpdate.checkout(SvnNgAbstractUpdate.java:831)
        at org.tmatesoft.svn.core.internal.wc2.ng.SvnNgCheckout.run(SvnNgCheckout.java:26)
        at org.tmatesoft.svn.core.internal.wc2.ng.SvnNgCheckout.run(SvnNgCheckout.java:11)
        at org.tmatesoft.svn.core.internal.wc2.ng.SvnNgOperationRunner.run(SvnNgOperationRunner.java:20)
        at org.tmatesoft.svn.core.internal.wc2.SvnOperationRunner.run(SvnOperationRunner.java:21)
        at org.tmatesoft.svn.core.wc2.SvnOperationFactory.run(SvnOperationFactory.java:1239)
        at org.tmatesoft.svn.core.wc2.SvnOperation.run(SvnOperation.java:294)
        at hudson.scm.subversion.CheckoutUpdater$SubversionUpdateTask.perform(CheckoutUpdater.java:133)
Also:   hudson.remoting.Channel$CallSiteStackTrace: Remote call to lucene
                at hudson.remoting.Channel.attachCallSiteStackTrace(Channel.java:1741)
                at hudson.remoting.UserRequest$ExceptionResponse.retrieve(UserRequest.java:357)
                at hudson.remoting.Channel.call(Channel.java:955)
                at hudson.FilePath.act(FilePath.java:1072)
                at hudson.FilePath.act(FilePath.java:1061)
                at hudson.scm.SubversionSCM.checkout(SubversionSCM.java:937)
                at hudson.scm.SubversionSCM.checkout(SubversionSCM.java:864)
                at org.jenkinsci.plugins.multiplescms.MultiSCM.checkout(MultiSCM.java:143)
                at hudson.scm.SCM.checkout(SCM.java:504)
                at hudson.model.AbstractProject.checkout(AbstractProject.java:1208)
                at hudson.model.AbstractBuild$AbstractBuildExecution.defaultCheckout(AbstractBuild.java:574)
                at jenkins.scm.SCMCheckoutStrategy.checkout(SCMCheckoutStrategy.java:86)
                at hudson.model.AbstractBuild$AbstractBuildExecution.run(AbstractBuild.java:499)
                at hudson.model.Run.execute(Run.java:1810)
                at hudson.model.FreeStyleBuild.run(FreeStyleBuild.java:43)
                at hudson.model.ResourceController.execute(ResourceController.java:97)
                at hudson.model.Executor.run(Executor.java:429)
Caused: java.io.IOException: Failed to check out http://svn.apache.org/repos/asf/lucene/test-data
        at hudson.scm.subversion.CheckoutUpdater$SubversionUpdateTask.perform(CheckoutUpdater.java:144)
        at hudson.scm.subversion.WorkspaceUpdater$UpdateTask.delegateTo(WorkspaceUpdater.java:168)
        at hudson.scm.subversion.WorkspaceUpdater$UpdateTask.delegateTo(WorkspaceUpdater.java:176)
        at hudson.scm.subversion.UpdateUpdater$TaskImpl.perform(UpdateUpdater.java:134)
        at hudson.scm.subversion.WorkspaceUpdater$UpdateTask.delegateTo(WorkspaceUpdater.java:168)
        at hudson.scm.SubversionSCM$CheckOutTask.perform(SubversionSCM.java:1041)
        at hudson.scm.SubversionSCM$CheckOutTask.invoke(SubversionSCM.java:1017)
        at hudson.scm.SubversionSCM$CheckOutTask.invoke(SubversionSCM.java:990)
        at hudson.FilePath$FileCallableWrapper.call(FilePath.java:3086)
        at hudson.remoting.UserRequest.perform(UserRequest.java:212)
        at hudson.remoting.UserRequest.perform(UserRequest.java:54)
        at hudson.remoting.Request$2.run(Request.java:369)
        at hudson.remoting.InterceptingExecutorService$1.call(InterceptingExecutorService.java:72)
        at java.util.concurrent.FutureTask.run(FutureTask.java:266)
        at java.util.concurrent.ThreadPoolExecutor.runWorker(ThreadPoolExecutor.java:1142)
        at java.util.concurrent.ThreadPoolExecutor$Worker.run(ThreadPoolExecutor.java:617)
        at java.lang.Thread.run(Thread.java:744)
Archiving artifacts
Recording test results
ERROR: Step ‘Publish JUnit test result report’ failed: No test report files were found. Configuration error?
Email was triggered for: Failure - Any
Sending email for trigger: Failure - Any


---------------------------------------------------------------------
To unsubscribe, e-mail: [hidden email]
For additional commands, e-mail: [hidden email]
Reply | Threaded
Open this post in threaded view
|

[JENKINS] Lucene-Solr-NightlyTests-master - Build # 1958 - Still Failing

Apache Jenkins Server-2
Build: https://builds.apache.org/job/Lucene-Solr-NightlyTests-master/1958/

No tests ran.

Build Log:
[...truncated 25 lines...]
ERROR: Failed to check out http://svn.apache.org/repos/asf/lucene/test-data
org.tmatesoft.svn.core.SVNException: svn: E175002: connection refused by the server
svn: E175002: OPTIONS request failed on '/repos/asf/lucene/test-data'
        at org.tmatesoft.svn.core.internal.wc.SVNErrorManager.error(SVNErrorManager.java:112)
        at org.tmatesoft.svn.core.internal.wc.SVNErrorManager.error(SVNErrorManager.java:96)
        at org.tmatesoft.svn.core.internal.io.dav.http.HTTPConnection.request(HTTPConnection.java:765)
        at org.tmatesoft.svn.core.internal.io.dav.http.HTTPConnection.request(HTTPConnection.java:352)
        at org.tmatesoft.svn.core.internal.io.dav.http.HTTPConnection.request(HTTPConnection.java:340)
        at org.tmatesoft.svn.core.internal.io.dav.DAVConnection.performHttpRequest(DAVConnection.java:910)
        at org.tmatesoft.svn.core.internal.io.dav.DAVConnection.exchangeCapabilities(DAVConnection.java:702)
        at org.tmatesoft.svn.core.internal.io.dav.DAVConnection.open(DAVConnection.java:113)
        at org.tmatesoft.svn.core.internal.io.dav.DAVRepository.openConnection(DAVRepository.java:1035)
        at org.tmatesoft.svn.core.internal.io.dav.DAVRepository.getLatestRevision(DAVRepository.java:164)
        at org.tmatesoft.svn.core.internal.wc2.ng.SvnNgRepositoryAccess.getRevisionNumber(SvnNgRepositoryAccess.java:119)
        at org.tmatesoft.svn.core.internal.wc2.SvnRepositoryAccess.getLocations(SvnRepositoryAccess.java:178)
        at org.tmatesoft.svn.core.internal.wc2.ng.SvnNgRepositoryAccess.createRepositoryFor(SvnNgRepositoryAccess.java:43)
        at org.tmatesoft.svn.core.internal.wc2.ng.SvnNgAbstractUpdate.checkout(SvnNgAbstractUpdate.java:831)
        at org.tmatesoft.svn.core.internal.wc2.ng.SvnNgCheckout.run(SvnNgCheckout.java:26)
        at org.tmatesoft.svn.core.internal.wc2.ng.SvnNgCheckout.run(SvnNgCheckout.java:11)
        at org.tmatesoft.svn.core.internal.wc2.ng.SvnNgOperationRunner.run(SvnNgOperationRunner.java:20)
        at org.tmatesoft.svn.core.internal.wc2.SvnOperationRunner.run(SvnOperationRunner.java:21)
        at org.tmatesoft.svn.core.wc2.SvnOperationFactory.run(SvnOperationFactory.java:1239)
        at org.tmatesoft.svn.core.wc2.SvnOperation.run(SvnOperation.java:294)
        at hudson.scm.subversion.CheckoutUpdater$SubversionUpdateTask.perform(CheckoutUpdater.java:133)
        at hudson.scm.subversion.WorkspaceUpdater$UpdateTask.delegateTo(WorkspaceUpdater.java:168)
        at hudson.scm.subversion.WorkspaceUpdater$UpdateTask.delegateTo(WorkspaceUpdater.java:176)
        at hudson.scm.subversion.UpdateUpdater$TaskImpl.perform(UpdateUpdater.java:134)
        at hudson.scm.subversion.WorkspaceUpdater$UpdateTask.delegateTo(WorkspaceUpdater.java:168)
        at hudson.scm.SubversionSCM$CheckOutTask.perform(SubversionSCM.java:1041)
        at hudson.scm.SubversionSCM$CheckOutTask.invoke(SubversionSCM.java:1017)
        at hudson.scm.SubversionSCM$CheckOutTask.invoke(SubversionSCM.java:990)
        at hudson.FilePath$FileCallableWrapper.call(FilePath.java:3086)
        at hudson.remoting.UserRequest.perform(UserRequest.java:212)
        at hudson.remoting.UserRequest.perform(UserRequest.java:54)
        at hudson.remoting.Request$2.run(Request.java:369)
        at hudson.remoting.InterceptingExecutorService$1.call(InterceptingExecutorService.java:72)
        at java.util.concurrent.FutureTask.run(FutureTask.java:266)
        at java.util.concurrent.ThreadPoolExecutor.runWorker(ThreadPoolExecutor.java:1142)
        at java.util.concurrent.ThreadPoolExecutor$Worker.run(ThreadPoolExecutor.java:617)
        at java.lang.Thread.run(Thread.java:744)
Caused by: java.net.ConnectException: Connection refused
        at java.net.PlainSocketImpl.socketConnect(Native Method)
        at java.net.AbstractPlainSocketImpl.doConnect(AbstractPlainSocketImpl.java:345)
        at java.net.AbstractPlainSocketImpl.connectToAddress(AbstractPlainSocketImpl.java:206)
        at java.net.AbstractPlainSocketImpl.connect(AbstractPlainSocketImpl.java:188)
        at java.net.SocksSocketImpl.connect(SocksSocketImpl.java:392)
        at java.net.Socket.connect(Socket.java:589)
        at org.tmatesoft.svn.core.internal.util.SVNSocketConnection.run(SVNSocketConnection.java:57)
        at java.util.concurrent.Executors$RunnableAdapter.call(Executors.java:511)
        ... 4 more
java.net.ConnectException: Connection refused
        at java.net.PlainSocketImpl.socketConnect(Native Method)
        at java.net.AbstractPlainSocketImpl.doConnect(AbstractPlainSocketImpl.java:345)
        at java.net.AbstractPlainSocketImpl.connectToAddress(AbstractPlainSocketImpl.java:206)
        at java.net.AbstractPlainSocketImpl.connect(AbstractPlainSocketImpl.java:188)
        at java.net.SocksSocketImpl.connect(SocksSocketImpl.java:392)
        at java.net.Socket.connect(Socket.java:589)
        at org.tmatesoft.svn.core.internal.util.SVNSocketConnection.run(SVNSocketConnection.java:57)
        at java.util.concurrent.Executors$RunnableAdapter.call(Executors.java:511)
Caused: org.tmatesoft.svn.core.SVNException: svn: E175002: connection refused by the server
svn: E175002: OPTIONS request failed on '/repos/asf/lucene/test-data'
        at org.tmatesoft.svn.core.internal.wc.SVNErrorManager.error(SVNErrorManager.java:112)
        at org.tmatesoft.svn.core.internal.wc.SVNErrorManager.error(SVNErrorManager.java:96)
        at org.tmatesoft.svn.core.internal.io.dav.http.HTTPConnection.request(HTTPConnection.java:765)
        at org.tmatesoft.svn.core.internal.io.dav.http.HTTPConnection.request(HTTPConnection.java:352)
        at org.tmatesoft.svn.core.internal.io.dav.http.HTTPConnection.request(HTTPConnection.java:340)
        at org.tmatesoft.svn.core.internal.io.dav.DAVConnection.performHttpRequest(DAVConnection.java:910)
        at org.tmatesoft.svn.core.internal.io.dav.DAVConnection.exchangeCapabilities(DAVConnection.java:702)
        at org.tmatesoft.svn.core.internal.io.dav.DAVConnection.open(DAVConnection.java:113)
        at org.tmatesoft.svn.core.internal.io.dav.DAVRepository.openConnection(DAVRepository.java:1035)
        at org.tmatesoft.svn.core.internal.io.dav.DAVRepository.getLatestRevision(DAVRepository.java:164)
        at org.tmatesoft.svn.core.internal.wc2.ng.SvnNgRepositoryAccess.getRevisionNumber(SvnNgRepositoryAccess.java:119)
        at org.tmatesoft.svn.core.internal.wc2.SvnRepositoryAccess.getLocations(SvnRepositoryAccess.java:178)
        at org.tmatesoft.svn.core.internal.wc2.ng.SvnNgRepositoryAccess.createRepositoryFor(SvnNgRepositoryAccess.java:43)
        at org.tmatesoft.svn.core.internal.wc2.ng.SvnNgAbstractUpdate.checkout(SvnNgAbstractUpdate.java:831)
        at org.tmatesoft.svn.core.internal.wc2.ng.SvnNgCheckout.run(SvnNgCheckout.java:26)
        at org.tmatesoft.svn.core.internal.wc2.ng.SvnNgCheckout.run(SvnNgCheckout.java:11)
        at org.tmatesoft.svn.core.internal.wc2.ng.SvnNgOperationRunner.run(SvnNgOperationRunner.java:20)
        at org.tmatesoft.svn.core.internal.wc2.SvnOperationRunner.run(SvnOperationRunner.java:21)
        at org.tmatesoft.svn.core.wc2.SvnOperationFactory.run(SvnOperationFactory.java:1239)
        at org.tmatesoft.svn.core.wc2.SvnOperation.run(SvnOperation.java:294)
        at hudson.scm.subversion.CheckoutUpdater$SubversionUpdateTask.perform(CheckoutUpdater.java:133)
Also:   hudson.remoting.Channel$CallSiteStackTrace: Remote call to lucene
                at hudson.remoting.Channel.attachCallSiteStackTrace(Channel.java:1741)
                at hudson.remoting.UserRequest$ExceptionResponse.retrieve(UserRequest.java:357)
                at hudson.remoting.Channel.call(Channel.java:955)
                at hudson.FilePath.act(FilePath.java:1072)
                at hudson.FilePath.act(FilePath.java:1061)
                at hudson.scm.SubversionSCM.checkout(SubversionSCM.java:937)
                at hudson.scm.SubversionSCM.checkout(SubversionSCM.java:864)
                at org.jenkinsci.plugins.multiplescms.MultiSCM.checkout(MultiSCM.java:143)
                at hudson.scm.SCM.checkout(SCM.java:504)
                at hudson.model.AbstractProject.checkout(AbstractProject.java:1208)
                at hudson.model.AbstractBuild$AbstractBuildExecution.defaultCheckout(AbstractBuild.java:574)
                at jenkins.scm.SCMCheckoutStrategy.checkout(SCMCheckoutStrategy.java:86)
                at hudson.model.AbstractBuild$AbstractBuildExecution.run(AbstractBuild.java:499)
                at hudson.model.Run.execute(Run.java:1810)
                at hudson.model.FreeStyleBuild.run(FreeStyleBuild.java:43)
                at hudson.model.ResourceController.execute(ResourceController.java:97)
                at hudson.model.Executor.run(Executor.java:429)
Caused: java.io.IOException: Failed to check out http://svn.apache.org/repos/asf/lucene/test-data
        at hudson.scm.subversion.CheckoutUpdater$SubversionUpdateTask.perform(CheckoutUpdater.java:144)
        at hudson.scm.subversion.WorkspaceUpdater$UpdateTask.delegateTo(WorkspaceUpdater.java:168)
        at hudson.scm.subversion.WorkspaceUpdater$UpdateTask.delegateTo(WorkspaceUpdater.java:176)
        at hudson.scm.subversion.UpdateUpdater$TaskImpl.perform(UpdateUpdater.java:134)
        at hudson.scm.subversion.WorkspaceUpdater$UpdateTask.delegateTo(WorkspaceUpdater.java:168)
        at hudson.scm.SubversionSCM$CheckOutTask.perform(SubversionSCM.java:1041)
        at hudson.scm.SubversionSCM$CheckOutTask.invoke(SubversionSCM.java:1017)
        at hudson.scm.SubversionSCM$CheckOutTask.invoke(SubversionSCM.java:990)
        at hudson.FilePath$FileCallableWrapper.call(FilePath.java:3086)
        at hudson.remoting.UserRequest.perform(UserRequest.java:212)
        at hudson.remoting.UserRequest.perform(UserRequest.java:54)
        at hudson.remoting.Request$2.run(Request.java:369)
        at hudson.remoting.InterceptingExecutorService$1.call(InterceptingExecutorService.java:72)
        at java.util.concurrent.FutureTask.run(FutureTask.java:266)
        at java.util.concurrent.ThreadPoolExecutor.runWorker(ThreadPoolExecutor.java:1142)
        at java.util.concurrent.ThreadPoolExecutor$Worker.run(ThreadPoolExecutor.java:617)
        at java.lang.Thread.run(Thread.java:744)
Retrying after 10 seconds
No credentials specified
 > git rev-parse --is-inside-work-tree # timeout=10
Fetching changes from the remote Git repository
 > git config remote.origin.url https://gitbox.apache.org/repos/asf/lucene-solr.git # timeout=10
Fetching upstream changes from https://gitbox.apache.org/repos/asf/lucene-solr.git
 > git --version # timeout=10
 > git fetch --tags --progress https://gitbox.apache.org/repos/asf/lucene-solr.git +refs/heads/*:refs/remotes/origin/*
 > git rev-parse refs/remotes/origin/master^{commit} # timeout=10
 > git rev-parse refs/remotes/origin/origin/master^{commit} # timeout=10
Checking out Revision fb5a3e28fe563f6a68c3a759c52046c09b24b88a (refs/remotes/origin/master)
 > git config core.sparsecheckout # timeout=10
 > git checkout -f fb5a3e28fe563f6a68c3a759c52046c09b24b88a
Commit message: "CloudExitableDirectoryReaderTest improvements"
Cleaning workspace
 > git rev-parse --verify HEAD # timeout=10
Resetting working tree
 > git reset --hard # timeout=10
 > git clean -fdx # timeout=10
Checking out a fresh workspace because /home/jenkins/jenkins-slave/workspace/Lucene-Solr-NightlyTests-master/test-data doesn't exist
Cleaning local Directory test-data
Checking out http://svn.apache.org/repos/asf/lucene/test-data at revision '2019-09-12T02:18:43.252 +0000'
ERROR: Failed to check out http://svn.apache.org/repos/asf/lucene/test-data
org.tmatesoft.svn.core.SVNException: svn: E175002: connection refused by the server
svn: E175002: OPTIONS request failed on '/repos/asf/lucene/test-data'
        at org.tmatesoft.svn.core.internal.wc.SVNErrorManager.error(SVNErrorManager.java:112)
        at org.tmatesoft.svn.core.internal.wc.SVNErrorManager.error(SVNErrorManager.java:96)
        at org.tmatesoft.svn.core.internal.io.dav.http.HTTPConnection.request(HTTPConnection.java:765)
        at org.tmatesoft.svn.core.internal.io.dav.http.HTTPConnection.request(HTTPConnection.java:352)
        at org.tmatesoft.svn.core.internal.io.dav.http.HTTPConnection.request(HTTPConnection.java:340)
        at org.tmatesoft.svn.core.internal.io.dav.DAVConnection.performHttpRequest(DAVConnection.java:910)
        at org.tmatesoft.svn.core.internal.io.dav.DAVConnection.exchangeCapabilities(DAVConnection.java:702)
        at org.tmatesoft.svn.core.internal.io.dav.DAVConnection.open(DAVConnection.java:113)
        at org.tmatesoft.svn.core.internal.io.dav.DAVRepository.openConnection(DAVRepository.java:1035)
        at org.tmatesoft.svn.core.internal.io.dav.DAVRepository.getLatestRevision(DAVRepository.java:164)
        at org.tmatesoft.svn.core.internal.wc2.ng.SvnNgRepositoryAccess.getRevisionNumber(SvnNgRepositoryAccess.java:119)
        at org.tmatesoft.svn.core.internal.wc2.SvnRepositoryAccess.getLocations(SvnRepositoryAccess.java:178)
        at org.tmatesoft.svn.core.internal.wc2.ng.SvnNgRepositoryAccess.createRepositoryFor(SvnNgRepositoryAccess.java:43)
        at org.tmatesoft.svn.core.internal.wc2.ng.SvnNgAbstractUpdate.checkout(SvnNgAbstractUpdate.java:831)
        at org.tmatesoft.svn.core.internal.wc2.ng.SvnNgCheckout.run(SvnNgCheckout.java:26)
        at org.tmatesoft.svn.core.internal.wc2.ng.SvnNgCheckout.run(SvnNgCheckout.java:11)
        at org.tmatesoft.svn.core.internal.wc2.ng.SvnNgOperationRunner.run(SvnNgOperationRunner.java:20)
        at org.tmatesoft.svn.core.internal.wc2.SvnOperationRunner.run(SvnOperationRunner.java:21)
        at org.tmatesoft.svn.core.wc2.SvnOperationFactory.run(SvnOperationFactory.java:1239)
        at org.tmatesoft.svn.core.wc2.SvnOperation.run(SvnOperation.java:294)
        at hudson.scm.subversion.CheckoutUpdater$SubversionUpdateTask.perform(CheckoutUpdater.java:133)
        at hudson.scm.subversion.WorkspaceUpdater$UpdateTask.delegateTo(WorkspaceUpdater.java:168)
        at hudson.scm.subversion.WorkspaceUpdater$UpdateTask.delegateTo(WorkspaceUpdater.java:176)
        at hudson.scm.subversion.UpdateUpdater$TaskImpl.perform(UpdateUpdater.java:134)
        at hudson.scm.subversion.WorkspaceUpdater$UpdateTask.delegateTo(WorkspaceUpdater.java:168)
        at hudson.scm.SubversionSCM$CheckOutTask.perform(SubversionSCM.java:1041)
        at hudson.scm.SubversionSCM$CheckOutTask.invoke(SubversionSCM.java:1017)
        at hudson.scm.SubversionSCM$CheckOutTask.invoke(SubversionSCM.java:990)
        at hudson.FilePath$FileCallableWrapper.call(FilePath.java:3086)
        at hudson.remoting.UserRequest.perform(UserRequest.java:212)
        at hudson.remoting.UserRequest.perform(UserRequest.java:54)
        at hudson.remoting.Request$2.run(Request.java:369)
        at hudson.remoting.InterceptingExecutorService$1.call(InterceptingExecutorService.java:72)
        at java.util.concurrent.FutureTask.run(FutureTask.java:266)
        at java.util.concurrent.ThreadPoolExecutor.runWorker(ThreadPoolExecutor.java:1142)
        at java.util.concurrent.ThreadPoolExecutor$Worker.run(ThreadPoolExecutor.java:617)
        at java.lang.Thread.run(Thread.java:744)
Caused by: java.net.ConnectException: Connection refused
        at java.net.PlainSocketImpl.socketConnect(Native Method)
        at java.net.AbstractPlainSocketImpl.doConnect(AbstractPlainSocketImpl.java:345)
        at java.net.AbstractPlainSocketImpl.connectToAddress(AbstractPlainSocketImpl.java:206)
        at java.net.AbstractPlainSocketImpl.connect(AbstractPlainSocketImpl.java:188)
        at java.net.SocksSocketImpl.connect(SocksSocketImpl.java:392)
        at java.net.Socket.connect(Socket.java:589)
        at org.tmatesoft.svn.core.internal.util.SVNSocketConnection.run(SVNSocketConnection.java:57)
        at java.util.concurrent.Executors$RunnableAdapter.call(Executors.java:511)
        ... 4 more
java.net.ConnectException: Connection refused
        at java.net.PlainSocketImpl.socketConnect(Native Method)
        at java.net.AbstractPlainSocketImpl.doConnect(AbstractPlainSocketImpl.java:345)
        at java.net.AbstractPlainSocketImpl.connectToAddress(AbstractPlainSocketImpl.java:206)
        at java.net.AbstractPlainSocketImpl.connect(AbstractPlainSocketImpl.java:188)
        at java.net.SocksSocketImpl.connect(SocksSocketImpl.java:392)
        at java.net.Socket.connect(Socket.java:589)
        at org.tmatesoft.svn.core.internal.util.SVNSocketConnection.run(SVNSocketConnection.java:57)
        at java.util.concurrent.Executors$RunnableAdapter.call(Executors.java:511)
Caused: org.tmatesoft.svn.core.SVNException: svn: E175002: connection refused by the server
svn: E175002: OPTIONS request failed on '/repos/asf/lucene/test-data'
        at org.tmatesoft.svn.core.internal.wc.SVNErrorManager.error(SVNErrorManager.java:112)
        at org.tmatesoft.svn.core.internal.wc.SVNErrorManager.error(SVNErrorManager.java:96)
        at org.tmatesoft.svn.core.internal.io.dav.http.HTTPConnection.request(HTTPConnection.java:765)
        at org.tmatesoft.svn.core.internal.io.dav.http.HTTPConnection.request(HTTPConnection.java:352)
        at org.tmatesoft.svn.core.internal.io.dav.http.HTTPConnection.request(HTTPConnection.java:340)
        at org.tmatesoft.svn.core.internal.io.dav.DAVConnection.performHttpRequest(DAVConnection.java:910)
        at org.tmatesoft.svn.core.internal.io.dav.DAVConnection.exchangeCapabilities(DAVConnection.java:702)
        at org.tmatesoft.svn.core.internal.io.dav.DAVConnection.open(DAVConnection.java:113)
        at org.tmatesoft.svn.core.internal.io.dav.DAVRepository.openConnection(DAVRepository.java:1035)
        at org.tmatesoft.svn.core.internal.io.dav.DAVRepository.getLatestRevision(DAVRepository.java:164)
        at org.tmatesoft.svn.core.internal.wc2.ng.SvnNgRepositoryAccess.getRevisionNumber(SvnNgRepositoryAccess.java:119)
        at org.tmatesoft.svn.core.internal.wc2.SvnRepositoryAccess.getLocations(SvnRepositoryAccess.java:178)
        at org.tmatesoft.svn.core.internal.wc2.ng.SvnNgRepositoryAccess.createRepositoryFor(SvnNgRepositoryAccess.java:43)
        at org.tmatesoft.svn.core.internal.wc2.ng.SvnNgAbstractUpdate.checkout(SvnNgAbstractUpdate.java:831)
        at org.tmatesoft.svn.core.internal.wc2.ng.SvnNgCheckout.run(SvnNgCheckout.java:26)
        at org.tmatesoft.svn.core.internal.wc2.ng.SvnNgCheckout.run(SvnNgCheckout.java:11)
        at org.tmatesoft.svn.core.internal.wc2.ng.SvnNgOperationRunner.run(SvnNgOperationRunner.java:20)
        at org.tmatesoft.svn.core.internal.wc2.SvnOperationRunner.run(SvnOperationRunner.java:21)
        at org.tmatesoft.svn.core.wc2.SvnOperationFactory.run(SvnOperationFactory.java:1239)
        at org.tmatesoft.svn.core.wc2.SvnOperation.run(SvnOperation.java:294)
        at hudson.scm.subversion.CheckoutUpdater$SubversionUpdateTask.perform(CheckoutUpdater.java:133)
Also:   hudson.remoting.Channel$CallSiteStackTrace: Remote call to lucene
                at hudson.remoting.Channel.attachCallSiteStackTrace(Channel.java:1741)
                at hudson.remoting.UserRequest$ExceptionResponse.retrieve(UserRequest.java:357)
                at hudson.remoting.Channel.call(Channel.java:955)
                at hudson.FilePath.act(FilePath.java:1072)
                at hudson.FilePath.act(FilePath.java:1061)
                at hudson.scm.SubversionSCM.checkout(SubversionSCM.java:937)
                at hudson.scm.SubversionSCM.checkout(SubversionSCM.java:864)
                at org.jenkinsci.plugins.multiplescms.MultiSCM.checkout(MultiSCM.java:143)
                at hudson.scm.SCM.checkout(SCM.java:504)
                at hudson.model.AbstractProject.checkout(AbstractProject.java:1208)
                at hudson.model.AbstractBuild$AbstractBuildExecution.defaultCheckout(AbstractBuild.java:574)
                at jenkins.scm.SCMCheckoutStrategy.checkout(SCMCheckoutStrategy.java:86)
                at hudson.model.AbstractBuild$AbstractBuildExecution.run(AbstractBuild.java:499)
                at hudson.model.Run.execute(Run.java:1810)
                at hudson.model.FreeStyleBuild.run(FreeStyleBuild.java:43)
                at hudson.model.ResourceController.execute(ResourceController.java:97)
                at hudson.model.Executor.run(Executor.java:429)
Caused: java.io.IOException: Failed to check out http://svn.apache.org/repos/asf/lucene/test-data
        at hudson.scm.subversion.CheckoutUpdater$SubversionUpdateTask.perform(CheckoutUpdater.java:144)
        at hudson.scm.subversion.WorkspaceUpdater$UpdateTask.delegateTo(WorkspaceUpdater.java:168)
        at hudson.scm.subversion.WorkspaceUpdater$UpdateTask.delegateTo(WorkspaceUpdater.java:176)
        at hudson.scm.subversion.UpdateUpdater$TaskImpl.perform(UpdateUpdater.java:134)
        at hudson.scm.subversion.WorkspaceUpdater$UpdateTask.delegateTo(WorkspaceUpdater.java:168)
        at hudson.scm.SubversionSCM$CheckOutTask.perform(SubversionSCM.java:1041)
        at hudson.scm.SubversionSCM$CheckOutTask.invoke(SubversionSCM.java:1017)
        at hudson.scm.SubversionSCM$CheckOutTask.invoke(SubversionSCM.java:990)
        at hudson.FilePath$FileCallableWrapper.call(FilePath.java:3086)
        at hudson.remoting.UserRequest.perform(UserRequest.java:212)
        at hudson.remoting.UserRequest.perform(UserRequest.java:54)
        at hudson.remoting.Request$2.run(Request.java:369)
        at hudson.remoting.InterceptingExecutorService$1.call(InterceptingExecutorService.java:72)
        at java.util.concurrent.FutureTask.run(FutureTask.java:266)
        at java.util.concurrent.ThreadPoolExecutor.runWorker(ThreadPoolExecutor.java:1142)
        at java.util.concurrent.ThreadPoolExecutor$Worker.run(ThreadPoolExecutor.java:617)
        at java.lang.Thread.run(Thread.java:744)
Retrying after 10 seconds
No credentials specified
 > git rev-parse --is-inside-work-tree # timeout=10
Fetching changes from the remote Git repository
 > git config remote.origin.url https://gitbox.apache.org/repos/asf/lucene-solr.git # timeout=10
Fetching upstream changes from https://gitbox.apache.org/repos/asf/lucene-solr.git
 > git --version # timeout=10
 > git fetch --tags --progress https://gitbox.apache.org/repos/asf/lucene-solr.git +refs/heads/*:refs/remotes/origin/*
 > git rev-parse refs/remotes/origin/master^{commit} # timeout=10
 > git rev-parse refs/remotes/origin/origin/master^{commit} # timeout=10
Checking out Revision fb5a3e28fe563f6a68c3a759c52046c09b24b88a (refs/remotes/origin/master)
 > git config core.sparsecheckout # timeout=10
 > git checkout -f fb5a3e28fe563f6a68c3a759c52046c09b24b88a
Commit message: "CloudExitableDirectoryReaderTest improvements"
Cleaning workspace
 > git rev-parse --verify HEAD # timeout=10
Resetting working tree
 > git reset --hard # timeout=10
 > git clean -fdx # timeout=10
Checking out a fresh workspace because /home/jenkins/jenkins-slave/workspace/Lucene-Solr-NightlyTests-master/test-data doesn't exist
Cleaning local Directory test-data
Checking out http://svn.apache.org/repos/asf/lucene/test-data at revision '2019-09-12T02:18:43.252 +0000'
ERROR: Failed to check out http://svn.apache.org/repos/asf/lucene/test-data
org.tmatesoft.svn.core.SVNException: svn: E175002: connection refused by the server
svn: E175002: OPTIONS request failed on '/repos/asf/lucene/test-data'
        at org.tmatesoft.svn.core.internal.wc.SVNErrorManager.error(SVNErrorManager.java:112)
        at org.tmatesoft.svn.core.internal.wc.SVNErrorManager.error(SVNErrorManager.java:96)
        at org.tmatesoft.svn.core.internal.io.dav.http.HTTPConnection.request(HTTPConnection.java:765)
        at org.tmatesoft.svn.core.internal.io.dav.http.HTTPConnection.request(HTTPConnection.java:352)
        at org.tmatesoft.svn.core.internal.io.dav.http.HTTPConnection.request(HTTPConnection.java:340)
        at org.tmatesoft.svn.core.internal.io.dav.DAVConnection.performHttpRequest(DAVConnection.java:910)
        at org.tmatesoft.svn.core.internal.io.dav.DAVConnection.exchangeCapabilities(DAVConnection.java:702)
        at org.tmatesoft.svn.core.internal.io.dav.DAVConnection.open(DAVConnection.java:113)
        at org.tmatesoft.svn.core.internal.io.dav.DAVRepository.openConnection(DAVRepository.java:1035)
        at org.tmatesoft.svn.core.internal.io.dav.DAVRepository.getLatestRevision(DAVRepository.java:164)
        at org.tmatesoft.svn.core.internal.wc2.ng.SvnNgRepositoryAccess.getRevisionNumber(SvnNgRepositoryAccess.java:119)
        at org.tmatesoft.svn.core.internal.wc2.SvnRepositoryAccess.getLocations(SvnRepositoryAccess.java:178)
        at org.tmatesoft.svn.core.internal.wc2.ng.SvnNgRepositoryAccess.createRepositoryFor(SvnNgRepositoryAccess.java:43)
        at org.tmatesoft.svn.core.internal.wc2.ng.SvnNgAbstractUpdate.checkout(SvnNgAbstractUpdate.java:831)
        at org.tmatesoft.svn.core.internal.wc2.ng.SvnNgCheckout.run(SvnNgCheckout.java:26)
        at org.tmatesoft.svn.core.internal.wc2.ng.SvnNgCheckout.run(SvnNgCheckout.java:11)
        at org.tmatesoft.svn.core.internal.wc2.ng.SvnNgOperationRunner.run(SvnNgOperationRunner.java:20)
        at org.tmatesoft.svn.core.internal.wc2.SvnOperationRunner.run(SvnOperationRunner.java:21)
        at org.tmatesoft.svn.core.wc2.SvnOperationFactory.run(SvnOperationFactory.java:1239)
        at org.tmatesoft.svn.core.wc2.SvnOperation.run(SvnOperation.java:294)
        at hudson.scm.subversion.CheckoutUpdater$SubversionUpdateTask.perform(CheckoutUpdater.java:133)
        at hudson.scm.subversion.WorkspaceUpdater$UpdateTask.delegateTo(WorkspaceUpdater.java:168)
        at hudson.scm.subversion.WorkspaceUpdater$UpdateTask.delegateTo(WorkspaceUpdater.java:176)
        at hudson.scm.subversion.UpdateUpdater$TaskImpl.perform(UpdateUpdater.java:134)
        at hudson.scm.subversion.WorkspaceUpdater$UpdateTask.delegateTo(WorkspaceUpdater.java:168)
        at hudson.scm.SubversionSCM$CheckOutTask.perform(SubversionSCM.java:1041)
        at hudson.scm.SubversionSCM$CheckOutTask.invoke(SubversionSCM.java:1017)
        at hudson.scm.SubversionSCM$CheckOutTask.invoke(SubversionSCM.java:990)
        at hudson.FilePath$FileCallableWrapper.call(FilePath.java:3086)
        at hudson.remoting.UserRequest.perform(UserRequest.java:212)
        at hudson.remoting.UserRequest.perform(UserRequest.java:54)
        at hudson.remoting.Request$2.run(Request.java:369)
        at hudson.remoting.InterceptingExecutorService$1.call(InterceptingExecutorService.java:72)
        at java.util.concurrent.FutureTask.run(FutureTask.java:266)
        at java.util.concurrent.ThreadPoolExecutor.runWorker(ThreadPoolExecutor.java:1142)
        at java.util.concurrent.ThreadPoolExecutor$Worker.run(ThreadPoolExecutor.java:617)
        at java.lang.Thread.run(Thread.java:744)
Caused by: java.net.ConnectException: Connection refused
        at java.net.PlainSocketImpl.socketConnect(Native Method)
        at java.net.AbstractPlainSocketImpl.doConnect(AbstractPlainSocketImpl.java:345)
        at java.net.AbstractPlainSocketImpl.connectToAddress(AbstractPlainSocketImpl.java:206)
        at java.net.AbstractPlainSocketImpl.connect(AbstractPlainSocketImpl.java:188)
        at java.net.SocksSocketImpl.connect(SocksSocketImpl.java:392)
        at java.net.Socket.connect(Socket.java:589)
        at org.tmatesoft.svn.core.internal.util.SVNSocketConnection.run(SVNSocketConnection.java:57)
        at java.util.concurrent.Executors$RunnableAdapter.call(Executors.java:511)
        ... 4 more
java.net.ConnectException: Connection refused
        at java.net.PlainSocketImpl.socketConnect(Native Method)
        at java.net.AbstractPlainSocketImpl.doConnect(AbstractPlainSocketImpl.java:345)
        at java.net.AbstractPlainSocketImpl.connectToAddress(AbstractPlainSocketImpl.java:206)
        at java.net.AbstractPlainSocketImpl.connect(AbstractPlainSocketImpl.java:188)
        at java.net.SocksSocketImpl.connect(SocksSocketImpl.java:392)
        at java.net.Socket.connect(Socket.java:589)
        at org.tmatesoft.svn.core.internal.util.SVNSocketConnection.run(SVNSocketConnection.java:57)
        at java.util.concurrent.Executors$RunnableAdapter.call(Executors.java:511)
Caused: org.tmatesoft.svn.core.SVNException: svn: E175002: connection refused by the server
svn: E175002: OPTIONS request failed on '/repos/asf/lucene/test-data'
        at org.tmatesoft.svn.core.internal.wc.SVNErrorManager.error(SVNErrorManager.java:112)
        at org.tmatesoft.svn.core.internal.wc.SVNErrorManager.error(SVNErrorManager.java:96)
        at org.tmatesoft.svn.core.internal.io.dav.http.HTTPConnection.request(HTTPConnection.java:765)
        at org.tmatesoft.svn.core.internal.io.dav.http.HTTPConnection.request(HTTPConnection.java:352)
        at org.tmatesoft.svn.core.internal.io.dav.http.HTTPConnection.request(HTTPConnection.java:340)
        at org.tmatesoft.svn.core.internal.io.dav.DAVConnection.performHttpRequest(DAVConnection.java:910)
        at org.tmatesoft.svn.core.internal.io.dav.DAVConnection.exchangeCapabilities(DAVConnection.java:702)
        at org.tmatesoft.svn.core.internal.io.dav.DAVConnection.open(DAVConnection.java:113)
        at org.tmatesoft.svn.core.internal.io.dav.DAVRepository.openConnection(DAVRepository.java:1035)
        at org.tmatesoft.svn.core.internal.io.dav.DAVRepository.getLatestRevision(DAVRepository.java:164)
        at org.tmatesoft.svn.core.internal.wc2.ng.SvnNgRepositoryAccess.getRevisionNumber(SvnNgRepositoryAccess.java:119)
        at org.tmatesoft.svn.core.internal.wc2.SvnRepositoryAccess.getLocations(SvnRepositoryAccess.java:178)
        at org.tmatesoft.svn.core.internal.wc2.ng.SvnNgRepositoryAccess.createRepositoryFor(SvnNgRepositoryAccess.java:43)
        at org.tmatesoft.svn.core.internal.wc2.ng.SvnNgAbstractUpdate.checkout(SvnNgAbstractUpdate.java:831)
        at org.tmatesoft.svn.core.internal.wc2.ng.SvnNgCheckout.run(SvnNgCheckout.java:26)
        at org.tmatesoft.svn.core.internal.wc2.ng.SvnNgCheckout.run(SvnNgCheckout.java:11)
        at org.tmatesoft.svn.core.internal.wc2.ng.SvnNgOperationRunner.run(SvnNgOperationRunner.java:20)
        at org.tmatesoft.svn.core.internal.wc2.SvnOperationRunner.run(SvnOperationRunner.java:21)
        at org.tmatesoft.svn.core.wc2.SvnOperationFactory.run(SvnOperationFactory.java:1239)
        at org.tmatesoft.svn.core.wc2.SvnOperation.run(SvnOperation.java:294)
        at hudson.scm.subversion.CheckoutUpdater$SubversionUpdateTask.perform(CheckoutUpdater.java:133)
Also:   hudson.remoting.Channel$CallSiteStackTrace: Remote call to lucene
                at hudson.remoting.Channel.attachCallSiteStackTrace(Channel.java:1741)
                at hudson.remoting.UserRequest$ExceptionResponse.retrieve(UserRequest.java:357)
                at hudson.remoting.Channel.call(Channel.java:955)
                at hudson.FilePath.act(FilePath.java:1072)
                at hudson.FilePath.act(FilePath.java:1061)
                at hudson.scm.SubversionSCM.checkout(SubversionSCM.java:937)
                at hudson.scm.SubversionSCM.checkout(SubversionSCM.java:864)
                at org.jenkinsci.plugins.multiplescms.MultiSCM.checkout(MultiSCM.java:143)
                at hudson.scm.SCM.checkout(SCM.java:504)
                at hudson.model.AbstractProject.checkout(AbstractProject.java:1208)
                at hudson.model.AbstractBuild$AbstractBuildExecution.defaultCheckout(AbstractBuild.java:574)
                at jenkins.scm.SCMCheckoutStrategy.checkout(SCMCheckoutStrategy.java:86)
                at hudson.model.AbstractBuild$AbstractBuildExecution.run(AbstractBuild.java:499)
                at hudson.model.Run.execute(Run.java:1810)
                at hudson.model.FreeStyleBuild.run(FreeStyleBuild.java:43)
                at hudson.model.ResourceController.execute(ResourceController.java:97)
                at hudson.model.Executor.run(Executor.java:429)
Caused: java.io.IOException: Failed to check out http://svn.apache.org/repos/asf/lucene/test-data
        at hudson.scm.subversion.CheckoutUpdater$SubversionUpdateTask.perform(CheckoutUpdater.java:144)
        at hudson.scm.subversion.WorkspaceUpdater$UpdateTask.delegateTo(WorkspaceUpdater.java:168)
        at hudson.scm.subversion.WorkspaceUpdater$UpdateTask.delegateTo(WorkspaceUpdater.java:176)
        at hudson.scm.subversion.UpdateUpdater$TaskImpl.perform(UpdateUpdater.java:134)
        at hudson.scm.subversion.WorkspaceUpdater$UpdateTask.delegateTo(WorkspaceUpdater.java:168)
        at hudson.scm.SubversionSCM$CheckOutTask.perform(SubversionSCM.java:1041)
        at hudson.scm.SubversionSCM$CheckOutTask.invoke(SubversionSCM.java:1017)
        at hudson.scm.SubversionSCM$CheckOutTask.invoke(SubversionSCM.java:990)
        at hudson.FilePath$FileCallableWrapper.call(FilePath.java:3086)
        at hudson.remoting.UserRequest.perform(UserRequest.java:212)
        at hudson.remoting.UserRequest.perform(UserRequest.java:54)
        at hudson.remoting.Request$2.run(Request.java:369)
        at hudson.remoting.InterceptingExecutorService$1.call(InterceptingExecutorService.java:72)
        at java.util.concurrent.FutureTask.run(FutureTask.java:266)
        at java.util.concurrent.ThreadPoolExecutor.runWorker(ThreadPoolExecutor.java:1142)
        at java.util.concurrent.ThreadPoolExecutor$Worker.run(ThreadPoolExecutor.java:617)
        at java.lang.Thread.run(Thread.java:744)
Archiving artifacts
Recording test results
ERROR: Step ‘Publish JUnit test result report’ failed: No test report files were found. Configuration error?
Email was triggered for: Failure - Any
Sending email for trigger: Failure - Any


---------------------------------------------------------------------
To unsubscribe, e-mail: [hidden email]
For additional commands, e-mail: [hidden email]
Reply | Threaded
Open this post in threaded view
|

[JENKINS] Lucene-Solr-NightlyTests-master - Build # 1959 - Still Failing

Apache Jenkins Server-2
Build: https://builds.apache.org/job/Lucene-Solr-NightlyTests-master/1959/

No tests ran.

Build Log:
[...truncated 25 lines...]
ERROR: Failed to check out http://svn.apache.org/repos/asf/lucene/test-data
org.tmatesoft.svn.core.SVNException: svn: E175002: connection refused by the server
svn: E175002: OPTIONS request failed on '/repos/asf/lucene/test-data'
        at org.tmatesoft.svn.core.internal.wc.SVNErrorManager.error(SVNErrorManager.java:112)
        at org.tmatesoft.svn.core.internal.wc.SVNErrorManager.error(SVNErrorManager.java:96)
        at org.tmatesoft.svn.core.internal.io.dav.http.HTTPConnection.request(HTTPConnection.java:765)
        at org.tmatesoft.svn.core.internal.io.dav.http.HTTPConnection.request(HTTPConnection.java:352)
        at org.tmatesoft.svn.core.internal.io.dav.http.HTTPConnection.request(HTTPConnection.java:340)
        at org.tmatesoft.svn.core.internal.io.dav.DAVConnection.performHttpRequest(DAVConnection.java:910)
        at org.tmatesoft.svn.core.internal.io.dav.DAVConnection.exchangeCapabilities(DAVConnection.java:702)
        at org.tmatesoft.svn.core.internal.io.dav.DAVConnection.open(DAVConnection.java:113)
        at org.tmatesoft.svn.core.internal.io.dav.DAVRepository.openConnection(DAVRepository.java:1035)
        at org.tmatesoft.svn.core.internal.io.dav.DAVRepository.getLatestRevision(DAVRepository.java:164)
        at org.tmatesoft.svn.core.internal.wc2.ng.SvnNgRepositoryAccess.getRevisionNumber(SvnNgRepositoryAccess.java:119)
        at org.tmatesoft.svn.core.internal.wc2.SvnRepositoryAccess.getLocations(SvnRepositoryAccess.java:178)
        at org.tmatesoft.svn.core.internal.wc2.ng.SvnNgRepositoryAccess.createRepositoryFor(SvnNgRepositoryAccess.java:43)
        at org.tmatesoft.svn.core.internal.wc2.ng.SvnNgAbstractUpdate.checkout(SvnNgAbstractUpdate.java:831)
        at org.tmatesoft.svn.core.internal.wc2.ng.SvnNgCheckout.run(SvnNgCheckout.java:26)
        at org.tmatesoft.svn.core.internal.wc2.ng.SvnNgCheckout.run(SvnNgCheckout.java:11)
        at org.tmatesoft.svn.core.internal.wc2.ng.SvnNgOperationRunner.run(SvnNgOperationRunner.java:20)
        at org.tmatesoft.svn.core.internal.wc2.SvnOperationRunner.run(SvnOperationRunner.java:21)
        at org.tmatesoft.svn.core.wc2.SvnOperationFactory.run(SvnOperationFactory.java:1239)
        at org.tmatesoft.svn.core.wc2.SvnOperation.run(SvnOperation.java:294)
        at hudson.scm.subversion.CheckoutUpdater$SubversionUpdateTask.perform(CheckoutUpdater.java:133)
        at hudson.scm.subversion.WorkspaceUpdater$UpdateTask.delegateTo(WorkspaceUpdater.java:168)
        at hudson.scm.subversion.WorkspaceUpdater$UpdateTask.delegateTo(WorkspaceUpdater.java:176)
        at hudson.scm.subversion.UpdateUpdater$TaskImpl.perform(UpdateUpdater.java:134)
        at hudson.scm.subversion.WorkspaceUpdater$UpdateTask.delegateTo(WorkspaceUpdater.java:168)
        at hudson.scm.SubversionSCM$CheckOutTask.perform(SubversionSCM.java:1041)
        at hudson.scm.SubversionSCM$CheckOutTask.invoke(SubversionSCM.java:1017)
        at hudson.scm.SubversionSCM$CheckOutTask.invoke(SubversionSCM.java:990)
        at hudson.FilePath$FileCallableWrapper.call(FilePath.java:3086)
        at hudson.remoting.UserRequest.perform(UserRequest.java:212)
        at hudson.remoting.UserRequest.perform(UserRequest.java:54)
        at hudson.remoting.Request$2.run(Request.java:369)
        at hudson.remoting.InterceptingExecutorService$1.call(InterceptingExecutorService.java:72)
        at java.util.concurrent.FutureTask.run(FutureTask.java:266)
        at java.util.concurrent.ThreadPoolExecutor.runWorker(ThreadPoolExecutor.java:1142)
        at java.util.concurrent.ThreadPoolExecutor$Worker.run(ThreadPoolExecutor.java:617)
        at java.lang.Thread.run(Thread.java:744)
Caused by: java.net.ConnectException: Connection refused
        at java.net.PlainSocketImpl.socketConnect(Native Method)
        at java.net.AbstractPlainSocketImpl.doConnect(AbstractPlainSocketImpl.java:345)
        at java.net.AbstractPlainSocketImpl.connectToAddress(AbstractPlainSocketImpl.java:206)
        at java.net.AbstractPlainSocketImpl.connect(AbstractPlainSocketImpl.java:188)
        at java.net.SocksSocketImpl.connect(SocksSocketImpl.java:392)
        at java.net.Socket.connect(Socket.java:589)
        at org.tmatesoft.svn.core.internal.util.SVNSocketConnection.run(SVNSocketConnection.java:57)
        at java.util.concurrent.Executors$RunnableAdapter.call(Executors.java:511)
        ... 4 more
java.net.ConnectException: Connection refused
        at java.net.PlainSocketImpl.socketConnect(Native Method)
        at java.net.AbstractPlainSocketImpl.doConnect(AbstractPlainSocketImpl.java:345)
        at java.net.AbstractPlainSocketImpl.connectToAddress(AbstractPlainSocketImpl.java:206)
        at java.net.AbstractPlainSocketImpl.connect(AbstractPlainSocketImpl.java:188)
        at java.net.SocksSocketImpl.connect(SocksSocketImpl.java:392)
        at java.net.Socket.connect(Socket.java:589)
        at org.tmatesoft.svn.core.internal.util.SVNSocketConnection.run(SVNSocketConnection.java:57)
        at java.util.concurrent.Executors$RunnableAdapter.call(Executors.java:511)
Caused: org.tmatesoft.svn.core.SVNException: svn: E175002: connection refused by the server
svn: E175002: OPTIONS request failed on '/repos/asf/lucene/test-data'
        at org.tmatesoft.svn.core.internal.wc.SVNErrorManager.error(SVNErrorManager.java:112)
        at org.tmatesoft.svn.core.internal.wc.SVNErrorManager.error(SVNErrorManager.java:96)
        at org.tmatesoft.svn.core.internal.io.dav.http.HTTPConnection.request(HTTPConnection.java:765)
        at org.tmatesoft.svn.core.internal.io.dav.http.HTTPConnection.request(HTTPConnection.java:352)
        at org.tmatesoft.svn.core.internal.io.dav.http.HTTPConnection.request(HTTPConnection.java:340)
        at org.tmatesoft.svn.core.internal.io.dav.DAVConnection.performHttpRequest(DAVConnection.java:910)
        at org.tmatesoft.svn.core.internal.io.dav.DAVConnection.exchangeCapabilities(DAVConnection.java:702)
        at org.tmatesoft.svn.core.internal.io.dav.DAVConnection.open(DAVConnection.java:113)
        at org.tmatesoft.svn.core.internal.io.dav.DAVRepository.openConnection(DAVRepository.java:1035)
        at org.tmatesoft.svn.core.internal.io.dav.DAVRepository.getLatestRevision(DAVRepository.java:164)
        at org.tmatesoft.svn.core.internal.wc2.ng.SvnNgRepositoryAccess.getRevisionNumber(SvnNgRepositoryAccess.java:119)
        at org.tmatesoft.svn.core.internal.wc2.SvnRepositoryAccess.getLocations(SvnRepositoryAccess.java:178)
        at org.tmatesoft.svn.core.internal.wc2.ng.SvnNgRepositoryAccess.createRepositoryFor(SvnNgRepositoryAccess.java:43)
        at org.tmatesoft.svn.core.internal.wc2.ng.SvnNgAbstractUpdate.checkout(SvnNgAbstractUpdate.java:831)
        at org.tmatesoft.svn.core.internal.wc2.ng.SvnNgCheckout.run(SvnNgCheckout.java:26)
        at org.tmatesoft.svn.core.internal.wc2.ng.SvnNgCheckout.run(SvnNgCheckout.java:11)
        at org.tmatesoft.svn.core.internal.wc2.ng.SvnNgOperationRunner.run(SvnNgOperationRunner.java:20)
        at org.tmatesoft.svn.core.internal.wc2.SvnOperationRunner.run(SvnOperationRunner.java:21)
        at org.tmatesoft.svn.core.wc2.SvnOperationFactory.run(SvnOperationFactory.java:1239)
        at org.tmatesoft.svn.core.wc2.SvnOperation.run(SvnOperation.java:294)
        at hudson.scm.subversion.CheckoutUpdater$SubversionUpdateTask.perform(CheckoutUpdater.java:133)
Also:   hudson.remoting.Channel$CallSiteStackTrace: Remote call to lucene
                at hudson.remoting.Channel.attachCallSiteStackTrace(Channel.java:1741)
                at hudson.remoting.UserRequest$ExceptionResponse.retrieve(UserRequest.java:357)
                at hudson.remoting.Channel.call(Channel.java:955)
                at hudson.FilePath.act(FilePath.java:1072)
                at hudson.FilePath.act(FilePath.java:1061)
                at hudson.scm.SubversionSCM.checkout(SubversionSCM.java:937)
                at hudson.scm.SubversionSCM.checkout(SubversionSCM.java:864)
                at org.jenkinsci.plugins.multiplescms.MultiSCM.checkout(MultiSCM.java:143)
                at hudson.scm.SCM.checkout(SCM.java:504)
                at hudson.model.AbstractProject.checkout(AbstractProject.java:1208)
                at hudson.model.AbstractBuild$AbstractBuildExecution.defaultCheckout(AbstractBuild.java:574)
                at jenkins.scm.SCMCheckoutStrategy.checkout(SCMCheckoutStrategy.java:86)
                at hudson.model.AbstractBuild$AbstractBuildExecution.run(AbstractBuild.java:499)
                at hudson.model.Run.execute(Run.java:1810)
                at hudson.model.FreeStyleBuild.run(FreeStyleBuild.java:43)
                at hudson.model.ResourceController.execute(ResourceController.java:97)
                at hudson.model.Executor.run(Executor.java:429)
Caused: java.io.IOException: Failed to check out http://svn.apache.org/repos/asf/lucene/test-data
        at hudson.scm.subversion.CheckoutUpdater$SubversionUpdateTask.perform(CheckoutUpdater.java:144)
        at hudson.scm.subversion.WorkspaceUpdater$UpdateTask.delegateTo(WorkspaceUpdater.java:168)
        at hudson.scm.subversion.WorkspaceUpdater$UpdateTask.delegateTo(WorkspaceUpdater.java:176)
        at hudson.scm.subversion.UpdateUpdater$TaskImpl.perform(UpdateUpdater.java:134)
        at hudson.scm.subversion.WorkspaceUpdater$UpdateTask.delegateTo(WorkspaceUpdater.java:168)
        at hudson.scm.SubversionSCM$CheckOutTask.perform(SubversionSCM.java:1041)
        at hudson.scm.SubversionSCM$CheckOutTask.invoke(SubversionSCM.java:1017)
        at hudson.scm.SubversionSCM$CheckOutTask.invoke(SubversionSCM.java:990)
        at hudson.FilePath$FileCallableWrapper.call(FilePath.java:3086)
        at hudson.remoting.UserRequest.perform(UserRequest.java:212)
        at hudson.remoting.UserRequest.perform(UserRequest.java:54)
        at hudson.remoting.Request$2.run(Request.java:369)
        at hudson.remoting.InterceptingExecutorService$1.call(InterceptingExecutorService.java:72)
        at java.util.concurrent.FutureTask.run(FutureTask.java:266)
        at java.util.concurrent.ThreadPoolExecutor.runWorker(ThreadPoolExecutor.java:1142)
        at java.util.concurrent.ThreadPoolExecutor$Worker.run(ThreadPoolExecutor.java:617)
        at java.lang.Thread.run(Thread.java:744)
Retrying after 10 seconds
No credentials specified
 > git rev-parse --is-inside-work-tree # timeout=10
Fetching changes from the remote Git repository
 > git config remote.origin.url https://gitbox.apache.org/repos/asf/lucene-solr.git # timeout=10
Fetching upstream changes from https://gitbox.apache.org/repos/asf/lucene-solr.git
 > git --version # timeout=10
 > git fetch --tags --progress https://gitbox.apache.org/repos/asf/lucene-solr.git +refs/heads/*:refs/remotes/origin/*
 > git rev-parse refs/remotes/origin/master^{commit} # timeout=10
 > git rev-parse refs/remotes/origin/origin/master^{commit} # timeout=10
Checking out Revision 3ed96026d353864c60566a9a3bdb1da853bb9e8f (refs/remotes/origin/master)
 > git config core.sparsecheckout # timeout=10
 > git checkout -f 3ed96026d353864c60566a9a3bdb1da853bb9e8f
Commit message: "LTR Test Hardening:"
Cleaning workspace
 > git rev-parse --verify HEAD # timeout=10
Resetting working tree
 > git reset --hard # timeout=10
 > git clean -fdx # timeout=10
Checking out a fresh workspace because /home/jenkins/jenkins-slave/workspace/Lucene-Solr-NightlyTests-master/test-data doesn't exist
Cleaning local Directory test-data
Checking out http://svn.apache.org/repos/asf/lucene/test-data at revision '2019-09-13T03:32:27.736 +0000'
ERROR: Failed to check out http://svn.apache.org/repos/asf/lucene/test-data
org.tmatesoft.svn.core.SVNException: svn: E175002: connection refused by the server
svn: E175002: OPTIONS request failed on '/repos/asf/lucene/test-data'
        at org.tmatesoft.svn.core.internal.wc.SVNErrorManager.error(SVNErrorManager.java:112)
        at org.tmatesoft.svn.core.internal.wc.SVNErrorManager.error(SVNErrorManager.java:96)
        at org.tmatesoft.svn.core.internal.io.dav.http.HTTPConnection.request(HTTPConnection.java:765)
        at org.tmatesoft.svn.core.internal.io.dav.http.HTTPConnection.request(HTTPConnection.java:352)
        at org.tmatesoft.svn.core.internal.io.dav.http.HTTPConnection.request(HTTPConnection.java:340)
        at org.tmatesoft.svn.core.internal.io.dav.DAVConnection.performHttpRequest(DAVConnection.java:910)
        at org.tmatesoft.svn.core.internal.io.dav.DAVConnection.exchangeCapabilities(DAVConnection.java:702)
        at org.tmatesoft.svn.core.internal.io.dav.DAVConnection.open(DAVConnection.java:113)
        at org.tmatesoft.svn.core.internal.io.dav.DAVRepository.openConnection(DAVRepository.java:1035)
        at org.tmatesoft.svn.core.internal.io.dav.DAVRepository.getLatestRevision(DAVRepository.java:164)
        at org.tmatesoft.svn.core.internal.wc2.ng.SvnNgRepositoryAccess.getRevisionNumber(SvnNgRepositoryAccess.java:119)
        at org.tmatesoft.svn.core.internal.wc2.SvnRepositoryAccess.getLocations(SvnRepositoryAccess.java:178)
        at org.tmatesoft.svn.core.internal.wc2.ng.SvnNgRepositoryAccess.createRepositoryFor(SvnNgRepositoryAccess.java:43)
        at org.tmatesoft.svn.core.internal.wc2.ng.SvnNgAbstractUpdate.checkout(SvnNgAbstractUpdate.java:831)
        at org.tmatesoft.svn.core.internal.wc2.ng.SvnNgCheckout.run(SvnNgCheckout.java:26)
        at org.tmatesoft.svn.core.internal.wc2.ng.SvnNgCheckout.run(SvnNgCheckout.java:11)
        at org.tmatesoft.svn.core.internal.wc2.ng.SvnNgOperationRunner.run(SvnNgOperationRunner.java:20)
        at org.tmatesoft.svn.core.internal.wc2.SvnOperationRunner.run(SvnOperationRunner.java:21)
        at org.tmatesoft.svn.core.wc2.SvnOperationFactory.run(SvnOperationFactory.java:1239)
        at org.tmatesoft.svn.core.wc2.SvnOperation.run(SvnOperation.java:294)
        at hudson.scm.subversion.CheckoutUpdater$SubversionUpdateTask.perform(CheckoutUpdater.java:133)
        at hudson.scm.subversion.WorkspaceUpdater$UpdateTask.delegateTo(WorkspaceUpdater.java:168)
        at hudson.scm.subversion.WorkspaceUpdater$UpdateTask.delegateTo(WorkspaceUpdater.java:176)
        at hudson.scm.subversion.UpdateUpdater$TaskImpl.perform(UpdateUpdater.java:134)
        at hudson.scm.subversion.WorkspaceUpdater$UpdateTask.delegateTo(WorkspaceUpdater.java:168)
        at hudson.scm.SubversionSCM$CheckOutTask.perform(SubversionSCM.java:1041)
        at hudson.scm.SubversionSCM$CheckOutTask.invoke(SubversionSCM.java:1017)
        at hudson.scm.SubversionSCM$CheckOutTask.invoke(SubversionSCM.java:990)
        at hudson.FilePath$FileCallableWrapper.call(FilePath.java:3086)
        at hudson.remoting.UserRequest.perform(UserRequest.java:212)
        at hudson.remoting.UserRequest.perform(UserRequest.java:54)
        at hudson.remoting.Request$2.run(Request.java:369)
        at hudson.remoting.InterceptingExecutorService$1.call(InterceptingExecutorService.java:72)
        at java.util.concurrent.FutureTask.run(FutureTask.java:266)
        at java.util.concurrent.ThreadPoolExecutor.runWorker(ThreadPoolExecutor.java:1142)
        at java.util.concurrent.ThreadPoolExecutor$Worker.run(ThreadPoolExecutor.java:617)
        at java.lang.Thread.run(Thread.java:744)
Caused by: java.net.ConnectException: Connection refused
        at java.net.PlainSocketImpl.socketConnect(Native Method)
        at java.net.AbstractPlainSocketImpl.doConnect(AbstractPlainSocketImpl.java:345)
        at java.net.AbstractPlainSocketImpl.connectToAddress(AbstractPlainSocketImpl.java:206)
        at java.net.AbstractPlainSocketImpl.connect(AbstractPlainSocketImpl.java:188)
        at java.net.SocksSocketImpl.connect(SocksSocketImpl.java:392)
        at java.net.Socket.connect(Socket.java:589)
        at org.tmatesoft.svn.core.internal.util.SVNSocketConnection.run(SVNSocketConnection.java:57)
        at java.util.concurrent.Executors$RunnableAdapter.call(Executors.java:511)
        ... 4 more
java.net.ConnectException: Connection refused
        at java.net.PlainSocketImpl.socketConnect(Native Method)
        at java.net.AbstractPlainSocketImpl.doConnect(AbstractPlainSocketImpl.java:345)
        at java.net.AbstractPlainSocketImpl.connectToAddress(AbstractPlainSocketImpl.java:206)
        at java.net.AbstractPlainSocketImpl.connect(AbstractPlainSocketImpl.java:188)
        at java.net.SocksSocketImpl.connect(SocksSocketImpl.java:392)
        at java.net.Socket.connect(Socket.java:589)
        at org.tmatesoft.svn.core.internal.util.SVNSocketConnection.run(SVNSocketConnection.java:57)
        at java.util.concurrent.Executors$RunnableAdapter.call(Executors.java:511)
Caused: org.tmatesoft.svn.core.SVNException: svn: E175002: connection refused by the server
svn: E175002: OPTIONS request failed on '/repos/asf/lucene/test-data'
        at org.tmatesoft.svn.core.internal.wc.SVNErrorManager.error(SVNErrorManager.java:112)
        at org.tmatesoft.svn.core.internal.wc.SVNErrorManager.error(SVNErrorManager.java:96)
        at org.tmatesoft.svn.core.internal.io.dav.http.HTTPConnection.request(HTTPConnection.java:765)
        at org.tmatesoft.svn.core.internal.io.dav.http.HTTPConnection.request(HTTPConnection.java:352)
        at org.tmatesoft.svn.core.internal.io.dav.http.HTTPConnection.request(HTTPConnection.java:340)
        at org.tmatesoft.svn.core.internal.io.dav.DAVConnection.performHttpRequest(DAVConnection.java:910)
        at org.tmatesoft.svn.core.internal.io.dav.DAVConnection.exchangeCapabilities(DAVConnection.java:702)
        at org.tmatesoft.svn.core.internal.io.dav.DAVConnection.open(DAVConnection.java:113)
        at org.tmatesoft.svn.core.internal.io.dav.DAVRepository.openConnection(DAVRepository.java:1035)
        at org.tmatesoft.svn.core.internal.io.dav.DAVRepository.getLatestRevision(DAVRepository.java:164)
        at org.tmatesoft.svn.core.internal.wc2.ng.SvnNgRepositoryAccess.getRevisionNumber(SvnNgRepositoryAccess.java:119)
        at org.tmatesoft.svn.core.internal.wc2.SvnRepositoryAccess.getLocations(SvnRepositoryAccess.java:178)
        at org.tmatesoft.svn.core.internal.wc2.ng.SvnNgRepositoryAccess.createRepositoryFor(SvnNgRepositoryAccess.java:43)
        at org.tmatesoft.svn.core.internal.wc2.ng.SvnNgAbstractUpdate.checkout(SvnNgAbstractUpdate.java:831)
        at org.tmatesoft.svn.core.internal.wc2.ng.SvnNgCheckout.run(SvnNgCheckout.java:26)
        at org.tmatesoft.svn.core.internal.wc2.ng.SvnNgCheckout.run(SvnNgCheckout.java:11)
        at org.tmatesoft.svn.core.internal.wc2.ng.SvnNgOperationRunner.run(SvnNgOperationRunner.java:20)
        at org.tmatesoft.svn.core.internal.wc2.SvnOperationRunner.run(SvnOperationRunner.java:21)
        at org.tmatesoft.svn.core.wc2.SvnOperationFactory.run(SvnOperationFactory.java:1239)
        at org.tmatesoft.svn.core.wc2.SvnOperation.run(SvnOperation.java:294)
        at hudson.scm.subversion.CheckoutUpdater$SubversionUpdateTask.perform(CheckoutUpdater.java:133)
Also:   hudson.remoting.Channel$CallSiteStackTrace: Remote call to lucene
                at hudson.remoting.Channel.attachCallSiteStackTrace(Channel.java:1741)
                at hudson.remoting.UserRequest$ExceptionResponse.retrieve(UserRequest.java:357)
                at hudson.remoting.Channel.call(Channel.java:955)
                at hudson.FilePath.act(FilePath.java:1072)
                at hudson.FilePath.act(FilePath.java:1061)
                at hudson.scm.SubversionSCM.checkout(SubversionSCM.java:937)
                at hudson.scm.SubversionSCM.checkout(SubversionSCM.java:864)
                at org.jenkinsci.plugins.multiplescms.MultiSCM.checkout(MultiSCM.java:143)
                at hudson.scm.SCM.checkout(SCM.java:504)
                at hudson.model.AbstractProject.checkout(AbstractProject.java:1208)
                at hudson.model.AbstractBuild$AbstractBuildExecution.defaultCheckout(AbstractBuild.java:574)
                at jenkins.scm.SCMCheckoutStrategy.checkout(SCMCheckoutStrategy.java:86)
                at hudson.model.AbstractBuild$AbstractBuildExecution.run(AbstractBuild.java:499)
                at hudson.model.Run.execute(Run.java:1810)
                at hudson.model.FreeStyleBuild.run(FreeStyleBuild.java:43)
                at hudson.model.ResourceController.execute(ResourceController.java:97)
                at hudson.model.Executor.run(Executor.java:429)
Caused: java.io.IOException: Failed to check out http://svn.apache.org/repos/asf/lucene/test-data
        at hudson.scm.subversion.CheckoutUpdater$SubversionUpdateTask.perform(CheckoutUpdater.java:144)
        at hudson.scm.subversion.WorkspaceUpdater$UpdateTask.delegateTo(WorkspaceUpdater.java:168)
        at hudson.scm.subversion.WorkspaceUpdater$UpdateTask.delegateTo(WorkspaceUpdater.java:176)
        at hudson.scm.subversion.UpdateUpdater$TaskImpl.perform(UpdateUpdater.java:134)
        at hudson.scm.subversion.WorkspaceUpdater$UpdateTask.delegateTo(WorkspaceUpdater.java:168)
        at hudson.scm.SubversionSCM$CheckOutTask.perform(SubversionSCM.java:1041)
        at hudson.scm.SubversionSCM$CheckOutTask.invoke(SubversionSCM.java:1017)
        at hudson.scm.SubversionSCM$CheckOutTask.invoke(SubversionSCM.java:990)
        at hudson.FilePath$FileCallableWrapper.call(FilePath.java:3086)
        at hudson.remoting.UserRequest.perform(UserRequest.java:212)
        at hudson.remoting.UserRequest.perform(UserRequest.java:54)
        at hudson.remoting.Request$2.run(Request.java:369)
        at hudson.remoting.InterceptingExecutorService$1.call(InterceptingExecutorService.java:72)
        at java.util.concurrent.FutureTask.run(FutureTask.java:266)
        at java.util.concurrent.ThreadPoolExecutor.runWorker(ThreadPoolExecutor.java:1142)
        at java.util.concurrent.ThreadPoolExecutor$Worker.run(ThreadPoolExecutor.java:617)
        at java.lang.Thread.run(Thread.java:744)
Retrying after 10 seconds
No credentials specified
 > git rev-parse --is-inside-work-tree # timeout=10
Fetching changes from the remote Git repository
 > git config remote.origin.url https://gitbox.apache.org/repos/asf/lucene-solr.git # timeout=10
Fetching upstream changes from https://gitbox.apache.org/repos/asf/lucene-solr.git
 > git --version # timeout=10
 > git fetch --tags --progress https://gitbox.apache.org/repos/asf/lucene-solr.git +refs/heads/*:refs/remotes/origin/*
 > git rev-parse refs/remotes/origin/master^{commit} # timeout=10
 > git rev-parse refs/remotes/origin/origin/master^{commit} # timeout=10
Checking out Revision 3ed96026d353864c60566a9a3bdb1da853bb9e8f (refs/remotes/origin/master)
 > git config core.sparsecheckout # timeout=10
 > git checkout -f 3ed96026d353864c60566a9a3bdb1da853bb9e8f
Commit message: "LTR Test Hardening:"
Cleaning workspace
 > git rev-parse --verify HEAD # timeout=10
Resetting working tree
 > git reset --hard # timeout=10
 > git clean -fdx # timeout=10
Checking out a fresh workspace because /home/jenkins/jenkins-slave/workspace/Lucene-Solr-NightlyTests-master/test-data doesn't exist
Cleaning local Directory test-data
Checking out http://svn.apache.org/repos/asf/lucene/test-data at revision '2019-09-13T03:32:27.736 +0000'
ERROR: Failed to check out http://svn.apache.org/repos/asf/lucene/test-data
org.tmatesoft.svn.core.SVNException: svn: E175002: connection refused by the server
svn: E175002: OPTIONS request failed on '/repos/asf/lucene/test-data'
        at org.tmatesoft.svn.core.internal.wc.SVNErrorManager.error(SVNErrorManager.java:112)
        at org.tmatesoft.svn.core.internal.wc.SVNErrorManager.error(SVNErrorManager.java:96)
        at org.tmatesoft.svn.core.internal.io.dav.http.HTTPConnection.request(HTTPConnection.java:765)
        at org.tmatesoft.svn.core.internal.io.dav.http.HTTPConnection.request(HTTPConnection.java:352)
        at org.tmatesoft.svn.core.internal.io.dav.http.HTTPConnection.request(HTTPConnection.java:340)
        at org.tmatesoft.svn.core.internal.io.dav.DAVConnection.performHttpRequest(DAVConnection.java:910)
        at org.tmatesoft.svn.core.internal.io.dav.DAVConnection.exchangeCapabilities(DAVConnection.java:702)
        at org.tmatesoft.svn.core.internal.io.dav.DAVConnection.open(DAVConnection.java:113)
        at org.tmatesoft.svn.core.internal.io.dav.DAVRepository.openConnection(DAVRepository.java:1035)
        at org.tmatesoft.svn.core.internal.io.dav.DAVRepository.getLatestRevision(DAVRepository.java:164)
        at org.tmatesoft.svn.core.internal.wc2.ng.SvnNgRepositoryAccess.getRevisionNumber(SvnNgRepositoryAccess.java:119)
        at org.tmatesoft.svn.core.internal.wc2.SvnRepositoryAccess.getLocations(SvnRepositoryAccess.java:178)
        at org.tmatesoft.svn.core.internal.wc2.ng.SvnNgRepositoryAccess.createRepositoryFor(SvnNgRepositoryAccess.java:43)
        at org.tmatesoft.svn.core.internal.wc2.ng.SvnNgAbstractUpdate.checkout(SvnNgAbstractUpdate.java:831)
        at org.tmatesoft.svn.core.internal.wc2.ng.SvnNgCheckout.run(SvnNgCheckout.java:26)
        at org.tmatesoft.svn.core.internal.wc2.ng.SvnNgCheckout.run(SvnNgCheckout.java:11)
        at org.tmatesoft.svn.core.internal.wc2.ng.SvnNgOperationRunner.run(SvnNgOperationRunner.java:20)
        at org.tmatesoft.svn.core.internal.wc2.SvnOperationRunner.run(SvnOperationRunner.java:21)
        at org.tmatesoft.svn.core.wc2.SvnOperationFactory.run(SvnOperationFactory.java:1239)
        at org.tmatesoft.svn.core.wc2.SvnOperation.run(SvnOperation.java:294)
        at hudson.scm.subversion.CheckoutUpdater$SubversionUpdateTask.perform(CheckoutUpdater.java:133)
        at hudson.scm.subversion.WorkspaceUpdater$UpdateTask.delegateTo(WorkspaceUpdater.java:168)
        at hudson.scm.subversion.WorkspaceUpdater$UpdateTask.delegateTo(WorkspaceUpdater.java:176)
        at hudson.scm.subversion.UpdateUpdater$TaskImpl.perform(UpdateUpdater.java:134)
        at hudson.scm.subversion.WorkspaceUpdater$UpdateTask.delegateTo(WorkspaceUpdater.java:168)
        at hudson.scm.SubversionSCM$CheckOutTask.perform(SubversionSCM.java:1041)
        at hudson.scm.SubversionSCM$CheckOutTask.invoke(SubversionSCM.java:1017)
        at hudson.scm.SubversionSCM$CheckOutTask.invoke(SubversionSCM.java:990)
        at hudson.FilePath$FileCallableWrapper.call(FilePath.java:3086)
        at hudson.remoting.UserRequest.perform(UserRequest.java:212)
        at hudson.remoting.UserRequest.perform(UserRequest.java:54)
        at hudson.remoting.Request$2.run(Request.java:369)
        at hudson.remoting.InterceptingExecutorService$1.call(InterceptingExecutorService.java:72)
        at java.util.concurrent.FutureTask.run(FutureTask.java:266)
        at java.util.concurrent.ThreadPoolExecutor.runWorker(ThreadPoolExecutor.java:1142)
        at java.util.concurrent.ThreadPoolExecutor$Worker.run(ThreadPoolExecutor.java:617)
        at java.lang.Thread.run(Thread.java:744)
Caused by: java.net.ConnectException: Connection refused
        at java.net.PlainSocketImpl.socketConnect(Native Method)
        at java.net.AbstractPlainSocketImpl.doConnect(AbstractPlainSocketImpl.java:345)
        at java.net.AbstractPlainSocketImpl.connectToAddress(AbstractPlainSocketImpl.java:206)
        at java.net.AbstractPlainSocketImpl.connect(AbstractPlainSocketImpl.java:188)
        at java.net.SocksSocketImpl.connect(SocksSocketImpl.java:392)
        at java.net.Socket.connect(Socket.java:589)
        at org.tmatesoft.svn.core.internal.util.SVNSocketConnection.run(SVNSocketConnection.java:57)
        at java.util.concurrent.Executors$RunnableAdapter.call(Executors.java:511)
        ... 4 more
java.net.ConnectException: Connection refused
        at java.net.PlainSocketImpl.socketConnect(Native Method)
        at java.net.AbstractPlainSocketImpl.doConnect(AbstractPlainSocketImpl.java:345)
        at java.net.AbstractPlainSocketImpl.connectToAddress(AbstractPlainSocketImpl.java:206)
        at java.net.AbstractPlainSocketImpl.connect(AbstractPlainSocketImpl.java:188)
        at java.net.SocksSocketImpl.connect(SocksSocketImpl.java:392)
        at java.net.Socket.connect(Socket.java:589)
        at org.tmatesoft.svn.core.internal.util.SVNSocketConnection.run(SVNSocketConnection.java:57)
        at java.util.concurrent.Executors$RunnableAdapter.call(Executors.java:511)
Caused: org.tmatesoft.svn.core.SVNException: svn: E175002: connection refused by the server
svn: E175002: OPTIONS request failed on '/repos/asf/lucene/test-data'
        at org.tmatesoft.svn.core.internal.wc.SVNErrorManager.error(SVNErrorManager.java:112)
        at org.tmatesoft.svn.core.internal.wc.SVNErrorManager.error(SVNErrorManager.java:96)
        at org.tmatesoft.svn.core.internal.io.dav.http.HTTPConnection.request(HTTPConnection.java:765)
        at org.tmatesoft.svn.core.internal.io.dav.http.HTTPConnection.request(HTTPConnection.java:352)
        at org.tmatesoft.svn.core.internal.io.dav.http.HTTPConnection.request(HTTPConnection.java:340)
        at org.tmatesoft.svn.core.internal.io.dav.DAVConnection.performHttpRequest(DAVConnection.java:910)
        at org.tmatesoft.svn.core.internal.io.dav.DAVConnection.exchangeCapabilities(DAVConnection.java:702)
        at org.tmatesoft.svn.core.internal.io.dav.DAVConnection.open(DAVConnection.java:113)
        at org.tmatesoft.svn.core.internal.io.dav.DAVRepository.openConnection(DAVRepository.java:1035)
        at org.tmatesoft.svn.core.internal.io.dav.DAVRepository.getLatestRevision(DAVRepository.java:164)
        at org.tmatesoft.svn.core.internal.wc2.ng.SvnNgRepositoryAccess.getRevisionNumber(SvnNgRepositoryAccess.java:119)
        at org.tmatesoft.svn.core.internal.wc2.SvnRepositoryAccess.getLocations(SvnRepositoryAccess.java:178)
        at org.tmatesoft.svn.core.internal.wc2.ng.SvnNgRepositoryAccess.createRepositoryFor(SvnNgRepositoryAccess.java:43)
        at org.tmatesoft.svn.core.internal.wc2.ng.SvnNgAbstractUpdate.checkout(SvnNgAbstractUpdate.java:831)
        at org.tmatesoft.svn.core.internal.wc2.ng.SvnNgCheckout.run(SvnNgCheckout.java:26)
        at org.tmatesoft.svn.core.internal.wc2.ng.SvnNgCheckout.run(SvnNgCheckout.java:11)
        at org.tmatesoft.svn.core.internal.wc2.ng.SvnNgOperationRunner.run(SvnNgOperationRunner.java:20)
        at org.tmatesoft.svn.core.internal.wc2.SvnOperationRunner.run(SvnOperationRunner.java:21)
        at org.tmatesoft.svn.core.wc2.SvnOperationFactory.run(SvnOperationFactory.java:1239)
        at org.tmatesoft.svn.core.wc2.SvnOperation.run(SvnOperation.java:294)
        at hudson.scm.subversion.CheckoutUpdater$SubversionUpdateTask.perform(CheckoutUpdater.java:133)
Also:   hudson.remoting.Channel$CallSiteStackTrace: Remote call to lucene
                at hudson.remoting.Channel.attachCallSiteStackTrace(Channel.java:1741)
                at hudson.remoting.UserRequest$ExceptionResponse.retrieve(UserRequest.java:357)
                at hudson.remoting.Channel.call(Channel.java:955)
                at hudson.FilePath.act(FilePath.java:1072)
                at hudson.FilePath.act(FilePath.java:1061)
                at hudson.scm.SubversionSCM.checkout(SubversionSCM.java:937)
                at hudson.scm.SubversionSCM.checkout(SubversionSCM.java:864)
                at org.jenkinsci.plugins.multiplescms.MultiSCM.checkout(MultiSCM.java:143)
                at hudson.scm.SCM.checkout(SCM.java:504)
                at hudson.model.AbstractProject.checkout(AbstractProject.java:1208)
                at hudson.model.AbstractBuild$AbstractBuildExecution.defaultCheckout(AbstractBuild.java:574)
                at jenkins.scm.SCMCheckoutStrategy.checkout(SCMCheckoutStrategy.java:86)
                at hudson.model.AbstractBuild$AbstractBuildExecution.run(AbstractBuild.java:499)
                at hudson.model.Run.execute(Run.java:1810)
                at hudson.model.FreeStyleBuild.run(FreeStyleBuild.java:43)
                at hudson.model.ResourceController.execute(ResourceController.java:97)
                at hudson.model.Executor.run(Executor.java:429)
Caused: java.io.IOException: Failed to check out http://svn.apache.org/repos/asf/lucene/test-data
        at hudson.scm.subversion.CheckoutUpdater$SubversionUpdateTask.perform(CheckoutUpdater.java:144)
        at hudson.scm.subversion.WorkspaceUpdater$UpdateTask.delegateTo(WorkspaceUpdater.java:168)
        at hudson.scm.subversion.WorkspaceUpdater$UpdateTask.delegateTo(WorkspaceUpdater.java:176)
        at hudson.scm.subversion.UpdateUpdater$TaskImpl.perform(UpdateUpdater.java:134)
        at hudson.scm.subversion.WorkspaceUpdater$UpdateTask.delegateTo(WorkspaceUpdater.java:168)
        at hudson.scm.SubversionSCM$CheckOutTask.perform(SubversionSCM.java:1041)
        at hudson.scm.SubversionSCM$CheckOutTask.invoke(SubversionSCM.java:1017)
        at hudson.scm.SubversionSCM$CheckOutTask.invoke(SubversionSCM.java:990)
        at hudson.FilePath$FileCallableWrapper.call(FilePath.java:3086)
        at hudson.remoting.UserRequest.perform(UserRequest.java:212)
        at hudson.remoting.UserRequest.perform(UserRequest.java:54)
        at hudson.remoting.Request$2.run(Request.java:369)
        at hudson.remoting.InterceptingExecutorService$1.call(InterceptingExecutorService.java:72)
        at java.util.concurrent.FutureTask.run(FutureTask.java:266)
        at java.util.concurrent.ThreadPoolExecutor.runWorker(ThreadPoolExecutor.java:1142)
        at java.util.concurrent.ThreadPoolExecutor$Worker.run(ThreadPoolExecutor.java:617)
        at java.lang.Thread.run(Thread.java:744)
Archiving artifacts
Recording test results
ERROR: Step ‘Publish JUnit test result report’ failed: No test report files were found. Configuration error?
Email was triggered for: Failure - Any
Sending email for trigger: Failure - Any


---------------------------------------------------------------------
To unsubscribe, e-mail: [hidden email]
For additional commands, e-mail: [hidden email]