[JENKINS] Lucene-Solr-Tests-4.x-Java6 - Build # 1886 - Failure

classic Classic list List threaded Threaded
1 message Options
Reply | Threaded
Open this post in threaded view
|

[JENKINS] Lucene-Solr-Tests-4.x-Java6 - Build # 1886 - Failure

Apache Jenkins Server-2
Build: https://builds.apache.org/job/Lucene-Solr-Tests-4.x-Java6/1886/

1 tests failed.
REGRESSION:  org.apache.solr.client.solrj.embedded.JettyWebappTest.testAdminUI

Error Message:
Server returned HTTP response code: 500 for URL: http://127.0.0.1:46558/test/

Stack Trace:
java.io.IOException: Server returned HTTP response code: 500 for URL: http://127.0.0.1:46558/test/
        at __randomizedtesting.SeedInfo.seed([9E87D68DFF6E3F71:A65535DE9805A4CE]:0)
        at sun.net.www.protocol.http.HttpURLConnection.getInputStream(HttpURLConnection.java:1403)
        at java.net.URL.openStream(URL.java:1031)
        at org.apache.solr.client.solrj.embedded.JettyWebappTest.testAdminUI(JettyWebappTest.java:98)
        at sun.reflect.NativeMethodAccessorImpl.invoke0(Native Method)
        at sun.reflect.NativeMethodAccessorImpl.invoke(NativeMethodAccessorImpl.java:57)
        at sun.reflect.DelegatingMethodAccessorImpl.invoke(DelegatingMethodAccessorImpl.java:43)
        at java.lang.reflect.Method.invoke(Method.java:616)
        at com.carrotsearch.randomizedtesting.RandomizedRunner.invoke(RandomizedRunner.java:1559)
        at com.carrotsearch.randomizedtesting.RandomizedRunner.access$600(RandomizedRunner.java:79)
        at com.carrotsearch.randomizedtesting.RandomizedRunner$6.evaluate(RandomizedRunner.java:737)
        at com.carrotsearch.randomizedtesting.RandomizedRunner$7.evaluate(RandomizedRunner.java:773)
        at com.carrotsearch.randomizedtesting.RandomizedRunner$8.evaluate(RandomizedRunner.java:787)
        at com.carrotsearch.randomizedtesting.rules.SystemPropertiesRestoreRule$1.evaluate(SystemPropertiesRestoreRule.java:53)
        at org.apache.lucene.util.TestRuleSetupTeardownChained$1.evaluate(TestRuleSetupTeardownChained.java:50)
        at org.apache.lucene.util.TestRuleFieldCacheSanity$1.evaluate(TestRuleFieldCacheSanity.java:51)
        at org.apache.lucene.util.AbstractBeforeAfterRule$1.evaluate(AbstractBeforeAfterRule.java:46)
        at com.carrotsearch.randomizedtesting.rules.SystemPropertiesInvariantRule$1.evaluate(SystemPropertiesInvariantRule.java:55)
        at org.apache.lucene.util.TestRuleThreadAndTestName$1.evaluate(TestRuleThreadAndTestName.java:49)
        at org.apache.lucene.util.TestRuleIgnoreAfterMaxFailures$1.evaluate(TestRuleIgnoreAfterMaxFailures.java:70)
        at org.apache.lucene.util.TestRuleMarkFailure$1.evaluate(TestRuleMarkFailure.java:48)
        at com.carrotsearch.randomizedtesting.rules.StatementAdapter.evaluate(StatementAdapter.java:36)
        at com.carrotsearch.randomizedtesting.ThreadLeakControl$StatementRunner.run(ThreadLeakControl.java:358)
        at com.carrotsearch.randomizedtesting.ThreadLeakControl.forkTimeoutingTask(ThreadLeakControl.java:782)
        at com.carrotsearch.randomizedtesting.ThreadLeakControl$3.evaluate(ThreadLeakControl.java:442)
        at com.carrotsearch.randomizedtesting.RandomizedRunner.runSingleTest(RandomizedRunner.java:746)
        at com.carrotsearch.randomizedtesting.RandomizedRunner$3.evaluate(RandomizedRunner.java:648)
        at com.carrotsearch.randomizedtesting.RandomizedRunner$4.evaluate(RandomizedRunner.java:682)
        at com.carrotsearch.randomizedtesting.RandomizedRunner$5.evaluate(RandomizedRunner.java:693)
        at org.apache.lucene.util.AbstractBeforeAfterRule$1.evaluate(AbstractBeforeAfterRule.java:46)
        at org.apache.lucene.util.TestRuleStoreClassName$1.evaluate(TestRuleStoreClassName.java:42)
        at com.carrotsearch.randomizedtesting.rules.SystemPropertiesInvariantRule$1.evaluate(SystemPropertiesInvariantRule.java:55)
        at com.carrotsearch.randomizedtesting.rules.NoShadowingOrOverridesOnMethodsRule$1.evaluate(NoShadowingOrOverridesOnMethodsRule.java:39)
        at com.carrotsearch.randomizedtesting.rules.NoShadowingOrOverridesOnMethodsRule$1.evaluate(NoShadowingOrOverridesOnMethodsRule.java:39)
        at com.carrotsearch.randomizedtesting.rules.StatementAdapter.evaluate(StatementAdapter.java:36)
        at org.apache.lucene.util.TestRuleAssertionsRequired$1.evaluate(TestRuleAssertionsRequired.java:43)
        at org.apache.lucene.util.TestRuleMarkFailure$1.evaluate(TestRuleMarkFailure.java:48)
        at org.apache.lucene.util.TestRuleIgnoreAfterMaxFailures$1.evaluate(TestRuleIgnoreAfterMaxFailures.java:70)
        at org.apache.lucene.util.TestRuleIgnoreTestSuites$1.evaluate(TestRuleIgnoreTestSuites.java:55)
        at com.carrotsearch.randomizedtesting.rules.StatementAdapter.evaluate(StatementAdapter.java:36)
        at com.carrotsearch.randomizedtesting.ThreadLeakControl$StatementRunner.run(ThreadLeakControl.java:358)
        at java.lang.Thread.run(Thread.java:679)




Build Log:
[...truncated 10189 lines...]
   [junit4] Suite: org.apache.solr.client.solrj.embedded.JettyWebappTest
   [junit4]   2> 125755 T251 oejs.Server.doStart jetty-8.1.10.v20130312
   [junit4]   2> 126216 T251 oejw.StandardDescriptorProcessor.visitServlet NO JSP Support for /test, did not find org.apache.jasper.servlet.JspServlet
   [junit4]   2> 126321 T251 oass.SolrDispatchFilter.init SolrDispatchFilter.init()
   [junit4]   2> 126334 T251 oasc.SolrResourceLoader.locateSolrHome JNDI not configured for solr (NoInitialContextEx)
   [junit4]   2> 126335 T251 oasc.SolrResourceLoader.locateSolrHome using system property solr.solr.home: /usr/home/hudson/hudson-slave/workspace/Lucene-Solr-Tests-4.x-Java6/solr/example/solr
   [junit4]   2> 126335 T251 oasc.SolrResourceLoader.<init> new SolrResourceLoader for directory: '/usr/home/hudson/hudson-slave/workspace/Lucene-Solr-Tests-4.x-Java6/solr/example/solr/'
   [junit4]   2> 126387 T251 oasc.ConfigSolr.fromFile Loading container configuration from /usr/home/hudson/hudson-slave/workspace/Lucene-Solr-Tests-4.x-Java6/solr/example/solr/solr.xml
   [junit4]   2> 126450 T251 oasc.ConfigSolrXml.<init> Config-defined core root directory:
   [junit4]   2> 126451 T251 oasc.CoreContainer.<init> New CoreContainer 1582457600
   [junit4]   2> 126451 T251 oasc.CoreContainer.load Loading cores into CoreContainer [instanceDir=/usr/home/hudson/hudson-slave/workspace/Lucene-Solr-Tests-4.x-Java6/solr/example/solr/]
   [junit4]   2> 126452 T251 oashc.HttpShardHandlerFactory.getParameter Setting socketTimeout to: 0
   [junit4]   2> 126453 T251 oashc.HttpShardHandlerFactory.getParameter Setting urlScheme to: http://
   [junit4]   2> 126453 T251 oashc.HttpShardHandlerFactory.getParameter Setting connTimeout to: 0
   [junit4]   2> 126453 T251 oashc.HttpShardHandlerFactory.getParameter Setting maxConnectionsPerHost to: 20
   [junit4]   2> 126453 T251 oashc.HttpShardHandlerFactory.getParameter Setting corePoolSize to: 0
   [junit4]   2> 126454 T251 oashc.HttpShardHandlerFactory.getParameter Setting maximumPoolSize to: 2147483647
   [junit4]   2> 126454 T251 oashc.HttpShardHandlerFactory.getParameter Setting maxThreadIdleTime to: 5
   [junit4]   2> 126454 T251 oashc.HttpShardHandlerFactory.getParameter Setting sizeOfQueue to: -1
   [junit4]   2> 126454 T251 oashc.HttpShardHandlerFactory.getParameter Setting fairnessPolicy to: false
   [junit4]   2> 126455 T251 oascsi.HttpClientUtil.createClient Creating new http client, config:maxConnectionsPerHost=20&maxConnections=10000&socketTimeout=0&connTimeout=0&retry=false
   [junit4]   2> 126469 T251 oasc.CorePropertiesLocator.discover Looking for core definitions underneath /usr/home/hudson/hudson-slave/workspace/Lucene-Solr-Tests-4.x-Java6/solr/example/solr
   [junit4]   2> 126477 T251 oasc.CorePropertiesLocator.discoverUnder Found core collection1 in /usr/home/hudson/hudson-slave/workspace/Lucene-Solr-Tests-4.x-Java6/solr/example/solr/collection1/
   [junit4]   2> 126483 T251 oasc.CorePropertiesLocator.discover Found 1 core definitions
   [junit4]   2> 126484 T253 oasc.CoreContainer.create Creating SolrCore 'collection1' using instanceDir: /usr/home/hudson/hudson-slave/workspace/Lucene-Solr-Tests-4.x-Java6/solr/example/solr/collection1
   [junit4]   2> 126484 T253 oasc.SolrResourceLoader.<init> new SolrResourceLoader for directory: '/usr/home/hudson/hudson-slave/workspace/Lucene-Solr-Tests-4.x-Java6/solr/example/solr/collection1/'
   [junit4]   2> 126508 T253 oasc.SolrConfig.initLibs Adding specified lib dirs to ClassLoader
   [junit4]   2> 126508 T253 oasc.SolrResourceLoader.addToClassLoader WARN No files added to classloader from lib: ../../../contrib/extraction/lib (resolved as: /usr/home/hudson/hudson-slave/workspace/Lucene-Solr-Tests-4.x-Java6/solr/example/solr/collection1/../../../contrib/extraction/lib).
   [junit4]   2> 126509 T253 oasc.SolrResourceLoader.addToClassLoader WARN Can't find (or read) directory to add to classloader: ../../../dist/ (resolved as: /usr/home/hudson/hudson-slave/workspace/Lucene-Solr-Tests-4.x-Java6/solr/example/solr/collection1/../../../dist).
   [junit4]   2> 126510 T253 oasc.SolrResourceLoader.addToClassLoader WARN No files added to classloader from lib: ../../../contrib/clustering/lib/ (resolved as: /usr/home/hudson/hudson-slave/workspace/Lucene-Solr-Tests-4.x-Java6/solr/example/solr/collection1/../../../contrib/clustering/lib).
   [junit4]   2> 126510 T253 oasc.SolrResourceLoader.addToClassLoader WARN Can't find (or read) directory to add to classloader: ../../../dist/ (resolved as: /usr/home/hudson/hudson-slave/workspace/Lucene-Solr-Tests-4.x-Java6/solr/example/solr/collection1/../../../dist).
   [junit4]   2> 126510 T253 oasc.SolrResourceLoader.addToClassLoader WARN No files added to classloader from lib: ../../../contrib/langid/lib/ (resolved as: /usr/home/hudson/hudson-slave/workspace/Lucene-Solr-Tests-4.x-Java6/solr/example/solr/collection1/../../../contrib/langid/lib).
   [junit4]   2> 126511 T253 oasc.SolrResourceLoader.addToClassLoader WARN Can't find (or read) directory to add to classloader: ../../../dist/ (resolved as: /usr/home/hudson/hudson-slave/workspace/Lucene-Solr-Tests-4.x-Java6/solr/example/solr/collection1/../../../dist).
   [junit4]   2> 126511 T253 oasc.SolrResourceLoader.addToClassLoader WARN No files added to classloader from lib: ../../../contrib/velocity/lib (resolved as: /usr/home/hudson/hudson-slave/workspace/Lucene-Solr-Tests-4.x-Java6/solr/example/solr/collection1/../../../contrib/velocity/lib).
   [junit4]   2> 126511 T253 oasc.SolrResourceLoader.addToClassLoader WARN Can't find (or read) directory to add to classloader: ../../../dist/ (resolved as: /usr/home/hudson/hudson-slave/workspace/Lucene-Solr-Tests-4.x-Java6/solr/example/solr/collection1/../../../dist).
   [junit4]   2> 126548 T253 oasu.SolrIndexConfig.<init> IndexWriter infoStream solr logging is enabled
   [junit4]   2> 126552 T253 oasc.SolrConfig.<init> Using Lucene MatchVersion: LUCENE_45
   [junit4]   2> 126620 T253 oasc.SolrConfig.<init> Loaded SolrConfig: solrconfig.xml
   [junit4]   2> 126621 T253 oass.IndexSchema.readSchema Reading Solr Schema from schema.xml
   [junit4]   2> 126639 T253 oass.IndexSchema.readSchema [collection1] Schema name=example
   [junit4]   2> 127262 T253 oass.IndexSchema.readSchema unique key field: id
   [junit4]   2> 127279 T253 oass.FileExchangeRateProvider.reload Reloading exchange rates from file currency.xml
   [junit4]   2> 127283 T253 oass.FileExchangeRateProvider.reload Reloading exchange rates from file currency.xml
   [junit4]   2> 127305 T253 oasc.SolrCore.initDirectoryFactory org.apache.solr.core.MockDirectoryFactory
   [junit4]   2> 127305 T253 oasc.SolrCore.<init> [collection1] Opening new SolrCore at /usr/home/hudson/hudson-slave/workspace/Lucene-Solr-Tests-4.x-Java6/solr/example/solr/collection1/, dataDir=/usr/home/hudson/hudson-slave/workspace/Lucene-Solr-Tests-4.x-Java6/solr/build/solr-solrj/test/J0/org.apache.solr.client.solrj.embedded.JettyWebappTest-1376055941762/
   [junit4]   2> 127306 T253 oasc.JmxMonitoredMap.<init> JMX monitoring is enabled. Adding Solr mbeans to JMX Server: com.sun.jmx.mbeanserver.JmxMBeanServer@442b7fc2
   [junit4]   2> 127307 T253 oasc.SolrCore.initListeners [collection1] Added SolrEventListener for newSearcher: org.apache.solr.core.QuerySenderListener{queries=[]}
   [junit4]   2> 127307 T253 oasc.SolrCore.initListeners [collection1] Added SolrEventListener for firstSearcher: org.apache.solr.core.QuerySenderListener{queries=[{q=static firstSearcher warming in solrconfig.xml}]}
   [junit4]   2> 127307 T253 oasc.CachingDirectoryFactory.get return new directory for /usr/home/hudson/hudson-slave/workspace/Lucene-Solr-Tests-4.x-Java6/solr/build/solr-solrj/test/J0/org.apache.solr.client.solrj.embedded.JettyWebappTest-1376055941762
   [junit4]   2> 127307 T253 oasc.SolrCore.getNewIndexDir New index directory detected: old=null new=/usr/home/hudson/hudson-slave/workspace/Lucene-Solr-Tests-4.x-Java6/solr/build/solr-solrj/test/J0/org.apache.solr.client.solrj.embedded.JettyWebappTest-1376055941762/index/
   [junit4]   2> 127308 T253 oasc.SolrCore.initIndex WARN [collection1] Solr index directory '/usr/home/hudson/hudson-slave/workspace/Lucene-Solr-Tests-4.x-Java6/solr/build/solr-solrj/test/J0/org.apache.solr.client.solrj.embedded.JettyWebappTest-1376055941762/index' doesn't exist. Creating new index...
   [junit4]   2> 127308 T253 oasc.CachingDirectoryFactory.get return new directory for /usr/home/hudson/hudson-slave/workspace/Lucene-Solr-Tests-4.x-Java6/solr/build/solr-solrj/test/J0/org.apache.solr.client.solrj.embedded.JettyWebappTest-1376055941762/index
   [junit4]   2> 127310 T253 oasu.LoggingInfoStream.message [IFD][coreLoadExecutor-133-thread-1]: init: current segments file is "null"; deletionPolicy=org.apache.solr.core.IndexDeletionPolicyWrapper@52e21a17
   [junit4]   2> 127310 T253 oasu.LoggingInfoStream.message [IFD][coreLoadExecutor-133-thread-1]: now checkpoint "" [0 segments ; isCommit = false]
   [junit4]   2> 127310 T253 oasu.LoggingInfoStream.message [IFD][coreLoadExecutor-133-thread-1]: 0 msec to checkpoint
   [junit4]   2> 127310 T253 oasu.LoggingInfoStream.message [IW][coreLoadExecutor-133-thread-1]: init: create=true
   [junit4]   2> 127310 T253 oasu.LoggingInfoStream.message [IW][coreLoadExecutor-133-thread-1]:
   [junit4]   2> dir=MockDirWrapper(org.apache.lucene.store.RAMDirectory@20c7afdd lockFactory=org.apache.lucene.store.NativeFSLockFactory@232c5bfc)
   [junit4]   2> index=
   [junit4]   2> version=4.5-SNAPSHOT
   [junit4]   2> matchVersion=LUCENE_45
   [junit4]   2> analyzer=null
   [junit4]   2> ramBufferSizeMB=100.0
   [junit4]   2> maxBufferedDocs=-1
   [junit4]   2> maxBufferedDeleteTerms=-1
   [junit4]   2> mergedSegmentWarmer=null
   [junit4]   2> readerTermsIndexDivisor=1
   [junit4]   2> termIndexInterval=32
   [junit4]   2> delPolicy=org.apache.solr.core.IndexDeletionPolicyWrapper
   [junit4]   2> commit=null
   [junit4]   2> openMode=CREATE
   [junit4]   2> similarity=org.apache.lucene.search.similarities.DefaultSimilarity
   [junit4]   2> mergeScheduler=ConcurrentMergeScheduler: maxThreadCount=1, maxMergeCount=2, mergeThreadPriority=-1
   [junit4]   2> default WRITE_LOCK_TIMEOUT=1000
   [junit4]   2> writeLockTimeout=1000
   [junit4]   2> codec=Lucene42
   [junit4]   2> infoStream=org.apache.solr.update.LoggingInfoStream
   [junit4]   2> mergePolicy=[TieredMergePolicy: maxMergeAtOnce=10, maxMergeAtOnceExplicit=30, maxMergedSegmentMB=5120.0, floorSegmentMB=2.0, forceMergeDeletesPctAllowed=10.0, segmentsPerTier=10.0, maxCFSSegmentSizeMB=8.796093022207999E12, noCFSRatio=0.0
   [junit4]   2> indexerThreadPool=org.apache.lucene.index.ThreadAffinityDocumentsWriterThreadPool@7a1f0683
   [junit4]   2> readerPooling=false
   [junit4]   2> perThreadHardLimitMB=1945
   [junit4]   2> useCompoundFile=false
   [junit4]   2>
   [junit4]   2> 127311 T253 oasu.LoggingInfoStream.message [IW][coreLoadExecutor-133-thread-1]: now flush at close waitForMerges=true
   [junit4]   2> 127311 T253 oasu.LoggingInfoStream.message [IW][coreLoadExecutor-133-thread-1]:   start flush: applyAllDeletes=true
   [junit4]   2> 127311 T253 oasu.LoggingInfoStream.message [IW][coreLoadExecutor-133-thread-1]:   index before flush
   [junit4]   2> 127311 T253 oasu.LoggingInfoStream.message [DW][coreLoadExecutor-133-thread-1]: coreLoadExecutor-133-thread-1 startFullFlush
   [junit4]   2> 127311 T253 oasu.LoggingInfoStream.message [DW][coreLoadExecutor-133-thread-1]: anyChanges? numDocsInRam=0 deletes=false hasTickets:false pendingChangesInFullFlush: false
   [junit4]   2> 127312 T253 oasu.LoggingInfoStream.message [DW][coreLoadExecutor-133-thread-1]: coreLoadExecutor-133-thread-1 finishFullFlush success=true
   [junit4]   2> 127312 T253 oasu.LoggingInfoStream.message [IW][coreLoadExecutor-133-thread-1]: apply all deletes during flush
   [junit4]   2> 127312 T253 oasu.LoggingInfoStream.message [BD][coreLoadExecutor-133-thread-1]: prune sis=org.apache.lucene.index.SegmentInfos@ae4c118 minGen=9223372036854775807 packetCount=0
   [junit4]   2> 127312 T253 oasu.LoggingInfoStream.message [CMS][coreLoadExecutor-133-thread-1]: now merge
   [junit4]   2> 127312 T253 oasu.LoggingInfoStream.message [CMS][coreLoadExecutor-133-thread-1]:   index:
   [junit4]   2> 127312 T253 oasu.LoggingInfoStream.message [CMS][coreLoadExecutor-133-thread-1]:   no more merges pending; now return
   [junit4]   2> 127313 T253 oasu.LoggingInfoStream.message [IW][coreLoadExecutor-133-thread-1]: waitForMerges
   [junit4]   2> 127313 T253 oasu.LoggingInfoStream.message [IW][coreLoadExecutor-133-thread-1]: waitForMerges done
   [junit4]   2> 127313 T253 oasu.LoggingInfoStream.message [IW][coreLoadExecutor-133-thread-1]: now call final commit()
   [junit4]   2> 127313 T253 oasu.LoggingInfoStream.message [IW][coreLoadExecutor-133-thread-1]: commit: start
   [junit4]   2> 127313 T253 oasu.LoggingInfoStream.message [IW][coreLoadExecutor-133-thread-1]: commit: enter lock
   [junit4]   2> 127313 T253 oasu.LoggingInfoStream.message [IW][coreLoadExecutor-133-thread-1]: commit: now prepare
   [junit4]   2> 127313 T253 oasu.LoggingInfoStream.message [IW][coreLoadExecutor-133-thread-1]: prepareCommit: flush
   [junit4]   2> 127314 T253 oasu.LoggingInfoStream.message [IW][coreLoadExecutor-133-thread-1]:   index before flush
   [junit4]   2> 127314 T253 oasu.LoggingInfoStream.message [DW][coreLoadExecutor-133-thread-1]: coreLoadExecutor-133-thread-1 startFullFlush
   [junit4]   2> 127314 T253 oasu.LoggingInfoStream.message [DW][coreLoadExecutor-133-thread-1]: anyChanges? numDocsInRam=0 deletes=false hasTickets:false pendingChangesInFullFlush: false
   [junit4]   2> 127314 T253 oasu.LoggingInfoStream.message [IW][coreLoadExecutor-133-thread-1]: apply all deletes during flush
   [junit4]   2> 127314 T253 oasu.LoggingInfoStream.message [BD][coreLoadExecutor-133-thread-1]: prune sis=org.apache.lucene.index.SegmentInfos@ae4c118 minGen=9223372036854775807 packetCount=0
   [junit4]   2> 127315 T253 oasu.LoggingInfoStream.message [DW][coreLoadExecutor-133-thread-1]: coreLoadExecutor-133-thread-1 finishFullFlush success=true
   [junit4]   2> 127315 T253 oasu.LoggingInfoStream.message [IW][coreLoadExecutor-133-thread-1]: startCommit(): start
   [junit4]   2> 127315 T253 oasu.LoggingInfoStream.message [IW][coreLoadExecutor-133-thread-1]: startCommit index= changeCount=1
   [junit4]   2> 127315 T253 oasu.LoggingInfoStream.message [IW][coreLoadExecutor-133-thread-1]: done all syncs: []
   [junit4]   2> 127315 T253 oasu.LoggingInfoStream.message [IW][coreLoadExecutor-133-thread-1]: commit: pendingCommit != null
   [junit4]   2> 127316 T253 oasu.LoggingInfoStream.message [IW][coreLoadExecutor-133-thread-1]: commit: wrote segments file "segments_1"
   [junit4]   2> 127316 T253 oasu.LoggingInfoStream.message [IFD][coreLoadExecutor-133-thread-1]: now checkpoint "" [0 segments ; isCommit = true]
   [junit4]   2> 127316 T253 oasc.SolrDeletionPolicy.onCommit SolrDeletionPolicy.onCommit: commits: num=1
   [junit4]   2> commit{dir=MockDirWrapper(org.apache.lucene.store.RAMDirectory@20c7afdd lockFactory=org.apache.lucene.store.NativeFSLockFactory@232c5bfc),segFN=segments_1,generation=1}
   [junit4]   2> 127316 T253 oasc.SolrDeletionPolicy.updateCommits newest commit generation = 1
   [junit4]   2> 127316 T253 oasu.LoggingInfoStream.message [IFD][coreLoadExecutor-133-thread-1]: 0 msec to checkpoint
   [junit4]   2> 127316 T253 oasu.LoggingInfoStream.message [IW][coreLoadExecutor-133-thread-1]: commit: done
   [junit4]   2> 127317 T253 oasu.LoggingInfoStream.message [IW][coreLoadExecutor-133-thread-1]: at close:
   [junit4]   2> 127317 T253 oasc.SolrCore.initWriters created json: solr.JSONResponseWriter
   [junit4]   2> 127318 T253 oasc.SolrCore.initWriters adding lazy queryResponseWriter: solr.VelocityResponseWriter
   [junit4]   2> 127318 T253 oasc.SolrCore.initWriters created velocity: solr.VelocityResponseWriter
   [junit4]   2> 127318 T253 oasc.SolrCore.initWriters created xslt: solr.XSLTResponseWriter
   [junit4]   2> 127318 T253 oasr.XSLTResponseWriter.init xsltCacheLifetimeSeconds=5
   [junit4]   2> 127405 T253 oasc.SolrCore.close [collection1]  CLOSING SolrCore org.apache.solr.core.SolrCore@7cd5146d
   [junit4]   2> 127407 T253 oasu.SolrCoreState.decrefSolrCoreState Closing SolrCoreState
   [junit4]   2> 127407 T253 oasu.DefaultSolrCoreState.closeIndexWriter SolrCoreState ref count has reached 0 - closing IndexWriter
   [junit4]   2> 127407 T253 oasc.SolrCore.closeSearcher [collection1] Closing main searcher on request.
   [junit4]   2> 127408 T253 oasc.CachingDirectoryFactory.close Closing MockDirectoryFactory - 2 directories currently being tracked
   [junit4]   2> 127408 T253 oasc.CachingDirectoryFactory.closeCacheValue looking to close /usr/home/hudson/hudson-slave/workspace/Lucene-Solr-Tests-4.x-Java6/solr/build/solr-solrj/test/J0/org.apache.solr.client.solrj.embedded.JettyWebappTest-1376055941762/index [CachedDir<<refCount=0;path=/usr/home/hudson/hudson-slave/workspace/Lucene-Solr-Tests-4.x-Java6/solr/build/solr-solrj/test/J0/org.apache.solr.client.solrj.embedded.JettyWebappTest-1376055941762/index;done=false>>]
   [junit4]   2> 127408 T253 oasc.CachingDirectoryFactory.close Closing directory: /usr/home/hudson/hudson-slave/workspace/Lucene-Solr-Tests-4.x-Java6/solr/build/solr-solrj/test/J0/org.apache.solr.client.solrj.embedded.JettyWebappTest-1376055941762/index
   [junit4]   2> 127408 T253 oasc.CachingDirectoryFactory.closeCacheValue looking to close /usr/home/hudson/hudson-slave/workspace/Lucene-Solr-Tests-4.x-Java6/solr/build/solr-solrj/test/J0/org.apache.solr.client.solrj.embedded.JettyWebappTest-1376055941762 [CachedDir<<refCount=0;path=/usr/home/hudson/hudson-slave/workspace/Lucene-Solr-Tests-4.x-Java6/solr/build/solr-solrj/test/J0/org.apache.solr.client.solrj.embedded.JettyWebappTest-1376055941762;done=false>>]
   [junit4]   2> 127408 T253 oasc.CachingDirectoryFactory.close Closing directory: /usr/home/hudson/hudson-slave/workspace/Lucene-Solr-Tests-4.x-Java6/solr/build/solr-solrj/test/J0/org.apache.solr.client.solrj.embedded.JettyWebappTest-1376055941762
   [junit4]   2> 127408 T253 oasc.CoreContainer.recordAndThrow ERROR Unable to create core: collection1 org.apache.solr.common.SolrException: Error loading class 'solr.clustering.ClusteringComponent'
   [junit4]   2> at org.apache.solr.core.SolrCore.<init>(SolrCore.java:830)
   [junit4]   2> at org.apache.solr.core.SolrCore.<init>(SolrCore.java:624)
   [junit4]   2> at org.apache.solr.core.CoreContainer.createFromLocal(CoreContainer.java:518)
   [junit4]   2> at org.apache.solr.core.CoreContainer.create(CoreContainer.java:553)
   [junit4]   2> at org.apache.solr.core.CoreContainer$1.call(CoreContainer.java:245)
   [junit4]   2> at org.apache.solr.core.CoreContainer$1.call(CoreContainer.java:237)
   [junit4]   2> at java.util.concurrent.FutureTask$Sync.innerRun(FutureTask.java:334)
   [junit4]   2> at java.util.concurrent.FutureTask.run(FutureTask.java:166)
   [junit4]   2> at java.util.concurrent.Executors$RunnableAdapter.call(Executors.java:471)
   [junit4]   2> at java.util.concurrent.FutureTask$Sync.innerRun(FutureTask.java:334)
   [junit4]   2> at java.util.concurrent.FutureTask.run(FutureTask.java:166)
   [junit4]   2> at java.util.concurrent.ThreadPoolExecutor.runWorker(ThreadPoolExecutor.java:1146)
   [junit4]   2> at java.util.concurrent.ThreadPoolExecutor$Worker.run(ThreadPoolExecutor.java:615)
   [junit4]   2> at java.lang.Thread.run(Thread.java:679)
   [junit4]   2> Caused by: org.apache.solr.common.SolrException: Error loading class 'solr.clustering.ClusteringComponent'
   [junit4]   2> at org.apache.solr.core.SolrResourceLoader.findClass(SolrResourceLoader.java:449)
   [junit4]   2> at org.apache.solr.core.SolrResourceLoader.findClass(SolrResourceLoader.java:381)
   [junit4]   2> at org.apache.solr.core.SolrCore.createInstance(SolrCore.java:525)
   [junit4]   2> at org.apache.solr.core.SolrCore.createInitInstance(SolrCore.java:581)
   [junit4]   2> at org.apache.solr.core.SolrCore.initPlugins(SolrCore.java:2114)
   [junit4]   2> at org.apache.solr.core.SolrCore.initPlugins(SolrCore.java:2108)
   [junit4]   2> at org.apache.solr.core.SolrCore.initPlugins(SolrCore.java:2141)
   [junit4]   2> at org.apache.solr.core.SolrCore.loadSearchComponents(SolrCore.java:1172)
   [junit4]   2> at org.apache.solr.core.SolrCore.<init>(SolrCore.java:761)
   [junit4]   2> ... 13 more
   [junit4]   2> Caused by: java.lang.ClassNotFoundException: solr.clustering.ClusteringComponent
   [junit4]   2> at java.net.URLClassLoader$1.run(URLClassLoader.java:217)
   [junit4]   2> at java.security.AccessController.doPrivileged(Native Method)
   [junit4]   2> at java.net.URLClassLoader.findClass(URLClassLoader.java:205)
   [junit4]   2> at java.lang.ClassLoader.loadClass(ClassLoader.java:321)
   [junit4]   2> at java.net.FactoryURLClassLoader.loadClass(URLClassLoader.java:615)
   [junit4]   2> at java.lang.ClassLoader.loadClass(ClassLoader.java:266)
   [junit4]   2> at java.lang.Class.forName0(Native Method)
   [junit4]   2> at java.lang.Class.forName(Class.java:266)
   [junit4]   2> at org.apache.solr.core.SolrResourceLoader.findClass(SolrResourceLoader.java:433)
   [junit4]   2> ... 21 more
   [junit4]   2>
   [junit4]   2> 127412 T253 oasc.SolrException.log ERROR null:org.apache.solr.common.SolrException: Unable to create core: collection1
   [junit4]   2> at org.apache.solr.core.CoreContainer.recordAndThrow(CoreContainer.java:930)
   [junit4]   2> at org.apache.solr.core.CoreContainer.create(CoreContainer.java:562)
   [junit4]   2> at org.apache.solr.core.CoreContainer$1.call(CoreContainer.java:245)
   [junit4]   2> at org.apache.solr.core.CoreContainer$1.call(CoreContainer.java:237)
   [junit4]   2> at java.util.concurrent.FutureTask$Sync.innerRun(FutureTask.java:334)
   [junit4]   2> at java.util.concurrent.FutureTask.run(FutureTask.java:166)
   [junit4]   2> at java.util.concurrent.Executors$RunnableAdapter.call(Executors.java:471)
   [junit4]   2> at java.util.concurrent.FutureTask$Sync.innerRun(FutureTask.java:334)
   [junit4]   2> at java.util.concurrent.FutureTask.run(FutureTask.java:166)
   [junit4]   2> at java.util.concurrent.ThreadPoolExecutor.runWorker(ThreadPoolExecutor.java:1146)
   [junit4]   2> at java.util.concurrent.ThreadPoolExecutor$Worker.run(ThreadPoolExecutor.java:615)
   [junit4]   2> at java.lang.Thread.run(Thread.java:679)
   [junit4]   2> Caused by: org.apache.solr.common.SolrException: Error loading class 'solr.clustering.ClusteringComponent'
   [junit4]   2> at org.apache.solr.core.SolrCore.<init>(SolrCore.java:830)
   [junit4]   2> at org.apache.solr.core.SolrCore.<init>(SolrCore.java:624)
   [junit4]   2> at org.apache.solr.core.CoreContainer.createFromLocal(CoreContainer.java:518)
   [junit4]   2> at org.apache.solr.core.CoreContainer.create(CoreContainer.java:553)
   [junit4]   2> ... 10 more
   [junit4]   2> Caused by: org.apache.solr.common.SolrException: Error loading class 'solr.clustering.ClusteringComponent'
   [junit4]   2> at org.apache.solr.core.SolrResourceLoader.findClass(SolrResourceLoader.java:449)
   [junit4]   2> at org.apache.solr.core.SolrResourceLoader.findClass(SolrResourceLoader.java:381)
   [junit4]   2> at org.apache.solr.core.SolrCore.createInstance(SolrCore.java:525)
   [junit4]   2> at org.apache.solr.core.SolrCore.createInitInstance(SolrCore.java:581)
   [junit4]   2> at org.apache.solr.core.SolrCore.initPlugins(SolrCore.java:2114)
   [junit4]   2> at org.apache.solr.core.SolrCore.initPlugins(SolrCore.java:2108)
   [junit4]   2> at org.apache.solr.core.SolrCore.initPlugins(SolrCore.java:2141)
   [junit4]   2> at org.apache.solr.core.SolrCore.loadSearchComponents(SolrCore.java:1172)
   [junit4]   2> at org.apache.solr.core.SolrCore.<init>(SolrCore.java:761)
   [junit4]   2> ... 13 more
   [junit4]   2> Caused by: java.lang.ClassNotFoundException: solr.clustering.ClusteringComponent
   [junit4]   2> at java.net.URLClassLoader$1.run(URLClassLoader.java:217)
   [junit4]   2> at java.security.AccessController.doPrivileged(Native Method)
   [junit4]   2> at java.net.URLClassLoader.findClass(URLClassLoader.java:205)
   [junit4]   2> at java.lang.ClassLoader.loadClass(ClassLoader.java:321)
   [junit4]   2> at java.net.FactoryURLClassLoader.loadClass(URLClassLoader.java:615)
   [junit4]   2> at java.lang.ClassLoader.loadClass(ClassLoader.java:266)
   [junit4]   2> at java.lang.Class.forName0(Native Method)
   [junit4]   2> at java.lang.Class.forName(Class.java:266)
   [junit4]   2> at org.apache.solr.core.SolrResourceLoader.findClass(SolrResourceLoader.java:433)
   [junit4]   2> ... 21 more
   [junit4]   2>
   [junit4]   2> 127412 T251 oass.SolrDispatchFilter.init user.dir=/usr/home/hudson/hudson-slave/workspace/Lucene-Solr-Tests-4.x-Java6/solr/build/solr-solrj/test/J0
   [junit4]   2> 127413 T251 oass.SolrDispatchFilter.init SolrDispatchFilter.init() done
   [junit4]   2> 127517 T251 oejs.AbstractConnector.doStart Started SocketConnector@0.0.0.0:46558
   [junit4]   2> 127555 T256 oasc.SolrException.log ERROR null:org.apache.solr.common.SolrException: SolrCore 'collection1' is not available due to init failure: Error loading class 'solr.clustering.ClusteringComponent'
   [junit4]   2> at org.apache.solr.core.CoreContainer.getCore(CoreContainer.java:779)
   [junit4]   2> at org.apache.solr.servlet.SolrDispatchFilter.doFilter(SolrDispatchFilter.java:258)
   [junit4]   2> at org.apache.solr.servlet.SolrDispatchFilter.doFilter(SolrDispatchFilter.java:158)
   [junit4]   2> at org.eclipse.jetty.servlet.ServletHandler$CachedChain.doFilter(ServletHandler.java:1419)
   [junit4]   2> at org.eclipse.jetty.servlet.ServletHandler.doHandle(ServletHandler.java:455)
   [junit4]   2> at org.eclipse.jetty.server.handler.ScopedHandler.handle(ScopedHandler.java:137)
   [junit4]   2> at org.eclipse.jetty.security.SecurityHandler.handle(SecurityHandler.java:557)
   [junit4]   2> at org.eclipse.jetty.server.session.SessionHandler.doHandle(SessionHandler.java:231)
   [junit4]   2> at org.eclipse.jetty.server.handler.ContextHandler.doHandle(ContextHandler.java:1075)
   [junit4]   2> at org.eclipse.jetty.servlet.ServletHandler.doScope(ServletHandler.java:384)
   [junit4]   2> at org.eclipse.jetty.server.session.SessionHandler.doScope(SessionHandler.java:193)
   [junit4]   2> at org.eclipse.jetty.server.handler.ContextHandler.doScope(ContextHandler.java:1009)
   [junit4]   2> at org.eclipse.jetty.server.handler.ScopedHandler.handle(ScopedHandler.java:135)
   [junit4]   2> at org.eclipse.jetty.server.handler.HandlerWrapper.handle(HandlerWrapper.java:116)
   [junit4]   2> at org.eclipse.jetty.server.Server.handle(Server.java:368)
   [junit4]   2> at org.eclipse.jetty.server.AbstractHttpConnection.handleRequest(AbstractHttpConnection.java:489)
   [junit4]   2> at org.eclipse.jetty.server.BlockingHttpConnection.handleRequest(BlockingHttpConnection.java:53)
   [junit4]   2> at org.eclipse.jetty.server.AbstractHttpConnection.headerComplete(AbstractHttpConnection.java:942)
   [junit4]   2> at org.eclipse.jetty.server.AbstractHttpConnection$RequestHandler.headerComplete(AbstractHttpConnection.java:1004)
   [junit4]   2> at org.eclipse.jetty.http.HttpParser.parseNext(HttpParser.java:640)
   [junit4]   2> at org.eclipse.jetty.http.HttpParser.parseAvailable(HttpParser.java:235)
   [junit4]   2> at org.eclipse.jetty.server.BlockingHttpConnection.handle(BlockingHttpConnection.java:72)
   [junit4]   2> at org.eclipse.jetty.server.bio.SocketConnector$ConnectorEndPoint.run(SocketConnector.java:264)
   [junit4]   2> at org.eclipse.jetty.util.thread.QueuedThreadPool.runJob(QueuedThreadPool.java:608)
   [junit4]   2> at org.eclipse.jetty.util.thread.QueuedThreadPool$3.run(QueuedThreadPool.java:543)
   [junit4]   2> at java.lang.Thread.run(Thread.java:679)
   [junit4]   2> Caused by: org.apache.solr.common.SolrException: Error loading class 'solr.clustering.ClusteringComponent'
   [junit4]   2> at org.apache.solr.core.SolrCore.<init>(SolrCore.java:830)
   [junit4]   2> at org.apache.solr.core.SolrCore.<init>(SolrCore.java:624)
   [junit4]   2> at org.apache.solr.core.CoreContainer.createFromLocal(CoreContainer.java:518)
   [junit4]   2> at org.apache.solr.core.CoreContainer.create(CoreContainer.java:553)
   [junit4]   2> at org.apache.solr.core.CoreContainer$1.call(CoreContainer.java:245)
   [junit4]   2> at org.apache.solr.core.CoreContainer$1.call(CoreContainer.java:237)
   [junit4]   2> at java.util.concurrent.FutureTask$Sync.innerRun(FutureTask.java:334)
   [junit4]   2> at java.util.concurrent.FutureTask.run(FutureTask.java:166)
   [junit4]   2> at java.util.concurrent.Executors$RunnableAdapter.call(Executors.java:471)
   [junit4]   2> at java.util.concurrent.FutureTask$Sync.innerRun(FutureTask.java:334)
   [junit4]   2> at java.util.concurrent.FutureTask.run(FutureTask.java:166)
   [junit4]   2> at java.util.concurrent.ThreadPoolExecutor.runWorker(ThreadPoolExecutor.java:1146)
   [junit4]   2> at java.util.concurrent.ThreadPoolExecutor$Worker.run(ThreadPoolExecutor.java:615)
   [junit4]   2> ... 1 more
   [junit4]   2> Caused by: org.apache.solr.common.SolrException: Error loading class 'solr.clustering.ClusteringComponent'
   [junit4]   2> at org.apache.solr.core.SolrResourceLoader.findClass(SolrResourceLoader.java:449)
   [junit4]   2> at org.apache.solr.core.SolrResourceLoader.findClass(SolrResourceLoader.java:381)
   [junit4]   2> at org.apache.solr.core.SolrCore.createInstance(SolrCore.java:525)
   [junit4]   2> at org.apache.solr.core.SolrCore.createInitInstance(SolrCore.java:581)
   [junit4]   2> at org.apache.solr.core.SolrCore.initPlugins(SolrCore.java:2114)
   [junit4]   2> at org.apache.solr.core.SolrCore.initPlugins(SolrCore.java:2108)
   [junit4]   2> at org.apache.solr.core.SolrCore.initPlugins(SolrCore.java:2141)
   [junit4]   2> at org.apache.solr.core.SolrCore.loadSearchComponents(SolrCore.java:1172)
   [junit4]   2> at org.apache.solr.core.SolrCore.<init>(SolrCore.java:761)
   [junit4]   2> ... 13 more
   [junit4]   2> Caused by: java.lang.ClassNotFoundException: solr.clustering.ClusteringComponent
   [junit4]   2> at java.net.URLClassLoader$1.run(URLClassLoader.java:217)
   [junit4]   2> at java.security.AccessController.doPrivileged(Native Method)
   [junit4]   2> at java.net.URLClassLoader.findClass(URLClassLoader.java:205)
   [junit4]   2> at java.lang.ClassLoader.loadClass(ClassLoader.java:321)
   [junit4]   2> at java.net.FactoryURLClassLoader.loadClass(URLClassLoader.java:615)
   [junit4]   2> at java.lang.ClassLoader.loadClass(ClassLoader.java:266)
   [junit4]   2> at java.lang.Class.forName0(Native Method)
   [junit4]   2> at java.lang.Class.forName(Class.java:266)
   [junit4]   2> at org.apache.solr.core.SolrResourceLoader.findClass(SolrResourceLoader.java:433)
   [junit4]   2> ... 21 more
   [junit4]   2>
   [junit4]   2> 127570 T251 oasc.CoreContainer.shutdown Shutting down CoreContainer instance=1582457600
   [junit4]   2> 127575 T251 oejsh.ContextHandler.doStop stopped o.e.j.w.WebAppContext{/test,file:/usr/home/hudson/hudson-slave/workspace/Lucene-Solr-Tests-4.x-Java6/solr/webapp/web/},/usr/home/hudson/hudson-slave/workspace/Lucene-Solr-Tests-4.x-Java6/solr/webapp/web
   [junit4]   2> NOTE: reproduce with: ant test  -Dtestcase=JettyWebappTest -Dtests.method=testAdminUI -Dtests.seed=9E87D68DFF6E3F71 -Dtests.multiplier=3 -Dtests.slow=true -Dtests.locale=no_NO_NY -Dtests.timezone=America/Argentina/Ushuaia -Dtests.file.encoding=US-ASCII
   [junit4] ERROR   1.99s J0 | JettyWebappTest.testAdminUI <<<
   [junit4]    > Throwable #1: java.io.IOException: Server returned HTTP response code: 500 for URL: http://127.0.0.1:46558/test/
   [junit4]    > at __randomizedtesting.SeedInfo.seed([9E87D68DFF6E3F71:A65535DE9805A4CE]:0)
   [junit4]    > at sun.net.www.protocol.http.HttpURLConnection.getInputStream(HttpURLConnection.java:1403)
   [junit4]    > at java.net.URL.openStream(URL.java:1031)
   [junit4]    > at org.apache.solr.client.solrj.embedded.JettyWebappTest.testAdminUI(JettyWebappTest.java:98)
   [junit4]    > at java.lang.Thread.run(Thread.java:679)
   [junit4]   2> NOTE: test params are: codec=Lucene42: {}, docValues:{}, sim=DefaultSimilarity, locale=no_NO_NY, timezone=America/Argentina/Ushuaia
   [junit4]   2> NOTE: FreeBSD 9.1-RELEASE-p3 amd64/Sun Microsystems Inc. 1.6.0_32 (64-bit)/cpus=16,threads=1,free=311674096,total=415760384
   [junit4]   2> NOTE: All tests run in this JVM: [SolrExampleEmbeddedTest, SolrExampleXMLTest, ClientUtilsTest, TestCoreAdmin, SolrExceptionTest, ModifiableSolrParamsTest, TestXMLEscaping, CloudSolrServerTest, DocumentAnalysisResponseTest, TestUpdateRequestCodec, SolrPingTest, SolrExampleBinaryTest, BasicHttpSolrServerTest, LargeVolumeBinaryJettyTest, JettyWebappTest]
   [junit4] Completed on J0 in 2.00s, 1 test, 1 error <<< FAILURES!

[...truncated 55 lines...]
BUILD FAILED
/usr/home/hudson/hudson-slave/workspace/Lucene-Solr-Tests-4.x-Java6/build.xml:395: The following error occurred while executing this line:
/usr/home/hudson/hudson-slave/workspace/Lucene-Solr-Tests-4.x-Java6/build.xml:375: The following error occurred while executing this line:
/usr/home/hudson/hudson-slave/workspace/Lucene-Solr-Tests-4.x-Java6/build.xml:39: The following error occurred while executing this line:
/usr/home/hudson/hudson-slave/workspace/Lucene-Solr-Tests-4.x-Java6/solr/build.xml:194: The following error occurred while executing this line:
/usr/home/hudson/hudson-slave/workspace/Lucene-Solr-Tests-4.x-Java6/solr/common-build.xml:449: The following error occurred while executing this line:
/usr/home/hudson/hudson-slave/workspace/Lucene-Solr-Tests-4.x-Java6/lucene/common-build.xml:1233: The following error occurred while executing this line:
/usr/home/hudson/hudson-slave/workspace/Lucene-Solr-Tests-4.x-Java6/lucene/common-build.xml:876: There were test failures: 46 suites, 272 tests, 1 error, 1 ignored (1 assumption)

Total time: 59 minutes 51 seconds
Build step 'Invoke Ant' marked build as failure
Archiving artifacts
Recording test results
Email was triggered for: Failure
Sending email for trigger: Failure




---------------------------------------------------------------------
To unsubscribe, e-mail: [hidden email]
For additional commands, e-mail: [hidden email]