[JENKINS] Lucene-Solr-Tests-8.x - Build # 479 - Unstable

classic Classic list List threaded Threaded
2 messages Options
Reply | Threaded
Open this post in threaded view
|

[JENKINS] Lucene-Solr-Tests-8.x - Build # 479 - Unstable

Apache Jenkins Server-2
Build: https://builds.apache.org/job/Lucene-Solr-Tests-8.x/479/

1 tests failed.
FAILED:  org.apache.solr.handler.TestContainerReqHandler.testPackageAPI

Error Message:
attempt: 9 Mismatch for value : '[requestHandler]' in response {   "responseHeader":{     "status":0,     "QTime":0},   "metadata":{"version":3},   "runtimeLib":[{       "name":"global",       "url":"http://localhost:40347/jar3.jar",       "60ec88c2a2e9b409f7afc309273383810a0d07a078b482434eda9674f7e25b8adafa8a67c9913c996cbfb78a7f6ad2b9db26dbd4fe0ca4068f248d5db563f922":"60ec88c2a2e9b409f7afc309273383810a0d07a078b482434eda9674f7e25b8adafa8a67c9913c996cbfb78a7f6ad2b9db26dbd4fe0ca4068f248d5db563f922",       "znodeVersion":3}],   "requestHandler":[{       "name":"bar",       "znodeVersion":3,       "class":"org.apache.solr.core.RuntimeLibReqHandler",       "package":"global"}]}

Stack Trace:
java.lang.AssertionError: attempt: 9 Mismatch for value : '[requestHandler]' in response {
  "responseHeader":{
    "status":0,
    "QTime":0},
  "metadata":{"version":3},
  "runtimeLib":[{
      "name":"global",
      "url":"http://localhost:40347/jar3.jar",
      "60ec88c2a2e9b409f7afc309273383810a0d07a078b482434eda9674f7e25b8adafa8a67c9913c996cbfb78a7f6ad2b9db26dbd4fe0ca4068f248d5db563f922":"60ec88c2a2e9b409f7afc309273383810a0d07a078b482434eda9674f7e25b8adafa8a67c9913c996cbfb78a7f6ad2b9db26dbd4fe0ca4068f248d5db563f922",
      "znodeVersion":3}],
  "requestHandler":[{
      "name":"bar",
      "znodeVersion":3,
      "class":"org.apache.solr.core.RuntimeLibReqHandler",
      "package":"global"}]}
        at __randomizedtesting.SeedInfo.seed([FC809F0E9A6F2FB4:8E8F8A40363475A4]:0)
        at org.junit.Assert.fail(Assert.java:88)
        at org.apache.solr.handler.TestContainerReqHandler.assertResponseValues(TestContainerReqHandler.java:117)
        at org.apache.solr.handler.TestContainerReqHandler.testPackageAPI(TestContainerReqHandler.java:232)
        at sun.reflect.NativeMethodAccessorImpl.invoke0(Native Method)
        at sun.reflect.NativeMethodAccessorImpl.invoke(NativeMethodAccessorImpl.java:62)
        at sun.reflect.DelegatingMethodAccessorImpl.invoke(DelegatingMethodAccessorImpl.java:43)
        at java.lang.reflect.Method.invoke(Method.java:498)
        at com.carrotsearch.randomizedtesting.RandomizedRunner.invoke(RandomizedRunner.java:1750)
        at com.carrotsearch.randomizedtesting.RandomizedRunner$8.evaluate(RandomizedRunner.java:938)
        at com.carrotsearch.randomizedtesting.RandomizedRunner$9.evaluate(RandomizedRunner.java:974)
        at com.carrotsearch.randomizedtesting.RandomizedRunner$10.evaluate(RandomizedRunner.java:988)
        at com.carrotsearch.randomizedtesting.rules.SystemPropertiesRestoreRule$1.evaluate(SystemPropertiesRestoreRule.java:57)
        at org.apache.lucene.util.TestRuleSetupTeardownChained$1.evaluate(TestRuleSetupTeardownChained.java:49)
        at org.apache.lucene.util.AbstractBeforeAfterRule$1.evaluate(AbstractBeforeAfterRule.java:45)
        at org.apache.lucene.util.TestRuleThreadAndTestName$1.evaluate(TestRuleThreadAndTestName.java:48)
        at org.apache.lucene.util.TestRuleIgnoreAfterMaxFailures$1.evaluate(TestRuleIgnoreAfterMaxFailures.java:64)
        at org.apache.lucene.util.TestRuleMarkFailure$1.evaluate(TestRuleMarkFailure.java:47)
        at com.carrotsearch.randomizedtesting.rules.StatementAdapter.evaluate(StatementAdapter.java:36)
        at com.carrotsearch.randomizedtesting.ThreadLeakControl$StatementRunner.run(ThreadLeakControl.java:368)
        at com.carrotsearch.randomizedtesting.ThreadLeakControl.forkTimeoutingTask(ThreadLeakControl.java:817)
        at com.carrotsearch.randomizedtesting.ThreadLeakControl$3.evaluate(ThreadLeakControl.java:468)
        at com.carrotsearch.randomizedtesting.RandomizedRunner.runSingleTest(RandomizedRunner.java:947)
        at com.carrotsearch.randomizedtesting.RandomizedRunner$5.evaluate(RandomizedRunner.java:832)
        at com.carrotsearch.randomizedtesting.RandomizedRunner$6.evaluate(RandomizedRunner.java:883)
        at com.carrotsearch.randomizedtesting.RandomizedRunner$7.evaluate(RandomizedRunner.java:894)
        at com.carrotsearch.randomizedtesting.rules.StatementAdapter.evaluate(StatementAdapter.java:36)
        at com.carrotsearch.randomizedtesting.rules.SystemPropertiesRestoreRule$1.evaluate(SystemPropertiesRestoreRule.java:57)
        at org.apache.lucene.util.AbstractBeforeAfterRule$1.evaluate(AbstractBeforeAfterRule.java:45)
        at com.carrotsearch.randomizedtesting.rules.StatementAdapter.evaluate(StatementAdapter.java:36)
        at org.apache.lucene.util.TestRuleStoreClassName$1.evaluate(TestRuleStoreClassName.java:41)
        at com.carrotsearch.randomizedtesting.rules.NoShadowingOrOverridesOnMethodsRule$1.evaluate(NoShadowingOrOverridesOnMethodsRule.java:40)
        at com.carrotsearch.randomizedtesting.rules.NoShadowingOrOverridesOnMethodsRule$1.evaluate(NoShadowingOrOverridesOnMethodsRule.java:40)
        at com.carrotsearch.randomizedtesting.rules.StatementAdapter.evaluate(StatementAdapter.java:36)
        at com.carrotsearch.randomizedtesting.rules.StatementAdapter.evaluate(StatementAdapter.java:36)
        at com.carrotsearch.randomizedtesting.rules.StatementAdapter.evaluate(StatementAdapter.java:36)
        at org.apache.lucene.util.TestRuleAssertionsRequired$1.evaluate(TestRuleAssertionsRequired.java:53)
        at org.apache.lucene.util.TestRuleMarkFailure$1.evaluate(TestRuleMarkFailure.java:47)
        at org.apache.lucene.util.TestRuleIgnoreAfterMaxFailures$1.evaluate(TestRuleIgnoreAfterMaxFailures.java:64)
        at org.apache.lucene.util.TestRuleIgnoreTestSuites$1.evaluate(TestRuleIgnoreTestSuites.java:54)
        at com.carrotsearch.randomizedtesting.rules.StatementAdapter.evaluate(StatementAdapter.java:36)
        at com.carrotsearch.randomizedtesting.ThreadLeakControl$StatementRunner.run(ThreadLeakControl.java:368)
        at java.lang.Thread.run(Thread.java:748)




Build Log:
[...truncated 15356 lines...]
   [junit4] Suite: org.apache.solr.handler.TestContainerReqHandler
   [junit4]   2> 2462840 INFO  (SUITE-TestContainerReqHandler-seed#[FC809F0E9A6F2FB4]-worker) [     ] o.a.s.SolrTestCaseJ4 SecureRandom sanity checks: test.solr.allowed.securerandom=null & java.security.egd=file:/dev/./urandom
   [junit4]   2> 2462842 INFO  (SUITE-TestContainerReqHandler-seed#[FC809F0E9A6F2FB4]-worker) [     ] o.a.s.SolrTestCaseJ4 Created dataDir: /home/jenkins/jenkins-slave/workspace/Lucene-Solr-Tests-8.x/solr/build/solr-core/test/J0/temp/solr.handler.TestContainerReqHandler_FC809F0E9A6F2FB4-001/data-dir-205-001
   [junit4]   2> 2462842 WARN  (SUITE-TestContainerReqHandler-seed#[FC809F0E9A6F2FB4]-worker) [     ] o.a.s.SolrTestCaseJ4 startTrackingSearchers: numOpens=3 numCloses=3
   [junit4]   2> 2462842 INFO  (SUITE-TestContainerReqHandler-seed#[FC809F0E9A6F2FB4]-worker) [     ] o.a.s.SolrTestCaseJ4 Using PointFields (NUMERIC_POINTS_SYSPROP=true) w/NUMERIC_DOCVALUES_SYSPROP=true
   [junit4]   2> 2462848 INFO  (SUITE-TestContainerReqHandler-seed#[FC809F0E9A6F2FB4]-worker) [     ] o.a.s.SolrTestCaseJ4 Randomized ssl (false) and clientAuth (false) via: @org.apache.solr.SolrTestCaseJ4$SuppressSSL(bugUrl=None)
   [junit4]   2> 2462853 INFO  (TEST-TestContainerReqHandler.testPackageAPI-seed#[FC809F0E9A6F2FB4]) [     ] o.a.s.SolrTestCaseJ4 ###Starting testPackageAPI
   [junit4]   2> 2462857 INFO  (TEST-TestContainerReqHandler.testPackageAPI-seed#[FC809F0E9A6F2FB4]) [     ] o.e.j.s.Server jetty-9.4.19.v20190610; built: 2019-06-10T16:30:51.723Z; git: afcf563148970e98786327af5e07c261fda175d3; jvm 1.8.0_191-b12
   [junit4]   2> 2462860 INFO  (TEST-TestContainerReqHandler.testPackageAPI-seed#[FC809F0E9A6F2FB4]) [     ] o.e.j.s.AbstractConnector Started ServerConnector@37d419db{HTTP/1.1,[http/1.1]}{0.0.0.0:40347}
   [junit4]   2> 2462860 INFO  (TEST-TestContainerReqHandler.testPackageAPI-seed#[FC809F0E9A6F2FB4]) [     ] o.e.j.s.Server Started @2462922ms
   [junit4]   2> 2462860 INFO  (TEST-TestContainerReqHandler.testPackageAPI-seed#[FC809F0E9A6F2FB4]) [     ] o.a.s.c.MiniSolrCloudCluster Starting cluster of 4 servers in /home/jenkins/jenkins-slave/workspace/Lucene-Solr-Tests-8.x/solr/build/solr-core/test/J0/temp/solr.handler.TestContainerReqHandler_FC809F0E9A6F2FB4-001/tempDir-001
   [junit4]   2> 2462861 INFO  (TEST-TestContainerReqHandler.testPackageAPI-seed#[FC809F0E9A6F2FB4]) [     ] o.a.s.c.ZkTestServer STARTING ZK TEST SERVER
   [junit4]   2> 2462862 INFO  (ZkTestServer Run Thread) [     ] o.a.s.c.ZkTestServer client port:0.0.0.0/0.0.0.0:0
   [junit4]   2> 2462862 INFO  (ZkTestServer Run Thread) [     ] o.a.s.c.ZkTestServer Starting server
   [junit4]   2> 2462962 INFO  (TEST-TestContainerReqHandler.testPackageAPI-seed#[FC809F0E9A6F2FB4]) [     ] o.a.s.c.ZkTestServer start zk server on port:33357
   [junit4]   2> 2462963 INFO  (TEST-TestContainerReqHandler.testPackageAPI-seed#[FC809F0E9A6F2FB4]) [     ] o.a.s.c.ZkTestServer waitForServerUp: 127.0.0.1:33357
   [junit4]   2> 2462963 INFO  (TEST-TestContainerReqHandler.testPackageAPI-seed#[FC809F0E9A6F2FB4]) [     ] o.a.s.c.ZkTestServer parse host and port list: 127.0.0.1:33357
   [junit4]   2> 2462963 INFO  (TEST-TestContainerReqHandler.testPackageAPI-seed#[FC809F0E9A6F2FB4]) [     ] o.a.s.c.ZkTestServer connecting to 127.0.0.1 33357
   [junit4]   2> 2462968 INFO  (TEST-TestContainerReqHandler.testPackageAPI-seed#[FC809F0E9A6F2FB4]) [     ] o.a.s.c.c.ConnectionManager Waiting for client to connect to ZooKeeper
   [junit4]   2> 2462973 INFO  (zkConnectionManagerCallback-15606-thread-1) [     ] o.a.s.c.c.ConnectionManager zkClient has connected
   [junit4]   2> 2462973 INFO  (TEST-TestContainerReqHandler.testPackageAPI-seed#[FC809F0E9A6F2FB4]) [     ] o.a.s.c.c.ConnectionManager Client is connected to ZooKeeper
   [junit4]   2> 2462979 INFO  (TEST-TestContainerReqHandler.testPackageAPI-seed#[FC809F0E9A6F2FB4]) [     ] o.a.s.c.c.ConnectionManager Waiting for client to connect to ZooKeeper
   [junit4]   2> 2462981 INFO  (zkConnectionManagerCallback-15608-thread-1) [     ] o.a.s.c.c.ConnectionManager zkClient has connected
   [junit4]   2> 2462981 INFO  (TEST-TestContainerReqHandler.testPackageAPI-seed#[FC809F0E9A6F2FB4]) [     ] o.a.s.c.c.ConnectionManager Client is connected to ZooKeeper
   [junit4]   2> 2462984 INFO  (TEST-TestContainerReqHandler.testPackageAPI-seed#[FC809F0E9A6F2FB4]) [     ] o.a.s.c.c.ConnectionManager Waiting for client to connect to ZooKeeper
   [junit4]   2> 2462986 INFO  (zkConnectionManagerCallback-15610-thread-1) [     ] o.a.s.c.c.ConnectionManager zkClient has connected
   [junit4]   2> 2462986 INFO  (TEST-TestContainerReqHandler.testPackageAPI-seed#[FC809F0E9A6F2FB4]) [     ] o.a.s.c.c.ConnectionManager Client is connected to ZooKeeper
   [junit4]   2> 2463090 WARN  (jetty-launcher-15611-thread-1) [     ] o.e.j.s.AbstractConnector Ignoring deprecated socket close linger time
   [junit4]   2> 2463090 WARN  (jetty-launcher-15611-thread-2) [     ] o.e.j.s.AbstractConnector Ignoring deprecated socket close linger time
   [junit4]   2> 2463090 WARN  (jetty-launcher-15611-thread-3) [     ] o.e.j.s.AbstractConnector Ignoring deprecated socket close linger time
   [junit4]   2> 2463090 INFO  (jetty-launcher-15611-thread-2) [     ] o.a.s.c.s.e.JettySolrRunner Start Jetty (original configured port=0)
   [junit4]   2> 2463090 INFO  (jetty-launcher-15611-thread-2) [     ] o.a.s.c.s.e.JettySolrRunner Trying to start Jetty on port 0 try number 1 ...
   [junit4]   2> 2463091 INFO  (jetty-launcher-15611-thread-3) [     ] o.a.s.c.s.e.JettySolrRunner Start Jetty (original configured port=0)
   [junit4]   2> 2463091 INFO  (jetty-launcher-15611-thread-2) [     ] o.e.j.s.Server jetty-9.4.19.v20190610; built: 2019-06-10T16:30:51.723Z; git: afcf563148970e98786327af5e07c261fda175d3; jvm 1.8.0_191-b12
   [junit4]   2> 2463091 INFO  (jetty-launcher-15611-thread-3) [     ] o.a.s.c.s.e.JettySolrRunner Trying to start Jetty on port 0 try number 1 ...
   [junit4]   2> 2463091 INFO  (jetty-launcher-15611-thread-3) [     ] o.e.j.s.Server jetty-9.4.19.v20190610; built: 2019-06-10T16:30:51.723Z; git: afcf563148970e98786327af5e07c261fda175d3; jvm 1.8.0_191-b12
   [junit4]   2> 2463091 INFO  (jetty-launcher-15611-thread-1) [     ] o.a.s.c.s.e.JettySolrRunner Start Jetty (original configured port=0)
   [junit4]   2> 2463091 INFO  (jetty-launcher-15611-thread-1) [     ] o.a.s.c.s.e.JettySolrRunner Trying to start Jetty on port 0 try number 1 ...
   [junit4]   2> 2463091 INFO  (jetty-launcher-15611-thread-1) [     ] o.e.j.s.Server jetty-9.4.19.v20190610; built: 2019-06-10T16:30:51.723Z; git: afcf563148970e98786327af5e07c261fda175d3; jvm 1.8.0_191-b12
   [junit4]   2> 2463091 WARN  (jetty-launcher-15611-thread-4) [     ] o.e.j.s.AbstractConnector Ignoring deprecated socket close linger time
   [junit4]   2> 2463091 INFO  (jetty-launcher-15611-thread-4) [     ] o.a.s.c.s.e.JettySolrRunner Start Jetty (original configured port=0)
   [junit4]   2> 2463091 INFO  (jetty-launcher-15611-thread-4) [     ] o.a.s.c.s.e.JettySolrRunner Trying to start Jetty on port 0 try number 1 ...
   [junit4]   2> 2463091 INFO  (jetty-launcher-15611-thread-4) [     ] o.e.j.s.Server jetty-9.4.19.v20190610; built: 2019-06-10T16:30:51.723Z; git: afcf563148970e98786327af5e07c261fda175d3; jvm 1.8.0_191-b12
   [junit4]   2> 2463111 INFO  (jetty-launcher-15611-thread-4) [     ] o.e.j.s.session DefaultSessionIdManager workerName=node0
   [junit4]   2> 2463111 INFO  (jetty-launcher-15611-thread-4) [     ] o.e.j.s.session No SessionScavenger set, using defaults
   [junit4]   2> 2463111 INFO  (jetty-launcher-15611-thread-4) [     ] o.e.j.s.session node0 Scavenging every 600000ms
   [junit4]   2> 2463115 INFO  (jetty-launcher-15611-thread-2) [     ] o.e.j.s.session DefaultSessionIdManager workerName=node0
   [junit4]   2> 2463115 INFO  (jetty-launcher-15611-thread-2) [     ] o.e.j.s.session No SessionScavenger set, using defaults
   [junit4]   2> 2463115 INFO  (jetty-launcher-15611-thread-2) [     ] o.e.j.s.session node0 Scavenging every 600000ms
   [junit4]   2> 2463116 INFO  (jetty-launcher-15611-thread-2) [     ] o.e.j.s.h.ContextHandler Started o.e.j.s.ServletContextHandler@6a5f1e4{/solr,null,AVAILABLE}
   [junit4]   2> 2463123 INFO  (jetty-launcher-15611-thread-3) [     ] o.e.j.s.session DefaultSessionIdManager workerName=node0
   [junit4]   2> 2463124 INFO  (jetty-launcher-15611-thread-3) [     ] o.e.j.s.session No SessionScavenger set, using defaults
   [junit4]   2> 2463124 INFO  (jetty-launcher-15611-thread-3) [     ] o.e.j.s.session node0 Scavenging every 660000ms
   [junit4]   2> 2463124 INFO  (jetty-launcher-15611-thread-4) [     ] o.e.j.s.h.ContextHandler Started o.e.j.s.ServletContextHandler@2a5af3bc{/solr,null,AVAILABLE}
   [junit4]   2> 2463124 INFO  (jetty-launcher-15611-thread-2) [     ] o.e.j.s.AbstractConnector Started ServerConnector@5d4123b5{HTTP/1.1,[http/1.1, h2c]}{127.0.0.1:46333}
   [junit4]   2> 2463124 INFO  (jetty-launcher-15611-thread-2) [     ] o.e.j.s.Server Started @2463186ms
   [junit4]   2> 2463124 INFO  (jetty-launcher-15611-thread-3) [     ] o.e.j.s.h.ContextHandler Started o.e.j.s.ServletContextHandler@7d5ff34b{/solr,null,AVAILABLE}
   [junit4]   2> 2463124 INFO  (jetty-launcher-15611-thread-2) [     ] o.a.s.c.s.e.JettySolrRunner Jetty properties: {hostContext=/solr, hostPort=46333}
   [junit4]   2> 2463125 ERROR (jetty-launcher-15611-thread-2) [     ] o.a.s.u.StartupLoggingUtils Missing Java Option solr.log.dir. Logging may be missing or incomplete.
   [junit4]   2> 2463125 INFO  (jetty-launcher-15611-thread-2) [     ] o.a.s.s.SolrDispatchFilter Using logger factory org.apache.logging.slf4j.Log4jLoggerFactory
   [junit4]   2> 2463125 INFO  (jetty-launcher-15611-thread-3) [     ] o.e.j.s.AbstractConnector Started ServerConnector@52c3d26{HTTP/1.1,[http/1.1, h2c]}{127.0.0.1:33955}
   [junit4]   2> 2463125 INFO  (jetty-launcher-15611-thread-3) [     ] o.e.j.s.Server Started @2463187ms
   [junit4]   2> 2463125 INFO  (jetty-launcher-15611-thread-3) [     ] o.a.s.c.s.e.JettySolrRunner Jetty properties: {hostContext=/solr, hostPort=33955}
   [junit4]   2> 2463125 INFO  (jetty-launcher-15611-thread-4) [     ] o.e.j.s.AbstractConnector Started ServerConnector@7e0f0535{HTTP/1.1,[http/1.1, h2c]}{127.0.0.1:32785}
   [junit4]   2> 2463125 INFO  (jetty-launcher-15611-thread-2) [     ] o.a.s.s.SolrDispatchFilter  ___      _       Welcome to Apache Solr™ version 8.3.0
   [junit4]   2> 2463125 INFO  (jetty-launcher-15611-thread-4) [     ] o.e.j.s.Server Started @2463187ms
   [junit4]   2> 2463125 INFO  (jetty-launcher-15611-thread-4) [     ] o.a.s.c.s.e.JettySolrRunner Jetty properties: {hostContext=/solr, hostPort=32785}
   [junit4]   2> 2463125 INFO  (jetty-launcher-15611-thread-2) [     ] o.a.s.s.SolrDispatchFilter / __| ___| |_ _   Starting in cloud mode on port null
   [junit4]   2> 2463125 INFO  (jetty-launcher-15611-thread-2) [     ] o.a.s.s.SolrDispatchFilter \__ \/ _ \ | '_|  Install dir: null
   [junit4]   2> 2463125 INFO  (jetty-launcher-15611-thread-2) [     ] o.a.s.s.SolrDispatchFilter |___/\___/_|_|    Start time: 2019-08-26T20:40:58.009Z
   [junit4]   2> 2463125 ERROR (jetty-launcher-15611-thread-3) [     ] o.a.s.u.StartupLoggingUtils Missing Java Option solr.log.dir. Logging may be missing or incomplete.
   [junit4]   2> 2463125 INFO  (jetty-launcher-15611-thread-3) [     ] o.a.s.s.SolrDispatchFilter Using logger factory org.apache.logging.slf4j.Log4jLoggerFactory
   [junit4]   2> 2463125 INFO  (jetty-launcher-15611-thread-3) [     ] o.a.s.s.SolrDispatchFilter  ___      _       Welcome to Apache Solr™ version 8.3.0
   [junit4]   2> 2463125 ERROR (jetty-launcher-15611-thread-4) [     ] o.a.s.u.StartupLoggingUtils Missing Java Option solr.log.dir. Logging may be missing or incomplete.
   [junit4]   2> 2463125 INFO  (jetty-launcher-15611-thread-4) [     ] o.a.s.s.SolrDispatchFilter Using logger factory org.apache.logging.slf4j.Log4jLoggerFactory
   [junit4]   2> 2463125 INFO  (jetty-launcher-15611-thread-3) [     ] o.a.s.s.SolrDispatchFilter / __| ___| |_ _   Starting in cloud mode on port null
   [junit4]   2> 2463125 INFO  (jetty-launcher-15611-thread-3) [     ] o.a.s.s.SolrDispatchFilter \__ \/ _ \ | '_|  Install dir: null
   [junit4]   2> 2463125 INFO  (jetty-launcher-15611-thread-3) [     ] o.a.s.s.SolrDispatchFilter |___/\___/_|_|    Start time: 2019-08-26T20:40:58.009Z
   [junit4]   2> 2463125 INFO  (jetty-launcher-15611-thread-4) [     ] o.a.s.s.SolrDispatchFilter  ___      _       Welcome to Apache Solr™ version 8.3.0
   [junit4]   2> 2463125 INFO  (jetty-launcher-15611-thread-4) [     ] o.a.s.s.SolrDispatchFilter / __| ___| |_ _   Starting in cloud mode on port null
   [junit4]   2> 2463125 INFO  (jetty-launcher-15611-thread-4) [     ] o.a.s.s.SolrDispatchFilter \__ \/ _ \ | '_|  Install dir: null
   [junit4]   2> 2463125 INFO  (jetty-launcher-15611-thread-4) [     ] o.a.s.s.SolrDispatchFilter |___/\___/_|_|    Start time: 2019-08-26T20:40:58.009Z
   [junit4]   2> 2463128 INFO  (jetty-launcher-15611-thread-3) [     ] o.a.s.c.c.ConnectionManager Waiting for client to connect to ZooKeeper
   [junit4]   2> 2463129 INFO  (jetty-launcher-15611-thread-1) [     ] o.e.j.s.session DefaultSessionIdManager workerName=node0
   [junit4]   2> 2463129 INFO  (jetty-launcher-15611-thread-1) [     ] o.e.j.s.session No SessionScavenger set, using defaults
   [junit4]   2> 2463129 INFO  (jetty-launcher-15611-thread-1) [     ] o.e.j.s.session node0 Scavenging every 600000ms
   [junit4]   2> 2463129 INFO  (zkConnectionManagerCallback-15615-thread-1) [     ] o.a.s.c.c.ConnectionManager zkClient has connected
   [junit4]   2> 2463129 INFO  (jetty-launcher-15611-thread-3) [     ] o.a.s.c.c.ConnectionManager Client is connected to ZooKeeper
   [junit4]   2> 2463130 INFO  (jetty-launcher-15611-thread-3) [     ] o.a.s.s.SolrDispatchFilter solr.xml found in ZooKeeper. Loading...
   [junit4]   2> 2463131 INFO  (jetty-launcher-15611-thread-4) [     ] o.a.s.c.c.ConnectionManager Waiting for client to connect to ZooKeeper
   [junit4]   2> 2463136 INFO  (jetty-launcher-15611-thread-2) [     ] o.a.s.c.c.ConnectionManager Waiting for client to connect to ZooKeeper
   [junit4]   2> 2463137 INFO  (jetty-launcher-15611-thread-1) [     ] o.e.j.s.h.ContextHandler Started o.e.j.s.ServletContextHandler@247fbcd3{/solr,null,AVAILABLE}
   [junit4]   2> 2463138 INFO  (jetty-launcher-15611-thread-1) [     ] o.e.j.s.AbstractConnector Started ServerConnector@4a6bd0ed{HTTP/1.1,[http/1.1, h2c]}{127.0.0.1:37705}
   [junit4]   2> 2463138 INFO  (jetty-launcher-15611-thread-1) [     ] o.e.j.s.Server Started @2463200ms
   [junit4]   2> 2463138 INFO  (jetty-launcher-15611-thread-1) [     ] o.a.s.c.s.e.JettySolrRunner Jetty properties: {hostContext=/solr, hostPort=37705}
   [junit4]   2> 2463138 ERROR (jetty-launcher-15611-thread-1) [     ] o.a.s.u.StartupLoggingUtils Missing Java Option solr.log.dir. Logging may be missing or incomplete.
   [junit4]   2> 2463139 INFO  (jetty-launcher-15611-thread-1) [     ] o.a.s.s.SolrDispatchFilter Using logger factory org.apache.logging.slf4j.Log4jLoggerFactory
   [junit4]   2> 2463139 INFO  (jetty-launcher-15611-thread-1) [     ] o.a.s.s.SolrDispatchFilter  ___      _       Welcome to Apache Solr™ version 8.3.0
   [junit4]   2> 2463139 INFO  (jetty-launcher-15611-thread-1) [     ] o.a.s.s.SolrDispatchFilter / __| ___| |_ _   Starting in cloud mode on port null
   [junit4]   2> 2463139 INFO  (jetty-launcher-15611-thread-1) [     ] o.a.s.s.SolrDispatchFilter \__ \/ _ \ | '_|  Install dir: null
   [junit4]   2> 2463139 INFO  (jetty-launcher-15611-thread-1) [     ] o.a.s.s.SolrDispatchFilter |___/\___/_|_|    Start time: 2019-08-26T20:40:58.023Z
   [junit4]   2> 2463141 INFO  (zkConnectionManagerCallback-15617-thread-1) [     ] o.a.s.c.c.ConnectionManager zkClient has connected
   [junit4]   2> 2463141 INFO  (zkConnectionManagerCallback-15613-thread-1) [     ] o.a.s.c.c.ConnectionManager zkClient has connected
   [junit4]   2> 2463141 INFO  (jetty-launcher-15611-thread-4) [     ] o.a.s.c.c.ConnectionManager Client is connected to ZooKeeper
   [junit4]   2> 2463141 INFO  (jetty-launcher-15611-thread-2) [     ] o.a.s.c.c.ConnectionManager Client is connected to ZooKeeper
   [junit4]   2> 2463141 INFO  (jetty-launcher-15611-thread-1) [     ] o.a.s.c.c.ConnectionManager Waiting for client to connect to ZooKeeper
   [junit4]   2> 2463142 INFO  (jetty-launcher-15611-thread-2) [     ] o.a.s.s.SolrDispatchFilter solr.xml found in ZooKeeper. Loading...
   [junit4]   2> 2463142 INFO  (jetty-launcher-15611-thread-4) [     ] o.a.s.s.SolrDispatchFilter solr.xml found in ZooKeeper. Loading...
   [junit4]   2> 2463149 INFO  (zkConnectionManagerCallback-15619-thread-1) [     ] o.a.s.c.c.ConnectionManager zkClient has connected
   [junit4]   2> 2463149 INFO  (jetty-launcher-15611-thread-1) [     ] o.a.s.c.c.ConnectionManager Client is connected to ZooKeeper
   [junit4]   2> 2463150 INFO  (jetty-launcher-15611-thread-1) [     ] o.a.s.s.SolrDispatchFilter solr.xml found in ZooKeeper. Loading...
   [junit4]   2> 2463422 INFO  (jetty-launcher-15611-thread-1) [     ] o.a.s.h.c.HttpShardHandlerFactory Host whitelist initialized: WhitelistHostChecker [whitelistHosts=null, whitelistHostCheckingEnabled=true]
   [junit4]   2> 2463423 WARN  (jetty-launcher-15611-thread-1) [     ] o.e.j.u.s.S.config Trusting all certificates configured for Client@6bc9698f[provider=null,keyStore=null,trustStore=null]
   [junit4]   2> 2463423 WARN  (jetty-launcher-15611-thread-1) [     ] o.e.j.u.s.S.config No Client EndPointIdentificationAlgorithm configured for Client@6bc9698f[provider=null,keyStore=null,trustStore=null]
   [junit4]   2> 2463466 WARN  (jetty-launcher-15611-thread-1) [     ] o.e.j.u.s.S.config Trusting all certificates configured for Client@33047ffd[provider=null,keyStore=null,trustStore=null]
   [junit4]   2> 2463466 WARN  (jetty-launcher-15611-thread-1) [     ] o.e.j.u.s.S.config No Client EndPointIdentificationAlgorithm configured for Client@33047ffd[provider=null,keyStore=null,trustStore=null]
   [junit4]   2> 2463467 INFO  (jetty-launcher-15611-thread-1) [     ] o.a.s.c.ZkContainer Zookeeper client=127.0.0.1:33357/solr
   [junit4]   2> 2463487 INFO  (jetty-launcher-15611-thread-1) [     ] o.a.s.c.c.ConnectionManager Waiting for client to connect to ZooKeeper
   [junit4]   2> 2463496 INFO  (zkConnectionManagerCallback-15629-thread-1) [     ] o.a.s.c.c.ConnectionManager zkClient has connected
   [junit4]   2> 2463496 INFO  (jetty-launcher-15611-thread-1) [     ] o.a.s.c.c.ConnectionManager Client is connected to ZooKeeper
   [junit4]   2> 2463540 INFO  (jetty-launcher-15611-thread-2) [     ] o.a.s.h.c.HttpShardHandlerFactory Host whitelist initialized: WhitelistHostChecker [whitelistHosts=null, whitelistHostCheckingEnabled=true]
   [junit4]   2> 2463541 WARN  (jetty-launcher-15611-thread-2) [     ] o.e.j.u.s.S.config Trusting all certificates configured for Client@1db3b86b[provider=null,keyStore=null,trustStore=null]
   [junit4]   2> 2463541 WARN  (jetty-launcher-15611-thread-2) [     ] o.e.j.u.s.S.config No Client EndPointIdentificationAlgorithm configured for Client@1db3b86b[provider=null,keyStore=null,trustStore=null]
   [junit4]   2> 2463553 WARN  (jetty-launcher-15611-thread-2) [     ] o.e.j.u.s.S.config Trusting all certificates configured for Client@4d26856e[provider=null,keyStore=null,trustStore=null]
   [junit4]   2> 2463553 WARN  (jetty-launcher-15611-thread-2) [     ] o.e.j.u.s.S.config No Client EndPointIdentificationAlgorithm configured for Client@4d26856e[provider=null,keyStore=null,trustStore=null]
   [junit4]   2> 2463554 INFO  (jetty-launcher-15611-thread-2) [     ] o.a.s.c.ZkContainer Zookeeper client=127.0.0.1:33357/solr
   [junit4]   2> 2463575 INFO  (jetty-launcher-15611-thread-2) [     ] o.a.s.c.c.ConnectionManager Waiting for client to connect to ZooKeeper
   [junit4]   2> 2463584 INFO  (zkConnectionManagerCallback-15635-thread-1) [     ] o.a.s.c.c.ConnectionManager zkClient has connected
   [junit4]   2> 2463584 INFO  (jetty-launcher-15611-thread-2) [     ] o.a.s.c.c.ConnectionManager Client is connected to ZooKeeper
   [junit4]   2> 2463624 INFO  (jetty-launcher-15611-thread-1) [n:127.0.0.1:37705_solr     ] o.a.s.c.c.ConnectionManager Waiting for client to connect to ZooKeeper
   [junit4]   2> 2463631 INFO  (zkConnectionManagerCallback-15637-thread-1) [     ] o.a.s.c.c.ConnectionManager zkClient has connected
   [junit4]   2> 2463631 INFO  (jetty-launcher-15611-thread-1) [n:127.0.0.1:37705_solr     ] o.a.s.c.c.ConnectionManager Client is connected to ZooKeeper
   [junit4]   2> 2463721 INFO  (jetty-launcher-15611-thread-2) [n:127.0.0.1:46333_solr     ] o.a.s.c.c.ConnectionManager Waiting for client to connect to ZooKeeper
   [junit4]   2> 2463735 INFO  (zkConnectionManagerCallback-15641-thread-1) [     ] o.a.s.c.c.ConnectionManager zkClient has connected
   [junit4]   2> 2463735 INFO  (jetty-launcher-15611-thread-2) [n:127.0.0.1:46333_solr     ] o.a.s.c.c.ConnectionManager Client is connected to ZooKeeper
   [junit4]   2> 2463746 DEBUG (jetty-launcher-15611-thread-2) [n:127.0.0.1:46333_solr     ] o.a.s.c.c.ZkStateReader Updating cluster state from ZooKeeper...
   [junit4]   2> 2463748 DEBUG (jetty-launcher-15611-thread-2) [n:127.0.0.1:46333_solr     ] o.a.s.c.c.ZkStateReader Loaded empty cluster properties
   [junit4]   2> 2463749 DEBUG (jetty-launcher-15611-thread-2) [n:127.0.0.1:46333_solr     ] o.a.s.c.c.ZkStateReader Updated live nodes from ZooKeeper... [] -> []
   [junit4]   2> 2463750 DEBUG (jetty-launcher-15611-thread-2) [n:127.0.0.1:46333_solr     ] o.a.s.c.c.ZkStateReader clusterStateSet: legacy [0] interesting [0] watched [0] lazy [0] total [0]
   [junit4]   2> 2463758 INFO  (jetty-launcher-15611-thread-2) [n:127.0.0.1:46333_solr     ] o.a.s.c.OverseerElectionContext I am going to be the leader 127.0.0.1:46333_solr
   [junit4]   2> 2463759 INFO  (jetty-launcher-15611-thread-2) [n:127.0.0.1:46333_solr     ] o.a.s.c.Overseer Overseer (id=72272136091861002-127.0.0.1:46333_solr-n_0000000000) starting
   [junit4]   2> 2463790 INFO  (jetty-launcher-15611-thread-2) [n:127.0.0.1:46333_solr     ] o.a.s.c.c.ConnectionManager Waiting for client to connect to ZooKeeper
   [junit4]   2> 2463796 INFO  (zkConnectionManagerCallback-15648-thread-1) [     ] o.a.s.c.c.ConnectionManager zkClient has connected
   [junit4]   2> 2463796 INFO  (jetty-launcher-15611-thread-2) [n:127.0.0.1:46333_solr     ] o.a.s.c.c.ConnectionManager Client is connected to ZooKeeper
   [junit4]   2> 2463796 DEBUG (jetty-launcher-15611-thread-2) [n:127.0.0.1:46333_solr     ] o.a.s.c.c.ZkStateReader Updating cluster state from ZooKeeper...
   [junit4]   2> 2463801 DEBUG (jetty-launcher-15611-thread-2) [n:127.0.0.1:46333_solr     ] o.a.s.c.c.ZkStateReader Loaded empty cluster properties
   [junit4]   2> 2463802 DEBUG (jetty-launcher-15611-thread-2) [n:127.0.0.1:46333_solr     ] o.a.s.c.c.ZkStateReader Updated live nodes from ZooKeeper... [] -> []
   [junit4]   2> 2463803 DEBUG (jetty-launcher-15611-thread-2) [n:127.0.0.1:46333_solr     ] o.a.s.c.c.ZkStateReader clusterStateSet: legacy [0] interesting [0] watched [0] lazy [0] total [0]
   [junit4]   2> 2463805 INFO  (jetty-launcher-15611-thread-2) [n:127.0.0.1:46333_solr     ] o.a.s.c.s.i.ZkClientClusterStateProvider Cluster at 127.0.0.1:33357/solr ready
   [junit4]   2> 2463811 INFO  (jetty-launcher-15611-thread-4) [     ] o.a.s.h.c.HttpShardHandlerFactory Host whitelist initialized: WhitelistHostChecker [whitelistHosts=null, whitelistHostCheckingEnabled=true]
   [junit4]   2> 2463813 INFO  (OverseerStateUpdate-72272136091861002-127.0.0.1:46333_solr-n_0000000000) [n:127.0.0.1:46333_solr     ] o.a.s.c.Overseer Starting to work on the main queue : 127.0.0.1:46333_solr
   [junit4]   2> 2463821 DEBUG (OverseerStateUpdate-72272136091861002-127.0.0.1:46333_solr-n_0000000000) [n:127.0.0.1:46333_solr     ] o.a.s.c.c.ZkStateReader Updated live nodes from ZooKeeper... [] -> []
   [junit4]   2> 2463822 DEBUG (OverseerStateUpdate-72272136091861002-127.0.0.1:46333_solr-n_0000000000) [n:127.0.0.1:46333_solr     ] o.a.s.c.c.ZkStateReader clusterStateSet: legacy [0] interesting [0] watched [0] lazy [0] total [0]
   [junit4]   2> 2463837 INFO  (jetty-launcher-15611-thread-2) [n:127.0.0.1:46333_solr     ] o.a.s.c.ZkController Register node as live in ZooKeeper:/live_nodes/127.0.0.1:46333_solr
   [junit4]   2> 2463845 WARN  (jetty-launcher-15611-thread-4) [     ] o.e.j.u.s.S.config Trusting all certificates configured for Client@7f035d39[provider=null,keyStore=null,trustStore=null]
   [junit4]   2> 2463845 WARN  (jetty-launcher-15611-thread-4) [     ] o.e.j.u.s.S.config No Client EndPointIdentificationAlgorithm configured for Client@7f035d39[provider=null,keyStore=null,trustStore=null]
   [junit4]   2> 2463858 DEBUG (zkCallback-15647-thread-1) [     ] o.a.s.c.c.ZkStateReader A live node change: [WatchedEvent state:SyncConnected type:NodeChildrenChanged path:/live_nodes], has occurred - updating... (live nodes size: [0])
   [junit4]   2> 2463866 INFO  (jetty-launcher-15611-thread-2) [n:127.0.0.1:46333_solr     ] o.a.s.c.PackageManager clusterprops.json changed , version -1
   [junit4]   2> 2463871 INFO  (zkCallback-15647-thread-1) [     ] o.a.s.c.c.ZkStateReader Updated live nodes from ZooKeeper... (0) -> (1)
   [junit4]   2> 2463871 DEBUG (zkCallback-15647-thread-1) [     ] o.a.s.c.c.ZkStateReader Updated live nodes from ZooKeeper... [] -> [127.0.0.1:46333_solr]
   [junit4]   2> 2463872 DEBUG (zkCallback-15640-thread-1) [     ] o.a.s.c.c.ZkStateReader A live node change: [WatchedEvent state:SyncConnected type:NodeChildrenChanged path:/live_nodes], has occurred - updating... (live nodes size: [0])
   [junit4]   2> 2463873 INFO  (zkCallback-15640-thread-1) [     ] o.a.s.c.c.ZkStateReader Updated live nodes from ZooKeeper... (0) -> (1)
   [junit4]   2> 2463873 DEBUG (zkCallback-15640-thread-1) [     ] o.a.s.c.c.ZkStateReader Updated live nodes from ZooKeeper... [] -> [127.0.0.1:46333_solr]
   [junit4]   2> 2463878 DEBUG (jetty-launcher-15611-thread-1) [n:127.0.0.1:37705_solr     ] o.a.s.c.c.ZkStateReader Updating cluster state from ZooKeeper...
   [junit4]   2> 2463879 DEBUG (jetty-launcher-15611-thread-1) [n:127.0.0.1:37705_solr     ] o.a.s.c.c.ZkStateReader Loaded empty cluster properties
   [junit4]   2> 2463880 INFO  (jetty-launcher-15611-thread-1) [n:127.0.0.1:37705_solr     ] o.a.s.c.c.ZkStateReader Updated live nodes from ZooKeeper... (0) -> (1)
   [junit4]   2> 2463880 DEBUG (jetty-launcher-15611-thread-1) [n:127.0.0.1:37705_solr     ] o.a.s.c.c.ZkStateReader Updated live nodes from ZooKeeper... [] -> [127.0.0.1:46333_solr]
   [junit4]   2> 2463881 DEBUG (jetty-launcher-15611-thread-1) [n:127.0.0.1:37705_solr     ] o.a.s.c.c.ZkStateReader clusterStateSet: legacy [0] interesting [0] watched [0] lazy [0] total [0]
   [junit4]   2> 2463891 INFO  (jetty-launcher-15611-thread-1) [n:127.0.0.1:37705_solr     ] o.a.s.c.ZkController Publish node=127.0.0.1:37705_solr as DOWN
   [junit4]   2> 2463893 INFO  (jetty-launcher-15611-thread-1) [n:127.0.0.1:37705_solr     ] o.a.s.c.TransientSolrCoreCacheDefault Allocating transient cache for 2147483647 transient cores
   [junit4]   2> 2463893 INFO  (jetty-launcher-15611-thread-1) [n:127.0.0.1:37705_solr     ] o.a.s.c.ZkController Register node as live in ZooKeeper:/live_nodes/127.0.0.1:37705_solr
   [junit4]   2> 2463896 WARN  (jetty-launcher-15611-thread-4) [     ] o.e.j.u.s.S.config Trusting all certificates configured for Client@22676178[provider=null,keyStore=null,trustStore=null]
   [junit4]   2> 2463896 WARN  (jetty-launcher-15611-thread-4) [     ] o.e.j.u.s.S.config No Client EndPointIdentificationAlgorithm configured for Client@22676178[provider=null,keyStore=null,trustStore=null]
   [junit4]   2> 2463898 INFO  (jetty-launcher-15611-thread-4) [     ] o.a.s.c.ZkContainer Zookeeper client=127.0.0.1:33357/solr
   [junit4]   2> 2463915 INFO  (jetty-launcher-15611-thread-4) [     ] o.a.s.c.c.ConnectionManager Waiting for client to connect to ZooKeeper
   [junit4]   2> 2463936 DEBUG (zkCallback-15647-thread-1) [     ] o.a.s.c.c.ZkStateReader A live node change: [WatchedEvent state:SyncConnected type:NodeChildrenChanged path:/live_nodes], has occurred - updating... (live nodes size: [1])
   [junit4]   2> 2463936 INFO  (zkCallback-15647-thread-1) [     ] o.a.s.c.c.ZkStateReader Updated live nodes from ZooKeeper... (1) -> (2)
   [junit4]   2> 2463936 DEBUG (zkCallback-15647-thread-1) [     ] o.a.s.c.c.ZkStateReader Updated live nodes from ZooKeeper... [127.0.0.1:46333_solr] -> [127.0.0.1:37705_solr, 127.0.0.1:46333_solr]
   [junit4]   2> 2463942 DEBUG (zkCallback-15640-thread-2) [     ] o.a.s.c.c.ZkStateReader A live node change: [WatchedEvent state:SyncConnected type:NodeChildrenChanged path:/live_nodes], has occurred - updating... (live nodes size: [1])
   [junit4]   2> 2463943 INFO  (zkCallback-15640-thread-2) [     ] o.a.s.c.c.ZkStateReader Updated live nodes from ZooKeeper... (1) -> (2)
   [junit4]   2> 2463943 DEBUG (zkCallback-15640-thread-2) [     ] o.a.s.c.c.ZkStateReader Updated live nodes from ZooKeeper... [127.0.0.1:46333_solr] -> [127.0.0.1:37705_solr, 127.0.0.1:46333_solr]
   [junit4]   2> 2463964 INFO  (jetty-launcher-15611-thread-1) [n:127.0.0.1:37705_solr     ] o.a.s.c.c.ConnectionManager Waiting for client to connect to ZooKeeper
   [junit4]   2> 2463971 DEBUG (zkCallback-15636-thread-1) [     ] o.a.s.c.c.ZkStateReader A live node change: [WatchedEvent state:SyncConnected type:NodeChildrenChanged path:/live_nodes], has occurred - updating... (live nodes size: [1])
   [junit4]   2> 2463979 INFO  (zkCallback-15636-thread-1) [     ] o.a.s.c.c.ZkStateReader Updated live nodes from ZooKeeper... (1) -> (2)
   [junit4]   2> 2463979 DEBUG (zkCallback-15636-thread-1) [     ] o.a.s.c.c.ZkStateReader Updated live nodes from ZooKeeper... [127.0.0.1:46333_solr] -> [127.0.0.1:37705_solr, 127.0.0.1:46333_solr]
   [junit4]   2> 2463991 INFO  (zkConnectionManagerCallback-15659-thread-1) [     ] o.a.s.c.c.ConnectionManager zkClient has connected
   [junit4]   2> 2463992 INFO  (jetty-launcher-15611-thread-1) [n:127.0.0.1:37705_solr     ] o.a.s.c.c.ConnectionManager Client is connected to ZooKeeper
   [junit4]   2> 2463992 DEBUG (jetty-launcher-15611-thread-1) [n:127.0.0.1:37705_solr     ] o.a.s.c.c.ZkStateReader Updating cluster state from ZooKeeper...
   [junit4]   2> 2463993 DEBUG (jetty-launcher-15611-thread-1) [n:127.0.0.1:37705_solr     ] o.a.s.c.c.ZkStateReader Loaded empty cluster properties
   [junit4]   2> 2463994 INFO  (jetty-launcher-15611-thread-1) [n:127.0.0.1:37705_solr     ] o.a.s.c.c.ZkStateReader Updated live nodes from ZooKeeper... (0) -> (2)
   [junit4]   2> 2463994 DEBUG (jetty-launcher-15611-thread-1) [n:127.0.0.1:37705_solr     ] o.a.s.c.c.ZkStateReader Updated live nodes from ZooKeeper... [] -> [127.0.0.1:37705_solr, 127.0.0.1:46333_solr]
   [junit4]   2> 2463995 DEBUG (jetty-launcher-15611-thread-1) [n:127.0.0.1:37705_solr     ] o.a.s.c.c.ZkStateReader clusterStateSet: legacy [0] interesting [0] watched [0] lazy [0] total [0]
   [junit4]   2> 2463997 INFO  (jetty-launcher-15611-thread-1) [n:127.0.0.1:37705_solr     ] o.a.s.c.s.i.ZkClientClusterStateProvider Cluster at 127.0.0.1:33357/solr ready
   [junit4]   2> 2463997 INFO  (jetty-launcher-15611-thread-1) [n:127.0.0.1:37705_solr     ] o.a.s.c.PackageManager clusterprops.json changed , version -1
   [junit4]   2> 2464015 INFO  (zkConnectionManagerCallback-15654-thread-1) [     ] o.a.s.c.c.ConnectionManager zkClient has connected
   [junit4]   2> 2464015 INFO  (jetty-launcher-15611-thread-4) [     ] o.a.s.c.c.ConnectionManager Client is connected to ZooKeeper
   [junit4]   2> 2464024 INFO  (jetty-launcher-15611-thread-2) [n:127.0.0.1:46333_solr     ] o.a.s.h.a.MetricsHistoryHandler No .system collection, keeping metrics history in memory.
   [junit4]   2> 2464056 INFO  (jetty-launcher-15611-thread-3) [     ] o.a.s.h.c.HttpShardHandlerFactory Host whitelist initialized: WhitelistHostChecker [whitelistHosts=null, whitelistHostCheckingEnabled=true]
   [junit4]   2> 2464058 WARN  (jetty-launcher-15611-thread-3) [     ] o.e.j.u.s.S.config Trusting all certificates configured for Client@2ab24798[provider=null,keyStore=null,trustStore=null]
   [junit4]   2> 2464058 WARN  (jetty-launcher-15611-thread-3) [     ] o.e.j.u.s.S.config No Client EndPointIdentificationAlgorithm configured for Client@2ab24798[provider=null,keyStore=null,trustStore=null]
   [junit4]   2> 2464086 INFO  (jetty-launcher-15611-thread-2) [n:127.0.0.1:46333_solr     ] o.a.s.m.r.SolrJmxReporter JMX monitoring for 'solr_46333.solr.node' (registry 'solr.node') enabled at server: com.sun.jmx.mbeanserver.JmxMBeanServer@d281446
   [junit4]   2> 2464104 WARN  (jetty-launcher-15611-thread-3) [     ] o.e.j.u.s.S.config Trusting all certificates configured for Client@44fde587[provider=null,keyStore=null,trustStore=null]
   [junit4]   2> 2464104 WARN  (jetty-launcher-15611-thread-3) [     ] o.e.j.u.s.S.config No Client EndPointIdentificationAlgorithm configured for Client@44fde587[provider=null,keyStore=null,trustStore=null]
   [junit4]   2> 2464106 INFO  (jetty-launcher-15611-thread-3) [     ] o.a.s.c.ZkContainer Zookeeper client=127.0.0.1:33357/solr
   [junit4]   2> 2464114 INFO  (jetty-launcher-15611-thread-2) [n:127.0.0.1:46333_solr     ] o.a.s.m.r.SolrJmxReporter JMX monitoring for 'solr_46333.solr.jvm' (registry 'solr.jvm') enabled at server: com.sun.jmx.mbeanserver.JmxMBeanServer@d281446
   [junit4]   2> 2464114 INFO  (jetty-launcher-15611-thread-2) [n:127.0.0.1:46333_solr     ] o.a.s.m.r.SolrJmxReporter JMX monitoring for 'solr_46333.solr.jetty' (registry 'solr.jetty') enabled at server: com.sun.jmx.mbeanserver.JmxMBeanServer@d281446
   [junit4]   2> 2464119 INFO  (jetty-launcher-15611-thread-2) [n:127.0.0.1:46333_solr     ] o.a.s.c.CorePropertiesLocator Found 0 core definitions underneath /home/jenkins/jenkins-slave/workspace/Lucene-Solr-Tests-8.x/solr/build/solr-core/test/J0/temp/solr.handler.TestContainerReqHandler_FC809F0E9A6F2FB4-001/tempDir-001/node2/.
   [junit4]   2> 2464126 INFO  (jetty-launcher-15611-thread-3) [     ] o.a.s.c.c.ConnectionManager Waiting for client to connect to ZooKeeper
   [junit4]   2> 2464134 INFO  (jetty-launcher-15611-thread-1) [n:127.0.0.1:37705_solr     ] o.a.s.h.a.MetricsHistoryHandler No .system collection, keeping metrics history in memory.
   [junit4]   2> 2464150 INFO  (zkConnectionManagerCallback-15666-thread-1) [     ] o.a.s.c.c.ConnectionManager zkClient has connected
   [junit4]   2> 2464151 INFO  (jetty-launcher-15611-thread-3) [     ] o.a.s.c.c.ConnectionManager Client is connected to ZooKeeper
   [junit4]   2> 2464171 INFO  (jetty-launcher-15611-thread-4) [n:127.0.0.1:32785_solr     ] o.a.s.c.c.ConnectionManager Waiting for client to connect to ZooKeeper
   [junit4]   2> 2464207 INFO  (zkConnectionManagerCallback-15669-thread-1) [     ] o.a.s.c.c.ConnectionManager zkClient has connected
   [junit4]   2> 2464207 INFO  (jetty-launcher-15611-thread-4) [n:127.0.0.1:32785_solr     ] o.a.s.c.c.ConnectionManager Client is connected to ZooKeeper
   [junit4]   2> 2464216 DEBUG (jetty-launcher-15611-thread-4) [n:127.0.0.1:32785_solr     ] o.a.s.c.c.ZkStateReader Updating cluster state from ZooKeeper...
   [junit4]   2> 2464218 DEBUG (jetty-launcher-15611-thread-4) [n:127.0.0.1:32785_solr     ] o.a.s.c.c.ZkStateReader Loaded empty cluster properties
   [junit4]   2> 2464219 INFO  (jetty-launcher-15611-thread-4) [n:127.0.0.1:32785_solr     ] o.a.s.c.c.ZkStateReader Updated live nodes from ZooKeeper... (0) -> (2)
   [junit4]   2> 2464219 DEBUG (jetty-launcher-15611-thread-4) [n:127.0.0.1:32785_solr     ] o.a.s.c.c.ZkStateReader Updated live nodes from ZooKeeper... [] -> [127.0.0.1:37705_solr, 127.0.0.1:46333_solr]
   [junit4]   2> 2464220 DEBUG (jetty-launcher-15611-thread-4) [n:127.0.0.1:32785_solr     ] o.a.s.c.c.ZkStateReader clusterStateSet: legacy [0] interesting [0] watched [0] lazy [0] total [0]
   [junit4]   2> 2464229 INFO  (jetty-launcher-15611-thread-4) [n:127.0.0.1:32785_solr     ] o.a.s.c.ZkController Publish node=127.0.0.1:32785_solr as DOWN
   [junit4]   2> 2464232 INFO  (jetty-launcher-15611-thread-4) [n:127.0.0.1:32785_solr     ] o.a.s.c.TransientSolrCoreCacheDefault Allocating transient cache for 2147483647 transient cores
   [junit4]   2> 2464233 INFO  (jetty-launcher-15611-thread-4) [n:127.0.0.1:32785_solr     ] o.a.s.c.ZkController Register node as live in ZooKeeper:/live_nodes/127.0.0.1:32785_solr
   [junit4]   2> 2464234 DEBUG (zkCallback-15636-thread-1) [     ] o.a.s.c.c.ZkStateReader A live node change: [WatchedEvent state:SyncConnected type:NodeChildrenChanged path:/live_nodes], has occurred - updating... (live nodes size: [2])
   [junit4]   2> 2464234 DEBUG (zkCallback-15647-thread-1) [     ] o.a.s.c.c.ZkStateReader A live node change: [WatchedEvent state:SyncConnected type:NodeChildrenChanged path:/live_nodes], has occurred - updating... (live nodes size: [2])
   [junit4]   2> 2464235 DEBUG (zkCallback-15640-thread-1) [     ] o.a.s.c.c.ZkStateReader A live node change: [WatchedEvent state:SyncConnected type:NodeChildrenChanged path:/live_nodes], has occurred - updating... (live nodes size: [2])
   [junit4]   2> 2464235 INFO  (zkCallback-15647-thread-1) [     ] o.a.s.c.c.ZkStateReader Updated live nodes from ZooKeeper... (2) -> (3)
   [junit4]   2> 2464235 DEBUG (zkCallback-15647-thread-1) [     ] o.a.s.c.c.ZkStateReader Updated live nodes from ZooKeeper... [127.0.0.1:37705_solr, 127.0.0.1:46333_solr] -> [127.0.0.1:32785_solr, 127.0.0.1:37705_solr, 127.0.0.1:46333_solr]
   [junit4]   2> 2464235 INFO  (zkCallback-15636-thread-1) [     ] o.a.s.c.c.ZkStateReader Updated live nodes from ZooKeeper... (2) -> (3)
   [junit4]   2> 2464235 DEBUG (zkCallback-15636-thread-1) [     ] o.a.s.c.c.ZkStateReader Updated live nodes from ZooKeeper... [127.0.0.1:37705_solr, 127.0.0.1:46333_solr] -> [127.0.0.1:32785_solr, 127.0.0.1:37705_solr, 127.0.0.1:46333_solr]
   [junit4]   2> 2464235 INFO  (zkCallback-15640-thread-1) [     ] o.a.s.c.c.ZkStateReader Updated live nodes from ZooKeeper... (2) -> (3)
   [junit4]   2> 2464235 DEBUG (zkCallback-15640-thread-1) [     ] o.a.s.c.c.ZkStateReader Updated live nodes from ZooKeeper... [127.0.0.1:37705_solr, 127.0.0.1:46333_solr] -> [127.0.0.1:32785_solr, 127.0.0.1:37705_solr, 127.0.0.1:46333_solr]
   [junit4]   2> 2464240 DEBUG (zkCallback-15658-thread-1) [     ] o.a.s.c.c.ZkStateReader A live node change: [WatchedEvent state:SyncConnected type:NodeChildrenChanged path:/live_nodes], has occurred - updating... (live nodes size: [2])
   [junit4]   2> 2464242 INFO  (zkCallback-15658-thread-1) [     ] o.a.s.c.c.ZkStateReader Updated live nodes from ZooKeeper... (2) -> (3)
   [junit4]   2> 2464245 INFO  (jetty-launcher-15611-thread-1) [n:127.0.0.1:37705_solr     ] o.a.s.m.r.SolrJmxReporter JMX monitoring for 'solr_37705.solr.node' (registry 'solr.node') enabled at server: com.sun.jmx.mbeanserver.JmxMBeanServer@d281446
   [junit4]   2> 2464250 DEBUG (zkCallback-15658-thread-1) [     ] o.a.s.c.c.ZkStateReader Updated live nodes from ZooKeeper... [127.0.0.1:37705_solr, 127.0.0.1:46333_solr] -> [127.0.0.1:32785_solr, 127.0.0.1:37705_solr, 127.0.0.1:46333_solr]
   [junit4]   2> 2464251 DEBUG (zkCallback-15668-thread-1) [     ] o.a.s.c.c.ZkStateReader A live node change: [WatchedEvent state:SyncConnected type:NodeChildrenChanged path:/live_nodes], has occurred - updating... (live nodes size: [2])
   [junit4]   2> 2464253 INFO  (zkCallback-15668-thread-1) [     ] o.a.s.c.c.ZkStateReader Updated live nodes from ZooKeeper... (2) -> (3)
   [junit4]   2> 2464253 DEBUG (zkCallback-15668-thread-1) [     ] o.a.s.c.c.ZkStateReader Updated live nodes from ZooKeeper... [127.0.0.1:37705_solr, 127.0.0.1:46333_solr] -> [127.0.0.1:32785_solr, 127.0.0.1:37705_solr, 127.0.0.1:46333_solr]
   [junit4]   2> 2464255 INFO  (jetty-launcher-15611-thread-4) [n:127.0.0.1:32785_solr     ] o.a.s.c.c.ConnectionManager Waiting for client to connect to ZooKeeper
   [junit4]   2> 2464256 INFO  (zkConnectionManagerCallback-15676-thread-1) [     ] o.a.s.c.c.ConnectionManager zkClient has connected
   [junit4]   2> 2464256 INFO  (jetty-launcher-15611-thread-4) [n:127.0.0.1:32785_solr     ] o.a.s.c.c.ConnectionManager Client is connected to ZooKeeper
   [junit4]   2> 2464256 DEBUG (jetty-launcher-15611-thread-4) [n:127.0.0.1:32785_solr     ] o.a.s.c.c.ZkStateReader Updating cluster state from ZooKeeper...
   [junit4]   2> 2464257 DEBUG (jetty-launcher-15611-thread-4) [n:127.0.0.1:32785_solr     ] o.a.s.c.c.ZkStateReader Loaded empty cluster properties
   [junit4]   2> 2464258 INFO  (jetty-launcher-15611-thread-4) [n:127.0.0.1:32785_solr     ] o.a.s.c.c.ZkStateReader Updated live nodes from ZooKeeper... (0) -> (3)
   [junit4]   2> 2464258 DEBUG (jetty-launcher-15611-thread-4) [n:127.0.0.1:32785_solr     ] o.a.s.c.c.ZkStateReader Updated live nodes from ZooKeeper... [] -> [127.0.0.1:32785_solr, 127.0.0.1:37705_solr, 127.0.0.1:46333_solr]
   [junit4]   2> 2464259 DEBUG (jetty-launcher-15611-thread-4) [n:127.0.0.1:32785_solr     ] o.a.s.c.c.ZkStateReader clusterStateSet: legacy [0] interesting [0] watched [0] lazy [0] total [0]
   [junit4]   2> 2464260 INFO  (jetty-launcher-15611-thread-4) [n:127.0.0.1:32785_solr     ] o.a.s.c.s.i.ZkClientClusterStateProvider Cluster at 127.0.0.1:33357/solr ready
   [junit4]   2> 2464261 INFO  (jetty-launcher-15611-thread-4) [n:127.0.0.1:32785_solr     ] o.a.s.c.PackageManager clusterprops.json changed , version -1
   [junit4]   2> 2464279 INFO  (jetty-launcher-15611-thread-1) [n:127.0.0.1:37705_solr     ] o.a.s.m.r.SolrJmxReporter JMX monitoring for 'solr_37705.solr.jvm' (registry 'solr.jvm') enabled at server: com.sun.jmx.mbeanserver.JmxMBeanServer@d281446
   [junit4]   2> 2464280 INFO  (jetty-launcher-15611-thread-1) [n:127.0.0.1:37705_solr     ] o.a.s.m.r.SolrJmxReporter JMX monitoring for 'solr_37705.solr.jetty' (registry 'solr.jetty') enabled at server: com.sun.jmx.mbeanserver.JmxMBeanServer@d281446
   [junit4]   2> 2464283 INFO  (jetty-launcher-15611-thread-1) [n:127.0.0.1:37705_solr     ] o.a.s.c.CorePropertiesLocator Found 0 core definitions underneath /home/jenkins/jenkins-slave/workspace/Lucene-Solr-Tests-8.x/solr/build/solr-core/test/J0/temp/solr.handler.TestContainerReqHandler_FC809F0E9A6F2FB4-001/tempDir-001/node1/.
   [junit4]   2> 2464309 INFO  (jetty-launcher-15611-thread-4) [n:127.0.0.1:32785_solr     ] o.a.s.h.a.MetricsHistoryHandler No .system collection, keeping metrics history in memory.
   [junit4]   2> 2464336 INFO  (jetty-launcher-15611-thread-3) [n:127.0.0.1:33955_solr     ] o.a.s.c.c.ConnectionManager Waiting for client to connect to ZooKeeper
   [junit4]   2> 2464344 INFO  (zkConnectionManagerCallback-15679-thread-1) [     ] o.a.s.c.c.ConnectionManager zkClient has connected
   [junit4]   2> 2464345 INFO  (jetty-launcher-15611-thread-3) [n:127.0.0.1:33955_solr     ] o.a.s.c.c.ConnectionManager Client is connected to ZooKeeper
   [junit4]   2> 2464356 DEBUG (jetty-launcher-15611-thread-3) [n:127.0.0.1:33955_solr     ] o.a.s.c.c.ZkStateReader Updating cluster state from ZooKeeper...
   [junit4]   2> 2464357 DEBUG (jetty-launcher-15611-thread-3) [n:127.0.0.1:33955_solr     ] o.a.s.c.c.ZkStateReader Loaded empty cluster properties
   [junit4]   2> 2464358 INFO  (jetty-launcher-15611-thread-3) [n:127.0.0.1:33955_solr     ] o.a.s.c.c.ZkStateReader Updated live nodes from ZooKeeper... (0) -> (3)
   [junit4]   2> 2464358 DEBUG (jetty-launcher-15611-thread-3) [n:127.0.0.1:33955_solr     ] o.a.s.c.c.ZkStateReader Updated live nodes from ZooKeeper... [] -> [127.0.0.1:32785_solr, 127.0.0.1:37705_solr, 127.0.0.1:46333_solr]
   [junit4]   2> 2464359 DEBUG (jetty-launcher-15611-thread-3) [n:127.0.0.1:33955_solr     ] o.a.s.c.c.ZkStateReader clusterStateSet: legacy [0] interesting [0] watched [0] lazy [0] total [0]
   [junit4]   2> 2464364 INFO  (jetty-launcher-15611-thread-3) [n:127.0.0.1:33955_solr     ] o.a.s.c.ZkController Publish node=127.0.0.1:33955_solr as DOWN
   [junit4]   2> 2464366 INFO  (jetty-launcher-15611-thread-3) [n:127.0.0.1:33955_solr     ] o.a.s.c.TransientSolrCoreCacheDefault Allocating transient cache for 2147483647 transient cores
   [junit4]   2> 2464366 INFO  (jetty-launcher-15611-thread-3) [n:127.0.0.1:33955_solr     ] o.a.s.c.ZkController Register node as live in ZooKeeper:/live_nodes/127.0.0.1:33955_solr
   [junit4]   2> 2464368 DEBUG (zkCallback-15647-thread-1) [     ] o.a.s.c.c.ZkStateReader A live node change: [WatchedEvent state:SyncConnected type:NodeChildrenChanged path:/live_nodes], has occurred - updating... (live nodes size: [3])
   [junit4]   2> 2464368 DEBUG (zkCallback-15636-thread-1) [     ] o.a.s.c.c.ZkStateReader A live node change: [WatchedEvent state:SyncConnected type:NodeChildrenChanged path:/live_nodes], has occurred - updating... (live nodes size: [3])
   [junit4]   2> 2464368 DEBUG (zkCallback-15640-thread-1) [     ] o.a.s.c.c.ZkStateReader A live node change: [WatchedEvent state:SyncConnected type:NodeChildrenChanged path:/live_nodes], has occurred - updating... (live nodes size: [3])
   [junit4]   2> 2464369 INFO  (zkCallback-15647-thread-1) [     ] o.a.s.c.c.ZkStateReader Updated live nodes from ZooKeeper... (3) -> (4)
   [junit4]   2> 2464369 DEBUG (zkCallback-15647-thread-1) [     ] o.a.s.c.c.ZkStateReader Updated live nodes from ZooKeeper... [127.0.0.1:32785_solr, 127.0.0.1:37705_solr, 127.0.0.1:46333_solr] -> [127.0.0.1:32785_solr, 127.0.0.1:33955_solr, 127.0.0.1:37705_solr, 127.0.0.1:46333_solr]
   [junit4]   2> 2464370 INFO  (zkCallback-15636-thread-1) [     ] o.a.s.c.c.ZkStateReader Updated live nodes from ZooKeeper... (3) -> (4)
   [junit4]   2> 2464370 DEBUG (zkCallback-15636-thread-1) [     ] o.a.s.c.c.ZkStateReader Updated live nodes from ZooKeeper... [127.0.0.1:32785_solr, 127.0.0.1:37705_solr, 127.0.0.1:46333_solr] -> [127.0.0.1:32785_solr, 127.0.0.1:33955_solr, 127.0.0.1:37705_solr, 127.0.0.1:46333_solr]
   [junit4]   2> 2464370 INFO  (zkCallback-15640-thread-1) [     ] o.a.s.c.c.ZkStateReader Updated live nodes from ZooKeeper... (3) -> (4)
   [junit4]   2> 2464370 DEBUG (zkCallback-15640-thread-1) [     ] o.a.s.c.c.ZkStateReader Updated live nodes from ZooKeeper... [127.0.0.1:32785_solr, 127.0.0.1:37705_solr, 127.0.0.1:46333_solr] -> [127.0.0.1:32785_solr, 127.0.0.1:33955_solr, 127.0.0.1:37705_solr, 127.0.0.1:46333_solr]
   [junit4]   2> 2464373 DEBUG (zkCallback-15658-thread-1) [     ] o.a.s.c.c.ZkStateReader A live node change: [WatchedEvent state:SyncConnected type:NodeChildrenChanged path:/live_nodes], has occurred - updating... (live nodes size: [3])
   [junit4]   2> 2464373 DEBUG (zkCallback-15678-thread-1) [     ] o.a.s.c.c.ZkStateReader A live node change: [WatchedEvent state:SyncConnected type:NodeChildrenChanged path:/live_nodes], has occurred - updating... (live nodes size: [3])
   [junit4]   2> 2464374 INFO  (zkCallback-15658-thread-1) [     ] o.a.s.c.c.ZkStateReader Updated live nodes from ZooKeeper... (3) -> (4)
   [junit4]   2> 2464374 DEBUG (zkCallback-15658-thread-1) [     ] o.a.s.c.c.ZkStateReader Updated live nodes from ZooKeeper... [127.0.0.1:32785_solr, 127.0.0.1:37705_solr, 127.0.0.1:46333_solr] -> [127.0.0.1:32785_solr, 127.0.0.1:33955_solr, 127.0.0.1:37705_solr, 127.0.0.1:46333_solr]
   [junit4]   2> 2464375 INFO  (zkCallback-15678-thread-1) [     ] o.a.s.c.c.ZkStateReader Updated live nodes from ZooKeeper... (3) -> (4)
   [junit4]   2> 2464375 DEBUG (zkCallback-15678-thread-1) [     ] o.a.s.c.c.ZkStateReader Updated live nodes from ZooKeeper... [127.0.0.1:32785_solr, 127.0.0.1:37705_solr, 127.0.0.1:46333_solr] -> [127.0.0.1:32785_solr, 127.0.0.1:33955_solr, 127.0.0.1:37705_solr, 127.0.0.1:46333_solr]
   [junit4]   2> 2464384 INFO  (jetty-launcher-15611-thread-4) [n:127.0.0.1:32785_solr     ] o.a.s.m.r.SolrJmxReporter JMX monitoring for 'solr_32785.solr.node' (registry 'solr.node') enabled at server: com.sun.jmx.mbeanserver.JmxMBeanServer@d281446
   [junit4]   2> 2464390 INFO  (jetty-launcher-15611-thread-3) [n:127.0.0.1:33955_solr     ] o.a.s.c.c.ConnectionManager Waiting for client to connect to ZooKeeper
   [junit4]   2> 2464390 DEBUG (zkCallback-15668-thread-1) [     ] o.a.s.c.c.ZkStateReader A live node change: [WatchedEvent state:SyncConnected type:NodeChildrenChanged path:/live_nodes], has occurred - updating... (live nodes size: [3])
   [junit4]   2> 2464391 INFO  (zkCallback-15668-thread-1) [     ] o.a.s.c.c.ZkStateReader Updated live nodes from ZooKeeper... (3) -> (4)
   [junit4]   2> 2464391 DEBUG (zkCallback-15668-thread-1) [     ] o.a.s.c.c.ZkStateReader Updated live nodes from ZooKeeper... [127.0.0.1:32785_solr, 127.0.0.1:37705_solr, 127.0.0.1:46333_solr] -> [127.0.0.1:32785_solr, 127.0.0.1:33955_solr, 127.0.0.1:37705_solr, 127.0.0.1:46333_solr]
   [junit4]   2> 2464393 DEBUG (zkCallback-15675-thread-1) [     ] o.a.s.c.c.ZkStateReader A live node change: [WatchedEvent state:SyncConnected type:NodeChildrenChanged path:/live_nodes], has occurred - updating... (live nodes size: [3])
   [junit4]   2> 2464399 INFO  (zkCallback-15675-thread-1) [     ] o.a.s.c.c.ZkStateReader Updated live nodes from ZooKeeper... (3) -> (4)
   [junit4]   2> 2464399 DEBUG (zkCallback-15675-thread-1) [     ] o.a.s.c.c.ZkStateReader Updated live nodes from ZooKeeper... [127.0.0.1:32785_solr, 127.0.0.1:37705_solr, 127.0.0.1:46333_solr] -> [127.0.0.1:32785_solr, 127.0.0.1:33955_solr, 127.0.0.1:37705_solr, 127.0.0.1:46333_solr]
   [junit4]   2> 2464403 INFO  (zkConnectionManagerCallback-15686-thread-1) [     ] o.a.s.c.c.ConnectionManager zkClient has connected
   [junit4]   2> 2464403 INFO  (jetty-launcher-15611-thread-3) [n:127.0.0.1:33955_solr     ] o.a.s.c.c.ConnectionManager Client is connected to ZooKeeper
   [junit4]   2> 2464403 DEBUG (jetty-launcher-15611-thread-3) [n:127.0.0.1:33955_solr     ] o.a.s.c.c.ZkStateReader Updating cluster state from ZooKeeper...
   [junit4]   2> 2464406 DEBUG (jetty-launcher-15611-thread-3) [n:127.0.0.1:33955_solr     ] o.a.s.c.c.ZkStateReader Loaded empty cluster properties
   [junit4]   2> 2464407 INFO  (jetty-launcher-15611-thread-3) [n:127.0.0.1:33955_solr     ] o.a.s.c.c.ZkStateReader Updated live nodes from ZooKeeper... (0) -> (4)
   [junit4]   2> 2464407 DEBUG (jetty-launcher-15611-thread-3) [n:127.0.0.1:33955_solr     ] o.a.s.c.c.ZkStateReader Updated live nodes from ZooKeeper... [] -> [127.0.0.1:32785_solr, 127.0.0.1:33955_solr, 127.0.0.1:37705_solr, 127.0.0.1:46333_solr]
   [junit4]   2> 2464408 DEBUG (jetty-launcher-15611-thread-3) [n:127.0.0.1:33955_solr     ] o.a.s.c.c.ZkStateReader clusterStateSet: legacy [0] interesting [0] watched [0] lazy [0] total [0]
   [junit4]   2> 2464409 INFO  (jetty-launcher-15611-thread-3) [n:127.0.0.1:33955_solr     ] o.a.s.c.s.i.ZkClientClusterStateProvider Cluster at 127.0.0.1:33357/solr ready
   [junit4]   2> 2464409 INFO  (jetty-launcher-15611-thread-3) [n:127.0.0.1:33955_solr     ] o.a.s.c.PackageManager clusterprops.json changed , version -1
   [junit4]   2> 2464415 INFO  (jetty-launcher-15611-thread-4) [n:127.0.0.1:32785_solr     ] o.a.s.m.r.SolrJmxReporter JMX monitoring for 'solr_32785.solr.jvm' (registry 'solr.jvm') enabled at server: com.sun.jmx.mbeanserver.JmxMBeanServer@d281446
   [junit4]   2> 2464416 INFO  (jetty-launcher-15611-thread-4) [n:127.0.0.1:32785_solr     ] o.a.s.m.r.SolrJmxReporter JMX monitoring for 'solr_32785.solr.jetty' (registry 'solr.jetty') enabled at server: com.sun.jmx.mbeanserver.JmxMBeanServer@d281446
   [junit4]   2> 2464418 INFO  (jetty-launcher-15611-thread-4) [n:127.0.0.1:32785_solr     ] o.a.s.c.CorePropertiesLocator Found 0 core definitions underneath /home/jenkins/jenkins-slave/workspace/Lucene-Solr-Tests-8.x/solr/build/solr-core/test/J0/temp/solr.handler.TestContainerReqHandler_FC809F0E9A6F2FB4-001/tempDir-001/node4/.
   [junit4]   2> 2464479 INFO  (jetty-launcher-15611-thread-3) [n:127.0.0.1:33955_solr     ] o.a.s.h.a.MetricsHistoryHandler No .system collection, keeping metrics history in memory.
   [junit4]   2> 2466491 INFO  (jetty-launcher-15611-thread-3) [n:127.0.0.1:33955_solr     ] o.a.s.m.r.SolrJmxReporter JMX monitoring for 'solr_33955.solr.node' (registry 'solr.node') enabled at server: com.sun.jmx.mbeanserver.JmxMBeanServer@d281446
   [junit4]   2> 2466535 INFO  (jetty-launcher-15611-thread-3) [n:127.0.0.1:33955_solr     ] o.a.s.m.r.SolrJmxReporter JMX monitoring for 'solr_33955.solr.jvm' (registry 'solr.jvm') enabled at server: com.sun.jmx.mbeanserver.JmxMBeanServer@d281446
   [junit4]   2> 2466536 INFO  (jetty-launcher-15611-thread-3) [n:127.0.0.1:33955_solr     ] o.a.s.m.r.SolrJmxReporter JMX monitoring for 'solr_33955.solr.jetty' (registry 'solr.jetty') enabled at server: com.sun.jmx.mbeanserver.JmxMBeanServer@d281446
   [junit4]   2> 2466538 INFO  (jetty-launcher-15611-thread-3) [n:127.0.0.1:33955_solr     ] o.a.s.c.CorePropertiesLocator Found 0 core definitions underneath /home/jenkins/jenkins-slave/workspace/Lucene-Solr-Tests-8.x/solr/build/solr-core/test/J0/temp/solr.handler.TestContainerReqHandler_FC809F0E9A6F2FB4-001/tempDir-001/node3/.
   [junit4]   2> 2466619 INFO  (TEST-TestContainerReqHandler.testPackageAPI-seed#[FC809F0E9A6F2FB4]) [     ] o.a.s.c.MiniSolrCloudCluster waitForAllNodes: numServers=4
   [junit4]   2> 2466622 INFO  (TEST-TestContainerReqHandler.testPackageAPI-seed#[FC809F0E9A6F2FB4]) [     ] o.a.s.c.c.ConnectionManager Waiting for client to connect to ZooKeeper
   [junit4]   2> 2466624 INFO  (zkConnectionManagerCallback-15692-thread-1) [     ] o.a.s.c.c.ConnectionManager zkClient has connected
   [junit4]   2> 2466624 INFO  (TEST-TestContainerReqHandler.testPackageAPI-seed#[FC809F0E9A6F2FB4]) [     ] o.a.s.c.c.ConnectionManager Client is connected to ZooKeeper
   [junit4]   2> 2466625 DEBUG (TEST-TestContainerReqHandler.testPackageAPI-seed#[FC809F0E9A6F2FB4]) [     ] o.a.s.c.c.ZkStateReader Updating cluster state from ZooKeeper...
   [junit4]   2> 2466626 DEBUG (TEST-TestContainerReqHandler.testPackageAPI-seed#[FC809F0E9A6F2FB4]) [     ] o.a.s.c.c.ZkStateReader Loaded empty cluster properties
   [junit4]   2> 2466628 INFO  (TEST-TestContainerReqHandler.testPackageAPI-seed#[FC809F0E9A6F2FB4]) [     ] o.a.s.c.c.ZkStateReader Updated live nodes from ZooKeeper... (0) -> (4)
   [junit4]   2> 2466628 DEBUG (TEST-TestContainerReqHandler.testPackageAPI-seed#[FC809F0E9A6F2FB4]) [     ] o.a.s.c.c.ZkStateReader Updated live nodes from ZooKeeper... [] -> [127.0.0.1:32785_solr, 127.0.0.1:33955_solr, 127.0.0.1:37705_solr, 127.0.0.1:46333_solr]
   [junit4]   2> 2466629 DEBUG (TEST-TestContainerReqHandler.testPackageAPI-seed#[FC809F0E9A6F2FB4]) [     ] o.a.s.c.c.ZkStateReader clusterStateSet: legacy [0] interesting [0] watched [0] lazy [0] total [0]
   [junit4]   2> 2466630 INFO  (TEST-TestContainerReqHandler.testPackageAPI-seed#[FC809F0E9A6F2FB4]) [     ] o.a.s.c.s.i.ZkClientClusterStateProvider Cluster at 127.0.0.1:33357/solr ready
   [junit4]   2> 2466641 ERROR (qtp1152132616-42316) [n:127.0.0.1:37705_solr     ] o.a.s.h.a.CollectionHandlerApi Error loading runtimelib
   [junit4]   2>           => org.apache.solr.common.SolrException: Invalid jar from http://localhost:40347/jar1.jar , expected sha512 hash : wrong-sha512 , actual : d01b51de67ae1680a84a813983b1de3b592fc32f1a22b662fc9057da5953abd1b72476388ba342cad21671cd0b805503c78ab9075ff2f3951fdf75fa16981420
   [junit4]   2> at org.apache.solr.core.RuntimeLib.init(RuntimeLib.java:112)
   [junit4]   2> org.apache.solr.common.SolrException: Invalid jar from http://localhost:40347/jar1.jar , expected sha512 hash : wrong-sha512 , actual : d01b51de67ae1680a84a813983b1de3b592fc32f1a22b662fc9057da5953abd1b72476388ba342cad21671cd0b805503c78ab9075ff2f3951fdf75fa16981420
   [junit4]   2> at org.apache.solr.core.RuntimeLib.init(RuntimeLib.java:112) ~[java/:?]
   [junit4]   2> at org.apache.solr.handler.admin.CollectionHandlerApi.addUpdatePackage(CollectionHandlerApi.java:227) ~[java/:?]
   [junit4]   2> at org.apache.solr.handler.admin.CollectionHandlerApi.lambda$wrap$0(CollectionHandlerApi.java:116) ~[java/:?]
   [junit4]   2> at org.apache.solr.handler.admin.CollectionHandlerApi$2.invoke(CollectionHandlerApi.java:314) ~[java/:?]
   [junit4]   2> at org.apache.solr.handler.admin.BaseHandlerApiSupport$1.call(BaseHandlerApiSupport.java:100) ~[java/:?]
   [junit4]   2> at org.apache.solr.api.V2HttpCall.handleAdmin(V2HttpCall.java:341) ~[java/:?]
   [junit4]   2> at org.apache.solr.servlet.HttpSolrCall.handleAdminRequest(HttpSolrCall.java:786) ~[java/:?]
   [junit4]   2> at org.apache.solr.servlet.HttpSolrCall.call(HttpSolrCall.java:546) ~[java/:?]
   [junit4]   2> at org.apache.solr.servlet.SolrDispatchFilter.doFilter(SolrDispatchFilter.java:423) ~[java/:?]
   [junit4]   2> at org.apache.solr.servlet.SolrDispatchFilter.doFilter(SolrDispatchFilter.java:350) ~[java/:?]
   [junit4]   2> at org.eclipse.jetty.servlet.ServletHandler$CachedChain.doFilter(ServletHandler.java:1610) ~[jetty-servlet-9.4.19.v20190610.jar:9.4.19.v20190610]
   [junit4]   2> at org.apache.solr.client.solrj.embedded.JettySolrRunner$DebugFilter.doFilter(JettySolrRunner.java:165) ~[java/:?]
   [junit4]   2> at org.eclipse.jetty.servlet.ServletHandler$CachedChain.doFilter(ServletHandler.java:1610) ~[jetty-servlet-9.4.19.v20190610.jar:9.4.19.v20190610]
   [junit4]   2> at org.eclipse.jetty.servlet.ServletHandler.doHandle(ServletHandler.java:540) ~[jetty-servlet-9.4.19.v20190610.jar:9.4.19.v20190610]
   [junit4]   2> at org.eclipse.jetty.server.handler.ScopedHandler.nextHandle(ScopedHandler.java:255) ~[jetty-server-9.4.19.v20190610.jar:9.4.19.v20190610]
   [junit4]   2> at org.eclipse.jetty.server.session.SessionHandler.doHandle(SessionHandler.java:1711) ~[jetty-server-9.4.19.v20190610.jar:9.4.19.v20190610]
   [junit4]   2> at org.eclipse.jetty.server.handler.ScopedHandler.nextHandle(ScopedHandler.java:255) ~[jetty-server-9.4.19.v20190610.jar:9.4.19.v20190610]
   [junit4]   2> at org.eclipse.jetty.server.handler.ContextHandler.doHandle(ContextHandler.java:1347) ~[jetty-server-9.4.19.v20190610.jar:9.4.19.v20190610]
   [junit4]   2> at org.eclipse.jetty.server.handler.ScopedHandler.nextScope(ScopedHandler.java:203) ~[jetty-server-9.4.19.v20190610.jar:9.4.19.v20190610]
   [junit4]   2> at org.eclipse.jetty.servlet.ServletHandler.doScope(ServletHandler.java:480) ~[jetty-servlet-9.4.19.v20190610.jar:9.4.19.v20190610]
   [junit4]   2> at org.eclipse.jetty.server.session.SessionHandler.doScope(SessionHandler.java:1678) ~[jetty-server-9.4.19.v20190610.jar:9.4.19.v20190610]
   [junit4]   2> at org.eclipse.jetty.server.handler.ScopedHandler.nextScope(ScopedHandler.java:201) ~[jetty-server-9.4.19.v20190610.jar:9.4.19.v20190610]
   [junit4]   2> at org.eclipse.jetty.server.handler.ContextHandler.doScope(ContextHandler.java:1249) ~[jetty-server-9.4.19.v20190610.jar:9.4.19.v20190610]
   [junit4]   2> at org.eclipse.jetty.server.handler.ScopedHandler.handle(ScopedHandler.java:144) ~[jetty-server-9.4.19.v20190610.jar:9.4.19.v20190610]
   [junit4]   2> at org.eclipse.jetty.server.handler.gzip.GzipHandler.handle(GzipHandler.java:703) ~[jetty-server-9.4.19.v20190610.jar:9.4.19.v20190610]
   [junit4]   2> at org.eclipse.jetty.server.handler.HandlerWrapper.handle(HandlerWrapper.java:132) ~[jetty-server-9.4.19.v20190610.jar:9.4.19.v20190610]
   [junit4]   2> at org.eclipse.jetty.server.Server.handle(Server.java:505) ~[jetty-server-9.4.19.v20190610.jar:9.4.19.v20190610]
   [junit4]   2> at org.eclipse.jetty.server.HttpChannel.handle(HttpChannel.java:370) ~[jetty-server-9.4.19.v20190610.jar:9.4.19.v20190610]
   [junit4]   2> at org.eclipse.jetty.server.HttpConnection.onFillable(HttpConnection.java:267) ~[jetty-server-9.4.19.v20190610.jar:9.4.19.v20190610]
   [junit4]   2> at org.eclipse.jetty.io.AbstractConnection$ReadCallback.succeeded(AbstractConnection.java:305) ~[jetty-io-9.4.19.v20190610.jar:9.4.19.v20190610]
   [junit4]   2> at org.eclipse.jetty.io.FillInterest.fillable(FillInterest.java:103) ~[jetty-io-9.4.19.v20190610.jar:9.4.19.v20190610]
   [junit4]   2> at org.eclipse.jetty.io.ChannelEndPoint$2.run(ChannelEndPoint.java:117) ~[jetty-io-9.4.19.v20190610.jar:9.4.19.v20190610]
   [junit4]   2> at org.eclipse.jetty.util.thread.QueuedThreadPool.runJob(QueuedThreadPool.java:781) ~[jetty-util-9.4.19.v20190610.jar:9.4.19.v20190610]
   [junit4]   2> at org.eclipse.jetty.util.thread.QueuedThreadPool$Runner.run(QueuedThreadPool.java:917) ~[jetty-util-9.4.19.v20190610.jar:9.4.19.v20190610]
   [junit4]   2> at java.lang.Thread.run(Thread.java:748) [?:1.8.0_191]
   [junit4]   2> 2466651 ERROR (qtp1152132616-42316) [n:127.0.0.1:37705_solr     ] o.a.s.h.a.CollectionHandlerApi Error in running command {
   [junit4]   2>   "add-package":{
   [junit4]   2>     "name":"global",
   [junit4]   2>     "url":"http://localhost:40347/jar1.jar",
   [junit4]   2>     "sha512":"wrong-sha512"},
   [junit4]   2>   "errors":["Invalid jar from http://localhost:40347/jar1.jar , expected sha512 hash : wrong-sha512 , actual : d01b51de67ae1680a84a813983b1de3b592fc32f1a22b662fc9057da5953abd1b72476388ba342cad21671cd0b805503c78ab9075ff2f3951fdf75fa16981420"]} , current clusterprops.json : {}
   [junit4]   2> 2466652 INFO  (qtp1152132616-42316) [n:127.0.0.1:37705_solr     ] o.a.s.s.HttpSolrCall [admin] webapp=null path=/cluster params={wt=javabin&version=2} status=400 QTime=19
   [junit4]   2> 2466664 ERROR (qtp1892218204-42304) [n:127.0.0.1:32785_solr     ] o.a.s.c.BlobRepository Error loading resource http://localhost:40347/jar0.jar
   [junit4]   2>           => org.apache.solr.common.SolrException: no such resource available: foo, url : http://localhost:40347/jar0.jar
   [junit4]   2> at org.apache.solr.core.BlobRepository.fetchFromUrl(BlobRepository.java:219)
   [junit4]   2> org.apache.solr.common.SolrException: no such resource available: foo, url : http://localhost:40347/jar0.jar
   [junit4]   2> at org.apache.solr.core.BlobRepository.fetchFromUrl(BlobRepository.java:219) ~[java/:?]
   [junit4]   2> at org.apache.solr.core.RuntimeLib.init(RuntimeLib.java:108) ~[java/:?]
   [junit4]   2> at org.apache.solr.handler.admin.CollectionHandlerApi.addUpdatePackage(CollectionHandlerApi.java:227) ~[java/:?]
   [junit4]   2> at org.apache.solr.handler.admin.CollectionHandlerApi.lambda$wrap$0(CollectionHandlerApi.java:116) ~[java/:?]
   [junit4]   2> at org.apache.solr.handler.admin.CollectionHandlerApi$2.invoke(CollectionHandlerApi.java:314) ~[java/:?]
   [junit4]   2> at org.apache.solr.handler.admin.BaseHandlerApiSupport$1.call(BaseHandlerApiSupport.java:100) ~[java/:?]
   [junit4]   2> at org.apache.solr.api.V2HttpCall.handleAdmin(V2HttpCall.java:341) ~[java/:?]
   [junit4]   2> at org.apache.solr.servlet.HttpSolrCall.handleAdminRequest(HttpSolrCall.java:786) ~[java/:?]
   [junit4]   2> at org.apache.solr.servlet.HttpSolrCall.call(HttpSolrCall.java:546) ~[java/:?]
   [junit4]   2> at org.apache.solr.servlet.SolrDispatchFilter.doFilter(SolrDispatchFilter.java:423) ~[java/:?]
   [junit4]   2> at org.apache.solr.servlet.SolrDispatchFilter.doFilter(SolrDispatchFilter.java:350) ~[java/:?]
   [junit4]   2> at org.eclipse.jetty.servlet.ServletHandler$CachedChain.doFilter(ServletHandler.java:1610) ~[jetty-servlet-9.4.19.v20190610.jar:9.4.19.v20190610]
   [junit4]   2> at org.apache.solr.client.solrj.embedded.JettySolrRunner$DebugFilter.doFilter(JettySolrRunner.java:165) ~[java/:?]
   [junit4]   2> at org.eclipse.jetty.servlet.ServletHandler$CachedChain.doFilter(ServletHandler.java:1610) ~[jetty-servlet-9.4.19.v20190610.jar:9.4.19.v20190610]
   [junit4]   2> at org.eclipse.jetty.servlet.ServletHandler.doHandle(ServletHandler.java:540) ~[jetty-servlet-9.4.19.v20190610.jar:9.4.19.v20190610]
   [junit4]   2> at org.eclipse.jetty.server.handler.ScopedHandler.nextHandle(ScopedHandler.java:255) ~[jetty-server-9.4.19.v20190610.jar:9.4.19.v20190610]
   [junit4]   2> at org.eclipse.jetty.server.session.SessionHandler.doHandle(SessionHandler.java:1711) ~[jetty-server-9.4.19.v20190610.jar:9.4.19.v20190610]
   [junit4]   2> at org.eclipse.jetty.server.handler.ScopedHandler.nextHandle(ScopedHandler.java:255) ~[jetty-server-9.4.19.v20190610.jar:9.4.19.v20190610]
   [junit4]   2> at org.eclipse.jetty.server.handler.ContextHandler.doHandle(ContextHandler.java:1347) ~[jetty-server-9.4.19.v20190610.jar:9.4.19.v20190610]
   [junit4]   2> at org.eclipse.jetty.server.handler.ScopedHandler.nextScope(ScopedHandler.java:203) ~[jetty-server-9.4.19.v20190610.jar:9.4.19.v20190610]
   [junit4]   2> at org.eclipse.jetty.servlet.ServletHandler.doScope(ServletHandler.java:480) ~[jetty-servlet-9.4.19.v20190610.jar:9.4.19.v20190610]
   [junit4]   2> at org.eclipse.jetty.server.session.SessionHandler.doScope(SessionHandler.java:1678) ~[jetty-server-9.4.19.v20190610.jar:9.4.19.v20190610]
   [junit4]   2> at org.eclipse.jetty.server.handler.ScopedHandler.nextScope(ScopedHandler.java:201) ~[jetty-server-9.4.19.v20190610.jar:9.4.19.v20190610]
   [junit4]   2> at org.eclipse.jetty.server.handler.ContextHandler.doScope(ContextHandler.java:1249) ~[jetty-server-9.4.19.v20190610.jar:9.4.19.v20190610]
   [junit4]   2> at org.eclipse.jetty.server.handler.ScopedHandler.handle(ScopedHandler.java:144) ~[jetty-server-9.4.19.v20190610.jar:9.4.19.v20190610]
   [junit4]   2> at org.eclipse.jetty.server.handler.gzip.GzipHandler.handle(GzipHandler.java:703) ~[jetty-server-9.4.19.v20190610.jar:9.4.19.v20190610]
   [junit4]   2> at org.eclipse.jetty.server.handler.HandlerWrapper.handle(HandlerWrapper.java:132) ~[jetty-server-9.4.19.v20190610.jar:9.4.19.v20190610]
   [junit4]   2> at org.eclipse.jetty.server.Server.handle(Server.java:505) ~[jetty-server-9.4.19.v20190610.jar:9.4.19.v20190610]
   [junit4]   2> at org.eclipse.jetty.server.HttpChannel.handle(HttpChannel.java:370) ~[jetty-server-9.4.19.v20190610.jar:9.4.19.v20190610]
   [junit4]   2> at org.eclipse.jetty.server.HttpConnection.onFillable(HttpConnection.java:267) ~[jetty-server-9.4.19.v20190610.jar:9.4.19.v20190610]
   [junit4]   2> at org.eclipse.jetty.io.AbstractConnection$ReadCallback.succeeded(AbstractConnection.java:305) ~[jetty-io-9.4.19.v20190610.jar:9.4.19.v20190610]
   [junit4]   2> at org.eclipse.jetty.io.FillInterest.fillable(FillInterest.java:103) ~[jetty-io-9.4.19.v20190610.jar:9.4.19.v20190610]
   [junit4]   2> at org.eclipse.jetty.io.ChannelEndPoint$2.run(ChannelEndPoint.java:117) ~[jetty-io-9.4.19.v20190610.jar:9.4.19.v20190610]
   [junit4]   2> at org.eclipse.jetty.util.thread.QueuedThreadPool.runJob(QueuedThreadPool.java:781) ~[jetty-util-9.4.19.v20190610.jar:9.4.19.v20190610]
   [junit4]   2> at org.eclipse.jetty.util.thread.QueuedThreadPool$Runner.run(QueuedThreadPool.java:917) ~[jetty-util-9.4.19.v20190610.jar:9.4.19.v20190610]
   [junit4]   2> at java.lang.Thread.run(Thread.java:748) [?:1.8.0_191]
   [junit4]   2> 2466665 ERROR (qtp1892218204-42304) [n:127.0.0.1:32785_solr     ] o.a.s.h.a.CollectionHandlerApi Error loading runtimelib
   [junit4]   2>           => org.apache.solr.common.SolrException: no such resource available: foo, url : http://localhost:40347/jar0.jar
   [junit4]   2> at org.apache.solr.core.BlobRepository.fetchFromUrl(BlobRepository.java:219)
   [junit4]   2> org.apache.solr.common.SolrException: no such resource available: foo, url : http://localhost:40347/jar0.jar
   [junit4]   2> at org.apache.solr.core.BlobRepository.fetchFromUrl(BlobRepository.java:219) ~[java/:?]
   [junit4]   2> at org.apache.solr.core.RuntimeLib.init(RuntimeLib.java:108) ~[java/:?]
   [junit4]   2> at org.apache.solr.handler.admin.CollectionHandlerApi.addUpdatePackage(CollectionHandlerApi.java:227) ~[java/:?]
   [junit4]   2> at org.apache.solr.handler.admin.CollectionHandlerApi.lambda$wrap$0(CollectionHandlerApi.java:116) ~[java/:?]
   [junit4]   2> at org.apache.solr.handler.admin.CollectionHandlerApi$2.invoke(CollectionHandlerApi.java:314) ~[java/:?]
   [junit4]   2> at org.apache.solr.handler.admin.BaseHandlerApiSupport$1.call(BaseHandlerApiSupport.java:100) ~[java/:?]
   [junit4]   2> at org.apache.solr.api.V2HttpCall.handleAdmin(V2HttpCall.java:341) ~[java/:?]
   [junit4]   2> at org.apache.solr.servlet.HttpSolrCall.handleAdminRequest(HttpSolrCall.java:786) ~[java/:?]
   [junit4]   2> at org.apache.solr.servlet.HttpSolrCall.call(HttpSolrCall.java:546) ~[java/:?]
   [junit4]   2> at org.apache.solr.servlet.SolrDispatchFilter.doFilter(SolrDispatchFilter.java:423) ~[java/:?]
   [junit4]   2> at org.apache.solr.servlet.SolrDispatchFilter.doFilter(SolrDispatchFilter.java:350) ~[java/:?]
   [junit4]   2> at org.eclipse.jetty.servlet.ServletHandler$CachedChain.doFilter(ServletHandler.java:1610) ~[jetty-servlet-9.4.19.v20190610.jar:9.4.19.v20190610]
   [junit4]   2> at org.apache.solr.client.solrj.embedded.JettySolrRunner$DebugFilter.doFilter(JettySolrRunner.java:165) ~[java/:?]
   [junit4]   2> at org.eclipse.jetty.servlet.ServletHandler$CachedChain.doFilter(ServletHandler.java:1610) ~[jetty-servlet-9.4.19.v20190610.jar:9.4.19.v20190610]
   [junit4]   2> at org.eclipse.jetty.servlet.ServletHandler.doHandle(ServletHandler.java:540) ~[jetty-servlet-9.4.19.v20190610.jar:9.4.19.v20190610]
   [junit4]   2> at org.eclipse.jetty.server.handler.ScopedHandler.nextHandle(ScopedHandler.java:255) ~[jetty-server-9.4.19.v20190610.jar:9.4.19.v20190610]
   [junit4]   2> at org.eclipse.jetty.server.session.SessionHandler.doHandle(SessionHandler.java:1711) ~[jetty-server-9.4.19.v20190610.jar:9.4.19.v20190610]
   [junit4]   2> at org.eclipse.jetty.server.handler.ScopedHandler.nextHandle(ScopedHandler.java:255) ~[jetty-server-9.4.19.v20190610.jar:9.4.19.v20190610]
   [junit4]   2> at org.eclipse.jetty.server.handler.ContextHandler.doHandle(ContextHandler.java:1347) ~[jetty-server-9.4.19.v20190610.jar:9.4.19.v20190610]
   [junit4]   2> at org.eclipse.jetty.server.handler.ScopedHandler.nextScope(ScopedHandler.java:203) ~[jetty-server-9.4.19.v20190610.jar:9.4.19.v20190610]
   [junit4]   2> at org.eclipse.jetty.servlet.ServletHandler.doScope(ServletHandler.java:480) ~[jetty-servlet-9.4.19.v20190610.jar:9.4.19.v20190610]
   [junit4]   2> at org.eclipse.jetty.server.session.SessionHandler.doScope(SessionHandler.java:1678) ~[jetty-server-9.4.19.v20190610.jar:9.4.19.v20190610]
   [junit4]   2> at org.eclipse.jetty.server.handler.ScopedHandler.nextScope(ScopedHandler.java:201) ~[jetty-server-9.4.19.v20190610.jar:9.4.19.v20190610]
   [junit4]   2> at org.eclipse.jetty.server.handler.ContextHandler.doScope(ContextHandler.java:1249) ~[jetty-server-9.4.19.v20190610.jar:9.4.19.v20190610]
   [junit4]   2> at org.eclipse.jetty.server.handler.ScopedHandler.handle(ScopedHandler.java:144) ~[jetty-server-9.4.19.v20190610.jar:9.4.19.v20190610]
   [junit4]   2> at org.eclipse.jetty.server.handler.gzip.GzipHandler.handle(GzipHandler.java:703) ~[jetty-server-9.4.19.v20190610.jar:9.4.19.v20190610]
   [junit4]   2> at org.eclipse.jetty.server.handler.HandlerWrapper.handle(HandlerWrapper.java:132) ~[jetty-server-9.4.19.v20190610.jar:9.4.19.v20190610]
   [junit4]   2> at org.eclipse.jetty.server.Server.handle(Server.java:505) ~[jetty-server-9.4.19.v20190610.jar:9.4.19.v20190610]
   [junit4]   2> at org.eclipse.jetty.server.HttpChannel.handle(HttpChannel.java:370) ~[jetty-server-9.4.19.v20190610.jar:9.4.19.v20190610]
   [junit4]   2> at org.eclipse.jetty.server.HttpConnection.onFillable(HttpConnection.java:267) ~[jetty-server-9.4.19.v20190610.jar:9.4.19.v20190610]
   [junit4]   2> at org.eclipse.jetty.io.AbstractConnection$ReadCallback.succeeded(AbstractConnection.java:305) ~[jetty-io-9.4.19.v20190610.jar:9.4.19.v20190610]
   [junit4]   2> at org.eclipse.jetty.io.FillInterest.fillable(FillInterest.java:103) ~[jetty-io-9.4.19.v20190610.jar:9.4.19.v20190610]
   [junit4]   2> at org.eclipse.jetty.io.ChannelEndPoint$2.run(ChannelEndPoint.java:117) ~[jetty-io-9.4.19.v20190610.jar:9.4.19.v20190610]
   [junit4]   2> at org.eclipse.jetty.util.thread.QueuedThreadPool.runJob(QueuedThreadPool.java:781) ~[jetty-util-9.4.19.v20190610.jar:9.4.19.v20190610]
   [junit4]   2> at org.eclipse.jetty.util.thread.QueuedThreadPool$Runner.run(QueuedThreadPool.java:917) ~[jetty-util-9.4.19.v20190610.jar:9.4.19.v20190610]
   [junit4]   2> at java.lang.Thread.run(Thread.java:748) [?:1.8.0_191]
   [junit4]   2> 2466665 ERROR (qtp1892218204-42304) [n:127.0.0.1:32785_solr     ] o.a.s.h.a.CollectionHandlerApi Error in running command {
   [junit4]   2>   "add-package":{
   [junit4]   2>     "name":"foo",
   [junit4]   2>     "url":"http://localhost:40347/jar0.jar",
   [junit4]   2>     "sha512":"d01b51de67ae1680a84a813983b1de3b592fc32f1a22b662fc9057da5953abd1b72476388ba342cad21671cd0b805503c78ab9075ff2f3951fdf75fa16981420"},
   [junit4]   2>   "errors":["no such resource available: foo, url : http://localhost:40347/jar0.jar"]} , current clusterprops.json : {}
   [junit4]   2> 2466666 INFO  (qtp1892218204-42304) [n:127.0.0.1:32785_solr     ] o.a.s.s.HttpSolrCall [admin] webapp=null path=/cluster params={wt=javabin&version=2} status=400 QTime=5
   [junit4]   2> 2466681 INFO  (qtp1401341877-42309) [n:127.0.0.1:46333_solr     ] o.a.s.c.CloudUtil Error fetching key names
   [junit4]   2> 2466685 DEBUG (zkCallback-15636-thread-1) [     ] o.a.s.c.c.ZkStateReader Loaded cluster properties: {package={global={name=global, url=http://localhost:40347/jar1.jar, sha512=d01b51de67ae1680a84a813983b1de3b592fc32f1a22b662fc9057da5953abd1b72476388ba342cad21671cd0b805503c78ab9075ff2f3951fdf75fa16981420}}} to version 0
   [junit4]   2> 2466685 INFO  (zkCallback-15636-thread-1) [     ] o.a.s.c.PackageManager clusterprops.json changed , version 0
   [junit4]   2> 2466685 DEBUG (zkCallback-15640-thread-1) [     ] o.a.s.c.c.ZkStateReader Loaded cluster properties: {package={global={name=global, url=http://localhost:40347/jar1.jar, sha512=d01b51de67ae1680a84a813983b1de3b592fc32f1a22b662fc9057da5953abd1b72476388ba342cad21671cd0b805503c78ab9075ff2f3951fdf75fa16981420}}} to version 0
   [junit4]   2> 2466685 DEBUG (zkCallback-15647-thread-1) [     ] o.a.s.c.c.ZkStateReader Loaded cluster properties: {package={global={name=global, url=http://localhost:40347/jar1.jar, sha512=d01b51de67ae1680a84a813983b1de3b592fc32f1a22b662fc9057da5953abd1b72476388ba342cad21671cd0b805503c78ab9075ff2f3951fdf75fa16981420}}} to version 0
   [junit4]   2> 2466685 INFO  (zkCallback-15640-thread-1) [     ] o.a.s.c.PackageManager clusterprops.json changed , version 0
   [junit4]   2> 2466685 DEBUG (zkCallback-15668-thread-1) [     ] o.a.s.c.c.ZkStateReader Loaded cluster properties: {package={global={name=global, url=http://localhost:40347/jar1.jar, sha512=d01b51de67ae1680a84a813983b1de3b592fc32f1a22b662fc9057da5953abd1b72476388ba342cad21671cd0b805503c78ab9075ff2f3951fdf75fa16981420}}} to version 0
   [junit4]   2> 2466685 INFO  (zkCallback-15668-thread-1) [     ] o.a.s.c.PackageManager clusterprops.json changed , version 0
   [junit4]   2> 2466686 DEBUG (zkCallback-15658-thread-1) [     ] o.a.s.c.c.ZkStateReader Loaded cluster properties: {package={global={name=global, url=http://localhost:40347/jar1.jar, sha512=d01b51de67ae1680a84a813983b1de3b592fc32f1a22b662fc9057da5953abd1b72476388ba342cad21671cd0b805503c78ab9075ff2f3951fdf75fa16981420}}} to version 0
   [junit4]   2> 2466686 INFO  (qtp1401341877-42309) [n:127.0.0.1:46333_solr     ] o.a.s.c.PackageManager clusterprops.json changed , version 0
   [junit4]   2> 2466687 DEBUG (zkCallback-15691-thread-1) [     ] o.a.s.c.c.ZkStateReader Loaded cluster properties: {package={global={name=global, url=http://localhost:40347/jar1.jar, sha512=d01b51de67ae1680a84a813983b1de3b592fc32f1a22b662fc9057da5953abd1b72476388ba342cad21671cd0b805503c78ab9075ff2f3951fdf75fa16981420}}} to version 0
   [junit4]   2> 2466697 INFO  (zkCallback-15636-thread-1) [     ] o.a.s.c.CloudUtil Error fetching key names
   [junit4]   2> 2466699 INFO  (qtp1401341877-42309) [n:127.0.0.1:46333_solr     ] o.a.s.c.CloudUtil Error fetching key names
   [junit4]   2> 2466703 DEBUG (zkCallback-15678-thread-1) [     ] o.a.s.c.c.ZkStateReader Loaded cluster properties: {package={global={name=global, url=http://localhost:40347/jar1.jar, sha512=d01b51de67ae1680a84a813983b1de3b592fc32f1a22b662fc9057da5953abd1b72476388ba342cad21671cd0b805503c78ab9075ff2f3951fdf75fa16981420}}} to version 0
   [junit4]   2> 2466703 INFO  (zkCallback-15678-thread-1) [     ] o.a.s.c.PackageManager clusterprops.json changed , version 0
   [junit4]   2> 2466704 DEBUG (zkCallback-15675-thread-1) [     ] o.a.s.c.c.ZkStateReader Loaded cluster properties: {package={global={name=global, url=http://localhost:40347/jar1.jar, sha512=d01b51de67ae1680a84a813983b1de3b592fc32f1a22b662fc9057da5953abd1b72476388ba342cad21671cd0b805503c78ab9075ff2f3951fdf75fa16981420}}} to version 0
   [junit4]   2> 2466705 INFO  (zkCallback-15640-thread-1) [     ] o.a.s.c.CloudUtil Error fetching key names
   [junit4]   2> 2466710 INFO  (zkCallback-15668-thread-1) [     ] o.a.s.c.CloudUtil Error fetching key names
   [junit4]   2> 2466712 INFO  (zkCallback-15640-thread-1) [     ] o.a.s.c.PackageManager Libraries changed. New memclassloader created with jars [http://localhost:40347/jar1.jar]
   [junit4]   2> 2466712 INFO  (zkCallback-15668-thread-1) [     ] o.a.s.c.PackageManager Libraries changed. New memclassloader created with jars [http://localhost:40347/jar1.jar]
   [junit4]   2> 2466712 INFO  (zkCallback-15636-thread-1) [     ] o.a.s.c.PackageManager Libraries changed. New memclassloader created with jars [http://localhost:40347/jar1.jar]
   [junit4]   2> 2466712 INFO  (qtp1401341877-42309) [n:127.0.0.1:46333_solr     ] o.a.s.c.PackageManager Libraries changed. New memclassloader created with jars [http://localhost:40347/jar1.jar]
   [junit4]   2> 2466713 INFO  (qtp1401341877-42309) [n:127.0.0.1:46333_solr     ] o.a.s.h.a.CollectionHandlerApi current version of clusterprops.json is 0 , trying to get every node to update
   [junit4]   2> 2466713 DEBUG (qtp1401341877-42309) [n:127.0.0.1:46333_solr     ] o.a.s.h.a.CollectionHandlerApi The current clusterprops.json:  {package={global={name=global, url=http://localhost:40347/jar1.jar, sha512=d01b51de67ae1680a84a813983b1de3b592fc32f1a22b662fc9057da5953abd1b72476388ba342cad21671cd0b805503c78ab9075ff2f3951fdf75fa16981420}}}
   [junit4]   2> 2466718 INFO  (zkCallback-15678-thread-1) [     ] o.a.s.c.CloudUtil Error fetching key names
   [junit4]   2> 2466720 DEBUG (zkCallback-15685-thread-1) [     ] o.a.s.c.c.ZkStateReader Loaded cluster properties: {package={global={name=global, url=http://localhost:40347/jar1.jar, sha512=d01b51de67ae1680a84a813983b1de3b592fc32f1a22b662fc9057da5953abd1b72476388ba342cad21671cd0b805503c78ab9075ff2f3951fdf75fa16981420}}} to version 0
   [junit4]   2> 2466720 INFO  (zkCallback-15678-thread-1) [     ] o.a.s.c.PackageManager Libraries changed. New memclassloader created with jars [http://localhost:40347/jar1.jar]
   [junit4]   2> 2466721 INFO  (qtp1401341877-42309) [n:127.0.0.1:46333_solr     ] o.a.s.h.a.CollectionHandlerApi Waiting up to 30 secs for 4 nodes to update clusterprops to be of version 0
   [junit4]   2> 2466752 INFO  (solrHandlerExecutor-12014-thread-1-processing-n:127.0.0.1:46333_solr) [n:127.0.0.1:46333_solr     ] o.a.s.h.SolrConfigHandler Time elapsed : 0 secs, maxWait 30
   [junit4]   2> 2466752 INFO  (solrHandlerExecutor-12014-thread-2-processing-n:127.0.0.1:46333_solr) [n:127.0.0.1:46333_solr     ] o.a.s.h.SolrConfigHandler Time elapsed : 0 secs, maxWait 30
   [junit4]   2> 2466755 INFO  (solrHandlerExecutor-12014-thread-3-processing-n:127.0.0.1:46333_solr) [n:127.0.0.1:46333_solr     ] o.a.s.h.SolrConfigHandler Time elapsed : 0 secs, maxWait 30
   [junit4]   2> 2466755 INFO  (solrHandlerExecutor-12014-thread-4-processing-n:127.0.0.1:46333_solr) [n:127.0.0.1:46333_solr     ] o.a.s.h.SolrConfigHandler Time elapsed : 0 secs, maxWait 30
   [junit4]   2> 2466855 DEBUG (qtp1892218204-42307) [n:127.0.0.1:32785_solr     ] o.a.s.c.PackageManager expected version : 0 , my version 0
   [junit4]   2> 2466855 DEBUG (qtp1892218204-42307) [n:127.0.0.1:32785_solr     ] o.a.s.c.c.ZkStateReader Expected version of clusterprops.json is 0 , my version is 0
   [junit4]   2> 2466857 INFO  (qtp1892218204-42307) [n:127.0.0.1:32785_solr     ] o.a.s.s.HttpSolrCall [admin] webapp=null path=/node/ext params={znodeVersion=0&wt=javabin&version=2} status=0 QTime=1
   [junit4]   2> 2466860 DEBUG (qtp200000043-42299) [n:127.0.0.1:33955_solr     ] o.a.s.c.PackageManager expected version : 0 , my version 0
   [junit4]   2> 2466860 DEBUG (qtp1401341877-42311) [n:127.0.0.1:46333_solr     ] o.a.s.c.PackageManager expected version : 0 , my version 0
   [junit4]   2> 2466860 DEBUG (qtp200000043-42299) [n:127.0.0.1:33955_solr     ] o.a.s.c.c.ZkStateReader Expected version of clusterprops.json is 0 , my version is 0
   [junit4]   2> 2466860 INFO  (qtp200000043-42299) [n:127.0.0.1:33955_solr     ] o.a.s.s.HttpSolrCall [admin] webapp=null path=/node/ext params={znodeVersion=0&wt=javabin&version=2} status=0 QTime=0
   [junit4]   2> 2466860 DEBUG (qtp1401341877-42311) [n:127.0.0.1:46333_solr     ] o.a.s.c.c.ZkStateReader Expected version of clusterprops.json is 0 , my version is 0
   [junit4]   2> 2466860 INFO  (qtp1401341877-42311) [n:127.0.0.1:46333_solr     ] o.a.s.s.HttpSolrCall [admin] webapp=null path=/node/ext params={znodeVersion=0&wt=javabin&version=2} status=0 QTime=0
   [junit4]   2> 2466860 DEBUG (qtp1152132616-42319) [n:127.0.0.1:37705_solr     ] o.a.s.c.PackageManager expected version : 0 , my version 0
   [junit4]   2> 2466860 DEBUG (qtp1152132616-42319) [n:127.0.0.1:37705_solr     ] o.a.s.c.c.ZkStateReader Expected version of clusterprops.json is 0 , my version is 0
   [junit4]   2> 2466860 INFO  (qtp1152132616-42319) [n:127.0.0.1:37705_solr     ] o.a.s.s.HttpSolrCall [admin] webapp=null path=/node/ext params={znodeVersion=0&wt=javabin&version=2} status=0 QTime=0
   [junit4]   2> 2466863 INFO  (qtp1401341877-42309) [n:127.0.0.1:46333_solr     ] o.a.s.h.a.CollectionHandlerApi Took 149.0ms to update the clusterprops to be of version 0  on 4 nodes
   [junit4]   2> 2466863 INFO  (qtp1401341877-42309) [n:127.0.0.1:46333_solr     ] o.a.s.s.HttpSolrCall [admin] webapp=null path=/cluster params={wt=javabin&version=2} status=0 QTime=190
   [junit4]   2> 2466876 DEBUG (zkCallback-15678-thread-1) [     ] o.a.s.c.c.ZkStateReader Loaded cluster properties: {package={global={name=global, url=http://localhost:40347/jar1.jar, sha512=d01b51de67ae1680a84a813983b1de3b592fc32f1a22b662fc9057da5953abd1b72476388ba342cad21671cd0b805503c78ab9075ff2f3951fdf75fa16981420}}, requestHandler={bar={name=bar, class=org.apache.solr.core.RuntimeLibReqHandler, package=global}}} to version 1
   [junit4]   2> 2466876 INFO  (zkCallback-15678-thread-1) [     ] o.a.s.c.PackageManager clusterprops.json changed , version 1
   [junit4]   2> 2466876 DEBUG (zkCallback-15647-thread-1) [     ] o.a.s.c.c.ZkStateReader Loaded cluster properties: {package={global={name=global, url=http://localhost:40347/jar1.jar, sha512=d01b51de67ae1680a84a813983b1de3b592fc32f1a22b662fc9057da5953abd1b72476388ba342cad21671cd0b805503c78ab9075ff2f3951fdf75fa16981420}}, requestHandler={bar={name=bar, class=org.apache.solr.core.RuntimeLibReqHandler, package=global}}} to version 1
   [junit4]   2> 2466876 DEBUG (zkCallback-15675-thread-1) [     ] o.a.s.c.c.ZkStateReader Loaded cluster properties: {package={global={name=global, url=http://localhost:40347/jar1.jar, sha512=d01b51de67ae1680a84a813983b1de3b592fc32f1a22b662fc9057da5953abd1b72476388ba342cad21671cd0b805503c78ab9075ff2f3951fdf75fa16981420}}, requestHandler={bar={name=bar, class=org.apache.solr.core.RuntimeLibReqHandler, package=global}}} to version 1
   [junit4]   2> 2466876 DEBUG (zkCallback-15658-thread-1) [     ] o.a.s.c.c.ZkStateReader Loaded cluster properties: {package={global={name=global, url=http://localhost:40347/jar1.jar, sha512=d01b51de67ae1680a84a813983b1de3b592fc32f1a22b662fc9057da5953abd1b72476388ba342cad21671cd0b805503c78ab9075ff2f3951fdf75fa16981420}}, requestHandler={bar={name=bar, class=org.apache.solr.core.RuntimeLibReqHandler, package

[...truncated too long message...]

oading settings :: file = /home/jenkins/jenkins-slave/workspace/Lucene-Solr-Tests-8.x/lucene/top-level-ivy-settings.xml

resolve:

ivy-availability-check:
[loadresource] Do not set property disallowed.ivy.jars.list as its length is 0.

-ivy-fail-disallowed-ivy-version:

ivy-fail:

ivy-configure:
[ivy:configure] :: loading settings :: file = /home/jenkins/jenkins-slave/workspace/Lucene-Solr-Tests-8.x/lucene/top-level-ivy-settings.xml

resolve:

ivy-availability-check:
[loadresource] Do not set property disallowed.ivy.jars.list as its length is 0.

-ivy-fail-disallowed-ivy-version:

ivy-fail:

ivy-fail:

ivy-configure:
[ivy:configure] :: loading settings :: file = /home/jenkins/jenkins-slave/workspace/Lucene-Solr-Tests-8.x/lucene/top-level-ivy-settings.xml

resolve:

ivy-availability-check:
[loadresource] Do not set property disallowed.ivy.jars.list as its length is 0.

-ivy-fail-disallowed-ivy-version:

ivy-fail:

ivy-configure:
[ivy:configure] :: loading settings :: file = /home/jenkins/jenkins-slave/workspace/Lucene-Solr-Tests-8.x/lucene/top-level-ivy-settings.xml

resolve:

ivy-availability-check:
[loadresource] Do not set property disallowed.ivy.jars.list as its length is 0.

-ivy-fail-disallowed-ivy-version:

ivy-fail:

ivy-fail:

ivy-configure:
[ivy:configure] :: loading settings :: file = /home/jenkins/jenkins-slave/workspace/Lucene-Solr-Tests-8.x/lucene/top-level-ivy-settings.xml

resolve:

ivy-availability-check:
[loadresource] Do not set property disallowed.ivy.jars.list as its length is 0.

-ivy-fail-disallowed-ivy-version:

ivy-fail:

ivy-fail:

ivy-configure:
[ivy:configure] :: loading settings :: file = /home/jenkins/jenkins-slave/workspace/Lucene-Solr-Tests-8.x/lucene/top-level-ivy-settings.xml

resolve:

ivy-availability-check:
[loadresource] Do not set property disallowed.ivy.jars.list as its length is 0.

-ivy-fail-disallowed-ivy-version:

ivy-fail:

ivy-fail:

ivy-configure:
[ivy:configure] :: loading settings :: file = /home/jenkins/jenkins-slave/workspace/Lucene-Solr-Tests-8.x/lucene/top-level-ivy-settings.xml

resolve:

ivy-availability-check:
[loadresource] Do not set property disallowed.ivy.jars.list as its length is 0.

-ivy-fail-disallowed-ivy-version:

ivy-fail:

ivy-fail:

ivy-configure:
[ivy:configure] :: loading settings :: file = /home/jenkins/jenkins-slave/workspace/Lucene-Solr-Tests-8.x/lucene/top-level-ivy-settings.xml

resolve:

ivy-availability-check:
[loadresource] Do not set property disallowed.ivy.jars.list as its length is 0.

-ivy-fail-disallowed-ivy-version:

ivy-fail:

ivy-fail:

ivy-configure:
[ivy:configure] :: loading settings :: file = /home/jenkins/jenkins-slave/workspace/Lucene-Solr-Tests-8.x/lucene/top-level-ivy-settings.xml

resolve:

ivy-availability-check:
[loadresource] Do not set property disallowed.ivy.jars.list as its length is 0.

-ivy-fail-disallowed-ivy-version:

ivy-fail:

ivy-fail:

ivy-configure:
[ivy:configure] :: loading settings :: file = /home/jenkins/jenkins-slave/workspace/Lucene-Solr-Tests-8.x/lucene/top-level-ivy-settings.xml

resolve:

ivy-availability-check:
[loadresource] Do not set property disallowed.ivy.jars.list as its length is 0.

-ivy-fail-disallowed-ivy-version:

ivy-fail:

ivy-fail:

ivy-configure:
[ivy:configure] :: loading settings :: file = /home/jenkins/jenkins-slave/workspace/Lucene-Solr-Tests-8.x/lucene/top-level-ivy-settings.xml

resolve:

ivy-availability-check:
[loadresource] Do not set property disallowed.ivy.jars.list as its length is 0.

-ivy-fail-disallowed-ivy-version:

ivy-fail:

ivy-fail:

ivy-configure:
[ivy:configure] :: loading settings :: file = /home/jenkins/jenkins-slave/workspace/Lucene-Solr-Tests-8.x/lucene/top-level-ivy-settings.xml

resolve:

ivy-availability-check:
[loadresource] Do not set property disallowed.ivy.jars.list as its length is 0.

-ivy-fail-disallowed-ivy-version:

ivy-fail:

ivy-fail:

ivy-configure:
[ivy:configure] :: loading settings :: file = /home/jenkins/jenkins-slave/workspace/Lucene-Solr-Tests-8.x/lucene/top-level-ivy-settings.xml

resolve:

ivy-availability-check:
[loadresource] Do not set property disallowed.ivy.jars.list as its length is 0.

-ivy-fail-disallowed-ivy-version:

ivy-fail:

ivy-fail:

ivy-configure:
[ivy:configure] :: loading settings :: file = /home/jenkins/jenkins-slave/workspace/Lucene-Solr-Tests-8.x/lucene/top-level-ivy-settings.xml

resolve:

ivy-availability-check:
[loadresource] Do not set property disallowed.ivy.jars.list as its length is 0.

-ivy-fail-disallowed-ivy-version:

ivy-fail:

ivy-fail:

ivy-configure:
[ivy:configure] :: loading settings :: file = /home/jenkins/jenkins-slave/workspace/Lucene-Solr-Tests-8.x/lucene/top-level-ivy-settings.xml

resolve:

jar-checksums:
    [mkdir] Created dir: /home/jenkins/jenkins-slave/workspace/Lucene-Solr-Tests-8.x/solr/null554606612
     [copy] Copying 249 files to /home/jenkins/jenkins-slave/workspace/Lucene-Solr-Tests-8.x/solr/null554606612
   [delete] Deleting directory /home/jenkins/jenkins-slave/workspace/Lucene-Solr-Tests-8.x/solr/null554606612

check-working-copy:
[ivy:cachepath] :: resolving dependencies :: #;working@lucene1-us-west
[ivy:cachepath] confs: [default]
[ivy:cachepath] found org.eclipse.jgit#org.eclipse.jgit;5.3.0.201903130848-r in public
[ivy:cachepath] found com.jcraft#jsch;0.1.54 in public
[ivy:cachepath] found com.jcraft#jzlib;1.1.1 in public
[ivy:cachepath] found com.googlecode.javaewah#JavaEWAH;1.1.6 in public
[ivy:cachepath] found org.slf4j#slf4j-api;1.7.2 in public
[ivy:cachepath] found org.bouncycastle#bcpg-jdk15on;1.60 in public
[ivy:cachepath] found org.bouncycastle#bcprov-jdk15on;1.60 in public
[ivy:cachepath] found org.bouncycastle#bcpkix-jdk15on;1.60 in public
[ivy:cachepath] found org.slf4j#slf4j-nop;1.7.2 in public
[ivy:cachepath] :: resolution report :: resolve 115ms :: artifacts dl 57ms
        ---------------------------------------------------------------------
        |                  |            modules            ||   artifacts   |
        |       conf       | number| search|dwnlded|evicted|| number|dwnlded|
        ---------------------------------------------------------------------
        |      default     |   9   |   0   |   0   |   0   ||   9   |   0   |
        ---------------------------------------------------------------------
[wc-checker] Initializing working copy...
[wc-checker] Checking working copy status...

-jenkins-base:

BUILD SUCCESSFUL
Total time: 122 minutes 55 seconds
Archiving artifacts
java.lang.InterruptedException: no matches found within 10000
        at hudson.FilePath$ValidateAntFileMask.hasMatch(FilePath.java:2847)
        at hudson.FilePath$ValidateAntFileMask.invoke(FilePath.java:2726)
        at hudson.FilePath$ValidateAntFileMask.invoke(FilePath.java:2707)
        at hudson.FilePath$FileCallableWrapper.call(FilePath.java:3086)
Also:   hudson.remoting.Channel$CallSiteStackTrace: Remote call to lucene
                at hudson.remoting.Channel.attachCallSiteStackTrace(Channel.java:1741)
                at hudson.remoting.UserRequest$ExceptionResponse.retrieve(UserRequest.java:357)
                at hudson.remoting.Channel.call(Channel.java:955)
                at hudson.FilePath.act(FilePath.java:1072)
                at hudson.FilePath.act(FilePath.java:1061)
                at hudson.FilePath.validateAntFileMask(FilePath.java:2705)
                at hudson.tasks.ArtifactArchiver.perform(ArtifactArchiver.java:243)
                at hudson.tasks.BuildStepCompatibilityLayer.perform(BuildStepCompatibilityLayer.java:81)
                at hudson.tasks.BuildStepMonitor$1.perform(BuildStepMonitor.java:20)
                at hudson.model.AbstractBuild$AbstractBuildExecution.perform(AbstractBuild.java:744)
                at hudson.model.AbstractBuild$AbstractBuildExecution.performAllBuildSteps(AbstractBuild.java:690)
                at hudson.model.Build$BuildExecution.post2(Build.java:186)
                at hudson.model.AbstractBuild$AbstractBuildExecution.post(AbstractBuild.java:635)
                at hudson.model.Run.execute(Run.java:1835)
                at hudson.model.FreeStyleBuild.run(FreeStyleBuild.java:43)
                at hudson.model.ResourceController.execute(ResourceController.java:97)
                at hudson.model.Executor.run(Executor.java:429)
Caused: hudson.FilePath$TunneledInterruptedException
        at hudson.FilePath$FileCallableWrapper.call(FilePath.java:3088)
        at hudson.remoting.UserRequest.perform(UserRequest.java:212)
        at hudson.remoting.UserRequest.perform(UserRequest.java:54)
        at hudson.remoting.Request$2.run(Request.java:369)
        at hudson.remoting.InterceptingExecutorService$1.call(InterceptingExecutorService.java:72)
        at java.util.concurrent.FutureTask.run(FutureTask.java:266)
        at java.util.concurrent.ThreadPoolExecutor.runWorker(ThreadPoolExecutor.java:1142)
        at java.util.concurrent.ThreadPoolExecutor$Worker.run(ThreadPoolExecutor.java:617)
        at java.lang.Thread.run(Thread.java:744)
Caused: java.lang.InterruptedException: java.lang.InterruptedException: no matches found within 10000
        at hudson.FilePath.act(FilePath.java:1074)
        at hudson.FilePath.act(FilePath.java:1061)
        at hudson.FilePath.validateAntFileMask(FilePath.java:2705)
        at hudson.tasks.ArtifactArchiver.perform(ArtifactArchiver.java:243)
        at hudson.tasks.BuildStepCompatibilityLayer.perform(BuildStepCompatibilityLayer.java:81)
        at hudson.tasks.BuildStepMonitor$1.perform(BuildStepMonitor.java:20)
        at hudson.model.AbstractBuild$AbstractBuildExecution.perform(AbstractBuild.java:744)
        at hudson.model.AbstractBuild$AbstractBuildExecution.performAllBuildSteps(AbstractBuild.java:690)
        at hudson.model.Build$BuildExecution.post2(Build.java:186)
        at hudson.model.AbstractBuild$AbstractBuildExecution.post(AbstractBuild.java:635)
        at hudson.model.Run.execute(Run.java:1835)
        at hudson.model.FreeStyleBuild.run(FreeStyleBuild.java:43)
        at hudson.model.ResourceController.execute(ResourceController.java:97)
        at hudson.model.Executor.run(Executor.java:429)
No artifacts found that match the file pattern "**/*.events,heapdumps/**,**/hs_err_pid*". Configuration error?
Recording test results
Build step 'Publish JUnit test result report' changed build result to UNSTABLE
Email was triggered for: Unstable (Test Failures)
Sending email for trigger: Unstable (Test Failures)


---------------------------------------------------------------------
To unsubscribe, e-mail: [hidden email]
For additional commands, e-mail: [hidden email]
Reply | Threaded
Open this post in threaded view
|

[JENKINS] Lucene-Solr-Tests-8.x - Build # 480 - Still Unstable

Apache Jenkins Server-2
Build: https://builds.apache.org/job/Lucene-Solr-Tests-8.x/480/

1 tests failed.
FAILED:  org.apache.solr.cloud.RollingRestartTest.test

Error Message:
No overseer designate as leader found after restart #1: 127.0.0.1:46325_

Stack Trace:
java.lang.AssertionError: No overseer designate as leader found after restart #1: 127.0.0.1:46325_
        at __randomizedtesting.SeedInfo.seed([F616D8058F8E697B:7E42E7DF21720483]:0)
        at org.junit.Assert.fail(Assert.java:88)
        at org.apache.solr.cloud.RollingRestartTest.restartWithRolesTest(RollingRestartTest.java:101)
        at org.apache.solr.cloud.RollingRestartTest.test(RollingRestartTest.java:53)
        at sun.reflect.NativeMethodAccessorImpl.invoke0(Native Method)
        at sun.reflect.NativeMethodAccessorImpl.invoke(NativeMethodAccessorImpl.java:62)
        at sun.reflect.DelegatingMethodAccessorImpl.invoke(DelegatingMethodAccessorImpl.java:43)
        at java.lang.reflect.Method.invoke(Method.java:498)
        at com.carrotsearch.randomizedtesting.RandomizedRunner.invoke(RandomizedRunner.java:1750)
        at com.carrotsearch.randomizedtesting.RandomizedRunner$8.evaluate(RandomizedRunner.java:938)
        at com.carrotsearch.randomizedtesting.RandomizedRunner$9.evaluate(RandomizedRunner.java:974)
        at com.carrotsearch.randomizedtesting.RandomizedRunner$10.evaluate(RandomizedRunner.java:988)
        at org.apache.solr.BaseDistributedSearchTestCase$ShardsRepeatRule$ShardsFixedStatement.callStatement(BaseDistributedSearchTestCase.java:1082)
        at org.apache.solr.BaseDistributedSearchTestCase$ShardsRepeatRule$ShardsStatement.evaluate(BaseDistributedSearchTestCase.java:1054)
        at com.carrotsearch.randomizedtesting.rules.SystemPropertiesRestoreRule$1.evaluate(SystemPropertiesRestoreRule.java:57)
        at org.apache.lucene.util.TestRuleSetupTeardownChained$1.evaluate(TestRuleSetupTeardownChained.java:49)
        at org.apache.lucene.util.AbstractBeforeAfterRule$1.evaluate(AbstractBeforeAfterRule.java:45)
        at org.apache.lucene.util.TestRuleThreadAndTestName$1.evaluate(TestRuleThreadAndTestName.java:48)
        at org.apache.lucene.util.TestRuleIgnoreAfterMaxFailures$1.evaluate(TestRuleIgnoreAfterMaxFailures.java:64)
        at org.apache.lucene.util.TestRuleMarkFailure$1.evaluate(TestRuleMarkFailure.java:47)
        at com.carrotsearch.randomizedtesting.rules.StatementAdapter.evaluate(StatementAdapter.java:36)
        at com.carrotsearch.randomizedtesting.ThreadLeakControl$StatementRunner.run(ThreadLeakControl.java:368)
        at com.carrotsearch.randomizedtesting.ThreadLeakControl.forkTimeoutingTask(ThreadLeakControl.java:817)
        at com.carrotsearch.randomizedtesting.ThreadLeakControl$3.evaluate(ThreadLeakControl.java:468)
        at com.carrotsearch.randomizedtesting.RandomizedRunner.runSingleTest(RandomizedRunner.java:947)
        at com.carrotsearch.randomizedtesting.RandomizedRunner$5.evaluate(RandomizedRunner.java:832)
        at com.carrotsearch.randomizedtesting.RandomizedRunner$6.evaluate(RandomizedRunner.java:883)
        at com.carrotsearch.randomizedtesting.RandomizedRunner$7.evaluate(RandomizedRunner.java:894)
        at com.carrotsearch.randomizedtesting.rules.StatementAdapter.evaluate(StatementAdapter.java:36)
        at com.carrotsearch.randomizedtesting.rules.SystemPropertiesRestoreRule$1.evaluate(SystemPropertiesRestoreRule.java:57)
        at org.apache.lucene.util.AbstractBeforeAfterRule$1.evaluate(AbstractBeforeAfterRule.java:45)
        at com.carrotsearch.randomizedtesting.rules.StatementAdapter.evaluate(StatementAdapter.java:36)
        at org.apache.lucene.util.TestRuleStoreClassName$1.evaluate(TestRuleStoreClassName.java:41)
        at com.carrotsearch.randomizedtesting.rules.NoShadowingOrOverridesOnMethodsRule$1.evaluate(NoShadowingOrOverridesOnMethodsRule.java:40)
        at com.carrotsearch.randomizedtesting.rules.NoShadowingOrOverridesOnMethodsRule$1.evaluate(NoShadowingOrOverridesOnMethodsRule.java:40)
        at com.carrotsearch.randomizedtesting.rules.StatementAdapter.evaluate(StatementAdapter.java:36)
        at com.carrotsearch.randomizedtesting.rules.StatementAdapter.evaluate(StatementAdapter.java:36)
        at com.carrotsearch.randomizedtesting.rules.StatementAdapter.evaluate(StatementAdapter.java:36)
        at org.apache.lucene.util.TestRuleAssertionsRequired$1.evaluate(TestRuleAssertionsRequired.java:53)
        at org.apache.lucene.util.TestRuleMarkFailure$1.evaluate(TestRuleMarkFailure.java:47)
        at org.apache.lucene.util.TestRuleIgnoreAfterMaxFailures$1.evaluate(TestRuleIgnoreAfterMaxFailures.java:64)
        at org.apache.lucene.util.TestRuleIgnoreTestSuites$1.evaluate(TestRuleIgnoreTestSuites.java:54)
        at com.carrotsearch.randomizedtesting.rules.StatementAdapter.evaluate(StatementAdapter.java:36)
        at com.carrotsearch.randomizedtesting.ThreadLeakControl$StatementRunner.run(ThreadLeakControl.java:368)
        at java.lang.Thread.run(Thread.java:748)




Build Log:
[...truncated 14750 lines...]
   [junit4] Suite: org.apache.solr.cloud.RollingRestartTest
   [junit4]   2> 1427893 INFO  (SUITE-RollingRestartTest-seed#[F616D8058F8E697B]-worker) [     ] o.a.s.SolrTestCaseJ4 SecureRandom sanity checks: test.solr.allowed.securerandom=null & java.security.egd=file:/dev/./urandom
   [junit4]   2> 1427896 INFO  (SUITE-RollingRestartTest-seed#[F616D8058F8E697B]-worker) [     ] o.a.s.SolrTestCaseJ4 Created dataDir: /home/jenkins/jenkins-slave/workspace/Lucene-Solr-Tests-8.x/solr/build/solr-core/test/J1/temp/solr.cloud.RollingRestartTest_F616D8058F8E697B-001/data-dir-124-001
   [junit4]   2> 1427896 INFO  (SUITE-RollingRestartTest-seed#[F616D8058F8E697B]-worker) [     ] o.a.s.SolrTestCaseJ4 Using PointFields (NUMERIC_POINTS_SYSPROP=true) w/NUMERIC_DOCVALUES_SYSPROP=true
   [junit4]   2> 1427898 INFO  (SUITE-RollingRestartTest-seed#[F616D8058F8E697B]-worker) [     ] o.a.s.SolrTestCaseJ4 Randomized ssl (true) and clientAuth (true) via: @org.apache.solr.util.RandomizeSSL(reason=, ssl=NaN, value=NaN, clientAuth=NaN)
   [junit4]   2> 1427899 INFO  (SUITE-RollingRestartTest-seed#[F616D8058F8E697B]-worker) [     ] o.a.s.BaseDistributedSearchTestCase Setting hostContext system property: /
   [junit4]   2> 1427907 INFO  (TEST-RollingRestartTest.test-seed#[F616D8058F8E697B]) [     ] o.a.s.c.ZkTestServer STARTING ZK TEST SERVER
   [junit4]   2> 1427910 INFO  (ZkTestServer Run Thread) [     ] o.a.s.c.ZkTestServer client port:0.0.0.0/0.0.0.0:0
   [junit4]   2> 1427910 INFO  (ZkTestServer Run Thread) [     ] o.a.s.c.ZkTestServer Starting server
   [junit4]   2> 1428010 INFO  (TEST-RollingRestartTest.test-seed#[F616D8058F8E697B]) [     ] o.a.s.c.ZkTestServer start zk server on port:44385
   [junit4]   2> 1428010 INFO  (TEST-RollingRestartTest.test-seed#[F616D8058F8E697B]) [     ] o.a.s.c.ZkTestServer waitForServerUp: 127.0.0.1:44385
   [junit4]   2> 1428010 INFO  (TEST-RollingRestartTest.test-seed#[F616D8058F8E697B]) [     ] o.a.s.c.ZkTestServer parse host and port list: 127.0.0.1:44385
   [junit4]   2> 1428010 INFO  (TEST-RollingRestartTest.test-seed#[F616D8058F8E697B]) [     ] o.a.s.c.ZkTestServer connecting to 127.0.0.1 44385
   [junit4]   2> 1428014 INFO  (TEST-RollingRestartTest.test-seed#[F616D8058F8E697B]) [     ] o.a.s.c.c.ConnectionManager Waiting for client to connect to ZooKeeper
   [junit4]   2> 1428019 INFO  (zkConnectionManagerCallback-7732-thread-1) [     ] o.a.s.c.c.ConnectionManager zkClient has connected
   [junit4]   2> 1428019 INFO  (TEST-RollingRestartTest.test-seed#[F616D8058F8E697B]) [     ] o.a.s.c.c.ConnectionManager Client is connected to ZooKeeper
   [junit4]   2> 1428039 INFO  (TEST-RollingRestartTest.test-seed#[F616D8058F8E697B]) [     ] o.a.s.c.c.ConnectionManager Waiting for client to connect to ZooKeeper
   [junit4]   2> 1428040 INFO  (zkConnectionManagerCallback-7734-thread-1) [     ] o.a.s.c.c.ConnectionManager zkClient has connected
   [junit4]   2> 1428040 INFO  (TEST-RollingRestartTest.test-seed#[F616D8058F8E697B]) [     ] o.a.s.c.c.ConnectionManager Client is connected to ZooKeeper
   [junit4]   2> 1428042 INFO  (TEST-RollingRestartTest.test-seed#[F616D8058F8E697B]) [     ] o.a.s.c.ZkTestServer put /home/jenkins/jenkins-slave/workspace/Lucene-Solr-Tests-8.x/solr/core/src/test-files/solr/collection1/conf/solrconfig-tlog.xml to /configs/conf1/solrconfig.xml
   [junit4]   2> 1428048 INFO  (TEST-RollingRestartTest.test-seed#[F616D8058F8E697B]) [     ] o.a.s.c.ZkTestServer put /home/jenkins/jenkins-slave/workspace/Lucene-Solr-Tests-8.x/solr/core/src/test-files/solr/collection1/conf/schema.xml to /configs/conf1/schema.xml
   [junit4]   2> 1428052 INFO  (TEST-RollingRestartTest.test-seed#[F616D8058F8E697B]) [     ] o.a.s.c.ZkTestServer put /home/jenkins/jenkins-slave/workspace/Lucene-Solr-Tests-8.x/solr/core/src/test-files/solr/collection1/conf/solrconfig.snippet.randomindexconfig.xml to /configs/conf1/solrconfig.snippet.randomindexconfig.xml
   [junit4]   2> 1428053 INFO  (TEST-RollingRestartTest.test-seed#[F616D8058F8E697B]) [     ] o.a.s.c.ZkTestServer put /home/jenkins/jenkins-slave/workspace/Lucene-Solr-Tests-8.x/solr/core/src/test-files/solr/collection1/conf/stopwords.txt to /configs/conf1/stopwords.txt
   [junit4]   2> 1428055 INFO  (TEST-RollingRestartTest.test-seed#[F616D8058F8E697B]) [     ] o.a.s.c.ZkTestServer put /home/jenkins/jenkins-slave/workspace/Lucene-Solr-Tests-8.x/solr/core/src/test-files/solr/collection1/conf/protwords.txt to /configs/conf1/protwords.txt
   [junit4]   2> 1428056 INFO  (TEST-RollingRestartTest.test-seed#[F616D8058F8E697B]) [     ] o.a.s.c.ZkTestServer put /home/jenkins/jenkins-slave/workspace/Lucene-Solr-Tests-8.x/solr/core/src/test-files/solr/collection1/conf/currency.xml to /configs/conf1/currency.xml
   [junit4]   2> 1428058 INFO  (TEST-RollingRestartTest.test-seed#[F616D8058F8E697B]) [     ] o.a.s.c.ZkTestServer put /home/jenkins/jenkins-slave/workspace/Lucene-Solr-Tests-8.x/solr/core/src/test-files/solr/collection1/conf/enumsConfig.xml to /configs/conf1/enumsConfig.xml
   [junit4]   2> 1428059 INFO  (TEST-RollingRestartTest.test-seed#[F616D8058F8E697B]) [     ] o.a.s.c.ZkTestServer put /home/jenkins/jenkins-slave/workspace/Lucene-Solr-Tests-8.x/solr/core/src/test-files/solr/collection1/conf/open-exchange-rates.json to /configs/conf1/open-exchange-rates.json
   [junit4]   2> 1428061 INFO  (TEST-RollingRestartTest.test-seed#[F616D8058F8E697B]) [     ] o.a.s.c.ZkTestServer put /home/jenkins/jenkins-slave/workspace/Lucene-Solr-Tests-8.x/solr/core/src/test-files/solr/collection1/conf/mapping-ISOLatin1Accent.txt to /configs/conf1/mapping-ISOLatin1Accent.txt
   [junit4]   2> 1428062 INFO  (TEST-RollingRestartTest.test-seed#[F616D8058F8E697B]) [     ] o.a.s.c.ZkTestServer put /home/jenkins/jenkins-slave/workspace/Lucene-Solr-Tests-8.x/solr/core/src/test-files/solr/collection1/conf/old_synonyms.txt to /configs/conf1/old_synonyms.txt
   [junit4]   2> 1428064 INFO  (TEST-RollingRestartTest.test-seed#[F616D8058F8E697B]) [     ] o.a.s.c.ZkTestServer put /home/jenkins/jenkins-slave/workspace/Lucene-Solr-Tests-8.x/solr/core/src/test-files/solr/collection1/conf/synonyms.txt to /configs/conf1/synonyms.txt
   [junit4]   2> 1428077 INFO  (TEST-RollingRestartTest.test-seed#[F616D8058F8E697B]) [     ] o.a.s.c.c.ConnectionManager Waiting for client to connect to ZooKeeper
   [junit4]   2> 1428086 INFO  (zkConnectionManagerCallback-7738-thread-1) [     ] o.a.s.c.c.ConnectionManager zkClient has connected
   [junit4]   2> 1428087 INFO  (TEST-RollingRestartTest.test-seed#[F616D8058F8E697B]) [     ] o.a.s.c.c.ConnectionManager Client is connected to ZooKeeper
   [junit4]   2> 1428190 INFO  (TEST-RollingRestartTest.test-seed#[F616D8058F8E697B]) [     ] o.a.s.c.AbstractFullDistribZkTestBase Will use NRT replicas unless explicitly asked otherwise
   [junit4]   2> 1428373 WARN  (TEST-RollingRestartTest.test-seed#[F616D8058F8E697B]) [     ] o.e.j.s.AbstractConnector Ignoring deprecated socket close linger time
   [junit4]   2> 1428374 INFO  (TEST-RollingRestartTest.test-seed#[F616D8058F8E697B]) [     ] o.a.s.c.s.e.JettySolrRunner Start Jetty (original configured port=0)
   [junit4]   2> 1428374 INFO  (TEST-RollingRestartTest.test-seed#[F616D8058F8E697B]) [     ] o.a.s.c.s.e.JettySolrRunner Trying to start Jetty on port 0 try number 1 ...
   [junit4]   2> 1428374 INFO  (TEST-RollingRestartTest.test-seed#[F616D8058F8E697B]) [     ] o.e.j.s.Server jetty-9.4.19.v20190610; built: 2019-06-10T16:30:51.723Z; git: afcf563148970e98786327af5e07c261fda175d3; jvm 1.8.0_191-b12
   [junit4]   2> 1428386 INFO  (TEST-RollingRestartTest.test-seed#[F616D8058F8E697B]) [     ] o.e.j.s.session DefaultSessionIdManager workerName=node0
   [junit4]   2> 1428386 INFO  (TEST-RollingRestartTest.test-seed#[F616D8058F8E697B]) [     ] o.e.j.s.session No SessionScavenger set, using defaults
   [junit4]   2> 1428386 INFO  (TEST-RollingRestartTest.test-seed#[F616D8058F8E697B]) [     ] o.e.j.s.session node0 Scavenging every 600000ms
   [junit4]   2> 1428395 INFO  (TEST-RollingRestartTest.test-seed#[F616D8058F8E697B]) [     ] o.e.j.s.h.ContextHandler Started o.e.j.s.ServletContextHandler@7510544d{/,null,AVAILABLE}
   [junit4]   2> 1428397 INFO  (TEST-RollingRestartTest.test-seed#[F616D8058F8E697B]) [     ] o.e.j.s.AbstractConnector Started ServerConnector@17fd512d{SSL,[ssl, http/1.1]}{127.0.0.1:46325}
   [junit4]   2> 1428397 INFO  (TEST-RollingRestartTest.test-seed#[F616D8058F8E697B]) [     ] o.e.j.s.Server Started @1428462ms
   [junit4]   2> 1428397 INFO  (TEST-RollingRestartTest.test-seed#[F616D8058F8E697B]) [     ] o.a.s.c.s.e.JettySolrRunner Jetty properties: {solr.data.dir=/home/jenkins/jenkins-slave/workspace/Lucene-Solr-Tests-8.x/solr/build/solr-core/test/J1/temp/solr.cloud.RollingRestartTest_F616D8058F8E697B-001/tempDir-001/control/data, hostContext=/, hostPort=46325, coreRootDirectory=/home/jenkins/jenkins-slave/workspace/Lucene-Solr-Tests-8.x/solr/build/solr-core/test/J1/temp/solr.cloud.RollingRestartTest_F616D8058F8E697B-001/control-001/cores}
   [junit4]   2> 1428397 ERROR (TEST-RollingRestartTest.test-seed#[F616D8058F8E697B]) [     ] o.a.s.u.StartupLoggingUtils Missing Java Option solr.log.dir. Logging may be missing or incomplete.
   [junit4]   2> 1428397 INFO  (TEST-RollingRestartTest.test-seed#[F616D8058F8E697B]) [     ] o.a.s.s.SolrDispatchFilter Using logger factory org.apache.logging.slf4j.Log4jLoggerFactory
   [junit4]   2> 1428397 INFO  (TEST-RollingRestartTest.test-seed#[F616D8058F8E697B]) [     ] o.a.s.s.SolrDispatchFilter  ___      _       Welcome to Apache Solr™ version 8.3.0
   [junit4]   2> 1428397 INFO  (TEST-RollingRestartTest.test-seed#[F616D8058F8E697B]) [     ] o.a.s.s.SolrDispatchFilter / __| ___| |_ _   Starting in cloud mode on port null
   [junit4]   2> 1428397 INFO  (TEST-RollingRestartTest.test-seed#[F616D8058F8E697B]) [     ] o.a.s.s.SolrDispatchFilter \__ \/ _ \ | '_|  Install dir: null
   [junit4]   2> 1428397 INFO  (TEST-RollingRestartTest.test-seed#[F616D8058F8E697B]) [     ] o.a.s.s.SolrDispatchFilter |___/\___/_|_|    Start time: 2019-08-27T04:25:34.534Z
   [junit4]   2> 1428404 INFO  (TEST-RollingRestartTest.test-seed#[F616D8058F8E697B]) [     ] o.a.s.c.c.ConnectionManager Waiting for client to connect to ZooKeeper
   [junit4]   2> 1428407 INFO  (zkConnectionManagerCallback-7740-thread-1) [     ] o.a.s.c.c.ConnectionManager zkClient has connected
   [junit4]   2> 1428407 INFO  (TEST-RollingRestartTest.test-seed#[F616D8058F8E697B]) [     ] o.a.s.c.c.ConnectionManager Client is connected to ZooKeeper
   [junit4]   2> 1428509 INFO  (TEST-RollingRestartTest.test-seed#[F616D8058F8E697B]) [     ] o.a.s.s.SolrDispatchFilter Loading solr.xml from SolrHome (not found in ZooKeeper)
   [junit4]   2> 1428509 INFO  (TEST-RollingRestartTest.test-seed#[F616D8058F8E697B]) [     ] o.a.s.c.SolrXmlConfig Loading container configuration from /home/jenkins/jenkins-slave/workspace/Lucene-Solr-Tests-8.x/solr/build/solr-core/test/J1/temp/solr.cloud.RollingRestartTest_F616D8058F8E697B-001/control-001/solr.xml
   [junit4]   2> 1428516 INFO  (TEST-RollingRestartTest.test-seed#[F616D8058F8E697B]) [     ] o.a.s.c.SolrXmlConfig Configuration parameter autoReplicaFailoverWorkLoopDelay is ignored
   [junit4]   2> 1428516 INFO  (TEST-RollingRestartTest.test-seed#[F616D8058F8E697B]) [     ] o.a.s.c.SolrXmlConfig Configuration parameter autoReplicaFailoverBadNodeExpiration is ignored
   [junit4]   2> 1428518 INFO  (TEST-RollingRestartTest.test-seed#[F616D8058F8E697B]) [     ] o.a.s.c.SolrXmlConfig MBean server found: com.sun.jmx.mbeanserver.JmxMBeanServer@7e76ad6, but no JMX reporters were configured - adding default JMX reporter.
   [junit4]   2> 1428696 INFO  (TEST-RollingRestartTest.test-seed#[F616D8058F8E697B]) [     ] o.a.s.h.c.HttpShardHandlerFactory Host whitelist initialized: WhitelistHostChecker [whitelistHosts=null, whitelistHostCheckingEnabled=false]
   [junit4]   2> 1428697 WARN  (TEST-RollingRestartTest.test-seed#[F616D8058F8E697B]) [     ] o.a.s.c.s.i.Http2SolrClient Create Http2SolrClient with HTTP/1.1 transport since Java 8 or lower versions does not support SSL + HTTP/2
   [junit4]   2> 1428700 WARN  (TEST-RollingRestartTest.test-seed#[F616D8058F8E697B]) [     ] o.e.j.u.s.S.config Trusting all certificates configured for Client@471a3eb9[provider=null,keyStore=null,trustStore=null]
   [junit4]   2> 1428700 WARN  (TEST-RollingRestartTest.test-seed#[F616D8058F8E697B]) [     ] o.e.j.u.s.S.config No Client EndPointIdentificationAlgorithm configured for Client@471a3eb9[provider=null,keyStore=null,trustStore=null]
   [junit4]   2> 1428711 WARN  (TEST-RollingRestartTest.test-seed#[F616D8058F8E697B]) [     ] o.a.s.c.s.i.Http2SolrClient Create Http2SolrClient with HTTP/1.1 transport since Java 8 or lower versions does not support SSL + HTTP/2
   [junit4]   2> 1428712 WARN  (TEST-RollingRestartTest.test-seed#[F616D8058F8E697B]) [     ] o.e.j.u.s.S.config Trusting all certificates configured for Client@41d0e0da[provider=null,keyStore=null,trustStore=null]
   [junit4]   2> 1428712 WARN  (TEST-RollingRestartTest.test-seed#[F616D8058F8E697B]) [     ] o.e.j.u.s.S.config No Client EndPointIdentificationAlgorithm configured for Client@41d0e0da[provider=null,keyStore=null,trustStore=null]
   [junit4]   2> 1428714 INFO  (TEST-RollingRestartTest.test-seed#[F616D8058F8E697B]) [     ] o.a.s.c.ZkContainer Zookeeper client=127.0.0.1:44385/solr
   [junit4]   2> 1428730 INFO  (TEST-RollingRestartTest.test-seed#[F616D8058F8E697B]) [     ] o.a.s.c.c.ConnectionManager Waiting for client to connect to ZooKeeper
   [junit4]   2> 1428735 INFO  (zkConnectionManagerCallback-7747-thread-1) [     ] o.a.s.c.c.ConnectionManager zkClient has connected
   [junit4]   2> 1428735 INFO  (TEST-RollingRestartTest.test-seed#[F616D8058F8E697B]) [     ] o.a.s.c.c.ConnectionManager Client is connected to ZooKeeper
   [junit4]   2> 1428838 INFO  (TEST-RollingRestartTest.test-seed#[F616D8058F8E697B]) [n:127.0.0.1:46325_     ] o.a.s.c.c.ConnectionManager Waiting for client to connect to ZooKeeper
   [junit4]   2> 1428840 INFO  (zkConnectionManagerCallback-7749-thread-1) [     ] o.a.s.c.c.ConnectionManager zkClient has connected
   [junit4]   2> 1428840 INFO  (TEST-RollingRestartTest.test-seed#[F616D8058F8E697B]) [n:127.0.0.1:46325_     ] o.a.s.c.c.ConnectionManager Client is connected to ZooKeeper
   [junit4]   2> 1428977 INFO  (TEST-RollingRestartTest.test-seed#[F616D8058F8E697B]) [n:127.0.0.1:46325_     ] o.a.s.c.OverseerElectionContext I am going to be the leader 127.0.0.1:46325_
   [junit4]   2> 1428978 INFO  (TEST-RollingRestartTest.test-seed#[F616D8058F8E697B]) [n:127.0.0.1:46325_     ] o.a.s.c.Overseer Overseer (id=72273962993451013-127.0.0.1:46325_-n_0000000000) starting
   [junit4]   2> 1428986 INFO  (TEST-RollingRestartTest.test-seed#[F616D8058F8E697B]) [n:127.0.0.1:46325_     ] o.a.s.c.c.ConnectionManager Waiting for client to connect to ZooKeeper
   [junit4]   2> 1428988 INFO  (zkConnectionManagerCallback-7756-thread-1) [     ] o.a.s.c.c.ConnectionManager zkClient has connected
   [junit4]   2> 1428988 INFO  (TEST-RollingRestartTest.test-seed#[F616D8058F8E697B]) [n:127.0.0.1:46325_     ] o.a.s.c.c.ConnectionManager Client is connected to ZooKeeper
   [junit4]   2> 1428991 INFO  (TEST-RollingRestartTest.test-seed#[F616D8058F8E697B]) [n:127.0.0.1:46325_     ] o.a.s.c.s.i.ZkClientClusterStateProvider Cluster at 127.0.0.1:44385/solr ready
   [junit4]   2> 1428995 INFO  (OverseerStateUpdate-72273962993451013-127.0.0.1:46325_-n_0000000000) [n:127.0.0.1:46325_     ] o.a.s.c.Overseer Starting to work on the main queue : 127.0.0.1:46325_
   [junit4]   2> 1428995 INFO  (TEST-RollingRestartTest.test-seed#[F616D8058F8E697B]) [n:127.0.0.1:46325_     ] o.a.s.c.ZkController Register node as live in ZooKeeper:/live_nodes/127.0.0.1:46325_
   [junit4]   2> 1428997 INFO  (OverseerStateUpdate-72273962993451013-127.0.0.1:46325_-n_0000000000) [n:127.0.0.1:46325_     ] o.a.s.c.c.ZkStateReader Updated live nodes from ZooKeeper... (0) -> (1)
   [junit4]   2> 1428999 INFO  (TEST-RollingRestartTest.test-seed#[F616D8058F8E697B]) [n:127.0.0.1:46325_     ] o.a.s.c.PackageManager clusterprops.json changed , version 1
   [junit4]   2> 1429007 INFO  (zkCallback-7755-thread-1) [     ] o.a.s.c.c.ZkStateReader Updated live nodes from ZooKeeper... (0) -> (1)
   [junit4]   2> 1429031 INFO  (TEST-RollingRestartTest.test-seed#[F616D8058F8E697B]) [n:127.0.0.1:46325_     ] o.a.s.h.a.MetricsHistoryHandler No .system collection, keeping metrics history in memory.
   [junit4]   2> 1429061 INFO  (TEST-RollingRestartTest.test-seed#[F616D8058F8E697B]) [n:127.0.0.1:46325_     ] o.a.s.m.r.SolrJmxReporter JMX monitoring for 'solr.node' (registry 'solr.node') enabled at server: com.sun.jmx.mbeanserver.JmxMBeanServer@7e76ad6
   [junit4]   2> 1429078 INFO  (TEST-RollingRestartTest.test-seed#[F616D8058F8E697B]) [n:127.0.0.1:46325_     ] o.a.s.m.r.SolrJmxReporter JMX monitoring for 'solr.jvm' (registry 'solr.jvm') enabled at server: com.sun.jmx.mbeanserver.JmxMBeanServer@7e76ad6
   [junit4]   2> 1429078 INFO  (TEST-RollingRestartTest.test-seed#[F616D8058F8E697B]) [n:127.0.0.1:46325_     ] o.a.s.m.r.SolrJmxReporter JMX monitoring for 'solr.jetty' (registry 'solr.jetty') enabled at server: com.sun.jmx.mbeanserver.JmxMBeanServer@7e76ad6
   [junit4]   2> 1429080 INFO  (TEST-RollingRestartTest.test-seed#[F616D8058F8E697B]) [n:127.0.0.1:46325_     ] o.a.s.c.CorePropertiesLocator Found 0 core definitions underneath /home/jenkins/jenkins-slave/workspace/Lucene-Solr-Tests-8.x/solr/build/solr-core/test/J1/temp/solr.cloud.RollingRestartTest_F616D8058F8E697B-001/control-001/cores
   [junit4]   2> 1429110 INFO  (TEST-RollingRestartTest.test-seed#[F616D8058F8E697B]) [     ] o.a.s.c.c.ConnectionManager Waiting for client to connect to ZooKeeper
   [junit4]   2> 1429111 INFO  (zkConnectionManagerCallback-7762-thread-1) [     ] o.a.s.c.c.ConnectionManager zkClient has connected
   [junit4]   2> 1429111 INFO  (TEST-RollingRestartTest.test-seed#[F616D8058F8E697B]) [     ] o.a.s.c.c.ConnectionManager Client is connected to ZooKeeper
   [junit4]   2> 1429113 INFO  (TEST-RollingRestartTest.test-seed#[F616D8058F8E697B]) [     ] o.a.s.c.c.ZkStateReader Updated live nodes from ZooKeeper... (0) -> (1)
   [junit4]   2> 1429114 INFO  (TEST-RollingRestartTest.test-seed#[F616D8058F8E697B]) [     ] o.a.s.c.s.i.ZkClientClusterStateProvider Cluster at 127.0.0.1:44385/solr ready
   [junit4]   2> 1429141 INFO  (qtp1309806890-24353) [n:127.0.0.1:46325_     ] o.a.s.h.a.CollectionsHandler Invoked Collection Action :create with params collection.configName=conf1&name=control_collection&nrtReplicas=1&action=CREATE&numShards=1&createNodeSet=127.0.0.1:46325_&wt=javabin&version=2 and sendToOCPQueue=true
   [junit4]   2> 1429148 INFO  (OverseerThreadFactory-6509-thread-1-processing-n:127.0.0.1:46325_) [n:127.0.0.1:46325_     ] o.a.s.c.a.c.CreateCollectionCmd Create collection control_collection
   [junit4]   2> 1429264 INFO  (qtp1309806890-24351) [n:127.0.0.1:46325_    x:control_collection_shard1_replica_n1 ] o.a.s.h.a.CoreAdminOperation core create command qt=/admin/cores&collection.configName=conf1&newCollection=true&name=control_collection_shard1_replica_n1&action=CREATE&numShards=1&collection=control_collection&shard=shard1&wt=javabin&version=2&replicaType=NRT
   [junit4]   2> 1429264 INFO  (qtp1309806890-24351) [n:127.0.0.1:46325_    x:control_collection_shard1_replica_n1 ] o.a.s.c.TransientSolrCoreCacheDefault Allocating transient cache for 4 transient cores
   [junit4]   2> 1430292 INFO  (qtp1309806890-24351) [n:127.0.0.1:46325_ c:control_collection s:shard1  x:control_collection_shard1_replica_n1 ] o.a.s.c.SolrConfig Using Lucene MatchVersion: 8.3.0
   [junit4]   2> 1430331 INFO  (qtp1309806890-24351) [n:127.0.0.1:46325_ c:control_collection s:shard1  x:control_collection_shard1_replica_n1 ] o.a.s.s.IndexSchema [control_collection_shard1_replica_n1] Schema name=test
   [junit4]   2> 1430487 INFO  (qtp1309806890-24351) [n:127.0.0.1:46325_ c:control_collection s:shard1  x:control_collection_shard1_replica_n1 ] o.a.s.s.IndexSchema Loaded schema test/1.0 with uniqueid field id
   [junit4]   2> 1430518 INFO  (qtp1309806890-24351) [n:127.0.0.1:46325_ c:control_collection s:shard1  x:control_collection_shard1_replica_n1 ] o.a.s.c.CoreContainer Creating SolrCore 'control_collection_shard1_replica_n1' using configuration from collection control_collection, trusted=true
   [junit4]   2> 1430519 INFO  (qtp1309806890-24351) [n:127.0.0.1:46325_ c:control_collection s:shard1  x:control_collection_shard1_replica_n1 ] o.a.s.m.r.SolrJmxReporter JMX monitoring for 'solr.core.control_collection.shard1.replica_n1' (registry 'solr.core.control_collection.shard1.replica_n1') enabled at server: com.sun.jmx.mbeanserver.JmxMBeanServer@7e76ad6
   [junit4]   2> 1430519 INFO  (qtp1309806890-24351) [n:127.0.0.1:46325_ c:control_collection s:shard1  x:control_collection_shard1_replica_n1 ] o.a.s.c.SolrCore [[control_collection_shard1_replica_n1] ] Opening new SolrCore at [/home/jenkins/jenkins-slave/workspace/Lucene-Solr-Tests-8.x/solr/build/solr-core/test/J1/temp/solr.cloud.RollingRestartTest_F616D8058F8E697B-001/control-001/cores/control_collection_shard1_replica_n1], dataDir=[/home/jenkins/jenkins-slave/workspace/Lucene-Solr-Tests-8.x/solr/build/solr-core/test/J1/temp/solr.cloud.RollingRestartTest_F616D8058F8E697B-001/control-001/cores/control_collection_shard1_replica_n1/data/]
   [junit4]   2> 1430524 INFO  (qtp1309806890-24351) [n:127.0.0.1:46325_ c:control_collection s:shard1  x:control_collection_shard1_replica_n1 ] o.a.s.u.RandomMergePolicy RandomMergePolicy wrapping class org.apache.lucene.index.TieredMergePolicy: [TieredMergePolicy: maxMergeAtOnce=42, maxMergeAtOnceExplicit=11, maxMergedSegmentMB=50.1064453125, floorSegmentMB=1.0078125, forceMergeDeletesPctAllowed=6.483215520891875, segmentsPerTier=30.0, maxCFSSegmentSizeMB=8.796093022207999E12, noCFSRatio=0.40386859800605446, deletesPctAllowed=37.73619152758184
   [junit4]   2> 1430546 WARN  (qtp1309806890-24351) [n:127.0.0.1:46325_ c:control_collection s:shard1  x:control_collection_shard1_replica_n1 ] o.a.s.c.RequestHandlers INVALID paramSet a in requestHandler {type = requestHandler,name = /dump,class = DumpRequestHandler,attributes = {initParams=a, name=/dump, class=DumpRequestHandler},args = {defaults={a=A,b=B}}}
   [junit4]   2> 1430621 INFO  (qtp1309806890-24351) [n:127.0.0.1:46325_ c:control_collection s:shard1  x:control_collection_shard1_replica_n1 ] o.a.s.u.UpdateHandler Using UpdateLog implementation: org.apache.solr.update.UpdateLog
   [junit4]   2> 1430621 INFO  (qtp1309806890-24351) [n:127.0.0.1:46325_ c:control_collection s:shard1  x:control_collection_shard1_replica_n1 ] o.a.s.u.UpdateLog Initializing UpdateLog: dataDir= defaultSyncLevel=FLUSH numRecordsToKeep=100 maxNumLogsToKeep=10 numVersionBuckets=65536
   [junit4]   2> 1430634 INFO  (qtp1309806890-24351) [n:127.0.0.1:46325_ c:control_collection s:shard1  x:control_collection_shard1_replica_n1 ] o.a.s.u.CommitTracker Hard AutoCommit: disabled
   [junit4]   2> 1430634 INFO  (qtp1309806890-24351) [n:127.0.0.1:46325_ c:control_collection s:shard1  x:control_collection_shard1_replica_n1 ] o.a.s.u.CommitTracker Soft AutoCommit: disabled
   [junit4]   2> 1430636 INFO  (qtp1309806890-24351) [n:127.0.0.1:46325_ c:control_collection s:shard1  x:control_collection_shard1_replica_n1 ] o.a.s.u.RandomMergePolicy RandomMergePolicy wrapping class org.apache.lucene.index.TieredMergePolicy: [TieredMergePolicy: maxMergeAtOnce=21, maxMergeAtOnceExplicit=26, maxMergedSegmentMB=7.904296875, floorSegmentMB=0.228515625, forceMergeDeletesPctAllowed=27.14793782786768, segmentsPerTier=14.0, maxCFSSegmentSizeMB=8.796093022207999E12, noCFSRatio=0.5654256189225446, deletesPctAllowed=37.66027930897462
   [junit4]   2> 1430638 INFO  (qtp1309806890-24351) [n:127.0.0.1:46325_ c:control_collection s:shard1  x:control_collection_shard1_replica_n1 ] o.a.s.s.SolrIndexSearcher Opening [Searcher@65ab9d3[control_collection_shard1_replica_n1] main]
   [junit4]   2> 1430654 INFO  (qtp1309806890-24351) [n:127.0.0.1:46325_ c:control_collection s:shard1  x:control_collection_shard1_replica_n1 ] o.a.s.r.ManagedResourceStorage Configured ZooKeeperStorageIO with znodeBase: /configs/conf1
   [junit4]   2> 1430655 INFO  (qtp1309806890-24351) [n:127.0.0.1:46325_ c:control_collection s:shard1  x:control_collection_shard1_replica_n1 ] o.a.s.r.ManagedResourceStorage Loaded null at path _rest_managed.json using ZooKeeperStorageIO:path=/configs/conf1
   [junit4]   2> 1430656 INFO  (qtp1309806890-24351) [n:127.0.0.1:46325_ c:control_collection s:shard1  x:control_collection_shard1_replica_n1 ] o.a.s.h.ReplicationHandler Commits will be reserved for 10000ms.
   [junit4]   2> 1430656 INFO  (qtp1309806890-24351) [n:127.0.0.1:46325_ c:control_collection s:shard1  x:control_collection_shard1_replica_n1 ] o.a.s.u.UpdateLog Could not find max version in index or recent updates, using new clock 1642992696602656768
   [junit4]   2> 1430662 INFO  (searcherExecutor-6514-thread-1-processing-n:127.0.0.1:46325_ x:control_collection_shard1_replica_n1 c:control_collection s:shard1) [n:127.0.0.1:46325_ c:control_collection s:shard1  x:control_collection_shard1_replica_n1 ] o.a.s.c.SolrCore [control_collection_shard1_replica_n1] Registered new searcher Searcher@65ab9d3[control_collection_shard1_replica_n1] main{ExitableDirectoryReader(UninvertingDirectoryReader())}
   [junit4]   2> 1430683 INFO  (qtp1309806890-24351) [n:127.0.0.1:46325_ c:control_collection s:shard1  x:control_collection_shard1_replica_n1 ] o.a.s.c.ZkShardTerms Successful update of terms at /collections/control_collection/terms/shard1 to Terms{values={core_node2=0}, version=0}
   [junit4]   2> 1430683 INFO  (qtp1309806890-24351) [n:127.0.0.1:46325_ c:control_collection s:shard1  x:control_collection_shard1_replica_n1 ] o.a.s.c.ShardLeaderElectionContextBase make sure parent is created /collections/control_collection/leaders/shard1
   [junit4]   2> 1430688 INFO  (qtp1309806890-24351) [n:127.0.0.1:46325_ c:control_collection s:shard1  x:control_collection_shard1_replica_n1 ] o.a.s.c.ShardLeaderElectionContext Enough replicas found to continue.
   [junit4]   2> 1430688 INFO  (qtp1309806890-24351) [n:127.0.0.1:46325_ c:control_collection s:shard1  x:control_collection_shard1_replica_n1 ] o.a.s.c.ShardLeaderElectionContext I may be the new leader - try and sync
   [junit4]   2> 1430688 INFO  (qtp1309806890-24351) [n:127.0.0.1:46325_ c:control_collection s:shard1  x:control_collection_shard1_replica_n1 ] o.a.s.c.SyncStrategy Sync replicas to https://127.0.0.1:46325/control_collection_shard1_replica_n1/
   [junit4]   2> 1430688 INFO  (qtp1309806890-24351) [n:127.0.0.1:46325_ c:control_collection s:shard1  x:control_collection_shard1_replica_n1 ] o.a.s.c.SyncStrategy Sync Success - now sync replicas to me
   [junit4]   2> 1430689 INFO  (qtp1309806890-24351) [n:127.0.0.1:46325_ c:control_collection s:shard1  x:control_collection_shard1_replica_n1 ] o.a.s.c.SyncStrategy https://127.0.0.1:46325/control_collection_shard1_replica_n1/ has no replicas
   [junit4]   2> 1430689 INFO  (qtp1309806890-24351) [n:127.0.0.1:46325_ c:control_collection s:shard1  x:control_collection_shard1_replica_n1 ] o.a.s.c.ShardLeaderElectionContextBase Creating leader registration node /collections/control_collection/leaders/shard1/leader after winning as /collections/control_collection/leader_elect/shard1/election/72273962993451013-core_node2-n_0000000000
   [junit4]   2> 1430691 INFO  (qtp1309806890-24351) [n:127.0.0.1:46325_ c:control_collection s:shard1  x:control_collection_shard1_replica_n1 ] o.a.s.c.ShardLeaderElectionContext I am the new leader: https://127.0.0.1:46325/control_collection_shard1_replica_n1/ shard1
   [junit4]   2> 1430695 INFO  (zkCallback-7748-thread-1) [     ] o.a.s.c.c.ZkStateReader A cluster state change: [WatchedEvent state:SyncConnected type:NodeDataChanged path:/collections/control_collection/state.json] for collection [control_collection] has occurred - updating... (live nodes size: [1])
   [junit4]   2> 1430697 INFO  (qtp1309806890-24351) [n:127.0.0.1:46325_ c:control_collection s:shard1  x:control_collection_shard1_replica_n1 ] o.a.s.c.ZkController I am the leader, no recovery necessary
   [junit4]   2> 1430703 INFO  (qtp1309806890-24351) [n:127.0.0.1:46325_ c:control_collection s:shard1  x:control_collection_shard1_replica_n1 ] o.a.s.s.HttpSolrCall [admin] webapp=null path=/admin/cores params={qt=/admin/cores&collection.configName=conf1&newCollection=true&name=control_collection_shard1_replica_n1&action=CREATE&numShards=1&collection=control_collection&shard=shard1&wt=javabin&version=2&replicaType=NRT} status=0 QTime=1439
   [junit4]   2> 1430712 INFO  (zkCallback-7748-thread-2) [     ] o.a.s.c.c.ZkStateReader A cluster state change: [WatchedEvent state:SyncConnected type:NodeDataChanged path:/collections/control_collection/state.json] for collection [control_collection] has occurred - updating... (live nodes size: [1])
   [junit4]   2> 1430715 INFO  (qtp1309806890-24353) [n:127.0.0.1:46325_     ] o.a.s.h.a.CollectionsHandler Wait for new collection to be active for at most 45 seconds. Check all shard replicas
   [junit4]   2> 1430814 INFO  (zkCallback-7748-thread-2) [     ] o.a.s.c.c.ZkStateReader A cluster state change: [WatchedEvent state:SyncConnected type:NodeDataChanged path:/collections/control_collection/state.json] for collection [control_collection] has occurred - updating... (live nodes size: [1])
   [junit4]   2> 1430814 INFO  (zkCallback-7748-thread-1) [     ] o.a.s.c.c.ZkStateReader A cluster state change: [WatchedEvent state:SyncConnected type:NodeDataChanged path:/collections/control_collection/state.json] for collection [control_collection] has occurred - updating... (live nodes size: [1])
   [junit4]   2> 1430815 INFO  (qtp1309806890-24353) [n:127.0.0.1:46325_     ] o.a.s.s.HttpSolrCall [admin] webapp=null path=/admin/collections params={collection.configName=conf1&name=control_collection&nrtReplicas=1&action=CREATE&numShards=1&createNodeSet=127.0.0.1:46325_&wt=javabin&version=2} status=0 QTime=1673
   [junit4]   2> 1430815 INFO  (TEST-RollingRestartTest.test-seed#[F616D8058F8E697B]) [     ] o.a.s.c.AbstractFullDistribZkTestBase Waiting to see 1 active replicas in collection: control_collection
   [junit4]   2> 1430819 INFO  (zkCallback-7748-thread-3) [     ] o.a.s.c.c.ZkStateReader A cluster state change: [WatchedEvent state:SyncConnected type:NodeDataChanged path:/collections/control_collection/state.json] for collection [control_collection] has occurred - updating... (live nodes size: [1])
   [junit4]   2> 1430945 INFO  (TEST-RollingRestartTest.test-seed#[F616D8058F8E697B]) [     ] o.a.s.c.c.ConnectionManager Waiting for client to connect to ZooKeeper
   [junit4]   2> 1430946 INFO  (zkConnectionManagerCallback-7768-thread-1) [     ] o.a.s.c.c.ConnectionManager zkClient has connected
   [junit4]   2> 1430946 INFO  (TEST-RollingRestartTest.test-seed#[F616D8058F8E697B]) [     ] o.a.s.c.c.ConnectionManager Client is connected to ZooKeeper
   [junit4]   2> 1430948 INFO  (TEST-RollingRestartTest.test-seed#[F616D8058F8E697B]) [     ] o.a.s.c.c.ZkStateReader Updated live nodes from ZooKeeper... (0) -> (1)
   [junit4]   2> 1430950 INFO  (TEST-RollingRestartTest.test-seed#[F616D8058F8E697B]) [     ] o.a.s.c.s.i.ZkClientClusterStateProvider Cluster at 127.0.0.1:44385/solr ready
   [junit4]   2> 1430950 INFO  (TEST-RollingRestartTest.test-seed#[F616D8058F8E697B]) [     ] o.a.s.c.ChaosMonkey monkey: init - expire sessions:false cause connection loss:false
   [junit4]   2> 1430954 INFO  (qtp1309806890-24353) [n:127.0.0.1:46325_     ] o.a.s.h.a.CollectionsHandler Invoked Collection Action :create with params collection.configName=conf1&name=collection1&nrtReplicas=1&action=CREATE&numShards=2&createNodeSet=&stateFormat=2&wt=javabin&version=2 and sendToOCPQueue=true
   [junit4]   2> 1430960 INFO  (OverseerCollectionConfigSetProcessor-72273962993451013-127.0.0.1:46325_-n_0000000000) [n:127.0.0.1:46325_     ] o.a.s.c.OverseerTaskQueue Response ZK path: /overseer/collection-queue-work/qnr-0000000000 doesn't exist.  Requestor may have disconnected from ZooKeeper
   [junit4]   2> 1430960 INFO  (OverseerThreadFactory-6509-thread-2-processing-n:127.0.0.1:46325_) [n:127.0.0.1:46325_     ] o.a.s.c.a.c.CreateCollectionCmd Create collection collection1
   [junit4]   2> 1431177 WARN  (OverseerThreadFactory-6509-thread-2-processing-n:127.0.0.1:46325_) [n:127.0.0.1:46325_     ] o.a.s.c.a.c.CreateCollectionCmd It is unusual to create a collection (collection1) without cores.
   [junit4]   2> 1431179 INFO  (qtp1309806890-24353) [n:127.0.0.1:46325_     ] o.a.s.h.a.CollectionsHandler Wait for new collection to be active for at most 45 seconds. Check all shard replicas
   [junit4]   2> 1431184 INFO  (qtp1309806890-24353) [n:127.0.0.1:46325_     ] o.a.s.s.HttpSolrCall [admin] webapp=null path=/admin/collections params={collection.configName=conf1&name=collection1&nrtReplicas=1&action=CREATE&numShards=2&createNodeSet=&stateFormat=2&wt=javabin&version=2} status=0 QTime=230
   [junit4]   2> 1431185 INFO  (TEST-RollingRestartTest.test-seed#[F616D8058F8E697B]) [     ] o.a.s.c.SolrCloudTestCase active slice count: 2 expected:2
   [junit4]   2> 1431185 INFO  (TEST-RollingRestartTest.test-seed#[F616D8058F8E697B]) [     ] o.a.s.c.SolrCloudTestCase active replica count: 0 expected replica count: 0
   [junit4]   2> 1431186 INFO  (TEST-RollingRestartTest.test-seed#[F616D8058F8E697B]) [     ] o.a.s.c.SolrCloudTestCase active slice count: 2 expected:2
   [junit4]   2> 1431186 INFO  (TEST-RollingRestartTest.test-seed#[F616D8058F8E697B]) [     ] o.a.s.c.SolrCloudTestCase active replica count: 0 expected replica count: 0
   [junit4]   2> 1431186 INFO  (TEST-RollingRestartTest.test-seed#[F616D8058F8E697B]) [     ] o.a.s.c.SolrCloudTestCase active slice count: 2 expected:2
   [junit4]   2> 1431186 INFO  (TEST-RollingRestartTest.test-seed#[F616D8058F8E697B]) [     ] o.a.s.c.SolrCloudTestCase active replica count: 0 expected replica count: 0
   [junit4]   2> 1431186 INFO  (TEST-RollingRestartTest.test-seed#[F616D8058F8E697B]) [     ] o.a.s.c.AbstractFullDistribZkTestBase Creating jetty instances pullReplicaCount=0 numOtherReplicas=2
   [junit4]   2> 1431366 INFO  (TEST-RollingRestartTest.test-seed#[F616D8058F8E697B]) [     ] o.a.s.c.AbstractFullDistribZkTestBase create jetty 1 in directory /home/jenkins/jenkins-slave/workspace/Lucene-Solr-Tests-8.x/solr/build/solr-core/test/J1/temp/solr.cloud.RollingRestartTest_F616D8058F8E697B-001/shard-1-001 of type NRT
   [junit4]   2> 1431368 WARN  (closeThreadPool-7769-thread-1) [     ] o.e.j.s.AbstractConnector Ignoring deprecated socket close linger time
   [junit4]   2> 1431368 INFO  (closeThreadPool-7769-thread-1) [     ] o.a.s.c.s.e.JettySolrRunner Start Jetty (original configured port=0)
   [junit4]   2> 1431368 INFO  (closeThreadPool-7769-thread-1) [     ] o.a.s.c.s.e.JettySolrRunner Trying to start Jetty on port 0 try number 1 ...
   [junit4]   2> 1431369 INFO  (closeThreadPool-7769-thread-1) [     ] o.e.j.s.Server jetty-9.4.19.v20190610; built: 2019-06-10T16:30:51.723Z; git: afcf563148970e98786327af5e07c261fda175d3; jvm 1.8.0_191-b12
   [junit4]   2> 1431372 INFO  (closeThreadPool-7769-thread-1) [     ] o.e.j.s.session DefaultSessionIdManager workerName=node0
   [junit4]   2> 1431372 INFO  (closeThreadPool-7769-thread-1) [     ] o.e.j.s.session No SessionScavenger set, using defaults
   [junit4]   2> 1431372 INFO  (closeThreadPool-7769-thread-1) [     ] o.e.j.s.session node0 Scavenging every 600000ms
   [junit4]   2> 1431373 INFO  (closeThreadPool-7769-thread-1) [     ] o.e.j.s.h.ContextHandler Started o.e.j.s.ServletContextHandler@58551493{/,null,AVAILABLE}
   [junit4]   2> 1431376 INFO  (closeThreadPool-7769-thread-1) [     ] o.e.j.s.AbstractConnector Started ServerConnector@382897c0{SSL,[ssl, http/1.1]}{127.0.0.1:34405}
   [junit4]   2> 1431376 INFO  (closeThreadPool-7769-thread-1) [     ] o.e.j.s.Server Started @1431441ms
   [junit4]   2> 1431376 INFO  (closeThreadPool-7769-thread-1) [     ] o.a.s.c.s.e.JettySolrRunner Jetty properties: {solr.data.dir=/home/jenkins/jenkins-slave/workspace/Lucene-Solr-Tests-8.x/solr/build/solr-core/test/J1/temp/solr.cloud.RollingRestartTest_F616D8058F8E697B-001/tempDir-001/jetty1, replicaType=NRT, solrconfig=solrconfig.xml, hostContext=/, hostPort=34405, coreRootDirectory=/home/jenkins/jenkins-slave/workspace/Lucene-Solr-Tests-8.x/solr/build/solr-core/test/J1/temp/solr.cloud.RollingRestartTest_F616D8058F8E697B-001/shard-1-001/cores}
   [junit4]   2> 1431377 ERROR (closeThreadPool-7769-thread-1) [     ] o.a.s.u.StartupLoggingUtils Missing Java Option solr.log.dir. Logging may be missing or incomplete.
   [junit4]   2> 1431377 INFO  (closeThreadPool-7769-thread-1) [     ] o.a.s.s.SolrDispatchFilter Using logger factory org.apache.logging.slf4j.Log4jLoggerFactory
   [junit4]   2> 1431377 INFO  (closeThreadPool-7769-thread-1) [     ] o.a.s.s.SolrDispatchFilter  ___      _       Welcome to Apache Solr™ version 8.3.0
   [junit4]   2> 1431377 INFO  (closeThreadPool-7769-thread-1) [     ] o.a.s.s.SolrDispatchFilter / __| ___| |_ _   Starting in cloud mode on port null
   [junit4]   2> 1431377 INFO  (closeThreadPool-7769-thread-1) [     ] o.a.s.s.SolrDispatchFilter \__ \/ _ \ | '_|  Install dir: null
   [junit4]   2> 1431377 INFO  (closeThreadPool-7769-thread-1) [     ] o.a.s.s.SolrDispatchFilter |___/\___/_|_|    Start time: 2019-08-27T04:25:37.514Z
   [junit4]   2> 1431406 INFO  (closeThreadPool-7769-thread-1) [     ] o.a.s.c.c.ConnectionManager Waiting for client to connect to ZooKeeper
   [junit4]   2> 1431418 INFO  (zkConnectionManagerCallback-7771-thread-1) [     ] o.a.s.c.c.ConnectionManager zkClient has connected
   [junit4]   2> 1431418 INFO  (closeThreadPool-7769-thread-1) [     ] o.a.s.c.c.ConnectionManager Client is connected to ZooKeeper
   [junit4]   2> 1431519 INFO  (closeThreadPool-7769-thread-1) [     ] o.a.s.s.SolrDispatchFilter Loading solr.xml from SolrHome (not found in ZooKeeper)
   [junit4]   2> 1431519 INFO  (closeThreadPool-7769-thread-1) [     ] o.a.s.c.SolrXmlConfig Loading container configuration from /home/jenkins/jenkins-slave/workspace/Lucene-Solr-Tests-8.x/solr/build/solr-core/test/J1/temp/solr.cloud.RollingRestartTest_F616D8058F8E697B-001/shard-1-001/solr.xml
   [junit4]   2> 1431525 INFO  (closeThreadPool-7769-thread-1) [     ] o.a.s.c.SolrXmlConfig Configuration parameter autoReplicaFailoverWorkLoopDelay is ignored
   [junit4]   2> 1431525 INFO  (closeThreadPool-7769-thread-1) [     ] o.a.s.c.SolrXmlConfig Configuration parameter autoReplicaFailoverBadNodeExpiration is ignored
   [junit4]   2> 1431527 INFO  (closeThreadPool-7769-thread-1) [     ] o.a.s.c.SolrXmlConfig MBean server found: com.sun.jmx.mbeanserver.JmxMBeanServer@7e76ad6, but no JMX reporters were configured - adding default JMX reporter.
   [junit4]   2> 1431606 INFO  (TEST-RollingRestartTest.test-seed#[F616D8058F8E697B]) [     ] o.a.s.c.AbstractFullDistribZkTestBase create jetty 2 in directory /home/jenkins/jenkins-slave/workspace/Lucene-Solr-Tests-8.x/solr/build/solr-core/test/J1/temp/solr.cloud.RollingRestartTest_F616D8058F8E697B-001/shard-2-001 of type NRT
   [junit4]   2> 1431608 WARN  (closeThreadPool-7769-thread-2) [     ] o.e.j.s.AbstractConnector Ignoring deprecated socket close linger time
   [junit4]   2> 1431608 INFO  (closeThreadPool-7769-thread-2) [     ] o.a.s.c.s.e.JettySolrRunner Start Jetty (original configured port=0)
   [junit4]   2> 1431608 INFO  (closeThreadPool-7769-thread-2) [     ] o.a.s.c.s.e.JettySolrRunner Trying to start Jetty on port 0 try number 1 ...
   [junit4]   2> 1431608 INFO  (closeThreadPool-7769-thread-2) [     ] o.e.j.s.Server jetty-9.4.19.v20190610; built: 2019-06-10T16:30:51.723Z; git: afcf563148970e98786327af5e07c261fda175d3; jvm 1.8.0_191-b12
   [junit4]   2> 1431684 INFO  (closeThreadPool-7769-thread-2) [     ] o.e.j.s.session DefaultSessionIdManager workerName=node0
   [junit4]   2> 1431684 INFO  (closeThreadPool-7769-thread-2) [     ] o.e.j.s.session No SessionScavenger set, using defaults
   [junit4]   2> 1431684 INFO  (closeThreadPool-7769-thread-2) [     ] o.e.j.s.session node0 Scavenging every 600000ms
   [junit4]   2> 1431690 INFO  (closeThreadPool-7769-thread-2) [     ] o.e.j.s.h.ContextHandler Started o.e.j.s.ServletContextHandler@43e2065f{/,null,AVAILABLE}
   [junit4]   2> 1431691 INFO  (closeThreadPool-7769-thread-2) [     ] o.e.j.s.AbstractConnector Started ServerConnector@58872b14{SSL,[ssl, http/1.1]}{127.0.0.1:40551}
   [junit4]   2> 1431691 INFO  (closeThreadPool-7769-thread-2) [     ] o.e.j.s.Server Started @1431756ms
   [junit4]   2> 1431692 INFO  (closeThreadPool-7769-thread-2) [     ] o.a.s.c.s.e.JettySolrRunner Jetty properties: {solr.data.dir=/home/jenkins/jenkins-slave/workspace/Lucene-Solr-Tests-8.x/solr/build/solr-core/test/J1/temp/solr.cloud.RollingRestartTest_F616D8058F8E697B-001/tempDir-001/jetty2, replicaType=NRT, solrconfig=solrconfig.xml, hostContext=/, hostPort=40551, coreRootDirectory=/home/jenkins/jenkins-slave/workspace/Lucene-Solr-Tests-8.x/solr/build/solr-core/test/J1/temp/solr.cloud.RollingRestartTest_F616D8058F8E697B-001/shard-2-001/cores}
   [junit4]   2> 1431692 ERROR (closeThreadPool-7769-thread-2) [     ] o.a.s.u.StartupLoggingUtils Missing Java Option solr.log.dir. Logging may be missing or incomplete.
   [junit4]   2> 1431692 INFO  (closeThreadPool-7769-thread-2) [     ] o.a.s.s.SolrDispatchFilter Using logger factory org.apache.logging.slf4j.Log4jLoggerFactory
   [junit4]   2> 1431692 INFO  (closeThreadPool-7769-thread-2) [     ] o.a.s.s.SolrDispatchFilter  ___      _       Welcome to Apache Solr™ version 8.3.0
   [junit4]   2> 1431692 INFO  (closeThreadPool-7769-thread-2) [     ] o.a.s.s.SolrDispatchFilter / __| ___| |_ _   Starting in cloud mode on port null
   [junit4]   2> 1431692 INFO  (closeThreadPool-7769-thread-2) [     ] o.a.s.s.SolrDispatchFilter \__ \/ _ \ | '_|  Install dir: null
   [junit4]   2> 1431692 INFO  (closeThreadPool-7769-thread-2) [     ] o.a.s.s.SolrDispatchFilter |___/\___/_|_|    Start time: 2019-08-27T04:25:37.829Z
   [junit4]   2> 1431711 INFO  (closeThreadPool-7769-thread-1) [     ] o.a.s.h.c.HttpShardHandlerFactory Host whitelist initialized: WhitelistHostChecker [whitelistHosts=null, whitelistHostCheckingEnabled=false]
   [junit4]   2> 1431712 WARN  (closeThreadPool-7769-thread-1) [     ] o.a.s.c.s.i.Http2SolrClient Create Http2SolrClient with HTTP/1.1 transport since Java 8 or lower versions does not support SSL + HTTP/2
   [junit4]   2> 1431712 INFO  (closeThreadPool-7769-thread-2) [     ] o.a.s.c.c.ConnectionManager Waiting for client to connect to ZooKeeper
   [junit4]   2> 1431731 INFO  (zkConnectionManagerCallback-7774-thread-1) [     ] o.a.s.c.c.ConnectionManager zkClient has connected
   [junit4]   2> 1431731 INFO  (closeThreadPool-7769-thread-2) [     ] o.a.s.c.c.ConnectionManager Client is connected to ZooKeeper
   [junit4]   2> 1431742 WARN  (closeThreadPool-7769-thread-1) [     ] o.e.j.u.s.S.config Trusting all certificates configured for Client@7b5b7f66[provider=null,keyStore=null,trustStore=null]
   [junit4]   2> 1431742 WARN  (closeThreadPool-7769-thread-1) [     ] o.e.j.u.s.S.config No Client EndPointIdentificationAlgorithm configured for Client@7b5b7f66[provider=null,keyStore=null,trustStore=null]
   [junit4]   2> 1431763 WARN  (closeThreadPool-7769-thread-1) [     ] o.a.s.c.s.i.Http2SolrClient Create Http2SolrClient with HTTP/1.1 transport since Java 8 or lower versions does not support SSL + HTTP/2
   [junit4]   2> 1431785 WARN  (closeThreadPool-7769-thread-1) [     ] o.e.j.u.s.S.config Trusting all certificates configured for Client@53f2a5ea[provider=null,keyStore=null,trustStore=null]
   [junit4]   2> 1431785 WARN  (closeThreadPool-7769-thread-1) [     ] o.e.j.u.s.S.config No Client EndPointIdentificationAlgorithm configured for Client@53f2a5ea[provider=null,keyStore=null,trustStore=null]
   [junit4]   2> 1431787 INFO  (closeThreadPool-7769-thread-1) [     ] o.a.s.c.ZkContainer Zookeeper client=127.0.0.1:44385/solr
   [junit4]   2> 1431788 INFO  (closeThreadPool-7769-thread-1) [     ] o.a.s.c.c.ConnectionManager Waiting for client to connect to ZooKeeper
   [junit4]   2> 1431790 INFO  (zkConnectionManagerCallback-7780-thread-1) [     ] o.a.s.c.c.ConnectionManager zkClient has connected
   [junit4]   2> 1431790 INFO  (closeThreadPool-7769-thread-1) [     ] o.a.s.c.c.ConnectionManager Client is connected to ZooKeeper
   [junit4]   2> 1431845 INFO  (closeThreadPool-7769-thread-2) [     ] o.a.s.s.SolrDispatchFilter Loading solr.xml from SolrHome (not found in ZooKeeper)
   [junit4]   2> 1431845 INFO  (closeThreadPool-7769-thread-2) [     ] o.a.s.c.SolrXmlConfig Loading container configuration from /home/jenkins/jenkins-slave/workspace/Lucene-Solr-Tests-8.x/solr/build/solr-core/test/J1/temp/solr.cloud.RollingRestartTest_F616D8058F8E697B-001/shard-2-001/solr.xml
   [junit4]   2> 1431849 INFO  (closeThreadPool-7769-thread-2) [     ] o.a.s.c.SolrXmlConfig Configuration parameter autoReplicaFailoverWorkLoopDelay is ignored
   [junit4]   2> 1431849 INFO  (closeThreadPool-7769-thread-2) [     ] o.a.s.c.SolrXmlConfig Configuration parameter autoReplicaFailoverBadNodeExpiration is ignored
   [junit4]   2> 1431851 INFO  (closeThreadPool-7769-thread-2) [     ] o.a.s.c.SolrXmlConfig MBean server found: com.sun.jmx.mbeanserver.JmxMBeanServer@7e76ad6, but no JMX reporters were configured - adding default JMX reporter.
   [junit4]   2> 1431956 INFO  (closeThreadPool-7769-thread-1) [n:127.0.0.1:34405_     ] o.a.s.c.c.ConnectionManager Waiting for client to connect to ZooKeeper
   [junit4]   2> 1431967 INFO  (zkConnectionManagerCallback-7783-thread-1) [     ] o.a.s.c.c.ConnectionManager zkClient has connected
   [junit4]   2> 1431967 INFO  (closeThreadPool-7769-thread-1) [n:127.0.0.1:34405_     ] o.a.s.c.c.ConnectionManager Client is connected to ZooKeeper
   [junit4]   2> 1431978 INFO  (closeThreadPool-7769-thread-2) [     ] o.a.s.h.c.HttpShardHandlerFactory Host whitelist initialized: WhitelistHostChecker [whitelistHosts=null, whitelistHostCheckingEnabled=false]
   [junit4]   2> 1431979 INFO  (closeThreadPool-7769-thread-1) [n:127.0.0.1:34405_     ] o.a.s.c.c.ZkStateReader Updated live nodes from ZooKeeper... (0) -> (1)
   [junit4]   2> 1431980 WARN  (closeThreadPool-7769-thread-2) [     ] o.a.s.c.s.i.Http2SolrClient Create Http2SolrClient with HTTP/1.1 transport since Java 8 or lower versions does not support SSL + HTTP/2
   [junit4]   2> 1431985 INFO  (closeThreadPool-7769-thread-1) [n:127.0.0.1:34405_     ] o.a.s.c.ZkController Publish node=127.0.0.1:34405_ as DOWN
   [junit4]   2> 1431986 INFO  (closeThreadPool-7769-thread-1) [n:127.0.0.1:34405_     ] o.a.s.c.TransientSolrCoreCacheDefault Allocating transient cache for 4 transient cores
   [junit4]   2> 1431986 INFO  (closeThreadPool-7769-thread-1) [n:127.0.0.1:34405_     ] o.a.s.c.ZkController Register node as live in ZooKeeper:/live_nodes/127.0.0.1:34405_
   [junit4]   2> 1431988 INFO  (zkCallback-7748-thread-3) [     ] o.a.s.c.c.ZkStateReader Updated live nodes from ZooKeeper... (1) -> (2)
   [junit4]   2> 1431997 INFO  (zkCallback-7755-thread-1) [     ] o.a.s.c.c.ZkStateReader Updated live nodes from ZooKeeper... (1) -> (2)
   [junit4]   2> 1431997 WARN  (closeThreadPool-7769-thread-2) [     ] o.e.j.u.s.S.config Trusting all certificates configured for Client@761df1ad[provider=null,keyStore=null,trustStore=null]
   [junit4]   2> 1431997 WARN  (closeThreadPool-7769-thread-2) [     ] o.e.j.u.s.S.config No Client EndPointIdentificationAlgorithm configured for Client@761df1ad[provider=null,keyStore=null,trustStore=null]
   [junit4]   2> 1432000 INFO  (zkCallback-7767-thread-1) [     ] o.a.s.c.c.ZkStateReader Updated live nodes from ZooKeeper... (1) -> (2)
   [junit4]   2> 1432001 INFO  (zkCallback-7782-thread-1) [     ] o.a.s.c.c.ZkStateReader Updated live nodes from ZooKeeper... (1) -> (2)
   [junit4]   2> 1432002 WARN  (closeThreadPool-7769-thread-2) [     ] o.a.s.c.s.i.Http2SolrClient Create Http2SolrClient with HTTP/1.1 transport since Java 8 or lower versions does not support SSL + HTTP/2
   [junit4]   2> 1432006 INFO  (closeThreadPool-7769-thread-1) [n:127.0.0.1:34405_     ] o.a.s.c.c.ConnectionManager Waiting for client to connect to ZooKeeper
   [junit4]   2> 1432007 WARN  (closeThreadPool-7769-thread-2) [     ] o.e.j.u.s.S.config Trusting all certificates configured for Client@17a0b2e1[provider=null,keyStore=null,trustStore=null]
   [junit4]   2> 1432007 WARN  (closeThreadPool-7769-thread-2) [     ] o.e.j.u.s.S.config No Client EndPointIdentificationAlgorithm configured for Client@17a0b2e1[provider=null,keyStore=null,trustStore=null]
   [junit4]   2> 1432008 INFO  (closeThreadPool-7769-thread-2) [     ] o.a.s.c.ZkContainer Zookeeper client=127.0.0.1:44385/solr
   [junit4]   2> 1432009 INFO  (zkConnectionManagerCallback-7792-thread-1) [     ] o.a.s.c.c.ConnectionManager zkClient has connected
   [junit4]   2> 1432009 INFO  (closeThreadPool-7769-thread-1) [n:127.0.0.1:34405_     ] o.a.s.c.c.ConnectionManager Client is connected to ZooKeeper
   [junit4]   2> 1432010 INFO  (closeThreadPool-7769-thread-1) [n:127.0.0.1:34405_     ] o.a.s.c.c.ZkStateReader Updated live nodes from ZooKeeper... (0) -> (2)
   [junit4]   2> 1432011 INFO  (closeThreadPool-7769-thread-2) [     ] o.a.s.c.c.ConnectionManager Waiting for client to connect to ZooKeeper
   [junit4]   2> 1432016 INFO  (closeThreadPool-7769-thread-1) [n:127.0.0.1:34405_     ] o.a.s.c.s.i.ZkClientClusterStateProvider Cluster at 127.0.0.1:44385/solr ready
   [junit4]   2> 1432017 INFO  (closeThreadPool-7769-thread-1) [n:127.0.0.1:34405_     ] o.a.s.c.PackageManager clusterprops.json changed , version 1
   [junit4]   2> 1432042 INFO  (zkConnectionManagerCallback-7796-thread-1) [     ] o.a.s.c.c.ConnectionManager zkClient has connected
   [junit4]   2> 1432042 INFO  (closeThreadPool-7769-thread-2) [     ] o.a.s.c.c.ConnectionManager Client is connected to ZooKeeper
   [junit4]   2> 1432065 INFO  (closeThreadPool-7769-thread-1) [n:127.0.0.1:34405_     ] o.a.s.h.a.MetricsHistoryHandler No .system collection, keeping metrics history in memory.
   [junit4]   2> 1432094 INFO  (closeThreadPool-7769-thread-1) [n:127.0.0.1:34405_     ] o.a.s.m.r.SolrJmxReporter JMX monitoring for 'solr.node' (registry 'solr.node') enabled at server: com.sun.jmx.mbeanserver.JmxMBeanServer@7e76ad6
   [junit4]   2> 1432110 INFO  (closeThreadPool-7769-thread-1) [n:127.0.0.1:34405_     ] o.a.s.m.r.SolrJmxReporter JMX monitoring for 'solr.jvm' (registry 'solr.jvm') enabled at server: com.sun.jmx.mbeanserver.JmxMBeanServer@7e76ad6
   [junit4]   2> 1432110 INFO  (closeThreadPool-7769-thread-1) [n:127.0.0.1:34405_     ] o.a.s.m.r.SolrJmxReporter JMX monitoring for 'solr.jetty' (registry 'solr.jetty') enabled at server: com.sun.jmx.mbeanserver.JmxMBeanServer@7e76ad6
   [junit4]   2> 1432112 INFO  (closeThreadPool-7769-thread-1) [n:127.0.0.1:34405_     ] o.a.s.c.CorePropertiesLocator Found 0 core definitions underneath /home/jenkins/jenkins-slave/workspace/Lucene-Solr-Tests-8.x/solr/build/solr-core/test/J1/temp/solr.cloud.RollingRestartTest_F616D8058F8E697B-001/shard-1-001/cores
   [junit4]   2> 1432147 INFO  (closeThreadPool-7769-thread-2) [n:127.0.0.1:40551_     ] o.a.s.c.c.ConnectionManager Waiting for client to connect to ZooKeeper
   [junit4]   2> 1432151 INFO  (closeThreadPool-7769-thread-1) [     ] o.a.s.c.AbstractFullDistribZkTestBase waitForLiveNode: 127.0.0.1:34405_
   [junit4]   2> 1432155 INFO  (zkConnectionManagerCallback-7799-thread-1) [     ] o.a.s.c.c.ConnectionManager zkClient has connected
   [junit4]   2> 1432155 INFO  (closeThreadPool-7769-thread-2) [n:127.0.0.1:40551_     ] o.a.s.c.c.ConnectionManager Client is connected to ZooKeeper
   [junit4]   2> 1432162 INFO  (closeThreadPool-7769-thread-2) [n:127.0.0.1:40551_     ] o.a.s.c.c.ZkStateReader Updated live nodes from ZooKeeper... (0) -> (2)
   [junit4]   2> 1432167 INFO  (closeThreadPool-7769-thread-2) [n:127.0.0.1:40551_     ] o.a.s.c.ZkController Publish node=127.0.0.1:40551_ as DOWN
   [junit4]   2> 1432168 INFO  (closeThreadPool-7769-thread-2) [n:127.0.0.1:40551_     ] o.a.s.c.TransientSolrCoreCacheDefault Allocating transient cache for 4 transient cores
   [junit4]   2> 1432168 INFO  (closeThreadPool-7769-thread-2) [n:127.0.0.1:40551_     ] o.a.s.c.ZkController Register node as live in ZooKeeper:/live_nodes/127.0.0.1:40551_
   [junit4]   2> 1432170 INFO  (zkCallback-7755-thread-1) [     ] o.a.s.c.c.ZkStateReader Updated live nodes from ZooKeeper... (2) -> (3)
   [junit4]   2> 1432171 INFO  (zkCallback-7748-thread-3) [     ] o.a.s.c.c.ZkStateReader Updated live nodes from ZooKeeper... (2) -> (3)
   [junit4]   2> 1432171 INFO  (zkCallback-7791-thread-1) [     ] o.a.s.c.c.ZkStateReader Updated live nodes from ZooKeeper... (2) -> (3)
   [junit4]   2> 1432171 INFO  (zkCallback-7798-thread-1) [     ] o.a.s.c.c.ZkStateReader Updated live nodes from ZooKeeper... (2) -> (3)
   [junit4]   2> 1432171 INFO  (zkCallback-7782-thread-1) [     ] o.a.s.c.c.ZkStateReader Updated live nodes from ZooKeeper... (2) -> (3)
   [junit4]   2> 1432172 INFO  (zkCallback-7767-thread-1) [     ] o.a.s.c.c.ZkStateReader Updated live nodes from ZooKeeper... (2) -> (3)
   [junit4]   2> 1432173 INFO  (closeThreadPool-7769-thread-2) [n:127.0.0.1:40551_     ] o.a.s.c.c.ConnectionManager Waiting for client to connect to ZooKeeper
   [junit4]   2> 1432174 INFO  (zkConnectionManagerCallback-7806-thread-1) [     ] o.a.s.c.c.ConnectionManager zkClient has connected
   [junit4]   2> 1432174 INFO  (closeThreadPool-7769-thread-2) [n:127.0.0.1:40551_     ] o.a.s.c.c.ConnectionManager Client is connected to ZooKeeper
   [junit4]   2> 1432175 INFO  (closeThreadPool-7769-thread-2) [n:127.0.0.1:40551_     ] o.a.s.c.c.ZkStateReader Updated live nodes from ZooKeeper... (0) -> (3)
   [junit4]   2> 1432177 INFO  (closeThreadPool-7769-thread-2) [n:127.0.0.1:40551_     ] o.a.s.c.s.i.ZkClientClusterStateProvider Cluster at 127.0.0.1:44385/solr ready
   [junit4]   2> 1432178 INFO  (closeThreadPool-7769-thread-2) [n:127.0.0.1:40551_     ] o.a.s.c.PackageManager clusterprops.json changed , version 1
   [junit4]   2> 1432206 INFO  (closeThreadPool-7769-thread-2) [n:127.0.0.1:40551_     ] o.a.s.h.a.MetricsHistoryHandler No .system collection, keeping metrics history in memory.
   [junit4]   2> 1432234 INFO  (closeThreadPool-7769-thread-2) [n:127.0.0.1:40551_     ] o.a.s.m.r.SolrJmxReporter JMX monitoring for 'solr.node' (registry 'solr.node') enabled at server: com.sun.jmx.mbeanserver.JmxMBeanServer@7e76ad6
   [junit4]   2> 1432250 INFO  (closeThreadPool-7769-thread-2) [n:127.0.0.1:40551_     ] o.a.s.m.r.SolrJmxReporter JMX monitoring for 'solr.jvm' (registry 'solr.jvm') enabled at server: com.sun.jmx.mbeanserver.JmxMBeanServer@7e76ad6
   [junit4]   2> 1432251 INFO  (closeThreadPool-7769-thread-2) [n:127.0.0.1:40551_     ] o.a.s.m.r.SolrJmxReporter JMX monitoring for 'solr.jetty' (registry 'solr.jetty') enabled at server: com.sun.jmx.mbeanserver.JmxMBeanServer@7e76ad6
   [junit4]   2> 1432253 INFO  (closeThreadPool-7769-thread-2) [n:127.0.0.1:40551_     ] o.a.s.c.CorePropertiesLocator Found 0 core definitions underneath /home/jenkins/jenkins-slave/workspace/Lucene-Solr-Tests-8.x/solr/build/solr-core/test/J1/temp/solr.cloud.RollingRestartTest_F616D8058F8E697B-001/shard-2-001/cores
   [junit4]   2> 1432303 INFO  (closeThreadPool-7769-thread-2) [     ] o.a.s.c.AbstractFullDistribZkTestBase waitForLiveNode: 127.0.0.1:40551_
   [junit4]   2> 1432340 INFO  (qtp261692107-24413) [n:127.0.0.1:34405_     ] o.a.s.h.a.CollectionsHandler Invoked Collection Action :addreplica with params node=127.0.0.1:40551_&action=ADDREPLICA&collection=collection1&shard=shard1&type=NRT&wt=javabin&version=2 and sendToOCPQueue=true
   [junit4]   2> 1432340 INFO  (qtp261692107-24414) [n:127.0.0.1:34405_     ] o.a.s.h.a.CollectionsHandler Invoked Collection Action :addreplica with params node=127.0.0.1:34405_&action=ADDREPLICA&collection=collection1&shard=shard2&type=NRT&wt=javabin&version=2 and sendToOCPQueue=true
   [junit4]   2> 1432347 INFO  (OverseerThreadFactory-6509-thread-3-processing-n:127.0.0.1:46325_) [n:127.0.0.1:46325_ c:collection1 s:shard1   ] o.a.s.c.a.c.AddReplicaCmd Node Identified 127.0.0.1:40551_ for creating new replica of shard shard1 for collection collection1
   [junit4]   2> 1432347 INFO  (OverseerCollectionConfigSetProcessor-72273962993451013-127.0.0.1:46325_-n_0000000000) [n:127.0.0.1:46325_     ] o.a.s.c.OverseerTaskQueue Response ZK path: /overseer/collection-queue-work/qnr-0000000002 doesn't exist.  Requestor may have disconnected from ZooKeeper
   [junit4]   2> 1432349 INFO  (OverseerThreadFactory-6509-thread-4-processing-n:127.0.0.1:46325_) [n:127.0.0.1:46325_ c:collection1 s:shard2   ] o.a.s.c.a.c.AddReplicaCmd Node Identified 127.0.0.1:34405_ for creating new replica of shard shard2 for collection collection1
   [junit4]   2> 1432351 INFO  (OverseerThreadFactory-6509-thread-3-processing-n:127.0.0.1:46325_) [n:127.0.0.1:46325_ c:collection1 s:shard1   ] o.a.s.c.a.c.AddReplicaCmd Returning CreateReplica command.
   [junit4]   2> 1432353 INFO  (OverseerThreadFactory-6509-thread-4-processing-n:127.0.0.1:46325_) [n:127.0.0.1:46325_ c:collection1 s:shard2   ] o.a.s.c.a.c.AddReplicaCmd Returning CreateReplica command.
   [junit4]   2> 1432407 INFO  (qtp261692107-24415) [n:127.0.0.1:34405_    x:collection1_shard2_replica_n2 ] o.a.s.h.a.CoreAdminOperation core create command qt=/admin/cores&collection.configName=conf1&name=collection1_shard2_replica_n2&action=CREATE&collection=collection1&shard=shard2&wt=javabin&version=2&replicaType=NRT
   [junit4]   2> 1432415 INFO  (qtp1624572728-24427) [n:127.0.0.1:40551_    x:collection1_shard1_replica_n1 ] o.a.s.h.a.CoreAdminOperation core create command qt=/admin/cores&collection.configName=conf1&name=collection1_shard1_replica_n1&action=CREATE&collection=collection1&shard=shard1&wt=javabin&version=2&replicaType=NRT
   [junit4]   2> 1433430 INFO  (qtp261692107-24415) [n:127.0.0.1:34405_ c:collection1 s:shard2  x:collection1_shard2_replica_n2 ] o.a.s.c.SolrConfig Using Lucene MatchVersion: 8.3.0
   [junit4]   2> 1433436 INFO  (qtp1624572728-24427) [n:127.0.0.1:40551_ c:collection1 s:shard1  x:collection1_shard1_replica_n1 ] o.a.s.c.SolrConfig Using Lucene MatchVersion: 8.3.0
   [junit4]   2> 1433451 INFO  (qtp261692107-24415) [n:127.0.0.1:34405_ c:collection1 s:shard2  x:collection1_shard2_replica_n2 ] o.a.s.s.IndexSchema [collection1_shard2_replica_n2] Schema name=test
   [junit4]   2> 1433456 INFO  (qtp1624572728-24427) [n:127.0.0.1:40551_ c:collection1 s:shard1  x:collection1_shard1_replica_n1 ] o.a.s.s.IndexSchema [collection1_shard1_replica_n1] Schema name=test
   [junit4]   2> 1433588 INFO  (qtp261692107-24415) [n:127.0.0.1:34405_ c:collection1 s:shard2  x:collection1_shard2_replica_n2 ] o.a.s.s.IndexSchema Loaded schema test/1.0 with uniqueid field id
   [junit4]   2> 1433592 INFO  (qtp1624572728-24427) [n:127.0.0.1:40551_ c:collection1 s:shard1  x:collection1_shard1_replica_n1 ] o.a.s.s.IndexSchema Loaded schema test/1.0 with uniqueid field id
   [junit4]   2> 1433620 INFO  (qtp1624572728-24427) [n:127.0.0.1:40551_ c:collection1 s:shard1  x:collection1_shard1_replica_n1 ] o.a.s.c.CoreContainer Creating SolrCore 'collection1_shard1_replica_n1' using configuration from collection collection1, trusted=true
   [junit4]   2> 1433621 INFO  (qtp1624572728-24427) [n:127.0.0.1:40551_ c:collection1 s:shard1  x:collection1_shard1_replica_n1 ] o.a.s.m.r.SolrJmxReporter JMX monitoring for 'solr.core.collection1.shard1.replica_n1' (registry 'solr.core.collection1.shard1.replica_n1') enabled at server: com.sun.jmx.mbeanserver.JmxMBeanServer@7e76ad6
   [junit4]   2> 1433621 INFO  (qtp1624572728-24427) [n:127.0.0.1:40551_ c:collection1 s:shard1  x:collection1_shard1_replica_n1 ] o.a.s.c.SolrCore [[collection1_shard1_replica_n1] ] Opening new SolrCore at [/home/jenkins/jenkins-slave/workspace/Lucene-Solr-Tests-8.x/solr/build/solr-core/test/J1/temp/solr.cloud.RollingRestartTest_F616D8058F8E697B-001/shard-2-001/cores/collection1_shard1_replica_n1], dataDir=[/home/jenkins/jenkins-slave/workspace/Lucene-Solr-Tests-8.x/solr/build/solr-core/test/J1/temp/solr.cloud.RollingRestartTest_F616D8058F8E697B-001/shard-2-001/cores/collection1_shard1_replica_n1/data/]
   [junit4]   2> 1433622 INFO  (qtp261692107-24415) [n:127.0.0.1:34405_ c:collection1 s:shard2  x:collection1_shard2_replica_n2 ] o.a.s.c.CoreContainer Creating SolrCore 'collection1_shard2_replica_n2' using configuration from collection collection1, trusted=true
   [junit4]   2> 1433623 INFO  (qtp261692107-24415) [n:127.0.0.1:34405_ c:collection1 s:shard2  x:collection1_shard2_replica_n2 ] o.a.s.m.r.SolrJmxReporter JMX monitoring for 'solr.core.collection1.shard2.replica_n2' (registry 'solr.core.collection1.shard2.replica_n2') enabled at server: com.sun.jmx.mbeanserver.JmxMBeanServer@7e76ad6
   [junit4]   2> 1433623 INFO  (qtp261692107-24415) [n:127.0.0.1:34405_ c:collection1 s:shard2  x:collection1_shard2_replica_n2 ] o.a.s.c.SolrCore [[collection1_shard2_replica_n2] ] Opening new SolrCore at [/home/jenkins/jenkins-slave/workspace/Lucene-Solr-Tests-8.x/solr/build/solr-core/test/J1/temp/solr.cloud.RollingRestartTest_F616D8058F8E697B-001/shard-1-001/cores/collection1_shard2_replica_n2], dataDir=[/home/jenkins/jenkins-slave/workspace/Lucene-Solr-Tests-8.x/solr/build/solr-core/test/J1/temp/solr.cloud.RollingRestartTest_F616D8058F8E697B-001/shard-1-001/cores/collection1_shard2_replica_n2/data/]
   [junit4]   2> 1433626 INFO  (qtp1624572728-24427) [n:127.0.0.1:40551_ c:collection1 s:shard1  x:collection1_shard1_replica_n1 ] o.a.s.u.RandomMergePolicy RandomMergePolicy wrapping class org.apache.lucene.index.TieredMergePolicy: [TieredMergePolicy: maxMergeAtOnce=42, maxMergeAtOnceExplicit=11, maxMergedSegmentMB=50.1064453125, floorSegmentMB=1.0078125, forceMergeDeletesPctAllowed=6.483215520891875, segmentsPerTier=30.0, maxCFSSegmentSizeMB=8.796093022207999E12, noCFSRatio=0.40386859800605446, deletesPctAllowed=37.73619152758184
   [junit4]   2> 1433629 INFO  (qtp261692107-24415) [n:127.0.0.1:34405_ c:collection1 s:shard2  x:collection1_shard2_replica_n2 ] o.a.s.u.RandomMergePolicy RandomMergePolicy wrapping class org.apache.lucene.index.TieredMergePolicy: [TieredMergePolicy: maxMergeAtOnce=42, maxMergeAtOnceExplicit=11, maxMergedSegmentMB=50.1064453125, floorSegmentMB=1.0078125, forceMergeDeletesPctAllowed=6.483215520891875, segmentsPerTier=30.0, maxCFSSegmentSizeMB=8.796093022207999E12, noCFSRatio=0.40386859800605446, deletesPctAllowed=37.73619152758184
   [junit4]   2> 1433643 WARN  (qtp1624572728-24427) [n:127.0.0.1:40551_ c:collection1 s:shard1  x:collection1_shard1_replica_n1 ] o.a.s.c.RequestHandlers INVALID paramSet a in requestHandler {type = requestHandler,name = /dump,class = DumpRequestHandler,attributes = {initParams=a, name=/dump, class=DumpRequestHandler},args = {defaults={a=A,b=B}}}
   [junit4]   2> 1433654 WARN  (qtp261692107-24415) [n:127.0.0.1:34405_ c:collection1 s:shard2  x:collection1_shard2_replica_n2 ] o.a.s.c.RequestHandlers INVALID paramSet a in requestHandler {type = requestHandler,name = /dump,class = DumpRequestHandler,attributes = {initParams=a, name=/dump, class=DumpRequestHandler},args = {defaults={a=A,b=B}}}
   [junit4]   2> 1433718 INFO  (qtp1624572728-24427) [n:127.0.0.1:40551_ c:collection1 s:shard1  x:collection1_shard1_replica_n1 ] o.a.s.u.UpdateHandler Using UpdateLog implementation: org.apache.solr.update.UpdateLog
   [junit4]   2> 1433718 INFO  (qtp1624572728-24427) [n:127.0.0.1:40551_ c:collection1 s:shard1  x:collection1_shard1_replica_n1 ] o.a.s.u.UpdateLog Initializing UpdateLog: dataDir= defaultSyncLevel=FLUSH numRecordsToKeep=100 maxNumLogsToKeep=10 numVersionBuckets=65536
   [junit4]   2> 1433720 INFO  (qtp1624572728-24427) [n:127.0.0.1:40551_ c:collection1 s:shard1  x:collection1_shard1_replica_n1 ] o.a.s.u.CommitTracker Hard AutoCommit: disabled
   [junit4]   2> 1433720 INFO  (qtp1624572728-24427) [n:127.0.0.1:40551_ c:collection1 s:shard1  x:collection1_shard1_replica_n1 ] o.a.s.u.CommitTracker Soft AutoCommit: disabled
   [junit4]   2> 1433722 INFO  (qtp1624572728-24427) [n:127.0.0.1:40551_ c:collection1 s:shard1  x:collection1_shard1_replica_n1 ] o.a.s.u.RandomMergePolicy RandomMergePolicy wrapping class org.apache.lucene.index.TieredMergePolicy: [TieredMergePolicy: maxMergeAtOnce=21, maxMergeAtOnceExplicit=26, maxMergedSegmentMB=7.904296875, floorSegmentMB=0.228515625, forceMergeDeletesPctAllowed=27.14793782786768, segmentsPerTier=14.0, maxCFSSegmentSizeMB=8.796093022207999E12, noCFSRatio=0.5654256189225446, deletesPctAllowed=37.66027930897462
   [junit4]   2> 1433722 INFO  (qtp261692107-24415) [n:127.0.0.1:34405_ c:collection1 s:shard2  x:collection1_shard2_replica_n2 ] o.a.s.u.UpdateHandler Using UpdateLog implementation: org.apache.solr.update.UpdateLog
   [junit4]   2> 1433722 INFO  (qtp261692107-24415) [n:127.0.0.1:34405_ c:collection1 s:shard2  x:collection1_shard2_replica_n2 ] o.a.s.u.UpdateLog Initializing UpdateLog: dataDir= defaultSyncLevel=FLUSH numRecordsToKeep=100 maxNumLogsToKeep=10 numVersionBuckets=65536
   [junit4]   2> 1433722 INFO  (qtp1624572728-24427) [n:127.0.0.1:40551_ c:collection1 s:shard1  x:collection1_shard1_replica_n1 ] o.a.s.s.SolrIndexSearcher Opening [Searcher@810c2e9[collection1_shard1_replica_n1] main]
   [junit4]   2> 1433723 INFO  (qtp261692107-24415) [n:127.0.0.1:34405_ c:collection1 s:shard2  x:collection1_shard2_replica_n2 ] o.a.s.u.CommitTracker Hard AutoCommit: disabled
   [junit4]   2> 1433723 INFO  (qtp261692107-24415) [n:127.0.0.1:34405_ c:collection1 s:shard2  x:collection1_shard2_replica_n2 ] o.a.s.u.CommitTracker Soft AutoCommit: disabled
   [junit4]   2> 1433725 INFO  (qtp261692107-24415) [n:127.0.0.1:34405_ c:collection1 s:shard2  x:collection1_shard2_replica_n2 ] o.a.s.u.RandomMergePolicy RandomMergePolicy wrapping class org.apache.lucene.index.TieredMergePolicy: [TieredMergePolicy: maxMergeAtOnce=21, maxMergeAtOnceExplicit=26, maxMergedSegmentMB=7.904296875, floorSegmentMB=0.228515625, forceMergeDeletesPctAllowed=27.14793782786768, segmentsPerTier=14.0, maxCFSSegmentSizeMB=8.796093022207999E12, noCFSRatio=0.5654256189225446, deletesPctAllowed=37.66027930897462
   [junit4]   2> 1433727 INFO  (qtp1624572728-24427) [n:127.0.0.1:40551_ c:collection1 s:shard1  x:collection1_shard1_replica_n1 ] o.a.s.r.ManagedResourceStorage Configured ZooKeeperStorageIO with znodeBase: /configs/conf1
   [junit4]   2> 1433726 INFO  (qtp261692107-24415) [n:127.0.0.1:34405_ c:collection1 s:shard2  x:collection1_shard2_replica_n2 ] o.a.s.s.SolrIndexSearcher Opening [Searcher@609da1df[collection1_shard2_replica_n2] main]
   [junit4]   2> 1433728 INFO  (qtp1624572728-24427) [n:127.0.0.1:40551_ c:collection1 s:shard1  x:collection1_shard1_replica_n1 ] o.a.s.r.ManagedResourceStorage Loaded null at path _rest_managed.json using ZooKeeperStorageIO:path=/configs/conf1
   [junit4]   2> 1433729 INFO  (qtp1624572728-24427) [n:127.0.0.1:40551_ c:collection1 s:shard1  x:collection1_shard1_replica_n1 ] o.a.s.h.ReplicationHandler Commits will be reserved for 10000ms.
   [junit4]   2> 1433729 INFO  (qtp1624572728-24427) [n:127.0.0.1:40551_ c:collection1 s:shard1  x:collection1_shard1_replica_n1 ] o.a.s.u.UpdateLog Could not find max version in index or recent updates, using new clock 1642992699824930816
   [junit4]   2> 1433731 INFO  (qtp261692107-24415) [n:127.0.0.1:34405_ c:collection1 s:shard2  x:collection1_shard2_replica_n2 ] o.a.s.r.ManagedResourceStorage Configured ZooKeeperStorageIO with znodeBase: /configs/conf1
   [junit4]   2> 1433733 INFO  (qtp261692107-24415) [n:127.0.0.1:34405_ c:collection1 s:shard2  x:collection1_shard2_replica_n2 ] o.a.s.r.ManagedResourceStorage Loaded null at path _rest_managed.json using ZooKeeperStorageIO:path=/configs/conf1
   [junit4]   2> 1433735 INFO  (qtp261692107-24415) [n:127.0.0.1:34405_ c:collection1 s:shard2  x:collection1_shard2_replica_n2 ] o.a.s.h.ReplicationHandler Commits will be reserved for 10000ms.
   [junit4]   2> 1433735 INFO  (qtp261692107-24415) [n:127.0.0.1:34405_ c:collection1 s:shard2  x:collection1_shard2_replica_n2 ] o.a.s.u.UpdateLog Could not find max version in index or recent updates, using new clock 1642992699831222272
   [junit4]   2> 1433736 INFO  (searcherExecutor-6537-thread-1-processing-n:127.0.0.1:40551_ x:collection1_shard1_replica_n1 c:collection1 s:shard1) [n:127.0.0.1:40551_ c:collection1 s:shard1  x:collection1_shard1_replica_n1 ] o.a.s.c.SolrCore [collection1_shard1_replica_n1] Registered new searcher Searcher@810c2e9[collection1_shard1_replica_n1] main{ExitableDirectoryReader(UninvertingDirectoryReader())}
   [junit4]   2> 1433739 INFO  (searcherExecutor-6538-thread-1-processing-n:127.0.0.1:34405_ x:collection1_shard2_replica_n2 c:collection1 s:shard2) [n:127.0.0.1:34405_ c:collection1 s:shard2  x:collection1_shard2_replica_n2 ] o.a.s.c.SolrCore [collection1_shard2_replica_n2] Registered new searcher Searcher@609da1df[collection1_shard2_replica_n2] main{ExitableDirectoryReader(UninvertingDirectoryReader())}
   [junit4]   2> 1433743 INFO  (qtp1624572728-24427) [n:127.0.0.1:40551_ c:collection1 s:shard1  x:collection1_shard1_replica_n1 ] o.a.s.c.ZkShardTerms Successful update of terms at /collections/collection1/terms/shard1 to Terms{values={core_node4=0}, version=0}
   [junit4]   2> 1433743 INFO  (qtp1624572728-24427) [n:127.0.0.1:40551_ c:collection1 s:shard1  x:collection1_shard1_replica_n1 ] o.a.s.c.ShardLeaderElectionContextBase make sure parent is created /collections/collection1/leaders/shard1
   [junit4]   2> 1433749 INFO  (qtp1624572728-24427) [n:127.0.0.1:40551_ c:collection1 s:shard1  x:collection1_shard1_replica_n1 ] o.a.s.c.ShardLeaderElectionContext Enough replicas found to continue.
   [junit4]   2> 1433749 INFO  (qtp1624572728-24427) [n:127.0.0.1:40551_ c:collection1 s:shard1  x:collection1_shard1_replica_n1 ] o.a.s.c.ShardLeaderElectionContext I may be the new leader - try and sync
   [junit4]   2> 1433749 INFO  (qtp1624572728-24427) [n:127.0.0.1:40551_ c:collection1 s:shard1  x:collection1_shard1_replica_n1 ] o.a.s.c.SyncStrategy Sync replicas to https://127.0.0.1:40551/collection1_shard1_replica_n1/
   [junit4]   2> 1433750 INFO  (qtp1624572728-24427) [n:127.0.0.1:40551_ c:collection1 s:shard1  x:collection1_shard1_replica_n1 ] o.a.s.c.SyncStrategy Sync Success - now sync replicas to me
   [junit4]   2> 1433751 INFO  (qtp1624572728-24427) [n:127.0.0.1:40551_ c:collection1 s:shard1  x:collection1_shard1_replica_n1 ] o.a.s.c.SyncStrategy https://127.0.0.1:40551/collection1_shard1_replica_n1/ has no replicas
   [junit4]   2> 1433751 INFO  (qtp1624572728-24427) [n:127.0.0.1:40551_ c:collection1 s:shard1  x:collection1_shard1_replica_n1 ] o.a.s.c.ShardLeaderElectionContextBase Creating leader registration node /collections/collection1/leaders/shard1/leader after winning as /collections/collection1/leader_elect/shard1/election/72273962993451023-core_node4-n_0000000000
   [junit4]   2> 1433751 INFO  (qtp261692107-24415) [n:127.0.0.1:34405_ c:collection1 s:shard2  x:collection1_shard2_replica_n2 ] o.a.s.c.ZkShardTerms Successful update of terms at /collections/collection1/terms/shard2 to Terms{values={core_node3=0}, version=0}
   [junit4]   2> 1433751 INFO  (qtp261692107-24415) [n:127.0.0.1:34405_ c:collection1 s:shard2  x:collection1_shard2_replica_n2 ] o.a.s.c.ShardLeaderElectionContextBase make sure parent is created /collections/collection1/leaders/shard2
   [junit4]   2> 1433753 INFO  (qtp1624572728-24427) [n:127.0.0.1:40551_ c:collection1 s:shard1  x:collection1_shard1_replica_n1 ] o.a.s.c.ShardLeaderElectionContext I am the new leader: https://127.0.0.1:40551/collection1_shard1_replica_n1/ shard1
   [junit4]   2> 1433755 INFO  (zkCallback-7798-thread-1) [     ] o.a.s.c.c.ZkStateReader A cluster state change: [WatchedEvent state:SyncConnected type:NodeDataChanged path:/collections/collection1/state.json] for collection [collection1] has occurred - updating... (live nodes size: [3])
   [junit4]   2> 1433756 INFO  (zkCallback-7798-thread-2) [     ] o.a.s.c.c.ZkStateReader A cluster state change: [WatchedEvent state:SyncConnected type:NodeDataChanged path:/collections/collection1/state.json] for collection [collection1] has occurred - updating... (live nodes size: [3])
   [junit4]   2> 1433757 INFO  (qtp1624572728-24427) [n:127.0.0.1:40551_ c:collection1 s:shard1  x:collection1_shard1_replica_n1 ] o.a.s.c.ZkController I am the leader, no recovery necessary
   [junit4]   2> 1433758 INFO  (qtp261692107-24415) [n:127.0.0.1:34405_ c:collection1 s:shard2  x:collection1_shard2_replica_n2 ] o.a.s.c.ShardLeaderElectionContext Enough replicas found to continue.
   [junit4]   2> 1433758 INFO  (qtp261692107-24415) [n:127.0.0.1:34405_ c:collection1 s:shard2  x:collection1_shard2_replica_n2 ] o.a.s.c.ShardLeaderElectionContext I may be the new leader - try and sync
   [junit4]   2> 1433758 INFO  (qtp261692107-24415) [n:127.0.0.1:34405_ c:collection1 s:shard2  x:collection1_shard2_replica_n2 ] o.a.s.c.SyncStrategy Sync replicas to https://127.0.0.1:34405/collection1_shard2_replica_n2/
   [junit4]   2> 1433758 INFO  (qtp261692107-24415) [n:127.0.0.1:34405_ c:collection1 s:shard2  x:collection1_shard2_replica_n2 ] o.a.s.c.SyncStrategy Sync Success - now sync replicas to me
   [junit4]   2> 1433759 INFO  (qtp261692107-24415) [n:127.0.0.1:34405_ c:collection1 s:shard2  x:collection1_shard2_replica_n2 ] o.a.s.c.SyncStrategy https://127.0.0.1:34405/collection1_shard2_replica_n2/ has no replicas
   [junit4]   2> 1433759 INFO  (qtp261692107-24415) [n:127.0.0.1:34405_ c:collection1 s:shard2  x:collection1_shard2_replica_n2 ] o.a.s.c.ShardLeaderElectionContextBase Creating leader registration node /collections/collection1/leaders/shard2/leader after winning as /collections/collection1/leader_elect/shard2/election/72273962993451020-core_node3-n_0000000000
   [junit4]   2> 1433761 INFO  (qtp1624572728-24427) [n:127.0.0.1:40551_ c:collection1 s:shard1  x:collection1_shard1_replica_n1 ] o.a.s.s.HttpSolrCall [admin] webapp=null path=/admin/cores params={qt=/admin/cores&collection.configName=conf1&name=collection1_shard1_replica_n1&action=CREATE&collection=collection1&shard=shard1&wt=javabin&version=2&replicaType=NRT} status=0 QTime=1345
   [junit4]   2> 1433763 INFO  (qtp261692107-24415) [n:127.0.0.1:34405_ c:collection1 s:shard2  x:collection1_shard2_replica_n2 ] o.a.s.c.ShardLeaderElectionContext I am the new leader: https://127.0.0.1:34405/collection1_shard2_replica_n2/ shard2
   [junit4]   2> 1433765 INFO  (qtp261692107-24413) [n:127.0.0.1:34405_ c:collection1    ] o.a.s.s.HttpSolrCall [admin] webapp=null path=/admin/collections params={node=127.0.0.1:40551_&action=ADDREPLICA&collection=collection1&shard=shard1&type=NRT&wt=javabin&version=2} status=0 QTime=1425
   [junit4]   2> 1433866 INFO  (zkCallback-7798-thread-1) [     ] o.a.s.c.c.ZkStateReader A cluster state change: [WatchedEvent state:SyncConnected type:NodeDataChanged path:/collections/collection1/state.json] for collection [collection1] has occurred - updating... (live nodes size: [3])
   [junit4]   2> 1433866 INFO  (zkCallback-7798-thread-2) [     ] o.a.s.c.c.ZkStateReader A cluster state change: [WatchedEvent state:SyncConnected type:NodeDataChanged path:/collections/collection1/state.json] for collection [collection1] has occurred - updating... (live nodes size: [3])
   [junit4]   2> 1433866 INFO  (zkCallback-7782-thread-1) [     ] o.a.s.c.c.ZkStateReader A cluster state change: [WatchedEvent state:SyncConnected type:NodeDataChanged path:/collections/collection1/state.json] for collection [collection1] has occurred - updating... (live nodes size: [3])
   [junit4]   2> 1433866 INFO  (zkCallback-7798-thread-3) [     ] o.a.s.c.c.ZkStateReader A cluster state change: [WatchedEvent state:SyncConnected type:NodeDataChanged path:/collections/collection1/state.json] for collection [collection1] has occurred - updating... (live nodes size: [3])
   [junit4]   2> 1433868 INFO  (qtp261692107-24415) [n:127.0.0.1:34405_ c:collection1 s:shard2  x:collection1_shard2_replica_n2 ] o.a.s.c.ZkController I am the leader, no recovery necessary
   [junit4]   2> 1433871 INFO  (qtp261692107-24415) [n:127.0.0.1:34405_ c:collection1 s:shard2  x:collection1_shard2_replica_n2 ] o.a.s.s.HttpSolrCall [admin] webapp=null path=/admin/cores params={qt=/admin/cores&collection.configName=conf1&name=collection1_shard2_replica_n2&action=CREATE&collection=collection1&shard=shard2&wt=javabin&version=2&replicaType=NRT} status=0 QTime=1464
   [junit4]   2> 1433876 INFO  (qtp261692107-24414) [n:127.0.0.1:34405_ c:collection1    ] o.a.s.s.HttpSolrCall [admin] webapp=null path=/admin/collections params={node=127.0.0.1:34405_&action=ADDREPLICA&collection=collection1&shard=shard2&type=NRT&wt=javabin&version=2} status=0 QTime=1536
   [junit4]   2> 1433877 INFO  (TEST-RollingRestartTest.test-seed#[F616D8058F8E697B]) [     ] o.a.s.c.AbstractFullDistribZkTestBase Waiting to see 2 active replicas in collection: collection1
   [junit4]   2> 1433972 INFO  (zkCallback-7767-thread-1) [     ] o.a.s.c.c.ZkStateReader A cluster state change: [WatchedEvent state:SyncConnected type:NodeDataChanged path:/collections/collection1/state.json] for collection [collection1] has occurred - updating... (live nodes size: [3])
   [junit4]   2> 1433972 INFO  (zkCallback-7798-thread-1) [     ] o.a.s.c.c.ZkStateReader A cluster state change: [WatchedEvent state:SyncConnected type:NodeDataChanged path:/collections/collection1/state.json] for collection [collection1] has occurred - updating... (live nodes size: [3])
   [junit4]   2> 1433972 INFO  (zkCallback-7798-thread-2) [     ] o.a.s.c.c.ZkStateReader A cluster state change: [WatchedEvent state:SyncConnected type:NodeDataChanged path:/collections/collection1/state.json] for collection [collection1] has occurred - updating... (live nodes size: [3])
   [junit4]   2> 1433972 INFO  (zkCallback-7782-thread-1) [     ] o.a.s.c.c.ZkStateReader A cluster state change: [WatchedEvent state:SyncConnected type:NodeDataChanged path:/collections/collection1/state.json] for collection [collection1] has occurred - updating... (live nodes size: [3])
   [junit4]   2> 1433972 INFO  (zkCallback-7798-thread-3) [     ] o.a.s.c.c.ZkStateReader A cluster state change: [WatchedEvent state:SyncConnected type:NodeDataChanged path:/collections/collection1/state.json] for collection [collection1] has occurred - updating... (live nodes size: [3])
   [junit4]   2> 1433974 INFO  (zkCallback-7782-thread-2) [     ] o.a.s.c.c.ZkStateReader A cluster state change: [WatchedEvent state:SyncConnected type:NodeDataChanged path:/collections/collection1/state.json] for collection [collection1] has occurred - updating... (live nodes size: [3])
   [junit4]   2> 1433982 INFO  (TEST-RollingRestartTest.test-seed#[F616D8058F8E697B]) [     ] o.a.s.SolrTestCaseJ4 ###Starting test
   [junit4]   2> 1433982 INFO  (TEST-RollingRestartTest.test-seed#[F616D8058F8E697B]) [     ] o.a.s.c.AbstractDistribZkTestBase Wait for recoveries to finish - collection: collection1 failOnTimeout:true timeout (sec):330
   [junit4]   2> 1433984 INFO  (TEST-RollingRestartTest.test-seed#[F616D8058F8E697B]) [     ] o.a.s.c.AbstractDistribZkTestBase Recoveries finished - collection: collection1
   [junit4]   2> 1433984 INFO  (TEST-RollingRestartTest.test-seed#[F616D8058F8E697B]) [     ] o.a.s.c.RollingRestartTest Current overseer leader = 127.0.0.1:46325_
   [junit4]   1> / (11)
   [junit4]   1>  /configs (2)
   [junit4]   1>   /configs/_default (7)
   [junit4]   1>    /configs/_default/protwords.txt (0)
   [junit4]   1>    DATA: ...supressed...
   [junit4]   1>    /configs/_default/managed-schema (0)
   [junit4]   1>    DATA:
   [junit4]   1>        <?xml version="1.0" encoding="UTF-8" ?>
   [junit4]   1>        <!--
   [junit4]   1>         Licensed to the Apache Software Foundation (ASF) under one or more
   [junit4]   1>         contributor license agreements.  See the NOTICE file distributed with
   [junit4]   1>         this work for additional information regarding copyright ownership.
   [junit4]   1>         The ASF licenses this file to You under the Apache License, Version 2.0
   [junit4]   1>         (the "License"); you may not use this file except in compliance with
   [junit4]   1>         the License.  You may obtain a copy of the License at
   [junit4]   1>        
   [junit4]   1>             http://www.apache.org/licenses/LICENSE-2.0
   [junit4]   1>        
   [junit4]   1>         Unless required by applicable law or agreed to in writing, software
   [junit4]   1>         distributed under the License is distributed on an "AS IS" BASIS,
   [junit4]   1>         WITHOUT WARRANTIES OR CONDITIONS OF ANY KIND, either express or implied.
   [junit4]   1>         See the License for the specific language governing permissions and
   [junit4]   1>         limitations under the License.
   [junit4]   1>        -->
   [junit4]   1>        
   [junit4]   1>        <!--
   [junit4]   1>        
   [junit4]   1>         This example schema is the recommended starting point for users.
   [junit4]   1>         It should be kept correct and concise, usable out-of-the-box.
   [junit4]   1>        
   [junit4]   1>        
   [junit4]   1>         For more information, on how to customize this file, please see
   [junit4]   1>         http://lucene.apache.org/solr/guide/documents-fields-and-schema-design.html
   [junit4]   1>        
   [junit4]   1>         PERFORMANCE NOTE: this schema includes many optional features and should not
   [junit4]   1>         be used for benchmarking.  To improve performance one could
   [junit4]   1>          - set stored="false" for all fields possible (esp large fields) when you
   [junit4]   1>            only need to search on the field but don't need to return the original
   [junit4]   1>            value.
   [junit4]   1>          - set indexed="false" if you don't need to search on the field, but only
   [junit4]   1>            return the field as a result of searching on other indexed fields.
   [junit4]   1>          - remove all unneeded copyField statements
   [junit4]   1>          - for best index size and searching performance, set "index" to false
   [junit4]   1>            for all general text fields, use copyField to copy them to the
   [junit4]   1>            catchall "text" field, and use that for searching.
   [junit4]   1>        -->
   [junit4]   1>        
   [junit4]   1>        <schema name="default-config" version="1.6">
   [junit4]   1>            <!-- attribute "name" is the name of this schema and is only used for display purposes.
   [junit4]   1>               version="x.y" is Solr's version number for the schema syntax and
   [junit4]   1>               semantics.  It should not normally be changed by applications.
   [junit4]   1>        
   [junit4]   1>               1.0: multiValued attribute did not exist, all fields are multiValued
   [junit4]   1>                    by nature
   [junit4]   1>               1.1: multiValued attribute introduced, false by default
   [junit4]   1>               1.2: omitTermFreqAndPositions attribute introduced, true by default
   [junit4]   1>                    except for text fields.
   [junit4]   1>               1.3: removed optional field compress feature
   [junit4]   1>               1.4: autoGeneratePhraseQueries attribute introduced to drive QueryParser
   [junit4]   1>                    behavior when a single string produces multiple tokens.  Defaults
   [junit4]   1>                    to off for version >= 1.4
   [junit4]   1>               1.5: omitNorms defaults to true for primitive field types
   [junit4]   1>                    (int, float, boolean, string...)
   [junit4]   1>               1.6: useDocValuesAsStored defaults to true.
   [junit4]   1>            -->
   [junit4]   1>        
   [junit4]   1>            <!-- Valid attributes for fields:
   [junit4]   1>             name: mandatory - the name for the field
   [junit4]   1>             type: mandatory - the name of a field type from the
   [junit4]   1>               fieldTypes section
   [junit4]   1>             indexed: true if this field should be indexed (searchable or sortable)
   [junit4]   1>             stored: true if this field should be retrievable
   [junit4]   1>             docValues: true if this field should have doc values. Doc Values is
   [junit4]   1>               recommended (required, if you are using *Point fields) for faceting,
   [junit4]   1>               grouping, sorting and function queries. Doc Values will make the index
   [junit4]   1>               faster to load, more NRT-friendly and more memory-efficient.
   [junit4]   1>               They are currently only supported by StrField, UUIDField, all
   [junit4]   1>               *PointFields, and depending on the field type, they might require
   [junit4]

[...truncated too long message...]

ading settings :: file = /home/jenkins/jenkins-slave/workspace/Lucene-Solr-Tests-8.x/lucene/top-level-ivy-settings.xml

resolve:

ivy-availability-check:
[loadresource] Do not set property disallowed.ivy.jars.list as its length is 0.

-ivy-fail-disallowed-ivy-version:

ivy-fail:

ivy-configure:
[ivy:configure] :: loading settings :: file = /home/jenkins/jenkins-slave/workspace/Lucene-Solr-Tests-8.x/lucene/top-level-ivy-settings.xml

resolve:

ivy-availability-check:
[loadresource] Do not set property disallowed.ivy.jars.list as its length is 0.

-ivy-fail-disallowed-ivy-version:

ivy-fail:

ivy-fail:

ivy-configure:
[ivy:configure] :: loading settings :: file = /home/jenkins/jenkins-slave/workspace/Lucene-Solr-Tests-8.x/lucene/top-level-ivy-settings.xml

resolve:

ivy-availability-check:
[loadresource] Do not set property disallowed.ivy.jars.list as its length is 0.

-ivy-fail-disallowed-ivy-version:

ivy-fail:

ivy-configure:
[ivy:configure] :: loading settings :: file = /home/jenkins/jenkins-slave/workspace/Lucene-Solr-Tests-8.x/lucene/top-level-ivy-settings.xml

resolve:

ivy-availability-check:
[loadresource] Do not set property disallowed.ivy.jars.list as its length is 0.

-ivy-fail-disallowed-ivy-version:

ivy-fail:

ivy-fail:

ivy-configure:
[ivy:configure] :: loading settings :: file = /home/jenkins/jenkins-slave/workspace/Lucene-Solr-Tests-8.x/lucene/top-level-ivy-settings.xml

resolve:

ivy-availability-check:
[loadresource] Do not set property disallowed.ivy.jars.list as its length is 0.

-ivy-fail-disallowed-ivy-version:

ivy-fail:

ivy-fail:

ivy-configure:
[ivy:configure] :: loading settings :: file = /home/jenkins/jenkins-slave/workspace/Lucene-Solr-Tests-8.x/lucene/top-level-ivy-settings.xml

resolve:

ivy-availability-check:
[loadresource] Do not set property disallowed.ivy.jars.list as its length is 0.

-ivy-fail-disallowed-ivy-version:

ivy-fail:

ivy-fail:

ivy-configure:
[ivy:configure] :: loading settings :: file = /home/jenkins/jenkins-slave/workspace/Lucene-Solr-Tests-8.x/lucene/top-level-ivy-settings.xml

resolve:

ivy-availability-check:
[loadresource] Do not set property disallowed.ivy.jars.list as its length is 0.

-ivy-fail-disallowed-ivy-version:

ivy-fail:

ivy-fail:

ivy-configure:
[ivy:configure] :: loading settings :: file = /home/jenkins/jenkins-slave/workspace/Lucene-Solr-Tests-8.x/lucene/top-level-ivy-settings.xml

resolve:

ivy-availability-check:
[loadresource] Do not set property disallowed.ivy.jars.list as its length is 0.

-ivy-fail-disallowed-ivy-version:

ivy-fail:

ivy-fail:

ivy-configure:
[ivy:configure] :: loading settings :: file = /home/jenkins/jenkins-slave/workspace/Lucene-Solr-Tests-8.x/lucene/top-level-ivy-settings.xml

resolve:

ivy-availability-check:
[loadresource] Do not set property disallowed.ivy.jars.list as its length is 0.

-ivy-fail-disallowed-ivy-version:

ivy-fail:

ivy-fail:

ivy-configure:
[ivy:configure] :: loading settings :: file = /home/jenkins/jenkins-slave/workspace/Lucene-Solr-Tests-8.x/lucene/top-level-ivy-settings.xml

resolve:

ivy-availability-check:
[loadresource] Do not set property disallowed.ivy.jars.list as its length is 0.

-ivy-fail-disallowed-ivy-version:

ivy-fail:

ivy-fail:

ivy-configure:
[ivy:configure] :: loading settings :: file = /home/jenkins/jenkins-slave/workspace/Lucene-Solr-Tests-8.x/lucene/top-level-ivy-settings.xml

resolve:

ivy-availability-check:
[loadresource] Do not set property disallowed.ivy.jars.list as its length is 0.

-ivy-fail-disallowed-ivy-version:

ivy-fail:

ivy-fail:

ivy-configure:
[ivy:configure] :: loading settings :: file = /home/jenkins/jenkins-slave/workspace/Lucene-Solr-Tests-8.x/lucene/top-level-ivy-settings.xml

resolve:

ivy-availability-check:
[loadresource] Do not set property disallowed.ivy.jars.list as its length is 0.

-ivy-fail-disallowed-ivy-version:

ivy-fail:

ivy-fail:

ivy-configure:
[ivy:configure] :: loading settings :: file = /home/jenkins/jenkins-slave/workspace/Lucene-Solr-Tests-8.x/lucene/top-level-ivy-settings.xml

resolve:

ivy-availability-check:
[loadresource] Do not set property disallowed.ivy.jars.list as its length is 0.

-ivy-fail-disallowed-ivy-version:

ivy-fail:

ivy-fail:

ivy-configure:
[ivy:configure] :: loading settings :: file = /home/jenkins/jenkins-slave/workspace/Lucene-Solr-Tests-8.x/lucene/top-level-ivy-settings.xml

resolve:

ivy-availability-check:
[loadresource] Do not set property disallowed.ivy.jars.list as its length is 0.

-ivy-fail-disallowed-ivy-version:

ivy-fail:

ivy-fail:

ivy-configure:
[ivy:configure] :: loading settings :: file = /home/jenkins/jenkins-slave/workspace/Lucene-Solr-Tests-8.x/lucene/top-level-ivy-settings.xml

resolve:

jar-checksums:
    [mkdir] Created dir: /home/jenkins/jenkins-slave/workspace/Lucene-Solr-Tests-8.x/solr/null1941922026
     [copy] Copying 249 files to /home/jenkins/jenkins-slave/workspace/Lucene-Solr-Tests-8.x/solr/null1941922026
   [delete] Deleting directory /home/jenkins/jenkins-slave/workspace/Lucene-Solr-Tests-8.x/solr/null1941922026

check-working-copy:
[ivy:cachepath] :: resolving dependencies :: #;working@lucene1-us-west
[ivy:cachepath] confs: [default]
[ivy:cachepath] found org.eclipse.jgit#org.eclipse.jgit;5.3.0.201903130848-r in public
[ivy:cachepath] found com.jcraft#jsch;0.1.54 in public
[ivy:cachepath] found com.jcraft#jzlib;1.1.1 in public
[ivy:cachepath] found com.googlecode.javaewah#JavaEWAH;1.1.6 in public
[ivy:cachepath] found org.slf4j#slf4j-api;1.7.2 in public
[ivy:cachepath] found org.bouncycastle#bcpg-jdk15on;1.60 in public
[ivy:cachepath] found org.bouncycastle#bcprov-jdk15on;1.60 in public
[ivy:cachepath] found org.bouncycastle#bcpkix-jdk15on;1.60 in public
[ivy:cachepath] found org.slf4j#slf4j-nop;1.7.2 in public
[ivy:cachepath] :: resolution report :: resolve 60ms :: artifacts dl 2ms
        ---------------------------------------------------------------------
        |                  |            modules            ||   artifacts   |
        |       conf       | number| search|dwnlded|evicted|| number|dwnlded|
        ---------------------------------------------------------------------
        |      default     |   9   |   0   |   0   |   0   ||   9   |   0   |
        ---------------------------------------------------------------------
[wc-checker] Initializing working copy...
[wc-checker] Checking working copy status...

-jenkins-base:

BUILD SUCCESSFUL
Total time: 117 minutes 33 seconds
Archiving artifacts
java.lang.InterruptedException: no matches found within 10000
        at hudson.FilePath$ValidateAntFileMask.hasMatch(FilePath.java:2847)
        at hudson.FilePath$ValidateAntFileMask.invoke(FilePath.java:2726)
        at hudson.FilePath$ValidateAntFileMask.invoke(FilePath.java:2707)
        at hudson.FilePath$FileCallableWrapper.call(FilePath.java:3086)
Also:   hudson.remoting.Channel$CallSiteStackTrace: Remote call to lucene
                at hudson.remoting.Channel.attachCallSiteStackTrace(Channel.java:1741)
                at hudson.remoting.UserRequest$ExceptionResponse.retrieve(UserRequest.java:357)
                at hudson.remoting.Channel.call(Channel.java:955)
                at hudson.FilePath.act(FilePath.java:1072)
                at hudson.FilePath.act(FilePath.java:1061)
                at hudson.FilePath.validateAntFileMask(FilePath.java:2705)
                at hudson.tasks.ArtifactArchiver.perform(ArtifactArchiver.java:243)
                at hudson.tasks.BuildStepCompatibilityLayer.perform(BuildStepCompatibilityLayer.java:81)
                at hudson.tasks.BuildStepMonitor$1.perform(BuildStepMonitor.java:20)
                at hudson.model.AbstractBuild$AbstractBuildExecution.perform(AbstractBuild.java:744)
                at hudson.model.AbstractBuild$AbstractBuildExecution.performAllBuildSteps(AbstractBuild.java:690)
                at hudson.model.Build$BuildExecution.post2(Build.java:186)
                at hudson.model.AbstractBuild$AbstractBuildExecution.post(AbstractBuild.java:635)
                at hudson.model.Run.execute(Run.java:1835)
                at hudson.model.FreeStyleBuild.run(FreeStyleBuild.java:43)
                at hudson.model.ResourceController.execute(ResourceController.java:97)
                at hudson.model.Executor.run(Executor.java:429)
Caused: hudson.FilePath$TunneledInterruptedException
        at hudson.FilePath$FileCallableWrapper.call(FilePath.java:3088)
        at hudson.remoting.UserRequest.perform(UserRequest.java:212)
        at hudson.remoting.UserRequest.perform(UserRequest.java:54)
        at hudson.remoting.Request$2.run(Request.java:369)
        at hudson.remoting.InterceptingExecutorService$1.call(InterceptingExecutorService.java:72)
        at java.util.concurrent.FutureTask.run(FutureTask.java:266)
        at java.util.concurrent.ThreadPoolExecutor.runWorker(ThreadPoolExecutor.java:1142)
        at java.util.concurrent.ThreadPoolExecutor$Worker.run(ThreadPoolExecutor.java:617)
        at java.lang.Thread.run(Thread.java:744)
Caused: java.lang.InterruptedException: java.lang.InterruptedException: no matches found within 10000
        at hudson.FilePath.act(FilePath.java:1074)
        at hudson.FilePath.act(FilePath.java:1061)
        at hudson.FilePath.validateAntFileMask(FilePath.java:2705)
        at hudson.tasks.ArtifactArchiver.perform(ArtifactArchiver.java:243)
        at hudson.tasks.BuildStepCompatibilityLayer.perform(BuildStepCompatibilityLayer.java:81)
        at hudson.tasks.BuildStepMonitor$1.perform(BuildStepMonitor.java:20)
        at hudson.model.AbstractBuild$AbstractBuildExecution.perform(AbstractBuild.java:744)
        at hudson.model.AbstractBuild$AbstractBuildExecution.performAllBuildSteps(AbstractBuild.java:690)
        at hudson.model.Build$BuildExecution.post2(Build.java:186)
        at hudson.model.AbstractBuild$AbstractBuildExecution.post(AbstractBuild.java:635)
        at hudson.model.Run.execute(Run.java:1835)
        at hudson.model.FreeStyleBuild.run(FreeStyleBuild.java:43)
        at hudson.model.ResourceController.execute(ResourceController.java:97)
        at hudson.model.Executor.run(Executor.java:429)
No artifacts found that match the file pattern "**/*.events,heapdumps/**,**/hs_err_pid*". Configuration error?
Recording test results
Build step 'Publish JUnit test result report' changed build result to UNSTABLE
Email was triggered for: Unstable (Test Failures)
Sending email for trigger: Unstable (Test Failures)


---------------------------------------------------------------------
To unsubscribe, e-mail: [hidden email]
For additional commands, e-mail: [hidden email]