[JENKINS] Lucene-Solr-Tests-8.x - Build # 509 - Unstable

classic Classic list List threaded Threaded
2 messages Options
Reply | Threaded
Open this post in threaded view
|

[JENKINS] Lucene-Solr-Tests-8.x - Build # 509 - Unstable

Apache Jenkins Server-2
Build: https://builds.apache.org/job/Lucene-Solr-Tests-8.x/509/

1 tests failed.
FAILED:  org.apache.solr.cloud.MetricsHistoryWithAuthIntegrationTest.testValuesAreCollected

Error Message:


Stack Trace:
java.lang.AssertionError
        at __randomizedtesting.SeedInfo.seed([EF7FB78D6CD33B0C:C782EAEABD37A449]:0)
        at org.junit.Assert.fail(Assert.java:86)
        at org.junit.Assert.assertTrue(Assert.java:41)
        at org.junit.Assert.assertNotNull(Assert.java:712)
        at org.junit.Assert.assertNotNull(Assert.java:722)
        at org.apache.solr.cloud.MetricsHistoryWithAuthIntegrationTest.testValuesAreCollected(MetricsHistoryWithAuthIntegrationTest.java:86)
        at sun.reflect.NativeMethodAccessorImpl.invoke0(Native Method)
        at sun.reflect.NativeMethodAccessorImpl.invoke(NativeMethodAccessorImpl.java:62)
        at sun.reflect.DelegatingMethodAccessorImpl.invoke(DelegatingMethodAccessorImpl.java:43)
        at java.lang.reflect.Method.invoke(Method.java:498)
        at com.carrotsearch.randomizedtesting.RandomizedRunner.invoke(RandomizedRunner.java:1750)
        at com.carrotsearch.randomizedtesting.RandomizedRunner$8.evaluate(RandomizedRunner.java:938)
        at com.carrotsearch.randomizedtesting.RandomizedRunner$9.evaluate(RandomizedRunner.java:974)
        at com.carrotsearch.randomizedtesting.RandomizedRunner$10.evaluate(RandomizedRunner.java:988)
        at com.carrotsearch.randomizedtesting.rules.SystemPropertiesRestoreRule$1.evaluate(SystemPropertiesRestoreRule.java:57)
        at org.apache.lucene.util.TestRuleSetupTeardownChained$1.evaluate(TestRuleSetupTeardownChained.java:49)
        at org.apache.lucene.util.AbstractBeforeAfterRule$1.evaluate(AbstractBeforeAfterRule.java:45)
        at org.apache.lucene.util.TestRuleThreadAndTestName$1.evaluate(TestRuleThreadAndTestName.java:48)
        at org.apache.lucene.util.TestRuleIgnoreAfterMaxFailures$1.evaluate(TestRuleIgnoreAfterMaxFailures.java:64)
        at org.apache.lucene.util.TestRuleMarkFailure$1.evaluate(TestRuleMarkFailure.java:47)
        at com.carrotsearch.randomizedtesting.rules.StatementAdapter.evaluate(StatementAdapter.java:36)
        at com.carrotsearch.randomizedtesting.ThreadLeakControl$StatementRunner.run(ThreadLeakControl.java:368)
        at com.carrotsearch.randomizedtesting.ThreadLeakControl.forkTimeoutingTask(ThreadLeakControl.java:817)
        at com.carrotsearch.randomizedtesting.ThreadLeakControl$3.evaluate(ThreadLeakControl.java:468)
        at com.carrotsearch.randomizedtesting.RandomizedRunner.runSingleTest(RandomizedRunner.java:947)
        at com.carrotsearch.randomizedtesting.RandomizedRunner$5.evaluate(RandomizedRunner.java:832)
        at com.carrotsearch.randomizedtesting.RandomizedRunner$6.evaluate(RandomizedRunner.java:883)
        at com.carrotsearch.randomizedtesting.RandomizedRunner$7.evaluate(RandomizedRunner.java:894)
        at com.carrotsearch.randomizedtesting.rules.StatementAdapter.evaluate(StatementAdapter.java:36)
        at com.carrotsearch.randomizedtesting.rules.SystemPropertiesRestoreRule$1.evaluate(SystemPropertiesRestoreRule.java:57)
        at org.apache.lucene.util.AbstractBeforeAfterRule$1.evaluate(AbstractBeforeAfterRule.java:45)
        at com.carrotsearch.randomizedtesting.rules.StatementAdapter.evaluate(StatementAdapter.java:36)
        at org.apache.lucene.util.TestRuleStoreClassName$1.evaluate(TestRuleStoreClassName.java:41)
        at com.carrotsearch.randomizedtesting.rules.NoShadowingOrOverridesOnMethodsRule$1.evaluate(NoShadowingOrOverridesOnMethodsRule.java:40)
        at com.carrotsearch.randomizedtesting.rules.NoShadowingOrOverridesOnMethodsRule$1.evaluate(NoShadowingOrOverridesOnMethodsRule.java:40)
        at com.carrotsearch.randomizedtesting.rules.StatementAdapter.evaluate(StatementAdapter.java:36)
        at com.carrotsearch.randomizedtesting.rules.StatementAdapter.evaluate(StatementAdapter.java:36)
        at com.carrotsearch.randomizedtesting.rules.StatementAdapter.evaluate(StatementAdapter.java:36)
        at org.apache.lucene.util.TestRuleAssertionsRequired$1.evaluate(TestRuleAssertionsRequired.java:53)
        at org.apache.lucene.util.TestRuleMarkFailure$1.evaluate(TestRuleMarkFailure.java:47)
        at org.apache.lucene.util.TestRuleIgnoreAfterMaxFailures$1.evaluate(TestRuleIgnoreAfterMaxFailures.java:64)
        at org.apache.lucene.util.TestRuleIgnoreTestSuites$1.evaluate(TestRuleIgnoreTestSuites.java:54)
        at com.carrotsearch.randomizedtesting.rules.StatementAdapter.evaluate(StatementAdapter.java:36)
        at com.carrotsearch.randomizedtesting.ThreadLeakControl$StatementRunner.run(ThreadLeakControl.java:368)
        at java.lang.Thread.run(Thread.java:748)




Build Log:
[...truncated 13170 lines...]
   [junit4] Suite: org.apache.solr.cloud.MetricsHistoryWithAuthIntegrationTest
   [junit4]   2> 46059 INFO  (SUITE-MetricsHistoryWithAuthIntegrationTest-seed#[EF7FB78D6CD33B0C]-worker) [     ] o.a.s.SolrTestCaseJ4 Created dataDir: /home/jenkins/jenkins-slave/workspace/Lucene-Solr-Tests-8.x/solr/build/solr-core/test/J1/temp/solr.cloud.MetricsHistoryWithAuthIntegrationTest_EF7FB78D6CD33B0C-001/data-dir-2-001
   [junit4]   2> 46066 WARN  (SUITE-MetricsHistoryWithAuthIntegrationTest-seed#[EF7FB78D6CD33B0C]-worker) [     ] o.a.s.SolrTestCaseJ4 startTrackingSearchers: numOpens=37 numCloses=37
   [junit4]   2> 46067 INFO  (SUITE-MetricsHistoryWithAuthIntegrationTest-seed#[EF7FB78D6CD33B0C]-worker) [     ] o.a.s.SolrTestCaseJ4 Using PointFields (NUMERIC_POINTS_SYSPROP=true) w/NUMERIC_DOCVALUES_SYSPROP=true
   [junit4]   2> 46079 INFO  (SUITE-MetricsHistoryWithAuthIntegrationTest-seed#[EF7FB78D6CD33B0C]-worker) [     ] o.a.s.SolrTestCaseJ4 Randomized ssl (true) and clientAuth (true) via: @org.apache.solr.util.RandomizeSSL(reason=, value=NaN, ssl=NaN, clientAuth=NaN)
   [junit4]   2> 46170 INFO  (SUITE-MetricsHistoryWithAuthIntegrationTest-seed#[EF7FB78D6CD33B0C]-worker) [     ] o.a.s.SolrTestCaseJ4 SecureRandom sanity checks: test.solr.allowed.securerandom=null & java.security.egd=file:/dev/./urandom
   [junit4]   2> 46176 INFO  (SUITE-MetricsHistoryWithAuthIntegrationTest-seed#[EF7FB78D6CD33B0C]-worker) [     ] o.a.s.c.MiniSolrCloudCluster Starting cluster of 1 servers in /home/jenkins/jenkins-slave/workspace/Lucene-Solr-Tests-8.x/solr/build/solr-core/test/J1/temp/solr.cloud.MetricsHistoryWithAuthIntegrationTest_EF7FB78D6CD33B0C-001/tempDir-001
   [junit4]   2> 46189 INFO  (SUITE-MetricsHistoryWithAuthIntegrationTest-seed#[EF7FB78D6CD33B0C]-worker) [     ] o.a.s.c.ZkTestServer STARTING ZK TEST SERVER
   [junit4]   2> 46192 INFO  (ZkTestServer Run Thread) [     ] o.a.s.c.ZkTestServer client port:0.0.0.0/0.0.0.0:0
   [junit4]   2> 46192 INFO  (ZkTestServer Run Thread) [     ] o.a.s.c.ZkTestServer Starting server
   [junit4]   2> 46392 INFO  (SUITE-MetricsHistoryWithAuthIntegrationTest-seed#[EF7FB78D6CD33B0C]-worker) [     ] o.a.s.c.ZkTestServer start zk server on port:36933
   [junit4]   2> 46392 INFO  (SUITE-MetricsHistoryWithAuthIntegrationTest-seed#[EF7FB78D6CD33B0C]-worker) [     ] o.a.s.c.ZkTestServer waitForServerUp: 127.0.0.1:36933
   [junit4]   2> 46392 INFO  (SUITE-MetricsHistoryWithAuthIntegrationTest-seed#[EF7FB78D6CD33B0C]-worker) [     ] o.a.s.c.ZkTestServer parse host and port list: 127.0.0.1:36933
   [junit4]   2> 46392 INFO  (SUITE-MetricsHistoryWithAuthIntegrationTest-seed#[EF7FB78D6CD33B0C]-worker) [     ] o.a.s.c.ZkTestServer connecting to 127.0.0.1 36933
   [junit4]   2> 46720 INFO  (SUITE-MetricsHistoryWithAuthIntegrationTest-seed#[EF7FB78D6CD33B0C]-worker) [     ] o.a.s.c.c.ConnectionManager Waiting for client to connect to ZooKeeper
   [junit4]   2> 46880 INFO  (zkConnectionManagerCallback-35-thread-1) [     ] o.a.s.c.c.ConnectionManager zkClient has connected
   [junit4]   2> 46880 INFO  (SUITE-MetricsHistoryWithAuthIntegrationTest-seed#[EF7FB78D6CD33B0C]-worker) [     ] o.a.s.c.c.ConnectionManager Client is connected to ZooKeeper
   [junit4]   2> 47013 INFO  (SUITE-MetricsHistoryWithAuthIntegrationTest-seed#[EF7FB78D6CD33B0C]-worker) [     ] o.a.s.c.c.ConnectionManager Waiting for client to connect to ZooKeeper
   [junit4]   2> 47044 INFO  (zkConnectionManagerCallback-37-thread-1) [     ] o.a.s.c.c.ConnectionManager zkClient has connected
   [junit4]   2> 47044 INFO  (SUITE-MetricsHistoryWithAuthIntegrationTest-seed#[EF7FB78D6CD33B0C]-worker) [     ] o.a.s.c.c.ConnectionManager Client is connected to ZooKeeper
   [junit4]   2> 47063 INFO  (SUITE-MetricsHistoryWithAuthIntegrationTest-seed#[EF7FB78D6CD33B0C]-worker) [     ] o.a.s.c.c.ConnectionManager Waiting for client to connect to ZooKeeper
   [junit4]   2> 47356 INFO  (zkConnectionManagerCallback-39-thread-1) [     ] o.a.s.c.c.ConnectionManager zkClient has connected
   [junit4]   2> 47357 INFO  (SUITE-MetricsHistoryWithAuthIntegrationTest-seed#[EF7FB78D6CD33B0C]-worker) [     ] o.a.s.c.c.ConnectionManager Client is connected to ZooKeeper
   [junit4]   2> 47518 WARN  (jetty-launcher-40-thread-1) [     ] o.e.j.s.AbstractConnector Ignoring deprecated socket close linger time
   [junit4]   2> 47522 INFO  (jetty-launcher-40-thread-1) [     ] o.a.s.c.s.e.JettySolrRunner Start Jetty (original configured port=0)
   [junit4]   2> 47522 INFO  (jetty-launcher-40-thread-1) [     ] o.a.s.c.s.e.JettySolrRunner Trying to start Jetty on port 0 try number 1 ...
   [junit4]   2> 47522 INFO  (jetty-launcher-40-thread-1) [     ] o.e.j.s.Server jetty-9.4.19.v20190610; built: 2019-06-10T16:30:51.723Z; git: afcf563148970e98786327af5e07c261fda175d3; jvm 1.8.0_191-b12
   [junit4]   2> 47562 INFO  (jetty-launcher-40-thread-1) [     ] o.e.j.s.session DefaultSessionIdManager workerName=node0
   [junit4]   2> 47562 INFO  (jetty-launcher-40-thread-1) [     ] o.e.j.s.session No SessionScavenger set, using defaults
   [junit4]   2> 47562 INFO  (jetty-launcher-40-thread-1) [     ] o.e.j.s.session node0 Scavenging every 600000ms
   [junit4]   2> 47563 INFO  (jetty-launcher-40-thread-1) [     ] o.e.j.s.h.ContextHandler Started o.e.j.s.ServletContextHandler@6d23065{/solr,null,AVAILABLE}
   [junit4]   2> 47778 INFO  (jetty-launcher-40-thread-1) [     ] o.e.j.s.AbstractConnector Started ServerConnector@1ad45b1{SSL,[ssl, http/1.1]}{127.0.0.1:43651}
   [junit4]   2> 47778 INFO  (jetty-launcher-40-thread-1) [     ] o.e.j.s.Server Started @47869ms
   [junit4]   2> 47778 INFO  (jetty-launcher-40-thread-1) [     ] o.a.s.c.s.e.JettySolrRunner Jetty properties: {hostContext=/solr, hostPort=43651}
   [junit4]   2> 47778 ERROR (jetty-launcher-40-thread-1) [     ] o.a.s.u.StartupLoggingUtils Missing Java Option solr.log.dir. Logging may be missing or incomplete.
   [junit4]   2> 47778 INFO  (jetty-launcher-40-thread-1) [     ] o.a.s.s.SolrDispatchFilter Using logger factory org.apache.logging.slf4j.Log4jLoggerFactory
   [junit4]   2> 47778 INFO  (jetty-launcher-40-thread-1) [     ] o.a.s.s.SolrDispatchFilter  ___      _       Welcome to Apache Solr™ version 8.3.0
   [junit4]   2> 47778 INFO  (jetty-launcher-40-thread-1) [     ] o.a.s.s.SolrDispatchFilter / __| ___| |_ _   Starting in cloud mode on port null
   [junit4]   2> 47779 INFO  (jetty-launcher-40-thread-1) [     ] o.a.s.s.SolrDispatchFilter \__ \/ _ \ | '_|  Install dir: null
   [junit4]   2> 47779 INFO  (jetty-launcher-40-thread-1) [     ] o.a.s.s.SolrDispatchFilter |___/\___/_|_|    Start time: 2019-09-02T01:09:00.198Z
   [junit4]   2> 47779 INFO  (jetty-launcher-40-thread-1) [     ] o.a.s.c.SolrResourceLoader solr home defaulted to 'solr/' (could not find system property or JNDI)
   [junit4]   2> 47783 INFO  (jetty-launcher-40-thread-1) [     ] o.a.s.c.c.ConnectionManager Waiting for client to connect to ZooKeeper
   [junit4]   2> 47789 INFO  (zkConnectionManagerCallback-42-thread-1) [     ] o.a.s.c.c.ConnectionManager zkClient has connected
   [junit4]   2> 47789 INFO  (jetty-launcher-40-thread-1) [     ] o.a.s.c.c.ConnectionManager Client is connected to ZooKeeper
   [junit4]   2> 47793 INFO  (jetty-launcher-40-thread-1) [     ] o.a.s.s.SolrDispatchFilter solr.xml found in ZooKeeper. Loading...
   [junit4]   2> 48019 INFO  (jetty-launcher-40-thread-1) [     ] o.a.s.h.c.HttpShardHandlerFactory Host whitelist initialized: WhitelistHostChecker [whitelistHosts=null, whitelistHostCheckingEnabled=true]
   [junit4]   2> 48021 WARN  (jetty-launcher-40-thread-1) [     ] o.a.s.c.s.i.Http2SolrClient Create Http2SolrClient with HTTP/1.1 transport since Java 8 or lower versions does not support SSL + HTTP/2
   [junit4]   2> 48042 WARN  (jetty-launcher-40-thread-1) [     ] o.e.j.u.s.S.config Trusting all certificates configured for Client@32a3aabf[provider=null,keyStore=null,trustStore=null]
   [junit4]   2> 48043 WARN  (jetty-launcher-40-thread-1) [     ] o.e.j.u.s.S.config No Client EndPointIdentificationAlgorithm configured for Client@32a3aabf[provider=null,keyStore=null,trustStore=null]
   [junit4]   2> 48049 WARN  (jetty-launcher-40-thread-1) [     ] o.a.s.c.s.i.Http2SolrClient Create Http2SolrClient with HTTP/1.1 transport since Java 8 or lower versions does not support SSL + HTTP/2
   [junit4]   2> 48072 WARN  (jetty-launcher-40-thread-1) [     ] o.e.j.u.s.S.config Trusting all certificates configured for Client@70fb4dbd[provider=null,keyStore=null,trustStore=null]
   [junit4]   2> 48072 WARN  (jetty-launcher-40-thread-1) [     ] o.e.j.u.s.S.config No Client EndPointIdentificationAlgorithm configured for Client@70fb4dbd[provider=null,keyStore=null,trustStore=null]
   [junit4]   2> 48073 INFO  (jetty-launcher-40-thread-1) [     ] o.a.s.c.ZkContainer Zookeeper client=127.0.0.1:36933/solr
   [junit4]   2> 48113 INFO  (jetty-launcher-40-thread-1) [     ] o.a.s.c.c.ConnectionManager Waiting for client to connect to ZooKeeper
   [junit4]   2> 48119 INFO  (zkConnectionManagerCallback-49-thread-1) [     ] o.a.s.c.c.ConnectionManager zkClient has connected
   [junit4]   2> 48119 INFO  (jetty-launcher-40-thread-1) [     ] o.a.s.c.c.ConnectionManager Client is connected to ZooKeeper
   [junit4]   2> 48231 INFO  (jetty-launcher-40-thread-1) [n:127.0.0.1:43651_solr     ] o.a.s.c.c.ConnectionManager Waiting for client to connect to ZooKeeper
   [junit4]   2> 48236 INFO  (zkConnectionManagerCallback-51-thread-1) [     ] o.a.s.c.c.ConnectionManager zkClient has connected
   [junit4]   2> 48236 INFO  (jetty-launcher-40-thread-1) [n:127.0.0.1:43651_solr     ] o.a.s.c.c.ConnectionManager Client is connected to ZooKeeper
   [junit4]   2> 48648 INFO  (jetty-launcher-40-thread-1) [n:127.0.0.1:43651_solr     ] o.a.s.c.OverseerElectionContext I am going to be the leader 127.0.0.1:43651_solr
   [junit4]   2> 48652 INFO  (jetty-launcher-40-thread-1) [n:127.0.0.1:43651_solr     ] o.a.s.c.Overseer Overseer (id=72307163784151045-127.0.0.1:43651_solr-n_0000000000) starting
   [junit4]   2> 48743 INFO  (jetty-launcher-40-thread-1) [n:127.0.0.1:43651_solr     ] o.a.s.c.c.ConnectionManager Waiting for client to connect to ZooKeeper
   [junit4]   2> 48748 INFO  (zkConnectionManagerCallback-58-thread-1) [     ] o.a.s.c.c.ConnectionManager zkClient has connected
   [junit4]   2> 48748 INFO  (jetty-launcher-40-thread-1) [n:127.0.0.1:43651_solr     ] o.a.s.c.c.ConnectionManager Client is connected to ZooKeeper
   [junit4]   2> 48754 INFO  (jetty-launcher-40-thread-1) [n:127.0.0.1:43651_solr     ] o.a.s.c.s.i.ZkClientClusterStateProvider Cluster at 127.0.0.1:36933/solr ready
   [junit4]   2> 48977 INFO  (OverseerStateUpdate-72307163784151045-127.0.0.1:43651_solr-n_0000000000) [n:127.0.0.1:43651_solr     ] o.a.s.c.Overseer Starting to work on the main queue : 127.0.0.1:43651_solr
   [junit4]   2> 48996 INFO  (jetty-launcher-40-thread-1) [n:127.0.0.1:43651_solr     ] o.a.s.c.ZkController Register node as live in ZooKeeper:/live_nodes/127.0.0.1:43651_solr
   [junit4]   2> 49051 INFO  (zkCallback-57-thread-1) [     ] o.a.s.c.c.ZkStateReader Updated live nodes from ZooKeeper... (0) -> (1)
   [junit4]   2> 49081 INFO  (zkCallback-50-thread-1) [     ] o.a.s.c.c.ZkStateReader Updated live nodes from ZooKeeper... (0) -> (1)
   [junit4]   2> 49102 INFO  (jetty-launcher-40-thread-1) [n:127.0.0.1:43651_solr     ] o.a.s.c.PackageManager clusterprops.json changed , version 0
   [junit4]   2> 49125 INFO  (jetty-launcher-40-thread-1) [n:127.0.0.1:43651_solr     ] o.a.s.c.CoreContainer Initializing authorization plugin: solr.RuleBasedAuthorizationPlugin
   [junit4]   2> 49270 INFO  (jetty-launcher-40-thread-1) [n:127.0.0.1:43651_solr     ] o.a.s.c.CoreContainer Initializing authentication plugin: solr.BasicAuthPlugin
   [junit4]   2> 49495 INFO  (jetty-launcher-40-thread-1) [n:127.0.0.1:43651_solr     ] o.a.s.h.a.MetricsHistoryHandler No .system collection, keeping metrics history in memory.
   [junit4]   2> 49842 INFO  (jetty-launcher-40-thread-1) [n:127.0.0.1:43651_solr     ] o.a.s.m.r.SolrJmxReporter JMX monitoring for 'solr_43651.solr.node' (registry 'solr.node') enabled at server: com.sun.jmx.mbeanserver.JmxMBeanServer@5a3956e5
   [junit4]   2> 49911 INFO  (jetty-launcher-40-thread-1) [n:127.0.0.1:43651_solr     ] o.a.s.m.r.SolrJmxReporter JMX monitoring for 'solr_43651.solr.jvm' (registry 'solr.jvm') enabled at server: com.sun.jmx.mbeanserver.JmxMBeanServer@5a3956e5
   [junit4]   2> 49911 INFO  (jetty-launcher-40-thread-1) [n:127.0.0.1:43651_solr     ] o.a.s.m.r.SolrJmxReporter JMX monitoring for 'solr_43651.solr.jetty' (registry 'solr.jetty') enabled at server: com.sun.jmx.mbeanserver.JmxMBeanServer@5a3956e5
   [junit4]   2> 49925 INFO  (jetty-launcher-40-thread-1) [n:127.0.0.1:43651_solr     ] o.a.s.c.CorePropertiesLocator Found 0 core definitions underneath /home/jenkins/jenkins-slave/workspace/Lucene-Solr-Tests-8.x/solr/build/solr-core/test/J1/temp/solr.cloud.MetricsHistoryWithAuthIntegrationTest_EF7FB78D6CD33B0C-001/tempDir-001/node1/.
   [junit4]   2> 50066 INFO  (SUITE-MetricsHistoryWithAuthIntegrationTest-seed#[EF7FB78D6CD33B0C]-worker) [     ] o.a.s.c.MiniSolrCloudCluster waitForAllNodes: numServers=1
   [junit4]   2> 50095 INFO  (SUITE-MetricsHistoryWithAuthIntegrationTest-seed#[EF7FB78D6CD33B0C]-worker) [     ] o.a.s.c.c.ConnectionManager Waiting for client to connect to ZooKeeper
   [junit4]   2> 50120 INFO  (zkConnectionManagerCallback-64-thread-1) [     ] o.a.s.c.c.ConnectionManager zkClient has connected
   [junit4]   2> 50120 INFO  (SUITE-MetricsHistoryWithAuthIntegrationTest-seed#[EF7FB78D6CD33B0C]-worker) [     ] o.a.s.c.c.ConnectionManager Client is connected to ZooKeeper
   [junit4]   2> 50128 INFO  (SUITE-MetricsHistoryWithAuthIntegrationTest-seed#[EF7FB78D6CD33B0C]-worker) [     ] o.a.s.c.c.ZkStateReader Updated live nodes from ZooKeeper... (0) -> (1)
   [junit4]   2> 50132 INFO  (SUITE-MetricsHistoryWithAuthIntegrationTest-seed#[EF7FB78D6CD33B0C]-worker) [     ] o.a.s.c.s.i.ZkClientClusterStateProvider Cluster at 127.0.0.1:36933/solr ready
   [junit4]   2> 51554 DEBUG (MetricsHistoryHandler-76-thread-1) [     ] o.a.s.h.a.MetricsHistoryHandler -- collectMetrics
   [junit4]   2> 53128 INFO  (qtp655879980-187) [n:127.0.0.1:43651_solr     ] o.a.s.s.HttpSolrCall [admin] webapp=null path=/admin/info/key params={omitHeader=true&wt=json} status=0 QTime=0
   [junit4]   2> 53140 INFO  (qtp655879980-185) [     ] o.a.s.s.PKIAuthenticationPlugin New Key obtained from  node: 127.0.0.1:43651_solr / MIIBIjANBgkqhkiG9w0BAQEFAAOCAQ8AMIIBCgKCAQEAgy70zguCzcazGXzq6HmLgNDJepckvPqLsnlpDifNaFpo+nkUKoF6nutjVb8ednVbFT7jN51QobidvIIMdfJG7VXR/2KCglUtBlnDBKrpMG+sK30+PdTG27F0G1MiUA2OuLBMzCm17kXRXdwov7KPOoNNGh3BCZtYE9cR+22pyyqiJ0NtnerkQW8mB/JHcnp61puIhYIXtilVWT5ZY450vet/mzyylTPrJkYwPmk5zIoEyupNb2Q+TB6oFz3UNQBenEyZnwZgr4alvAuXxycM6oLzyl3QTYjQ9DtTPis6F0/0oBmTtDf24eYzxigepk1wBea1U1/8z6GHZJVza+FxnQIDAQAB
   [junit4]   2> 53197 INFO  (TEST-MetricsHistoryWithAuthIntegrationTest.testValuesAreCollected-seed#[EF7FB78D6CD33B0C]) [     ] o.a.s.SolrTestCaseJ4 ###Starting testValuesAreCollected
   [junit4]   2> 53214 INFO  (qtp655879980-185) [n:127.0.0.1:43651_solr     ] o.a.s.s.HttpSolrCall [admin] webapp=null path=/admin/metrics params={wt=javabin&version=2&key=solr.jvm:os.processCpuLoad&key=solr.node:CONTAINER.fs.coreRoot.usableSpace&key=solr.jvm:os.systemLoadAverage&key=solr.jvm:memory.heap.used} status=0 QTime=29
   [junit4]   2> 53397 INFO  (qtp655879980-186) [n:127.0.0.1:43651_solr     ] o.a.s.s.HttpSolrCall [admin] webapp=null path=/admin/metrics/history params={name=solr.jvm&action=get&wt=javabin&version=2} status=0 QTime=152
   [junit4]   2> 53399 INFO  (TEST-MetricsHistoryWithAuthIntegrationTest.testValuesAreCollected-seed#[EF7FB78D6CD33B0C]) [     ] o.a.s.SolrTestCaseJ4 ###Ending testValuesAreCollected
   [junit4]   2> NOTE: reproduce with: ant test  -Dtestcase=MetricsHistoryWithAuthIntegrationTest -Dtests.method=testValuesAreCollected -Dtests.seed=EF7FB78D6CD33B0C -Dtests.multiplier=2 -Dtests.slow=true -Dtests.locale=es-NI -Dtests.timezone=Asia/Macao -Dtests.asserts=true -Dtests.file.encoding=UTF-8
   [junit4] FAILURE 0.27s J1 | MetricsHistoryWithAuthIntegrationTest.testValuesAreCollected <<<
   [junit4]    > Throwable #1: java.lang.AssertionError
   [junit4]    > at __randomizedtesting.SeedInfo.seed([EF7FB78D6CD33B0C:C782EAEABD37A449]:0)
   [junit4]    > at org.apache.solr.cloud.MetricsHistoryWithAuthIntegrationTest.testValuesAreCollected(MetricsHistoryWithAuthIntegrationTest.java:86)
   [junit4]    > at java.lang.Thread.run(Thread.java:748)
   [junit4]   2> 53525 INFO  (jetty-closer-65-thread-1) [     ] o.a.s.c.CoreContainer Shutting down CoreContainer instance=1072500710
   [junit4]   2> 53526 INFO  (jetty-closer-65-thread-1) [     ] o.a.s.c.ZkController Remove node as live in ZooKeeper:/live_nodes/127.0.0.1:43651_solr
   [junit4]   2> 53536 INFO  (jetty-closer-65-thread-1) [     ] o.a.s.c.ZkController Publish this node as DOWN...
   [junit4]   2> 53536 INFO  (jetty-closer-65-thread-1) [     ] o.a.s.c.ZkController Publish node=127.0.0.1:43651_solr as DOWN
   [junit4]   2> 53569 INFO  (jetty-closer-65-thread-1) [     ] o.a.s.c.TransientSolrCoreCacheDefault Allocating transient cache for 2147483647 transient cores
   [junit4]   2> 53570 DEBUG (jetty-closer-65-thread-1) [     ] o.a.s.h.a.MetricsHistoryHandler Closing 1429978096
   [junit4]   2> 53570 INFO  (jetty-closer-65-thread-1) [     ] o.a.s.m.SolrMetricManager Closing metric reporters for registry=solr.node, tag=null
   [junit4]   2> 53571 INFO  (jetty-closer-65-thread-1) [     ] o.a.s.m.r.SolrJmxReporter Closing reporter [org.apache.solr.metrics.reporters.SolrJmxReporter@612ecf30: rootName = solr_43651, domain = solr.node, service url = null, agent id = null] for registry solr.node / com.codahale.metrics.MetricRegistry@550d191c
   [junit4]   2> 53620 INFO  (jetty-closer-65-thread-1) [     ] o.a.s.m.SolrMetricManager Closing metric reporters for registry=solr.jvm, tag=null
   [junit4]   2> 53621 INFO  (jetty-closer-65-thread-1) [     ] o.a.s.m.r.SolrJmxReporter Closing reporter [org.apache.solr.metrics.reporters.SolrJmxReporter@373a5f7d: rootName = solr_43651, domain = solr.jvm, service url = null, agent id = null] for registry solr.jvm / com.codahale.metrics.MetricRegistry@b3bc9be
   [junit4]   2> 53630 INFO  (jetty-closer-65-thread-1) [     ] o.a.s.m.SolrMetricManager Closing metric reporters for registry=solr.jetty, tag=null
   [junit4]   2> 53637 INFO  (jetty-closer-65-thread-1) [     ] o.a.s.m.r.SolrJmxReporter Closing reporter [org.apache.solr.metrics.reporters.SolrJmxReporter@19d08ae2: rootName = solr_43651, domain = solr.jetty, service url = null, agent id = null] for registry solr.jetty / com.codahale.metrics.MetricRegistry@4f3a0411
   [junit4]   2> 53637 INFO  (jetty-closer-65-thread-1) [     ] o.a.s.m.SolrMetricManager Closing metric reporters for registry=solr.cluster, tag=null
   [junit4]   2> 53721 INFO  (closeThreadPool-69-thread-2) [     ] o.a.s.c.Overseer Overseer (id=72307163784151045-127.0.0.1:43651_solr-n_0000000000) closing
   [junit4]   2> 53721 INFO  (OverseerStateUpdate-72307163784151045-127.0.0.1:43651_solr-n_0000000000) [n:127.0.0.1:43651_solr     ] o.a.s.c.Overseer Overseer Loop exiting : 127.0.0.1:43651_solr
   [junit4]   2> 53739 INFO  (OverseerAutoScalingTriggerThread-72307163784151045-127.0.0.1:43651_solr-n_0000000000) [     ] o.a.s.c.a.OverseerTriggerThread OverseerTriggerThread woken up but we are closed, exiting.
   [junit4]   2> 53743 INFO  (closeThreadPool-69-thread-1) [     ] o.a.s.c.Overseer Overseer (id=72307163784151045-127.0.0.1:43651_solr-n_0000000000) closing
   [junit4]   2> 53942 INFO  (jetty-closer-65-thread-1) [     ] o.a.s.c.Overseer Overseer (id=72307163784151045-127.0.0.1:43651_solr-n_0000000000) closing
   [junit4]   2> 54050 INFO  (jetty-closer-65-thread-1) [     ] o.e.j.s.AbstractConnector Stopped ServerConnector@1ad45b1{SSL,[ssl, http/1.1]}{127.0.0.1:0}
   [junit4]   2> 54050 INFO  (jetty-closer-65-thread-1) [     ] o.e.j.s.h.ContextHandler Stopped o.e.j.s.ServletContextHandler@6d23065{/solr,null,UNAVAILABLE}
   [junit4]   2> 54050 INFO  (jetty-closer-65-thread-1) [     ] o.e.j.s.session node0 Stopped scavenging
   [junit4]   2> 54052 INFO  (SUITE-MetricsHistoryWithAuthIntegrationTest-seed#[EF7FB78D6CD33B0C]-worker) [     ] o.a.s.c.ZkTestServer Shutting down ZkTestServer.
   [junit4]   2> 54264 WARN  (ZkTestServer Run Thread) [     ] o.a.s.c.ZkTestServer Watch limit violations:
   [junit4]   2> Maximum concurrent create/delete watches above limit:
   [junit4]   2>
   [junit4]   2> 3 /solr/aliases.json
   [junit4]   2>
   [junit4]   2> Maximum concurrent data watches above limit:
   [junit4]   2>
   [junit4]   2> 3 /solr/clusterstate.json
   [junit4]   2> 3 /solr/clusterprops.json
   [junit4]   2>
   [junit4]   2> Maximum concurrent children watches above limit:
   [junit4]   2>
   [junit4]   2> 5 /solr/live_nodes
   [junit4]   2> 3 /solr/collections
   [junit4]   2> 2 /solr/overseer/queue
   [junit4]   2>
   [junit4]   2> 54290 INFO  (SUITE-MetricsHistoryWithAuthIntegrationTest-seed#[EF7FB78D6CD33B0C]-worker) [     ] o.a.s.c.ZkTestServer waitForServerDown: 127.0.0.1:36933
   [junit4]   2> 54291 INFO  (SUITE-MetricsHistoryWithAuthIntegrationTest-seed#[EF7FB78D6CD33B0C]-worker) [     ] o.a.s.c.ZkTestServer parse host and port list: 127.0.0.1:36933
   [junit4]   2> 54291 INFO  (SUITE-MetricsHistoryWithAuthIntegrationTest-seed#[EF7FB78D6CD33B0C]-worker) [     ] o.a.s.c.ZkTestServer connecting to 127.0.0.1 36933
   [junit4]   2> NOTE: leaving temporary files on disk at: /home/jenkins/jenkins-slave/workspace/Lucene-Solr-Tests-8.x/solr/build/solr-core/test/J1/temp/solr.cloud.MetricsHistoryWithAuthIntegrationTest_EF7FB78D6CD33B0C-001
   [junit4]   2> NOTE: test params are: codec=Asserting(Lucene80): {}, docValues:{}, maxPointsInLeafNode=1404, maxMBSortInHeap=5.023326221058635, sim=Asserting(org.apache.lucene.search.similarities.AssertingSimilarity@1f299c59), locale=es-NI, timezone=Asia/Macao
   [junit4]   2> NOTE: Linux 4.15.0-54-generic amd64/Oracle Corporation 1.8.0_191 (64-bit)/cpus=4,threads=1,free=325482976,total=393740288
   [junit4]   2> NOTE: All tests run in this JVM: [TestJsonFacetRefinement, MetricsHistoryWithAuthIntegrationTest]
   [junit4] Completed [3/875 (1!)] on J1 in 8.88s, 1 test, 1 failure <<< FAILURES!

[...truncated 55138 lines...]
[asciidoctor:convert] asciidoctor: ERROR: about-this-guide.adoc: line 1: invalid part, must have at least one section (e.g., chapter, appendix, etc.)
[asciidoctor:convert] asciidoctor: ERROR: solr-glossary.adoc: line 1: invalid part, must have at least one section (e.g., chapter, appendix, etc.)
     [java] Processed 2594 links (2120 relative) to 3410 anchors in 259 files
     [echo] Validated Links & Anchors via: /home/jenkins/jenkins-slave/workspace/Lucene-Solr-Tests-8.x/solr/build/solr-ref-guide/bare-bones-html/

-documentation-lint:
    [jtidy] Checking for broken html (such as invalid tags)...
   [delete] Deleting directory /home/jenkins/jenkins-slave/workspace/Lucene-Solr-Tests-8.x/lucene/build/jtidy_tmp
     [echo] Checking for broken links...
     [exec]
     [exec] Crawl/parse...
     [exec]
     [exec] Verify...
     [echo] Checking for malformed docs...

jar-checksums:

resolve:

ivy-availability-check:
[loadresource] Do not set property disallowed.ivy.jars.list as its length is 0.

-ivy-fail-disallowed-ivy-version:

ivy-fail:

ivy-configure:
[ivy:configure] :: loading settings :: file = /home/jenkins/jenkins-slave/workspace/Lucene-Solr-Tests-8.x/lucene/top-level-ivy-settings.xml

resolve:

ivy-availability-check:
[loadresource] Do not set property disallowed.ivy.jars.list as its length is 0.

-ivy-fail-disallowed-ivy-version:

ivy-fail:

ivy-configure:
[ivy:configure] :: loading settings :: file = /home/jenkins/jenkins-slave/workspace/Lucene-Solr-Tests-8.x/lucene/top-level-ivy-settings.xml

resolve:

resolve:

ivy-availability-check:
[loadresource] Do not set property disallowed.ivy.jars.list as its length is 0.

-ivy-fail-disallowed-ivy-version:

ivy-fail:

ivy-configure:
[ivy:configure] :: loading settings :: file = /home/jenkins/jenkins-slave/workspace/Lucene-Solr-Tests-8.x/lucene/top-level-ivy-settings.xml

resolve:

ivy-availability-check:
[loadresource] Do not set property disallowed.ivy.jars.list as its length is 0.

-ivy-fail-disallowed-ivy-version:

ivy-fail:

ivy-configure:
[ivy:configure] :: loading settings :: file = /home/jenkins/jenkins-slave/workspace/Lucene-Solr-Tests-8.x/lucene/top-level-ivy-settings.xml

resolve:

ivy-availability-check:
[loadresource] Do not set property disallowed.ivy.jars.list as its length is 0.

-ivy-fail-disallowed-ivy-version:

ivy-fail:

ivy-configure:
[ivy:configure] :: loading settings :: file = /home/jenkins/jenkins-slave/workspace/Lucene-Solr-Tests-8.x/lucene/top-level-ivy-settings.xml

resolve:

ivy-availability-check:
[loadresource] Do not set property disallowed.ivy.jars.list as its length is 0.

-ivy-fail-disallowed-ivy-version:

ivy-fail:

ivy-configure:
[ivy:configure] :: loading settings :: file = /home/jenkins/jenkins-slave/workspace/Lucene-Solr-Tests-8.x/lucene/top-level-ivy-settings.xml

resolve:

ivy-availability-check:
[loadresource] Do not set property disallowed.ivy.jars.list as its length is 0.

-ivy-fail-disallowed-ivy-version:

ivy-fail:

ivy-configure:
[ivy:configure] :: loading settings :: file = /home/jenkins/jenkins-slave/workspace/Lucene-Solr-Tests-8.x/lucene/top-level-ivy-settings.xml

resolve:

ivy-availability-check:
[loadresource] Do not set property disallowed.ivy.jars.list as its length is 0.

-ivy-fail-disallowed-ivy-version:

ivy-fail:

ivy-configure:
[ivy:configure] :: loading settings :: file = /home/jenkins/jenkins-slave/workspace/Lucene-Solr-Tests-8.x/lucene/top-level-ivy-settings.xml

resolve:

ivy-availability-check:
[loadresource] Do not set property disallowed.ivy.jars.list as its length is 0.

-ivy-fail-disallowed-ivy-version:

ivy-fail:

ivy-configure:
[ivy:configure] :: loading settings :: file = /home/jenkins/jenkins-slave/workspace/Lucene-Solr-Tests-8.x/lucene/top-level-ivy-settings.xml

resolve:

ivy-availability-check:
[loadresource] Do not set property disallowed.ivy.jars.list as its length is 0.

-ivy-fail-disallowed-ivy-version:

ivy-fail:

ivy-configure:
[ivy:configure] :: loading settings :: file = /home/jenkins/jenkins-slave/workspace/Lucene-Solr-Tests-8.x/lucene/top-level-ivy-settings.xml

resolve:

ivy-availability-check:
[loadresource] Do not set property disallowed.ivy.jars.list as its length is 0.

-ivy-fail-disallowed-ivy-version:

ivy-fail:

ivy-configure:
[ivy:configure] :: loading settings :: file = /home/jenkins/jenkins-slave/workspace/Lucene-Solr-Tests-8.x/lucene/top-level-ivy-settings.xml

resolve:

ivy-availability-check:
[loadresource] Do not set property disallowed.ivy.jars.list as its length is 0.

-ivy-fail-disallowed-ivy-version:

ivy-fail:

ivy-configure:
[ivy:configure] :: loading settings :: file = /home/jenkins/jenkins-slave/workspace/Lucene-Solr-Tests-8.x/lucene/top-level-ivy-settings.xml

resolve:

ivy-availability-check:
[loadresource] Do not set property disallowed.ivy.jars.list as its length is 0.

-ivy-fail-disallowed-ivy-version:

ivy-fail:

ivy-configure:
[ivy:configure] :: loading settings :: file = /home/jenkins/jenkins-slave/workspace/Lucene-Solr-Tests-8.x/lucene/top-level-ivy-settings.xml

resolve:

ivy-availability-check:
[loadresource] Do not set property disallowed.ivy.jars.list as its length is 0.

-ivy-fail-disallowed-ivy-version:

ivy-fail:

ivy-configure:
[ivy:configure] :: loading settings :: file = /home/jenkins/jenkins-slave/workspace/Lucene-Solr-Tests-8.x/lucene/top-level-ivy-settings.xml

resolve:

ivy-availability-check:
[loadresource] Do not set property disallowed.ivy.jars.list as its length is 0.

-ivy-fail-disallowed-ivy-version:

ivy-fail:

ivy-configure:
[ivy:configure] :: loading settings :: file = /home/jenkins/jenkins-slave/workspace/Lucene-Solr-Tests-8.x/lucene/top-level-ivy-settings.xml

resolve:

ivy-availability-check:
[loadresource] Do not set property disallowed.ivy.jars.list as its length is 0.

-ivy-fail-disallowed-ivy-version:

ivy-fail:

ivy-configure:
[ivy:configure] :: loading settings :: file = /home/jenkins/jenkins-slave/workspace/Lucene-Solr-Tests-8.x/lucene/top-level-ivy-settings.xml

resolve:

ivy-availability-check:
[loadresource] Do not set property disallowed.ivy.jars.list as its length is 0.

-ivy-fail-disallowed-ivy-version:

ivy-fail:

ivy-configure:
[ivy:configure] :: loading settings :: file = /home/jenkins/jenkins-slave/workspace/Lucene-Solr-Tests-8.x/lucene/top-level-ivy-settings.xml

resolve:

ivy-availability-check:
[loadresource] Do not set property disallowed.ivy.jars.list as its length is 0.

-ivy-fail-disallowed-ivy-version:

ivy-fail:

ivy-configure:
[ivy:configure] :: loading settings :: file = /home/jenkins/jenkins-slave/workspace/Lucene-Solr-Tests-8.x/lucene/top-level-ivy-settings.xml

resolve:

ivy-availability-check:
[loadresource] Do not set property disallowed.ivy.jars.list as its length is 0.

-ivy-fail-disallowed-ivy-version:

ivy-fail:

ivy-configure:
[ivy:configure] :: loading settings :: file = /home/jenkins/jenkins-slave/workspace/Lucene-Solr-Tests-8.x/lucene/top-level-ivy-settings.xml

resolve:

ivy-availability-check:
[loadresource] Do not set property disallowed.ivy.jars.list as its length is 0.

-ivy-fail-disallowed-ivy-version:

ivy-fail:

ivy-configure:
[ivy:configure] :: loading settings :: file = /home/jenkins/jenkins-slave/workspace/Lucene-Solr-Tests-8.x/lucene/top-level-ivy-settings.xml

resolve:

ivy-availability-check:
[loadresource] Do not set property disallowed.ivy.jars.list as its length is 0.

-ivy-fail-disallowed-ivy-version:

ivy-fail:

ivy-configure:
[ivy:configure] :: loading settings :: file = /home/jenkins/jenkins-slave/workspace/Lucene-Solr-Tests-8.x/lucene/top-level-ivy-settings.xml

resolve:

ivy-availability-check:
[loadresource] Do not set property disallowed.ivy.jars.list as its length is 0.

-ivy-fail-disallowed-ivy-version:

ivy-fail:

ivy-configure:
[ivy:configure] :: loading settings :: file = /home/jenkins/jenkins-slave/workspace/Lucene-Solr-Tests-8.x/lucene/top-level-ivy-settings.xml

resolve:

ivy-availability-check:
[loadresource] Do not set property disallowed.ivy.jars.list as its length is 0.

-ivy-fail-disallowed-ivy-version:

ivy-fail:

ivy-configure:
[ivy:configure] :: loading settings :: file = /home/jenkins/jenkins-slave/workspace/Lucene-Solr-Tests-8.x/lucene/top-level-ivy-settings.xml

resolve:

ivy-availability-check:
[loadresource] Do not set property disallowed.ivy.jars.list as its length is 0.

-ivy-fail-disallowed-ivy-version:

ivy-fail:

ivy-configure:
[ivy:configure] :: loading settings :: file = /home/jenkins/jenkins-slave/workspace/Lucene-Solr-Tests-8.x/lucene/top-level-ivy-settings.xml

resolve:

ivy-availability-check:
[loadresource] Do not set property disallowed.ivy.jars.list as its length is 0.

-ivy-fail-disallowed-ivy-version:

ivy-fail:

ivy-configure:
[ivy:configure] :: loading settings :: file = /home/jenkins/jenkins-slave/workspace/Lucene-Solr-Tests-8.x/lucene/top-level-ivy-settings.xml

resolve:

ivy-availability-check:
[loadresource] Do not set property disallowed.ivy.jars.list as its length is 0.

-ivy-fail-disallowed-ivy-version:

ivy-fail:

ivy-configure:
[ivy:configure] :: loading settings :: file = /home/jenkins/jenkins-slave/workspace/Lucene-Solr-Tests-8.x/lucene/top-level-ivy-settings.xml

resolve:

ivy-availability-check:
[loadresource] Do not set property disallowed.ivy.jars.list as its length is 0.

-ivy-fail-disallowed-ivy-version:

ivy-fail:

ivy-configure:
[ivy:configure] :: loading settings :: file = /home/jenkins/jenkins-slave/workspace/Lucene-Solr-Tests-8.x/lucene/top-level-ivy-settings.xml

resolve:

ivy-availability-check:
[loadresource] Do not set property disallowed.ivy.jars.list as its length is 0.

-ivy-fail-disallowed-ivy-version:

ivy-fail:

ivy-configure:
[ivy:configure] :: loading settings :: file = /home/jenkins/jenkins-slave/workspace/Lucene-Solr-Tests-8.x/lucene/top-level-ivy-settings.xml

common.resolve:

resolve:

ivy-availability-check:
[loadresource] Do not set property disallowed.ivy.jars.list as its length is 0.

-ivy-fail-disallowed-ivy-version:

ivy-fail:

ivy-configure:
[ivy:configure] :: loading settings :: file = /home/jenkins/jenkins-slave/workspace/Lucene-Solr-Tests-8.x/lucene/top-level-ivy-settings.xml

resolve:

ivy-availability-check:
[loadresource] Do not set property disallowed.ivy.jars.list as its length is 0.

-ivy-fail-disallowed-ivy-version:

ivy-fail:

ivy-configure:
[ivy:configure] :: loading settings :: file = /home/jenkins/jenkins-slave/workspace/Lucene-Solr-Tests-8.x/lucene/top-level-ivy-settings.xml

resolve:

ivy-availability-check:
[loadresource] Do not set property disallowed.ivy.jars.list as its length is 0.

-ivy-fail-disallowed-ivy-version:

ivy-fail:

ivy-configure:
[ivy:configure] :: loading settings :: file = /home/jenkins/jenkins-slave/workspace/Lucene-Solr-Tests-8.x/lucene/top-level-ivy-settings.xml

resolve:

ivy-availability-check:
[loadresource] Do not set property disallowed.ivy.jars.list as its length is 0.

-ivy-fail-disallowed-ivy-version:

ivy-fail:

ivy-configure:
[ivy:configure] :: loading settings :: file = /home/jenkins/jenkins-slave/workspace/Lucene-Solr-Tests-8.x/lucene/top-level-ivy-settings.xml

resolve:

ivy-availability-check:
[loadresource] Do not set property disallowed.ivy.jars.list as its length is 0.

-ivy-fail-disallowed-ivy-version:

ivy-fail:

ivy-configure:
[ivy:configure] :: loading settings :: file = /home/jenkins/jenkins-slave/workspace/Lucene-Solr-Tests-8.x/lucene/top-level-ivy-settings.xml

resolve:

jar-checksums:
    [mkdir] Created dir: /home/jenkins/jenkins-slave/workspace/Lucene-Solr-Tests-8.x/lucene/null1076142184
     [copy] Copying 38 files to /home/jenkins/jenkins-slave/workspace/Lucene-Solr-Tests-8.x/lucene/null1076142184
   [delete] Deleting directory /home/jenkins/jenkins-slave/workspace/Lucene-Solr-Tests-8.x/lucene/null1076142184

resolve-example:

ivy-availability-check:
[loadresource] Do not set property disallowed.ivy.jars.list as its length is 0.

-ivy-fail-disallowed-ivy-version:

ivy-fail:

ivy-configure:
[ivy:configure] :: loading settings :: file = /home/jenkins/jenkins-slave/workspace/Lucene-Solr-Tests-8.x/lucene/top-level-ivy-settings.xml

resolve:

resolve-server:

ivy-availability-check:
[loadresource] Do not set property disallowed.ivy.jars.list as its length is 0.

-ivy-fail-disallowed-ivy-version:

ivy-fail:

ivy-fail:

ivy-configure:
[ivy:configure] :: loading settings :: file = /home/jenkins/jenkins-slave/workspace/Lucene-Solr-Tests-8.x/lucene/top-level-ivy-settings.xml

resolve:

resolve:

ivy-availability-check:
[loadresource] Do not set property disallowed.ivy.jars.list as its length is 0.

-ivy-fail-disallowed-ivy-version:

ivy-fail:

ivy-fail:

ivy-configure:
[ivy:configure] :: loading settings :: file = /home/jenkins/jenkins-slave/workspace/Lucene-Solr-Tests-8.x/lucene/top-level-ivy-settings.xml

resolve:

ivy-availability-check:
[loadresource] Do not set property disallowed.ivy.jars.list as its length is 0.

-ivy-fail-disallowed-ivy-version:

ivy-fail:

ivy-fail:

ivy-configure:
[ivy:configure] :: loading settings :: file = /home/jenkins/jenkins-slave/workspace/Lucene-Solr-Tests-8.x/lucene/top-level-ivy-settings.xml

resolve:

ivy-availability-check:
[loadresource] Do not set property disallowed.ivy.jars.list as its length is 0.

-ivy-fail-disallowed-ivy-version:

ivy-fail:

ivy-configure:
[ivy:configure] :: loading settings :: file = /home/jenkins/jenkins-slave/workspace/Lucene-Solr-Tests-8.x/lucene/top-level-ivy-settings.xml

resolve:

ivy-availability-check:
[loadresource] Do not set property disallowed.ivy.jars.list as its length is 0.

-ivy-fail-disallowed-ivy-version:

ivy-fail:

ivy-fail:

ivy-configure:
[ivy:configure] :: loading settings :: file = /home/jenkins/jenkins-slave/workspace/Lucene-Solr-Tests-8.x/lucene/top-level-ivy-settings.xml

resolve:

ivy-availability-check:
[loadresource] Do not set property disallowed.ivy.jars.list as its length is 0.

-ivy-fail-disallowed-ivy-version:

ivy-fail:

ivy-configure:
[ivy:configure] :: loading settings :: file = /home/jenkins/jenkins-slave/workspace/Lucene-Solr-Tests-8.x/lucene/top-level-ivy-settings.xml

resolve:

ivy-availability-check:
[loadresource] Do not set property disallowed.ivy.jars.list as its length is 0.

-ivy-fail-disallowed-ivy-version:

ivy-fail:

ivy-fail:

ivy-configure:
[ivy:configure] :: loading settings :: file = /home/jenkins/jenkins-slave/workspace/Lucene-Solr-Tests-8.x/lucene/top-level-ivy-settings.xml

resolve:

ivy-availability-check:
[loadresource] Do not set property disallowed.ivy.jars.list as its length is 0.

-ivy-fail-disallowed-ivy-version:

ivy-fail:

ivy-fail:

ivy-configure:
[ivy:configure] :: loading settings :: file = /home/jenkins/jenkins-slave/workspace/Lucene-Solr-Tests-8.x/lucene/top-level-ivy-settings.xml

resolve:

ivy-availability-check:
[loadresource] Do not set property disallowed.ivy.jars.list as its length is 0.

-ivy-fail-disallowed-ivy-version:

ivy-fail:

ivy-fail:

ivy-configure:
[ivy:configure] :: loading settings :: file = /home/jenkins/jenkins-slave/workspace/Lucene-Solr-Tests-8.x/lucene/top-level-ivy-settings.xml

resolve:

ivy-availability-check:
[loadresource] Do not set property disallowed.ivy.jars.list as its length is 0.

-ivy-fail-disallowed-ivy-version:

ivy-fail:

ivy-fail:

ivy-configure:
[ivy:configure] :: loading settings :: file = /home/jenkins/jenkins-slave/workspace/Lucene-Solr-Tests-8.x/lucene/top-level-ivy-settings.xml

resolve:

ivy-availability-check:
[loadresource] Do not set property disallowed.ivy.jars.list as its length is 0.

-ivy-fail-disallowed-ivy-version:

ivy-fail:

ivy-fail:

ivy-configure:
[ivy:configure] :: loading settings :: file = /home/jenkins/jenkins-slave/workspace/Lucene-Solr-Tests-8.x/lucene/top-level-ivy-settings.xml

resolve:

ivy-availability-check:
[loadresource] Do not set property disallowed.ivy.jars.list as its length is 0.

-ivy-fail-disallowed-ivy-version:

ivy-fail:

ivy-fail:

ivy-configure:
[ivy:configure] :: loading settings :: file = /home/jenkins/jenkins-slave/workspace/Lucene-Solr-Tests-8.x/lucene/top-level-ivy-settings.xml

resolve:

ivy-availability-check:
[loadresource] Do not set property disallowed.ivy.jars.list as its length is 0.

-ivy-fail-disallowed-ivy-version:

ivy-fail:

ivy-fail:

ivy-configure:
[ivy:configure] :: loading settings :: file = /home/jenkins/jenkins-slave/workspace/Lucene-Solr-Tests-8.x/lucene/top-level-ivy-settings.xml

resolve:

ivy-availability-check:
[loadresource] Do not set property disallowed.ivy.jars.list as its length is 0.

-ivy-fail-disallowed-ivy-version:

ivy-fail:

ivy-fail:

ivy-configure:
[ivy:configure] :: loading settings :: file = /home/jenkins/jenkins-slave/workspace/Lucene-Solr-Tests-8.x/lucene/top-level-ivy-settings.xml

resolve:

ivy-availability-check:
[loadresource] Do not set property disallowed.ivy.jars.list as its length is 0.

-ivy-fail-disallowed-ivy-version:

ivy-fail:

ivy-fail:

ivy-configure:
[ivy:configure] :: loading settings :: file = /home/jenkins/jenkins-slave/workspace/Lucene-Solr-Tests-8.x/lucene/top-level-ivy-settings.xml

resolve:

ivy-availability-check:
[loadresource] Do not set property disallowed.ivy.jars.list as its length is 0.

-ivy-fail-disallowed-ivy-version:

ivy-fail:

ivy-fail:

ivy-configure:
[ivy:configure] :: loading settings :: file = /home/jenkins/jenkins-slave/workspace/Lucene-Solr-Tests-8.x/lucene/top-level-ivy-settings.xml

resolve:

ivy-availability-check:
[loadresource] Do not set property disallowed.ivy.jars.list as its length is 0.

-ivy-fail-disallowed-ivy-version:

ivy-fail:

ivy-fail:

ivy-configure:
[ivy:configure] :: loading settings :: file = /home/jenkins/jenkins-slave/workspace/Lucene-Solr-Tests-8.x/lucene/top-level-ivy-settings.xml

resolve:

jar-checksums:
    [mkdir] Created dir: /home/jenkins/jenkins-slave/workspace/Lucene-Solr-Tests-8.x/solr/null1213686351
     [copy] Copying 249 files to /home/jenkins/jenkins-slave/workspace/Lucene-Solr-Tests-8.x/solr/null1213686351
   [delete] Deleting directory /home/jenkins/jenkins-slave/workspace/Lucene-Solr-Tests-8.x/solr/null1213686351

check-working-copy:
[ivy:cachepath] :: resolving dependencies :: #;working@lucene1-us-west
[ivy:cachepath] confs: [default]
[ivy:cachepath] found org.eclipse.jgit#org.eclipse.jgit;5.3.0.201903130848-r in public
[ivy:cachepath] found com.jcraft#jsch;0.1.54 in public
[ivy:cachepath] found com.jcraft#jzlib;1.1.1 in public
[ivy:cachepath] found com.googlecode.javaewah#JavaEWAH;1.1.6 in public
[ivy:cachepath] found org.slf4j#slf4j-api;1.7.2 in public
[ivy:cachepath] found org.bouncycastle#bcpg-jdk15on;1.60 in public
[ivy:cachepath] found org.bouncycastle#bcprov-jdk15on;1.60 in public
[ivy:cachepath] found org.bouncycastle#bcpkix-jdk15on;1.60 in public
[ivy:cachepath] found org.slf4j#slf4j-nop;1.7.2 in public
[ivy:cachepath] :: resolution report :: resolve 29ms :: artifacts dl 3ms
        ---------------------------------------------------------------------
        |                  |            modules            ||   artifacts   |
        |       conf       | number| search|dwnlded|evicted|| number|dwnlded|
        ---------------------------------------------------------------------
        |      default     |   9   |   0   |   0   |   0   ||   9   |   0   |
        ---------------------------------------------------------------------
[wc-checker] Initializing working copy...
[wc-checker] Checking working copy status...

-jenkins-base:

BUILD SUCCESSFUL
Total time: 123 minutes 2 seconds
Archiving artifacts
java.lang.InterruptedException: no matches found within 10000
        at hudson.FilePath$ValidateAntFileMask.hasMatch(FilePath.java:2847)
        at hudson.FilePath$ValidateAntFileMask.invoke(FilePath.java:2726)
        at hudson.FilePath$ValidateAntFileMask.invoke(FilePath.java:2707)
        at hudson.FilePath$FileCallableWrapper.call(FilePath.java:3086)
Also:   hudson.remoting.Channel$CallSiteStackTrace: Remote call to lucene
                at hudson.remoting.Channel.attachCallSiteStackTrace(Channel.java:1741)
                at hudson.remoting.UserRequest$ExceptionResponse.retrieve(UserRequest.java:357)
                at hudson.remoting.Channel.call(Channel.java:955)
                at hudson.FilePath.act(FilePath.java:1072)
                at hudson.FilePath.act(FilePath.java:1061)
                at hudson.FilePath.validateAntFileMask(FilePath.java:2705)
                at hudson.tasks.ArtifactArchiver.perform(ArtifactArchiver.java:243)
                at hudson.tasks.BuildStepCompatibilityLayer.perform(BuildStepCompatibilityLayer.java:81)
                at hudson.tasks.BuildStepMonitor$1.perform(BuildStepMonitor.java:20)
                at hudson.model.AbstractBuild$AbstractBuildExecution.perform(AbstractBuild.java:744)
                at hudson.model.AbstractBuild$AbstractBuildExecution.performAllBuildSteps(AbstractBuild.java:690)
                at hudson.model.Build$BuildExecution.post2(Build.java:186)
                at hudson.model.AbstractBuild$AbstractBuildExecution.post(AbstractBuild.java:635)
                at hudson.model.Run.execute(Run.java:1835)
                at hudson.model.FreeStyleBuild.run(FreeStyleBuild.java:43)
                at hudson.model.ResourceController.execute(ResourceController.java:97)
                at hudson.model.Executor.run(Executor.java:429)
Caused: hudson.FilePath$TunneledInterruptedException
        at hudson.FilePath$FileCallableWrapper.call(FilePath.java:3088)
        at hudson.remoting.UserRequest.perform(UserRequest.java:212)
        at hudson.remoting.UserRequest.perform(UserRequest.java:54)
        at hudson.remoting.Request$2.run(Request.java:369)
        at hudson.remoting.InterceptingExecutorService$1.call(InterceptingExecutorService.java:72)
        at java.util.concurrent.FutureTask.run(FutureTask.java:266)
        at java.util.concurrent.ThreadPoolExecutor.runWorker(ThreadPoolExecutor.java:1142)
        at java.util.concurrent.ThreadPoolExecutor$Worker.run(ThreadPoolExecutor.java:617)
        at java.lang.Thread.run(Thread.java:744)
Caused: java.lang.InterruptedException: java.lang.InterruptedException: no matches found within 10000
        at hudson.FilePath.act(FilePath.java:1074)
        at hudson.FilePath.act(FilePath.java:1061)
        at hudson.FilePath.validateAntFileMask(FilePath.java:2705)
        at hudson.tasks.ArtifactArchiver.perform(ArtifactArchiver.java:243)
        at hudson.tasks.BuildStepCompatibilityLayer.perform(BuildStepCompatibilityLayer.java:81)
        at hudson.tasks.BuildStepMonitor$1.perform(BuildStepMonitor.java:20)
        at hudson.model.AbstractBuild$AbstractBuildExecution.perform(AbstractBuild.java:744)
        at hudson.model.AbstractBuild$AbstractBuildExecution.performAllBuildSteps(AbstractBuild.java:690)
        at hudson.model.Build$BuildExecution.post2(Build.java:186)
        at hudson.model.AbstractBuild$AbstractBuildExecution.post(AbstractBuild.java:635)
        at hudson.model.Run.execute(Run.java:1835)
        at hudson.model.FreeStyleBuild.run(FreeStyleBuild.java:43)
        at hudson.model.ResourceController.execute(ResourceController.java:97)
        at hudson.model.Executor.run(Executor.java:429)
No artifacts found that match the file pattern "**/*.events,heapdumps/**,**/hs_err_pid*". Configuration error?
Recording test results
Build step 'Publish JUnit test result report' changed build result to UNSTABLE
Email was triggered for: Unstable (Test Failures)
Sending email for trigger: Unstable (Test Failures)


---------------------------------------------------------------------
To unsubscribe, e-mail: [hidden email]
For additional commands, e-mail: [hidden email]
Reply | Threaded
Open this post in threaded view
|

[JENKINS] Lucene-Solr-Tests-8.x - Build # 510 - Still Unstable

Apache Jenkins Server-2
Build: https://builds.apache.org/job/Lucene-Solr-Tests-8.x/510/

2 tests failed.
FAILED:  org.apache.solr.handler.TestContainerReqHandler.testPackageAPI

Error Message:
attempt: 9 Mismatch for value : '[requestHandler]' in response {   "responseHeader":{     "status":0,     "QTime":0},   "metadata":{"version":3},   "runtimeLib":[{       "name":"global",       "url":"http://localhost:34099/jar3.jar",       "sha256":"20e0bfaec71b2e93c4da9f2ed3745dda04dc3fc915b66cc0275863982e73b2a3",       "znodeVersion":3}],   "requestHandler":[{       "name":"bar",       "znodeVersion":3,       "class":"org.apache.solr.core.RuntimeLibReqHandler",       "package":"global"}]}

Stack Trace:
java.lang.AssertionError: attempt: 9 Mismatch for value : '[requestHandler]' in response {
  "responseHeader":{
    "status":0,
    "QTime":0},
  "metadata":{"version":3},
  "runtimeLib":[{
      "name":"global",
      "url":"http://localhost:34099/jar3.jar",
      "sha256":"20e0bfaec71b2e93c4da9f2ed3745dda04dc3fc915b66cc0275863982e73b2a3",
      "znodeVersion":3}],
  "requestHandler":[{
      "name":"bar",
      "znodeVersion":3,
      "class":"org.apache.solr.core.RuntimeLibReqHandler",
      "package":"global"}]}
        at __randomizedtesting.SeedInfo.seed([9C3BBC3A2BE2DEBD:EE34A97487B984AD]:0)
        at org.junit.Assert.fail(Assert.java:88)
        at org.apache.solr.handler.TestContainerReqHandler.assertResponseValues(TestContainerReqHandler.java:121)
        at org.apache.solr.handler.TestContainerReqHandler.testPackageAPI(TestContainerReqHandler.java:236)
        at sun.reflect.NativeMethodAccessorImpl.invoke0(Native Method)
        at sun.reflect.NativeMethodAccessorImpl.invoke(NativeMethodAccessorImpl.java:62)
        at sun.reflect.DelegatingMethodAccessorImpl.invoke(DelegatingMethodAccessorImpl.java:43)
        at java.lang.reflect.Method.invoke(Method.java:498)
        at com.carrotsearch.randomizedtesting.RandomizedRunner.invoke(RandomizedRunner.java:1750)
        at com.carrotsearch.randomizedtesting.RandomizedRunner$8.evaluate(RandomizedRunner.java:938)
        at com.carrotsearch.randomizedtesting.RandomizedRunner$9.evaluate(RandomizedRunner.java:974)
        at com.carrotsearch.randomizedtesting.RandomizedRunner$10.evaluate(RandomizedRunner.java:988)
        at com.carrotsearch.randomizedtesting.rules.SystemPropertiesRestoreRule$1.evaluate(SystemPropertiesRestoreRule.java:57)
        at org.apache.lucene.util.TestRuleSetupTeardownChained$1.evaluate(TestRuleSetupTeardownChained.java:49)
        at org.apache.lucene.util.AbstractBeforeAfterRule$1.evaluate(AbstractBeforeAfterRule.java:45)
        at org.apache.lucene.util.TestRuleThreadAndTestName$1.evaluate(TestRuleThreadAndTestName.java:48)
        at org.apache.lucene.util.TestRuleIgnoreAfterMaxFailures$1.evaluate(TestRuleIgnoreAfterMaxFailures.java:64)
        at org.apache.lucene.util.TestRuleMarkFailure$1.evaluate(TestRuleMarkFailure.java:47)
        at com.carrotsearch.randomizedtesting.rules.StatementAdapter.evaluate(StatementAdapter.java:36)
        at com.carrotsearch.randomizedtesting.ThreadLeakControl$StatementRunner.run(ThreadLeakControl.java:368)
        at com.carrotsearch.randomizedtesting.ThreadLeakControl.forkTimeoutingTask(ThreadLeakControl.java:817)
        at com.carrotsearch.randomizedtesting.ThreadLeakControl$3.evaluate(ThreadLeakControl.java:468)
        at com.carrotsearch.randomizedtesting.RandomizedRunner.runSingleTest(RandomizedRunner.java:947)
        at com.carrotsearch.randomizedtesting.RandomizedRunner$5.evaluate(RandomizedRunner.java:832)
        at com.carrotsearch.randomizedtesting.RandomizedRunner$6.evaluate(RandomizedRunner.java:883)
        at com.carrotsearch.randomizedtesting.RandomizedRunner$7.evaluate(RandomizedRunner.java:894)
        at com.carrotsearch.randomizedtesting.rules.StatementAdapter.evaluate(StatementAdapter.java:36)
        at com.carrotsearch.randomizedtesting.rules.SystemPropertiesRestoreRule$1.evaluate(SystemPropertiesRestoreRule.java:57)
        at org.apache.lucene.util.AbstractBeforeAfterRule$1.evaluate(AbstractBeforeAfterRule.java:45)
        at com.carrotsearch.randomizedtesting.rules.StatementAdapter.evaluate(StatementAdapter.java:36)
        at org.apache.lucene.util.TestRuleStoreClassName$1.evaluate(TestRuleStoreClassName.java:41)
        at com.carrotsearch.randomizedtesting.rules.NoShadowingOrOverridesOnMethodsRule$1.evaluate(NoShadowingOrOverridesOnMethodsRule.java:40)
        at com.carrotsearch.randomizedtesting.rules.NoShadowingOrOverridesOnMethodsRule$1.evaluate(NoShadowingOrOverridesOnMethodsRule.java:40)
        at com.carrotsearch.randomizedtesting.rules.StatementAdapter.evaluate(StatementAdapter.java:36)
        at com.carrotsearch.randomizedtesting.rules.StatementAdapter.evaluate(StatementAdapter.java:36)
        at com.carrotsearch.randomizedtesting.rules.StatementAdapter.evaluate(StatementAdapter.java:36)
        at org.apache.lucene.util.TestRuleAssertionsRequired$1.evaluate(TestRuleAssertionsRequired.java:53)
        at org.apache.lucene.util.TestRuleMarkFailure$1.evaluate(TestRuleMarkFailure.java:47)
        at org.apache.lucene.util.TestRuleIgnoreAfterMaxFailures$1.evaluate(TestRuleIgnoreAfterMaxFailures.java:64)
        at org.apache.lucene.util.TestRuleIgnoreTestSuites$1.evaluate(TestRuleIgnoreTestSuites.java:54)
        at com.carrotsearch.randomizedtesting.rules.StatementAdapter.evaluate(StatementAdapter.java:36)
        at com.carrotsearch.randomizedtesting.ThreadLeakControl$StatementRunner.run(ThreadLeakControl.java:368)
        at java.lang.Thread.run(Thread.java:748)


FAILED:  org.apache.solr.client.solrj.impl.Http2SolrClientTest.testQuery

Error Message:
Captured an uncaught exception in thread: Thread[id=7235, name=h2sc-3270-thread-16, state=RUNNABLE, group=TGRP-Http2SolrClientTest]

Stack Trace:
com.carrotsearch.randomizedtesting.UncaughtExceptionError: Captured an uncaught exception in thread: Thread[id=7235, name=h2sc-3270-thread-16, state=RUNNABLE, group=TGRP-Http2SolrClientTest]
        at __randomizedtesting.SeedInfo.seed([26E087F1669EE1A5:AD91F3829714DB70]:0)
Caused by: java.util.concurrent.RejectedExecutionException: Task java.util.concurrent.ScheduledThreadPoolExecutor$ScheduledFutureTask@7a8a1c78 rejected from java.util.concurrent.ScheduledThreadPoolExecutor@744ded59[Terminated, pool size = 0, active threads = 0, queued tasks = 0, completed tasks = 0]
        at __randomizedtesting.SeedInfo.seed([26E087F1669EE1A5]:0)
        at java.util.concurrent.ThreadPoolExecutor$AbortPolicy.rejectedExecution(ThreadPoolExecutor.java:2063)
        at java.util.concurrent.ThreadPoolExecutor.reject(ThreadPoolExecutor.java:830)
        at java.util.concurrent.ScheduledThreadPoolExecutor.delayedExecute(ScheduledThreadPoolExecutor.java:326)
        at java.util.concurrent.ScheduledThreadPoolExecutor.schedule(ScheduledThreadPoolExecutor.java:533)
        at org.eclipse.jetty.util.thread.ScheduledExecutorScheduler.schedule(ScheduledExecutorScheduler.java:97)
        at org.eclipse.jetty.util.SocketAddressResolver$Async.lambda$resolve$1(SocketAddressResolver.java:154)
        at org.apache.solr.common.util.ExecutorUtil$MDCAwareThreadPoolExecutor.lambda$execute$0(ExecutorUtil.java:210)
        at java.util.concurrent.ThreadPoolExecutor.runWorker(ThreadPoolExecutor.java:1149)
        at java.util.concurrent.ThreadPoolExecutor$Worker.run(ThreadPoolExecutor.java:624)
        at java.lang.Thread.run(Thread.java:748)




Build Log:
[...truncated 14206 lines...]
   [junit4] Suite: org.apache.solr.handler.TestContainerReqHandler
   [junit4]   2> 1726252 INFO  (SUITE-TestContainerReqHandler-seed#[9C3BBC3A2BE2DEBD]-worker) [     ] o.a.s.SolrTestCaseJ4 Created dataDir: /home/jenkins/jenkins-slave/workspace/Lucene-Solr-Tests-8.x/solr/build/solr-core/test/J0/temp/solr.handler.TestContainerReqHandler_9C3BBC3A2BE2DEBD-001/data-dir-151-001
   [junit4]   2> 1726252 WARN  (SUITE-TestContainerReqHandler-seed#[9C3BBC3A2BE2DEBD]-worker) [     ] o.a.s.SolrTestCaseJ4 startTrackingSearchers: numOpens=23 numCloses=23
   [junit4]   2> 1726252 INFO  (SUITE-TestContainerReqHandler-seed#[9C3BBC3A2BE2DEBD]-worker) [     ] o.a.s.SolrTestCaseJ4 Using TrieFields (NUMERIC_POINTS_SYSPROP=false) w/NUMERIC_DOCVALUES_SYSPROP=true
   [junit4]   2> 1726253 INFO  (SUITE-TestContainerReqHandler-seed#[9C3BBC3A2BE2DEBD]-worker) [     ] o.a.s.SolrTestCaseJ4 Randomized ssl (false) and clientAuth (false) via: @org.apache.solr.SolrTestCaseJ4$SuppressSSL(bugUrl=None)
   [junit4]   2> 1726253 INFO  (SUITE-TestContainerReqHandler-seed#[9C3BBC3A2BE2DEBD]-worker) [     ] o.a.s.SolrTestCaseJ4 SecureRandom sanity checks: test.solr.allowed.securerandom=null & java.security.egd=file:/dev/./urandom
   [junit4]   2> 1726326 INFO  (TEST-TestContainerReqHandler.testRuntimeLibWithSig2048-seed#[9C3BBC3A2BE2DEBD]) [     ] o.a.s.SolrTestCaseJ4 ###Starting testRuntimeLibWithSig2048
   [junit4]   2> 1726449 INFO  (TEST-TestContainerReqHandler.testRuntimeLibWithSig2048-seed#[9C3BBC3A2BE2DEBD]) [     ] o.e.j.s.Server jetty-9.4.19.v20190610; built: 2019-06-10T16:30:51.723Z; git: afcf563148970e98786327af5e07c261fda175d3; jvm 1.8.0_191-b12
   [junit4]   2> 1726543 INFO  (TEST-TestContainerReqHandler.testRuntimeLibWithSig2048-seed#[9C3BBC3A2BE2DEBD]) [     ] o.e.j.s.AbstractConnector Started ServerConnector@389fce30{HTTP/1.1,[http/1.1]}{0.0.0.0:38093}
   [junit4]   2> 1726543 INFO  (TEST-TestContainerReqHandler.testRuntimeLibWithSig2048-seed#[9C3BBC3A2BE2DEBD]) [     ] o.e.j.s.Server Started @1726641ms
   [junit4]   2> 1726543 INFO  (TEST-TestContainerReqHandler.testRuntimeLibWithSig2048-seed#[9C3BBC3A2BE2DEBD]) [     ] o.a.s.c.MiniSolrCloudCluster Starting cluster of 4 servers in /home/jenkins/jenkins-slave/workspace/Lucene-Solr-Tests-8.x/solr/build/solr-core/test/J0/temp/solr.handler.TestContainerReqHandler_9C3BBC3A2BE2DEBD-001/tempDir-001
   [junit4]   2> 1726544 INFO  (TEST-TestContainerReqHandler.testRuntimeLibWithSig2048-seed#[9C3BBC3A2BE2DEBD]) [     ] o.a.s.c.ZkTestServer STARTING ZK TEST SERVER
   [junit4]   2> 1726546 INFO  (ZkTestServer Run Thread) [     ] o.a.s.c.ZkTestServer client port:0.0.0.0/0.0.0.0:0
   [junit4]   2> 1726546 INFO  (ZkTestServer Run Thread) [     ] o.a.s.c.ZkTestServer Starting server
   [junit4]   2> 1726646 INFO  (TEST-TestContainerReqHandler.testRuntimeLibWithSig2048-seed#[9C3BBC3A2BE2DEBD]) [     ] o.a.s.c.ZkTestServer start zk server on port:46604
   [junit4]   2> 1726646 INFO  (TEST-TestContainerReqHandler.testRuntimeLibWithSig2048-seed#[9C3BBC3A2BE2DEBD]) [     ] o.a.s.c.ZkTestServer waitForServerUp: 127.0.0.1:46604
   [junit4]   2> 1726646 INFO  (TEST-TestContainerReqHandler.testRuntimeLibWithSig2048-seed#[9C3BBC3A2BE2DEBD]) [     ] o.a.s.c.ZkTestServer parse host and port list: 127.0.0.1:46604
   [junit4]   2> 1726646 INFO  (TEST-TestContainerReqHandler.testRuntimeLibWithSig2048-seed#[9C3BBC3A2BE2DEBD]) [     ] o.a.s.c.ZkTestServer connecting to 127.0.0.1 46604
   [junit4]   2> 1726648 INFO  (TEST-TestContainerReqHandler.testRuntimeLibWithSig2048-seed#[9C3BBC3A2BE2DEBD]) [     ] o.a.s.c.c.ConnectionManager Waiting for client to connect to ZooKeeper
   [junit4]   2> 1726650 INFO  (zkConnectionManagerCallback-6946-thread-1) [     ] o.a.s.c.c.ConnectionManager zkClient has connected
   [junit4]   2> 1726650 INFO  (TEST-TestContainerReqHandler.testRuntimeLibWithSig2048-seed#[9C3BBC3A2BE2DEBD]) [     ] o.a.s.c.c.ConnectionManager Client is connected to ZooKeeper
   [junit4]   2> 1726670 INFO  (TEST-TestContainerReqHandler.testRuntimeLibWithSig2048-seed#[9C3BBC3A2BE2DEBD]) [     ] o.a.s.c.c.ConnectionManager Waiting for client to connect to ZooKeeper
   [junit4]   2> 1726671 INFO  (zkConnectionManagerCallback-6948-thread-1) [     ] o.a.s.c.c.ConnectionManager zkClient has connected
   [junit4]   2> 1726671 INFO  (TEST-TestContainerReqHandler.testRuntimeLibWithSig2048-seed#[9C3BBC3A2BE2DEBD]) [     ] o.a.s.c.c.ConnectionManager Client is connected to ZooKeeper
   [junit4]   2> 1726680 INFO  (TEST-TestContainerReqHandler.testRuntimeLibWithSig2048-seed#[9C3BBC3A2BE2DEBD]) [     ] o.a.s.c.c.ConnectionManager Waiting for client to connect to ZooKeeper
   [junit4]   2> 1726681 INFO  (zkConnectionManagerCallback-6950-thread-1) [     ] o.a.s.c.c.ConnectionManager zkClient has connected
   [junit4]   2> 1726681 INFO  (TEST-TestContainerReqHandler.testRuntimeLibWithSig2048-seed#[9C3BBC3A2BE2DEBD]) [     ] o.a.s.c.c.ConnectionManager Client is connected to ZooKeeper
   [junit4]   2> 1726835 WARN  (jetty-launcher-6951-thread-1) [     ] o.e.j.s.AbstractConnector Ignoring deprecated socket close linger time
   [junit4]   2> 1726835 INFO  (jetty-launcher-6951-thread-1) [     ] o.a.s.c.s.e.JettySolrRunner Start Jetty (original configured port=0)
   [junit4]   2> 1726835 INFO  (jetty-launcher-6951-thread-1) [     ] o.a.s.c.s.e.JettySolrRunner Trying to start Jetty on port 0 try number 1 ...
   [junit4]   2> 1726835 INFO  (jetty-launcher-6951-thread-1) [     ] o.e.j.s.Server jetty-9.4.19.v20190610; built: 2019-06-10T16:30:51.723Z; git: afcf563148970e98786327af5e07c261fda175d3; jvm 1.8.0_191-b12
   [junit4]   2> 1726847 WARN  (jetty-launcher-6951-thread-2) [     ] o.e.j.s.AbstractConnector Ignoring deprecated socket close linger time
   [junit4]   2> 1726847 INFO  (jetty-launcher-6951-thread-2) [     ] o.a.s.c.s.e.JettySolrRunner Start Jetty (original configured port=0)
   [junit4]   2> 1726847 INFO  (jetty-launcher-6951-thread-2) [     ] o.a.s.c.s.e.JettySolrRunner Trying to start Jetty on port 0 try number 1 ...
   [junit4]   2> 1726847 INFO  (jetty-launcher-6951-thread-2) [     ] o.e.j.s.Server jetty-9.4.19.v20190610; built: 2019-06-10T16:30:51.723Z; git: afcf563148970e98786327af5e07c261fda175d3; jvm 1.8.0_191-b12
   [junit4]   2> 1726883 WARN  (jetty-launcher-6951-thread-3) [     ] o.e.j.s.AbstractConnector Ignoring deprecated socket close linger time
   [junit4]   2> 1726883 INFO  (jetty-launcher-6951-thread-3) [     ] o.a.s.c.s.e.JettySolrRunner Start Jetty (original configured port=0)
   [junit4]   2> 1726883 INFO  (jetty-launcher-6951-thread-3) [     ] o.a.s.c.s.e.JettySolrRunner Trying to start Jetty on port 0 try number 1 ...
   [junit4]   2> 1726884 INFO  (jetty-launcher-6951-thread-3) [     ] o.e.j.s.Server jetty-9.4.19.v20190610; built: 2019-06-10T16:30:51.723Z; git: afcf563148970e98786327af5e07c261fda175d3; jvm 1.8.0_191-b12
   [junit4]   2> 1726916 WARN  (jetty-launcher-6951-thread-4) [     ] o.e.j.s.AbstractConnector Ignoring deprecated socket close linger time
   [junit4]   2> 1726916 INFO  (jetty-launcher-6951-thread-4) [     ] o.a.s.c.s.e.JettySolrRunner Start Jetty (original configured port=0)
   [junit4]   2> 1726916 INFO  (jetty-launcher-6951-thread-4) [     ] o.a.s.c.s.e.JettySolrRunner Trying to start Jetty on port 0 try number 1 ...
   [junit4]   2> 1726916 INFO  (jetty-launcher-6951-thread-4) [     ] o.e.j.s.Server jetty-9.4.19.v20190610; built: 2019-06-10T16:30:51.723Z; git: afcf563148970e98786327af5e07c261fda175d3; jvm 1.8.0_191-b12
   [junit4]   2> 1726936 INFO  (jetty-launcher-6951-thread-3) [     ] o.e.j.s.session DefaultSessionIdManager workerName=node0
   [junit4]   2> 1726936 INFO  (jetty-launcher-6951-thread-3) [     ] o.e.j.s.session No SessionScavenger set, using defaults
   [junit4]   2> 1726936 INFO  (jetty-launcher-6951-thread-3) [     ] o.e.j.s.session node0 Scavenging every 600000ms
   [junit4]   2> 1726992 INFO  (jetty-launcher-6951-thread-3) [     ] o.e.j.s.h.ContextHandler Started o.e.j.s.ServletContextHandler@67695947{/solr,null,AVAILABLE}
   [junit4]   2> 1727082 INFO  (jetty-launcher-6951-thread-4) [     ] o.e.j.s.session DefaultSessionIdManager workerName=node0
   [junit4]   2> 1727082 INFO  (jetty-launcher-6951-thread-4) [     ] o.e.j.s.session No SessionScavenger set, using defaults
   [junit4]   2> 1727082 INFO  (jetty-launcher-6951-thread-4) [     ] o.e.j.s.session node0 Scavenging every 600000ms
   [junit4]   2> 1727082 INFO  (jetty-launcher-6951-thread-4) [     ] o.e.j.s.h.ContextHandler Started o.e.j.s.ServletContextHandler@6f724019{/solr,null,AVAILABLE}
   [junit4]   2> 1727111 INFO  (jetty-launcher-6951-thread-2) [     ] o.e.j.s.session DefaultSessionIdManager workerName=node0
   [junit4]   2> 1727111 INFO  (jetty-launcher-6951-thread-2) [     ] o.e.j.s.session No SessionScavenger set, using defaults
   [junit4]   2> 1727111 INFO  (jetty-launcher-6951-thread-2) [     ] o.e.j.s.session node0 Scavenging every 660000ms
   [junit4]   2> 1727111 INFO  (jetty-launcher-6951-thread-2) [     ] o.e.j.s.h.ContextHandler Started o.e.j.s.ServletContextHandler@5a7b4dce{/solr,null,AVAILABLE}
   [junit4]   2> 1727112 INFO  (jetty-launcher-6951-thread-1) [     ] o.e.j.s.session DefaultSessionIdManager workerName=node0
   [junit4]   2> 1727112 INFO  (jetty-launcher-6951-thread-1) [     ] o.e.j.s.session No SessionScavenger set, using defaults
   [junit4]   2> 1727112 INFO  (jetty-launcher-6951-thread-1) [     ] o.e.j.s.session node0 Scavenging every 600000ms
   [junit4]   2> 1727112 INFO  (jetty-launcher-6951-thread-1) [     ] o.e.j.s.h.ContextHandler Started o.e.j.s.ServletContextHandler@566cd8af{/solr,null,AVAILABLE}
   [junit4]   2> 1727118 INFO  (jetty-launcher-6951-thread-4) [     ] o.e.j.s.AbstractConnector Started ServerConnector@6d7fb281{HTTP/1.1,[http/1.1, h2c]}{127.0.0.1:39359}
   [junit4]   2> 1727118 INFO  (jetty-launcher-6951-thread-4) [     ] o.e.j.s.Server Started @1727216ms
   [junit4]   2> 1727118 INFO  (jetty-launcher-6951-thread-4) [     ] o.a.s.c.s.e.JettySolrRunner Jetty properties: {hostContext=/solr, hostPort=39359}
   [junit4]   2> 1727118 INFO  (jetty-launcher-6951-thread-2) [     ] o.e.j.s.AbstractConnector Started ServerConnector@671218b4{HTTP/1.1,[http/1.1, h2c]}{127.0.0.1:35106}
   [junit4]   2> 1727118 INFO  (jetty-launcher-6951-thread-2) [     ] o.e.j.s.Server Started @1727216ms
   [junit4]   2> 1727118 INFO  (jetty-launcher-6951-thread-2) [     ] o.a.s.c.s.e.JettySolrRunner Jetty properties: {hostContext=/solr, hostPort=35106}
   [junit4]   2> 1727118 ERROR (jetty-launcher-6951-thread-4) [     ] o.a.s.u.StartupLoggingUtils Missing Java Option solr.log.dir. Logging may be missing or incomplete.
   [junit4]   2> 1727118 INFO  (jetty-launcher-6951-thread-4) [     ] o.a.s.s.SolrDispatchFilter Using logger factory org.apache.logging.slf4j.Log4jLoggerFactory
   [junit4]   2> 1727118 ERROR (jetty-launcher-6951-thread-2) [     ] o.a.s.u.StartupLoggingUtils Missing Java Option solr.log.dir. Logging may be missing or incomplete.
   [junit4]   2> 1727118 INFO  (jetty-launcher-6951-thread-2) [     ] o.a.s.s.SolrDispatchFilter Using logger factory org.apache.logging.slf4j.Log4jLoggerFactory
   [junit4]   2> 1727118 INFO  (jetty-launcher-6951-thread-4) [     ] o.a.s.s.SolrDispatchFilter  ___      _       Welcome to Apache Solr™ version 8.3.0
   [junit4]   2> 1727118 INFO  (jetty-launcher-6951-thread-4) [     ] o.a.s.s.SolrDispatchFilter / __| ___| |_ _   Starting in cloud mode on port null
   [junit4]   2> 1727118 INFO  (jetty-launcher-6951-thread-2) [     ] o.a.s.s.SolrDispatchFilter  ___      _       Welcome to Apache Solr™ version 8.3.0
   [junit4]   2> 1727118 INFO  (jetty-launcher-6951-thread-4) [     ] o.a.s.s.SolrDispatchFilter \__ \/ _ \ | '_|  Install dir: null
   [junit4]   2> 1727118 INFO  (jetty-launcher-6951-thread-2) [     ] o.a.s.s.SolrDispatchFilter / __| ___| |_ _   Starting in cloud mode on port null
   [junit4]   2> 1727118 INFO  (jetty-launcher-6951-thread-4) [     ] o.a.s.s.SolrDispatchFilter |___/\___/_|_|    Start time: 2019-09-02T07:08:57.311Z
   [junit4]   2> 1727118 INFO  (jetty-launcher-6951-thread-2) [     ] o.a.s.s.SolrDispatchFilter \__ \/ _ \ | '_|  Install dir: null
   [junit4]   2> 1727118 INFO  (jetty-launcher-6951-thread-2) [     ] o.a.s.s.SolrDispatchFilter |___/\___/_|_|    Start time: 2019-09-02T07:08:57.311Z
   [junit4]   2> 1727119 INFO  (jetty-launcher-6951-thread-3) [     ] o.e.j.s.AbstractConnector Started ServerConnector@799c74ea{HTTP/1.1,[http/1.1, h2c]}{127.0.0.1:39860}
   [junit4]   2> 1727119 INFO  (jetty-launcher-6951-thread-3) [     ] o.e.j.s.Server Started @1727217ms
   [junit4]   2> 1727119 INFO  (jetty-launcher-6951-thread-3) [     ] o.a.s.c.s.e.JettySolrRunner Jetty properties: {hostContext=/solr, hostPort=39860}
   [junit4]   2> 1727119 ERROR (jetty-launcher-6951-thread-3) [     ] o.a.s.u.StartupLoggingUtils Missing Java Option solr.log.dir. Logging may be missing or incomplete.
   [junit4]   2> 1727119 INFO  (jetty-launcher-6951-thread-3) [     ] o.a.s.s.SolrDispatchFilter Using logger factory org.apache.logging.slf4j.Log4jLoggerFactory
   [junit4]   2> 1727119 INFO  (jetty-launcher-6951-thread-3) [     ] o.a.s.s.SolrDispatchFilter  ___      _       Welcome to Apache Solr™ version 8.3.0
   [junit4]   2> 1727119 INFO  (jetty-launcher-6951-thread-3) [     ] o.a.s.s.SolrDispatchFilter / __| ___| |_ _   Starting in cloud mode on port null
   [junit4]   2> 1727119 INFO  (jetty-launcher-6951-thread-3) [     ] o.a.s.s.SolrDispatchFilter \__ \/ _ \ | '_|  Install dir: null
   [junit4]   2> 1727119 INFO  (jetty-launcher-6951-thread-3) [     ] o.a.s.s.SolrDispatchFilter |___/\___/_|_|    Start time: 2019-09-02T07:08:57.312Z
   [junit4]   2> 1727120 INFO  (jetty-launcher-6951-thread-2) [     ] o.a.s.c.c.ConnectionManager Waiting for client to connect to ZooKeeper
   [junit4]   2> 1727134 INFO  (jetty-launcher-6951-thread-4) [     ] o.a.s.c.c.ConnectionManager Waiting for client to connect to ZooKeeper
   [junit4]   2> 1727174 INFO  (jetty-launcher-6951-thread-3) [     ] o.a.s.c.c.ConnectionManager Waiting for client to connect to ZooKeeper
   [junit4]   2> 1727175 INFO  (jetty-launcher-6951-thread-1) [     ] o.e.j.s.AbstractConnector Started ServerConnector@3f134b3{HTTP/1.1,[http/1.1, h2c]}{127.0.0.1:39601}
   [junit4]   2> 1727175 INFO  (jetty-launcher-6951-thread-1) [     ] o.e.j.s.Server Started @1727272ms
   [junit4]   2> 1727175 INFO  (jetty-launcher-6951-thread-1) [     ] o.a.s.c.s.e.JettySolrRunner Jetty properties: {hostContext=/solr, hostPort=39601}
   [junit4]   2> 1727191 ERROR (jetty-launcher-6951-thread-1) [     ] o.a.s.u.StartupLoggingUtils Missing Java Option solr.log.dir. Logging may be missing or incomplete.
   [junit4]   2> 1727191 INFO  (jetty-launcher-6951-thread-1) [     ] o.a.s.s.SolrDispatchFilter Using logger factory org.apache.logging.slf4j.Log4jLoggerFactory
   [junit4]   2> 1727191 INFO  (jetty-launcher-6951-thread-1) [     ] o.a.s.s.SolrDispatchFilter  ___      _       Welcome to Apache Solr™ version 8.3.0
   [junit4]   2> 1727191 INFO  (jetty-launcher-6951-thread-1) [     ] o.a.s.s.SolrDispatchFilter / __| ___| |_ _   Starting in cloud mode on port null
   [junit4]   2> 1727191 INFO  (jetty-launcher-6951-thread-1) [     ] o.a.s.s.SolrDispatchFilter \__ \/ _ \ | '_|  Install dir: null
   [junit4]   2> 1727191 INFO  (jetty-launcher-6951-thread-1) [     ] o.a.s.s.SolrDispatchFilter |___/\___/_|_|    Start time: 2019-09-02T07:08:57.384Z
   [junit4]   2> 1727192 INFO  (zkConnectionManagerCallback-6955-thread-1) [     ] o.a.s.c.c.ConnectionManager zkClient has connected
   [junit4]   2> 1727192 INFO  (jetty-launcher-6951-thread-3) [     ] o.a.s.c.c.ConnectionManager Client is connected to ZooKeeper
   [junit4]   2> 1727194 INFO  (jetty-launcher-6951-thread-3) [     ] o.a.s.s.SolrDispatchFilter solr.xml found in ZooKeeper. Loading...
   [junit4]   2> 1727229 INFO  (jetty-launcher-6951-thread-1) [     ] o.a.s.c.c.ConnectionManager Waiting for client to connect to ZooKeeper
   [junit4]   2> 1727229 INFO  (zkConnectionManagerCallback-6953-thread-1) [     ] o.a.s.c.c.ConnectionManager zkClient has connected
   [junit4]   2> 1727229 INFO  (jetty-launcher-6951-thread-2) [     ] o.a.s.c.c.ConnectionManager Client is connected to ZooKeeper
   [junit4]   2> 1727230 INFO  (jetty-launcher-6951-thread-2) [     ] o.a.s.s.SolrDispatchFilter solr.xml found in ZooKeeper. Loading...
   [junit4]   2> 1727243 INFO  (zkConnectionManagerCallback-6957-thread-1) [     ] o.a.s.c.c.ConnectionManager zkClient has connected
   [junit4]   2> 1727243 INFO  (jetty-launcher-6951-thread-4) [     ] o.a.s.c.c.ConnectionManager Client is connected to ZooKeeper
   [junit4]   2> 1727246 INFO  (zkConnectionManagerCallback-6959-thread-1) [     ] o.a.s.c.c.ConnectionManager zkClient has connected
   [junit4]   2> 1727247 INFO  (jetty-launcher-6951-thread-1) [     ] o.a.s.c.c.ConnectionManager Client is connected to ZooKeeper
   [junit4]   2> 1727264 INFO  (jetty-launcher-6951-thread-1) [     ] o.a.s.s.SolrDispatchFilter solr.xml found in ZooKeeper. Loading...
   [junit4]   2> 1727280 INFO  (jetty-launcher-6951-thread-4) [     ] o.a.s.s.SolrDispatchFilter solr.xml found in ZooKeeper. Loading...
   [junit4]   2> 1728213 INFO  (jetty-launcher-6951-thread-3) [     ] o.a.s.h.c.HttpShardHandlerFactory Host whitelist initialized: WhitelistHostChecker [whitelistHosts=null, whitelistHostCheckingEnabled=true]
   [junit4]   2> 1728233 WARN  (jetty-launcher-6951-thread-3) [     ] o.e.j.u.s.S.config Trusting all certificates configured for Client@160a537d[provider=null,keyStore=null,trustStore=null]
   [junit4]   2> 1728233 WARN  (jetty-launcher-6951-thread-3) [     ] o.e.j.u.s.S.config No Client EndPointIdentificationAlgorithm configured for Client@160a537d[provider=null,keyStore=null,trustStore=null]
   [junit4]   2> 1728239 INFO  (jetty-launcher-6951-thread-4) [     ] o.a.s.h.c.HttpShardHandlerFactory Host whitelist initialized: WhitelistHostChecker [whitelistHosts=null, whitelistHostCheckingEnabled=true]
   [junit4]   2> 1728246 WARN  (jetty-launcher-6951-thread-3) [     ] o.e.j.u.s.S.config Trusting all certificates configured for Client@4dc420fc[provider=null,keyStore=null,trustStore=null]
   [junit4]   2> 1728246 WARN  (jetty-launcher-6951-thread-3) [     ] o.e.j.u.s.S.config No Client EndPointIdentificationAlgorithm configured for Client@4dc420fc[provider=null,keyStore=null,trustStore=null]
   [junit4]   2> 1728247 INFO  (jetty-launcher-6951-thread-3) [     ] o.a.s.c.ZkContainer Zookeeper client=127.0.0.1:46604/solr
   [junit4]   2> 1728266 INFO  (jetty-launcher-6951-thread-3) [     ] o.a.s.c.c.ConnectionManager Waiting for client to connect to ZooKeeper
   [junit4]   2> 1728266 WARN  (jetty-launcher-6951-thread-4) [     ] o.e.j.u.s.S.config Trusting all certificates configured for Client@3d9723ec[provider=null,keyStore=null,trustStore=null]
   [junit4]   2> 1728266 WARN  (jetty-launcher-6951-thread-4) [     ] o.e.j.u.s.S.config No Client EndPointIdentificationAlgorithm configured for Client@3d9723ec[provider=null,keyStore=null,trustStore=null]
   [junit4]   2> 1728282 INFO  (zkConnectionManagerCallback-6970-thread-1) [     ] o.a.s.c.c.ConnectionManager zkClient has connected
   [junit4]   2> 1728282 INFO  (jetty-launcher-6951-thread-3) [     ] o.a.s.c.c.ConnectionManager Client is connected to ZooKeeper
   [junit4]   2> 1728283 WARN  (jetty-launcher-6951-thread-4) [     ] o.e.j.u.s.S.config Trusting all certificates configured for Client@5ee4ba5[provider=null,keyStore=null,trustStore=null]
   [junit4]   2> 1728283 WARN  (jetty-launcher-6951-thread-4) [     ] o.e.j.u.s.S.config No Client EndPointIdentificationAlgorithm configured for Client@5ee4ba5[provider=null,keyStore=null,trustStore=null]
   [junit4]   2> 1728284 INFO  (jetty-launcher-6951-thread-4) [     ] o.a.s.c.ZkContainer Zookeeper client=127.0.0.1:46604/solr
   [junit4]   2> 1728285 INFO  (jetty-launcher-6951-thread-4) [     ] o.a.s.c.c.ConnectionManager Waiting for client to connect to ZooKeeper
   [junit4]   2> 1728402 WARN  (NIOWorkerThread-2) [     ] o.a.z.s.NIOServerCnxn Unable to read additional data from client sessionid 0x10b9510aa990007, likely client has closed socket
   [junit4]   2> 1728411 INFO  (zkConnectionManagerCallback-6975-thread-1) [     ] o.a.s.c.c.ConnectionManager zkClient has connected
   [junit4]   2> 1728411 INFO  (jetty-launcher-6951-thread-4) [     ] o.a.s.c.c.ConnectionManager Client is connected to ZooKeeper
   [junit4]   2> 1728573 INFO  (jetty-launcher-6951-thread-3) [n:127.0.0.1:39860_solr     ] o.a.s.c.c.ConnectionManager Waiting for client to connect to ZooKeeper
   [junit4]   2> 1728614 INFO  (zkConnectionManagerCallback-6977-thread-1) [     ] o.a.s.c.c.ConnectionManager zkClient has connected
   [junit4]   2> 1728642 INFO  (jetty-launcher-6951-thread-3) [n:127.0.0.1:39860_solr     ] o.a.s.c.c.ConnectionManager Client is connected to ZooKeeper
   [junit4]   2> 1728695 INFO  (jetty-launcher-6951-thread-4) [n:127.0.0.1:39359_solr     ] o.a.s.c.c.ConnectionManager Waiting for client to connect to ZooKeeper
   [junit4]   2> 1728695 INFO  (zkConnectionManagerCallback-6979-thread-1) [     ] o.a.s.c.c.ConnectionManager zkClient has connected
   [junit4]   2> 1728695 INFO  (jetty-launcher-6951-thread-4) [n:127.0.0.1:39359_solr     ] o.a.s.c.c.ConnectionManager Client is connected to ZooKeeper
   [junit4]   2> 1728734 INFO  (jetty-launcher-6951-thread-1) [     ] o.a.s.h.c.HttpShardHandlerFactory Host whitelist initialized: WhitelistHostChecker [whitelistHosts=null, whitelistHostCheckingEnabled=true]
   [junit4]   2> 1728745 DEBUG (jetty-launcher-6951-thread-4) [n:127.0.0.1:39359_solr     ] o.a.s.c.c.ZkStateReader Updating cluster state from ZooKeeper...
   [junit4]   2> 1728746 DEBUG (jetty-launcher-6951-thread-4) [n:127.0.0.1:39359_solr     ] o.a.s.c.c.ZkStateReader Loaded empty cluster properties
   [junit4]   2> 1728746 DEBUG (jetty-launcher-6951-thread-4) [n:127.0.0.1:39359_solr     ] o.a.s.c.c.ZkStateReader Updated live nodes from ZooKeeper... [] -> []
   [junit4]   2> 1728747 DEBUG (jetty-launcher-6951-thread-4) [n:127.0.0.1:39359_solr     ] o.a.s.c.c.ZkStateReader clusterStateSet: legacy [0] interesting [0] watched [0] lazy [0] total [0]
   [junit4]   2> 1728747 WARN  (jetty-launcher-6951-thread-1) [     ] o.e.j.u.s.S.config Trusting all certificates configured for Client@7208b898[provider=null,keyStore=null,trustStore=null]
   [junit4]   2> 1728747 WARN  (jetty-launcher-6951-thread-1) [     ] o.e.j.u.s.S.config No Client EndPointIdentificationAlgorithm configured for Client@7208b898[provider=null,keyStore=null,trustStore=null]
   [junit4]   2> 1728750 WARN  (jetty-launcher-6951-thread-1) [     ] o.e.j.u.s.S.config Trusting all certificates configured for Client@2b6d4be7[provider=null,keyStore=null,trustStore=null]
   [junit4]   2> 1728750 WARN  (jetty-launcher-6951-thread-1) [     ] o.e.j.u.s.S.config No Client EndPointIdentificationAlgorithm configured for Client@2b6d4be7[provider=null,keyStore=null,trustStore=null]
   [junit4]   2> 1728751 INFO  (jetty-launcher-6951-thread-1) [     ] o.a.s.c.ZkContainer Zookeeper client=127.0.0.1:46604/solr
   [junit4]   2> 1728776 INFO  (jetty-launcher-6951-thread-1) [     ] o.a.s.c.c.ConnectionManager Waiting for client to connect to ZooKeeper
   [junit4]   2> 1728817 INFO  (jetty-launcher-6951-thread-4) [n:127.0.0.1:39359_solr     ] o.a.s.c.OverseerElectionContext I am going to be the leader 127.0.0.1:39359_solr
   [junit4]   2> 1728819 INFO  (jetty-launcher-6951-thread-4) [n:127.0.0.1:39359_solr     ] o.a.s.c.Overseer Overseer (id=75317717595914250-127.0.0.1:39359_solr-n_0000000000) starting
   [junit4]   2> 1728853 INFO  (zkConnectionManagerCallback-6989-thread-1) [     ] o.a.s.c.c.ConnectionManager zkClient has connected
   [junit4]   2> 1728861 INFO  (jetty-launcher-6951-thread-1) [     ] o.a.s.c.c.ConnectionManager Client is connected to ZooKeeper
   [junit4]   2> 1728935 INFO  (jetty-launcher-6951-thread-2) [     ] o.a.s.h.c.HttpShardHandlerFactory Host whitelist initialized: WhitelistHostChecker [whitelistHosts=null, whitelistHostCheckingEnabled=true]
   [junit4]   2> 1728960 INFO  (jetty-launcher-6951-thread-4) [n:127.0.0.1:39359_solr     ] o.a.s.c.c.ConnectionManager Waiting for client to connect to ZooKeeper
   [junit4]   2> 1728962 WARN  (jetty-launcher-6951-thread-2) [     ] o.e.j.u.s.S.config Trusting all certificates configured for Client@79dc6e94[provider=null,keyStore=null,trustStore=null]
   [junit4]   2> 1728963 WARN  (jetty-launcher-6951-thread-2) [     ] o.e.j.u.s.S.config No Client EndPointIdentificationAlgorithm configured for Client@79dc6e94[provider=null,keyStore=null,trustStore=null]
   [junit4]   2> 1728994 WARN  (jetty-launcher-6951-thread-2) [     ] o.e.j.u.s.S.config Trusting all certificates configured for Client@62efc3fa[provider=null,keyStore=null,trustStore=null]
   [junit4]   2> 1728994 WARN  (jetty-launcher-6951-thread-2) [     ] o.e.j.u.s.S.config No Client EndPointIdentificationAlgorithm configured for Client@62efc3fa[provider=null,keyStore=null,trustStore=null]
   [junit4]   2> 1728995 INFO  (jetty-launcher-6951-thread-2) [     ] o.a.s.c.ZkContainer Zookeeper client=127.0.0.1:46604/solr
   [junit4]   2> 1728997 INFO  (zkConnectionManagerCallback-6995-thread-1) [     ] o.a.s.c.c.ConnectionManager zkClient has connected
   [junit4]   2> 1728997 INFO  (jetty-launcher-6951-thread-4) [n:127.0.0.1:39359_solr     ] o.a.s.c.c.ConnectionManager Client is connected to ZooKeeper
   [junit4]   2> 1728997 DEBUG (jetty-launcher-6951-thread-4) [n:127.0.0.1:39359_solr     ] o.a.s.c.c.ZkStateReader Updating cluster state from ZooKeeper...
   [junit4]   2> 1728998 DEBUG (jetty-launcher-6951-thread-4) [n:127.0.0.1:39359_solr     ] o.a.s.c.c.ZkStateReader Loaded empty cluster properties
   [junit4]   2> 1729011 DEBUG (jetty-launcher-6951-thread-4) [n:127.0.0.1:39359_solr     ] o.a.s.c.c.ZkStateReader Updated live nodes from ZooKeeper... [] -> []
   [junit4]   2> 1729012 DEBUG (jetty-launcher-6951-thread-4) [n:127.0.0.1:39359_solr     ] o.a.s.c.c.ZkStateReader clusterStateSet: legacy [0] interesting [0] watched [0] lazy [0] total [0]
   [junit4]   2> 1729013 INFO  (jetty-launcher-6951-thread-4) [n:127.0.0.1:39359_solr     ] o.a.s.c.s.i.ZkClientClusterStateProvider Cluster at 127.0.0.1:46604/solr ready
   [junit4]   2> 1729036 INFO  (jetty-launcher-6951-thread-2) [     ] o.a.s.c.c.ConnectionManager Waiting for client to connect to ZooKeeper
   [junit4]   2> 1729053 INFO  (jetty-launcher-6951-thread-1) [n:127.0.0.1:39601_solr     ] o.a.s.c.c.ConnectionManager Waiting for client to connect to ZooKeeper
   [junit4]   2> 1729089 INFO  (OverseerStateUpdate-75317717595914250-127.0.0.1:39359_solr-n_0000000000) [n:127.0.0.1:39359_solr     ] o.a.s.c.Overseer Starting to work on the main queue : 127.0.0.1:39359_solr
   [junit4]   2> 1729090 INFO  (jetty-launcher-6951-thread-4) [n:127.0.0.1:39359_solr     ] o.a.s.c.ZkController Register node as live in ZooKeeper:/live_nodes/127.0.0.1:39359_solr
   [junit4]   2> 1729091 DEBUG (OverseerStateUpdate-75317717595914250-127.0.0.1:39359_solr-n_0000000000) [n:127.0.0.1:39359_solr     ] o.a.s.c.c.ZkStateReader Updated live nodes from ZooKeeper... [] -> []
   [junit4]   2> 1729108 INFO  (zkConnectionManagerCallback-7000-thread-1) [     ] o.a.s.c.c.ConnectionManager zkClient has connected
   [junit4]   2> 1729108 INFO  (jetty-launcher-6951-thread-2) [     ] o.a.s.c.c.ConnectionManager Client is connected to ZooKeeper
   [junit4]   2> 1729109 DEBUG (zkCallback-6994-thread-1) [     ] o.a.s.c.c.ZkStateReader A live node change: [WatchedEvent state:SyncConnected type:NodeChildrenChanged path:/live_nodes], has occurred - updating... (live nodes size: [0])
   [junit4]   2> 1729109 INFO  (zkConnectionManagerCallback-7002-thread-1) [     ] o.a.s.c.c.ConnectionManager zkClient has connected
   [junit4]   2> 1729109 INFO  (jetty-launcher-6951-thread-1) [n:127.0.0.1:39601_solr     ] o.a.s.c.c.ConnectionManager Client is connected to ZooKeeper
   [junit4]   2> 1729109 DEBUG (OverseerStateUpdate-75317717595914250-127.0.0.1:39359_solr-n_0000000000) [n:127.0.0.1:39359_solr     ] o.a.s.c.c.ZkStateReader clusterStateSet: legacy [0] interesting [0] watched [0] lazy [0] total [0]
   [junit4]   2> 1729141 DEBUG (zkCallback-6978-thread-1) [     ] o.a.s.c.c.ZkStateReader A live node change: [WatchedEvent state:SyncConnected type:NodeChildrenChanged path:/live_nodes], has occurred - updating... (live nodes size: [0])
   [junit4]   2> 1729144 INFO  (zkCallback-6994-thread-1) [     ] o.a.s.c.c.ZkStateReader Updated live nodes from ZooKeeper... (0) -> (1)
   [junit4]   2> 1729144 DEBUG (zkCallback-6994-thread-1) [     ] o.a.s.c.c.ZkStateReader Updated live nodes from ZooKeeper... [] -> [127.0.0.1:39359_solr]
   [junit4]   2> 1729220 INFO  (zkCallback-6978-thread-1) [     ] o.a.s.c.c.ZkStateReader Updated live nodes from ZooKeeper... (0) -> (1)
   [junit4]   2> 1729220 DEBUG (zkCallback-6978-thread-1) [     ] o.a.s.c.c.ZkStateReader Updated live nodes from ZooKeeper... [] -> [127.0.0.1:39359_solr]
   [junit4]   2> 1729220 INFO  (jetty-launcher-6951-thread-2) [n:127.0.0.1:35106_solr     ] o.a.s.c.c.ConnectionManager Waiting for client to connect to ZooKeeper
   [junit4]   2> 1729287 INFO  (jetty-launcher-6951-thread-4) [n:127.0.0.1:39359_solr     ] o.a.s.c.PackageManager clusterprops.json changed , version -1
   [junit4]   2> 1729290 INFO  (zkConnectionManagerCallback-7004-thread-1) [     ] o.a.s.c.c.ConnectionManager zkClient has connected
   [junit4]   2> 1729290 INFO  (jetty-launcher-6951-thread-2) [n:127.0.0.1:35106_solr     ] o.a.s.c.c.ConnectionManager Client is connected to ZooKeeper
   [junit4]   2> 1729356 DEBUG (jetty-launcher-6951-thread-2) [n:127.0.0.1:35106_solr     ] o.a.s.c.c.ZkStateReader Updating cluster state from ZooKeeper...
   [junit4]   2> 1729357 DEBUG (jetty-launcher-6951-thread-2) [n:127.0.0.1:35106_solr     ] o.a.s.c.c.ZkStateReader Loaded empty cluster properties
   [junit4]   2> 1729357 INFO  (jetty-launcher-6951-thread-2) [n:127.0.0.1:35106_solr     ] o.a.s.c.c.ZkStateReader Updated live nodes from ZooKeeper... (0) -> (1)
   [junit4]   2> 1729357 DEBUG (jetty-launcher-6951-thread-2) [n:127.0.0.1:35106_solr     ] o.a.s.c.c.ZkStateReader Updated live nodes from ZooKeeper... [] -> [127.0.0.1:39359_solr]
   [junit4]   2> 1729357 DEBUG (jetty-launcher-6951-thread-2) [n:127.0.0.1:35106_solr     ] o.a.s.c.c.ZkStateReader clusterStateSet: legacy [0] interesting [0] watched [0] lazy [0] total [0]
   [junit4]   2> 1729378 INFO  (jetty-launcher-6951-thread-2) [n:127.0.0.1:35106_solr     ] o.a.s.c.ZkController Publish node=127.0.0.1:35106_solr as DOWN
   [junit4]   2> 1729379 INFO  (jetty-launcher-6951-thread-2) [n:127.0.0.1:35106_solr     ] o.a.s.c.TransientSolrCoreCacheDefault Allocating transient cache for 2147483647 transient cores
   [junit4]   2> 1729379 INFO  (jetty-launcher-6951-thread-2) [n:127.0.0.1:35106_solr     ] o.a.s.c.ZkController Register node as live in ZooKeeper:/live_nodes/127.0.0.1:35106_solr
   [junit4]   2> 1729432 INFO  (jetty-launcher-6951-thread-2) [n:127.0.0.1:35106_solr     ] o.a.s.c.c.ConnectionManager Waiting for client to connect to ZooKeeper
   [junit4]   2> 1729433 DEBUG (zkCallback-7003-thread-1) [     ] o.a.s.c.c.ZkStateReader A live node change: [WatchedEvent state:SyncConnected type:NodeChildrenChanged path:/live_nodes], has occurred - updating... (live nodes size: [1])
   [junit4]   2> 1729441 DEBUG (zkCallback-6978-thread-2) [     ] o.a.s.c.c.ZkStateReader A live node change: [WatchedEvent state:SyncConnected type:NodeChildrenChanged path:/live_nodes], has occurred - updating... (live nodes size: [1])
   [junit4]   2> 1729441 INFO  (zkConnectionManagerCallback-7013-thread-1) [     ] o.a.s.c.c.ConnectionManager zkClient has connected
   [junit4]   2> 1729452 DEBUG (jetty-launcher-6951-thread-1) [n:127.0.0.1:39601_solr     ] o.a.s.c.c.ZkStateReader Updating cluster state from ZooKeeper...
   [junit4]   2> 1729452 INFO  (jetty-launcher-6951-thread-2) [n:127.0.0.1:35106_solr     ] o.a.s.c.c.ConnectionManager Client is connected to ZooKeeper
   [junit4]   2> 1729453 DEBUG (jetty-launcher-6951-thread-2) [n:127.0.0.1:35106_solr     ] o.a.s.c.c.ZkStateReader Updating cluster state from ZooKeeper...
   [junit4]   2> 1729453 DEBUG (zkCallback-6994-thread-1) [     ] o.a.s.c.c.ZkStateReader A live node change: [WatchedEvent state:SyncConnected type:NodeChildrenChanged path:/live_nodes], has occurred - updating... (live nodes size: [1])
   [junit4]   2> 1729469 INFO  (jetty-launcher-6951-thread-4) [n:127.0.0.1:39359_solr     ] o.a.s.h.a.MetricsHistoryHandler No .system collection, keeping metrics history in memory.
   [junit4]   2> 1729482 INFO  (zkCallback-6978-thread-2) [     ] o.a.s.c.c.ZkStateReader Updated live nodes from ZooKeeper... (1) -> (2)
   [junit4]   2> 1729482 DEBUG (zkCallback-6978-thread-2) [     ] o.a.s.c.c.ZkStateReader Updated live nodes from ZooKeeper... [127.0.0.1:39359_solr] -> [127.0.0.1:35106_solr, 127.0.0.1:39359_solr]
   [junit4]   2> 1729482 DEBUG (jetty-launcher-6951-thread-1) [n:127.0.0.1:39601_solr     ] o.a.s.c.c.ZkStateReader Loaded empty cluster properties
   [junit4]   2> 1729483 INFO  (jetty-launcher-6951-thread-1) [n:127.0.0.1:39601_solr     ] o.a.s.c.c.ZkStateReader Updated live nodes from ZooKeeper... (0) -> (2)
   [junit4]   2> 1729483 DEBUG (jetty-launcher-6951-thread-1) [n:127.0.0.1:39601_solr     ] o.a.s.c.c.ZkStateReader Updated live nodes from ZooKeeper... [] -> [127.0.0.1:35106_solr, 127.0.0.1:39359_solr]
   [junit4]   2> 1729485 DEBUG (jetty-launcher-6951-thread-1) [n:127.0.0.1:39601_solr     ] o.a.s.c.c.ZkStateReader clusterStateSet: legacy [0] interesting [0] watched [0] lazy [0] total [0]
   [junit4]   2> 1729490 INFO  (zkCallback-7003-thread-1) [     ] o.a.s.c.c.ZkStateReader Updated live nodes from ZooKeeper... (1) -> (2)
   [junit4]   2> 1729490 DEBUG (zkCallback-7003-thread-1) [     ] o.a.s.c.c.ZkStateReader Updated live nodes from ZooKeeper... [127.0.0.1:39359_solr] -> [127.0.0.1:35106_solr, 127.0.0.1:39359_solr]
   [junit4]   2> 1729490 INFO  (zkCallback-6994-thread-1) [     ] o.a.s.c.c.ZkStateReader Updated live nodes from ZooKeeper... (1) -> (2)
   [junit4]   2> 1729490 DEBUG (zkCallback-6994-thread-1) [     ] o.a.s.c.c.ZkStateReader Updated live nodes from ZooKeeper... [127.0.0.1:39359_solr] -> [127.0.0.1:35106_solr, 127.0.0.1:39359_solr]
   [junit4]   2> 1729505 DEBUG (jetty-launcher-6951-thread-2) [n:127.0.0.1:35106_solr     ] o.a.s.c.c.ZkStateReader Loaded empty cluster properties
   [junit4]   2> 1729542 INFO  (jetty-launcher-6951-thread-2) [n:127.0.0.1:35106_solr     ] o.a.s.c.c.ZkStateReader Updated live nodes from ZooKeeper... (0) -> (2)
   [junit4]   2> 1729542 DEBUG (jetty-launcher-6951-thread-2) [n:127.0.0.1:35106_solr     ] o.a.s.c.c.ZkStateReader Updated live nodes from ZooKeeper... [] -> [127.0.0.1:35106_solr, 127.0.0.1:39359_solr]
   [junit4]   2> 1729594 INFO  (jetty-launcher-6951-thread-1) [n:127.0.0.1:39601_solr     ] o.a.s.c.ZkController Publish node=127.0.0.1:39601_solr as DOWN
   [junit4]   2> 1729598 DEBUG (jetty-launcher-6951-thread-2) [n:127.0.0.1:35106_solr     ] o.a.s.c.c.ZkStateReader clusterStateSet: legacy [0] interesting [0] watched [0] lazy [0] total [0]
   [junit4]   2> 1729615 DEBUG (jetty-launcher-6951-thread-3) [n:127.0.0.1:39860_solr     ] o.a.s.c.c.ZkStateReader Updating cluster state from ZooKeeper...
   [junit4]   2> 1729615 DEBUG (jetty-launcher-6951-thread-3) [n:127.0.0.1:39860_solr     ] o.a.s.c.c.ZkStateReader Loaded empty cluster properties
   [junit4]   2> 1729616 INFO  (jetty-launcher-6951-thread-3) [n:127.0.0.1:39860_solr     ] o.a.s.c.c.ZkStateReader Updated live nodes from ZooKeeper... (0) -> (2)
   [junit4]   2> 1729616 DEBUG (jetty-launcher-6951-thread-3) [n:127.0.0.1:39860_solr     ] o.a.s.c.c.ZkStateReader Updated live nodes from ZooKeeper... [] -> [127.0.0.1:35106_solr, 127.0.0.1:39359_solr]
   [junit4]   2> 1729616 DEBUG (jetty-launcher-6951-thread-3) [n:127.0.0.1:39860_solr     ] o.a.s.c.c.ZkStateReader clusterStateSet: legacy [0] interesting [0] watched [0] lazy [0] total [0]
   [junit4]   2> 1729617 INFO  (jetty-launcher-6951-thread-2) [n:127.0.0.1:35106_solr     ] o.a.s.c.s.i.ZkClientClusterStateProvider Cluster at 127.0.0.1:46604/solr ready
   [junit4]   2> 1729617 INFO  (jetty-launcher-6951-thread-2) [n:127.0.0.1:35106_solr     ] o.a.s.c.PackageManager clusterprops.json changed , version -1
   [junit4]   2> 1729638 INFO  (jetty-launcher-6951-thread-1) [n:127.0.0.1:39601_solr     ] o.a.s.c.TransientSolrCoreCacheDefault Allocating transient cache for 2147483647 transient cores
   [junit4]   2> 1729638 INFO  (jetty-launcher-6951-thread-1) [n:127.0.0.1:39601_solr     ] o.a.s.c.ZkController Register node as live in ZooKeeper:/live_nodes/127.0.0.1:39601_solr
   [junit4]   2> 1729654 INFO  (jetty-launcher-6951-thread-4) [n:127.0.0.1:39359_solr     ] o.a.s.m.r.SolrJmxReporter JMX monitoring for 'solr_39359.solr.node' (registry 'solr.node') enabled at server: com.sun.jmx.mbeanserver.JmxMBeanServer@431179e4
   [junit4]   2> 1729656 DEBUG (zkCallback-6978-thread-2) [     ] o.a.s.c.c.ZkStateReader A live node change: [WatchedEvent state:SyncConnected type:NodeChildrenChanged path:/live_nodes], has occurred - updating... (live nodes size: [2])
   [junit4]   2> 1729656 INFO  (zkCallback-6978-thread-2) [     ] o.a.s.c.c.ZkStateReader Updated live nodes from ZooKeeper... (2) -> (3)
   [junit4]   2> 1729656 DEBUG (zkCallback-6978-thread-2) [     ] o.a.s.c.c.ZkStateReader Updated live nodes from ZooKeeper... [127.0.0.1:35106_solr, 127.0.0.1:39359_solr] -> [127.0.0.1:35106_solr, 127.0.0.1:39359_solr, 127.0.0.1:39601_solr]
   [junit4]   2> 1729664 INFO  (jetty-launcher-6951-thread-1) [n:127.0.0.1:39601_solr     ] o.a.s.c.c.ConnectionManager Waiting for client to connect to ZooKeeper
   [junit4]   2> 1729671 DEBUG (zkCallback-7003-thread-1) [     ] o.a.s.c.c.ZkStateReader A live node change: [WatchedEvent state:SyncConnected type:NodeChildrenChanged path:/live_nodes], has occurred - updating... (live nodes size: [2])
   [junit4]   2> 1729671 DEBUG (zkCallback-6994-thread-1) [     ] o.a.s.c.c.ZkStateReader A live node change: [WatchedEvent state:SyncConnected type:NodeChildrenChanged path:/live_nodes], has occurred - updating... (live nodes size: [2])
   [junit4]   2> 1729672 INFO  (zkCallback-6994-thread-1) [     ] o.a.s.c.c.ZkStateReader Updated live nodes from ZooKeeper... (2) -> (3)
   [junit4]   2> 1729672 DEBUG (zkCallback-6994-thread-1) [     ] o.a.s.c.c.ZkStateReader Updated live nodes from ZooKeeper... [127.0.0.1:35106_solr, 127.0.0.1:39359_solr] -> [127.0.0.1:35106_solr, 127.0.0.1:39359_solr, 127.0.0.1:39601_solr]
   [junit4]   2> 1729672 INFO  (jetty-launcher-6951-thread-3) [n:127.0.0.1:39860_solr     ] o.a.s.c.ZkController Publish node=127.0.0.1:39860_solr as DOWN
   [junit4]   2> 1729673 INFO  (jetty-launcher-6951-thread-3) [n:127.0.0.1:39860_solr     ] o.a.s.c.TransientSolrCoreCacheDefault Allocating transient cache for 2147483647 transient cores
   [junit4]   2> 1729673 INFO  (jetty-launcher-6951-thread-3) [n:127.0.0.1:39860_solr     ] o.a.s.c.ZkController Register node as live in ZooKeeper:/live_nodes/127.0.0.1:39860_solr
   [junit4]   2> 1729674 DEBUG (zkCallback-6994-thread-1) [     ] o.a.s.c.c.ZkStateReader A live node change: [WatchedEvent state:SyncConnected type:NodeChildrenChanged path:/live_nodes], has occurred - updating... (live nodes size: [3])
   [junit4]   2> 1729674 DEBUG (zkCallback-6978-thread-2) [     ] o.a.s.c.c.ZkStateReader A live node change: [WatchedEvent state:SyncConnected type:NodeChildrenChanged path:/live_nodes], has occurred - updating... (live nodes size: [3])
   [junit4]   2> 1729674 INFO  (zkCallback-6978-thread-2) [     ] o.a.s.c.c.ZkStateReader Updated live nodes from ZooKeeper... (3) -> (4)
   [junit4]   2> 1729674 DEBUG (zkCallback-6978-thread-2) [     ] o.a.s.c.c.ZkStateReader Updated live nodes from ZooKeeper... [127.0.0.1:35106_solr, 127.0.0.1:39359_solr, 127.0.0.1:39601_solr] -> [127.0.0.1:35106_solr, 127.0.0.1:39359_solr, 127.0.0.1:39601_solr, 127.0.0.1:39860_solr]
   [junit4]   2> 1729674 INFO  (zkCallback-6994-thread-1) [     ] o.a.s.c.c.ZkStateReader Updated live nodes from ZooKeeper... (3) -> (4)
   [junit4]   2> 1729674 DEBUG (zkCallback-6994-thread-1) [     ] o.a.s.c.c.ZkStateReader Updated live nodes from ZooKeeper... [127.0.0.1:35106_solr, 127.0.0.1:39359_solr, 127.0.0.1:39601_solr] -> [127.0.0.1:35106_solr, 127.0.0.1:39359_solr, 127.0.0.1:39601_solr, 127.0.0.1:39860_solr]
   [junit4]   2> 1729707 INFO  (jetty-launcher-6951-thread-4) [n:127.0.0.1:39359_solr     ] o.a.s.m.r.SolrJmxReporter JMX monitoring for 'solr_39359.solr.jvm' (registry 'solr.jvm') enabled at server: com.sun.jmx.mbeanserver.JmxMBeanServer@431179e4
   [junit4]   2> 1729707 INFO  (jetty-launcher-6951-thread-4) [n:127.0.0.1:39359_solr     ] o.a.s.m.r.SolrJmxReporter JMX monitoring for 'solr_39359.solr.jetty' (registry 'solr.jetty') enabled at server: com.sun.jmx.mbeanserver.JmxMBeanServer@431179e4
   [junit4]   2> 1729708 INFO  (zkCallback-7003-thread-1) [     ] o.a.s.c.c.ZkStateReader Updated live nodes from ZooKeeper... (2) -> (4)
   [junit4]   2> 1729708 DEBUG (zkCallback-7003-thread-1) [     ] o.a.s.c.c.ZkStateReader Updated live nodes from ZooKeeper... [127.0.0.1:35106_solr, 127.0.0.1:39359_solr] -> [127.0.0.1:35106_solr, 127.0.0.1:39359_solr, 127.0.0.1:39601_solr, 127.0.0.1:39860_solr]
   [junit4]   2> 1729728 DEBUG (zkCallback-7012-thread-1) [     ] o.a.s.c.c.ZkStateReader A live node change: [WatchedEvent state:SyncConnected type:NodeChildrenChanged path:/live_nodes], has occurred - updating... (live nodes size: [2])
   [junit4]   2> 1729761 INFO  (jetty-launcher-6951-thread-4) [n:127.0.0.1:39359_solr     ] o.a.s.c.CorePropertiesLocator Found 0 core definitions underneath /home/jenkins/jenkins-slave/workspace/Lucene-Solr-Tests-8.x/solr/build/solr-core/test/J0/temp/solr.handler.TestContainerReqHandler_9C3BBC3A2BE2DEBD-001/tempDir-001/node4/.
   [junit4]   2> 1729762 INFO  (jetty-launcher-6951-thread-3) [n:127.0.0.1:39860_solr     ] o.a.s.c.c.ConnectionManager Waiting for client to connect to ZooKeeper
   [junit4]   2> 1729762 INFO  (zkCallback-7012-thread-1) [     ] o.a.s.c.c.ZkStateReader Updated live nodes from ZooKeeper... (2) -> (4)
   [junit4]   2> 1729762 DEBUG (zkCallback-7012-thread-1) [     ] o.a.s.c.c.ZkStateReader Updated live nodes from ZooKeeper... [127.0.0.1:35106_solr, 127.0.0.1:39359_solr] -> [127.0.0.1:35106_solr, 127.0.0.1:39359_solr, 127.0.0.1:39601_solr, 127.0.0.1:39860_solr]
   [junit4]   2> 1729762 DEBUG (zkCallback-6976-thread-1) [     ] o.a.s.c.c.ZkStateReader A live node change: [WatchedEvent state:SyncConnected type:NodeChildrenChanged path:/live_nodes], has occurred - updating... (live nodes size: [2])
   [junit4]   2> 1729763 INFO  (zkCallback-6976-thread-1) [     ] o.a.s.c.c.ZkStateReader Updated live nodes from ZooKeeper... (2) -> (4)
   [junit4]   2> 1729763 DEBUG (zkCallback-6976-thread-1) [     ] o.a.s.c.c.ZkStateReader Updated live nodes from ZooKeeper... [127.0.0.1:35106_solr, 127.0.0.1:39359_solr] -> [127.0.0.1:35106_solr, 127.0.0.1:39359_solr, 127.0.0.1:39601_solr, 127.0.0.1:39860_solr]
   [junit4]   2> 1729763 DEBUG (zkCallback-7001-thread-1) [     ] o.a.s.c.c.ZkStateReader A live node change: [WatchedEvent state:SyncConnected type:NodeChildrenChanged path:/live_nodes], has occurred - updating... (live nodes size: [2])
   [junit4]   2> 1729764 INFO  (zkConnectionManagerCallback-7019-thread-1) [     ] o.a.s.c.c.ConnectionManager zkClient has connected
   [junit4]   2> 1729764 INFO  (jetty-launcher-6951-thread-1) [n:127.0.0.1:39601_solr     ] o.a.s.c.c.ConnectionManager Client is connected to ZooKeeper
   [junit4]   2> 1729764 INFO  (zkCallback-7001-thread-1) [     ] o.a.s.c.c.ZkStateReader Updated live nodes from ZooKeeper... (2) -> (4)
   [junit4]   2> 1729764 DEBUG (zkCallback-7001-thread-1) [     ] o.a.s.c.c.ZkStateReader Updated live nodes from ZooKeeper... [127.0.0.1:35106_solr, 127.0.0.1:39359_solr] -> [127.0.0.1:35106_solr, 127.0.0.1:39359_solr, 127.0.0.1:39601_solr, 127.0.0.1:39860_solr]
   [junit4]   2> 1729764 DEBUG (jetty-launcher-6951-thread-1) [n:127.0.0.1:39601_solr     ] o.a.s.c.c.ZkStateReader Updating cluster state from ZooKeeper...
   [junit4]   2> 1729783 DEBUG (jetty-launcher-6951-thread-1) [n:127.0.0.1:39601_solr     ] o.a.s.c.c.ZkStateReader Loaded empty cluster properties
   [junit4]   2> 1729797 INFO  (jetty-launcher-6951-thread-1) [n:127.0.0.1:39601_solr     ] o.a.s.c.c.ZkStateReader Updated live nodes from ZooKeeper... (0) -> (4)
   [junit4]   2> 1729797 DEBUG (jetty-launcher-6951-thread-1) [n:127.0.0.1:39601_solr     ] o.a.s.c.c.ZkStateReader Updated live nodes from ZooKeeper... [] -> [127.0.0.1:35106_solr, 127.0.0.1:39359_solr, 127.0.0.1:39601_solr, 127.0.0.1:39860_solr]
   [junit4]   2> 1729798 DEBUG (jetty-launcher-6951-thread-1) [n:127.0.0.1:39601_solr     ] o.a.s.c.c.ZkStateReader clusterStateSet: legacy [0] interesting [0] watched [0] lazy [0] total [0]
   [junit4]   2> 1729907 INFO  (jetty-launcher-6951-thread-2) [n:127.0.0.1:35106_solr     ] o.a.s.h.a.MetricsHistoryHandler No .system collection, keeping metrics history in memory.
   [junit4]   2> 1729918 INFO  (jetty-launcher-6951-thread-1) [n:127.0.0.1:39601_solr     ] o.a.s.c.s.i.ZkClientClusterStateProvider Cluster at 127.0.0.1:46604/solr ready
   [junit4]   2> 1729919 INFO  (jetty-launcher-6951-thread-1) [n:127.0.0.1:39601_solr     ] o.a.s.c.PackageManager clusterprops.json changed , version -1
   [junit4]   2> 1729926 INFO  (zkConnectionManagerCallback-7024-thread-1) [     ] o.a.s.c.c.ConnectionManager zkClient has connected
   [junit4]   2> 1729926 INFO  (jetty-launcher-6951-thread-3) [n:127.0.0.1:39860_solr     ] o.a.s.c.c.ConnectionManager Client is connected to ZooKeeper
   [junit4]   2> 1729927 DEBUG (jetty-launcher-6951-thread-3) [n:127.0.0.1:39860_solr     ] o.a.s.c.c.ZkStateReader Updating cluster state from ZooKeeper...
   [junit4]   2> 1730150 DEBUG (jetty-launcher-6951-thread-3) [n:127.0.0.1:39860_solr     ] o.a.s.c.c.ZkStateReader Loaded empty cluster properties
   [junit4]   2> 1730156 INFO  (jetty-launcher-6951-thread-1) [n:127.0.0.1:39601_solr     ] o.a.s.h.a.MetricsHistoryHandler No .system collection, keeping metrics history in memory.
   [junit4]   2> 1730184 INFO  (jetty-launcher-6951-thread-2) [n:127.0.0.1:35106_solr     ] o.a.s.m.r.SolrJmxReporter JMX monitoring for 'solr_35106.solr.node' (registry 'solr.node') enabled at server: com.sun.jmx.mbeanserver.JmxMBeanServer@431179e4
   [junit4]   2> 1730239 INFO  (jetty-launcher-6951-thread-3) [n:127.0.0.1:39860_solr     ] o.a.s.c.c.ZkStateReader Updated live nodes from ZooKeeper... (0) -> (4)
   [junit4]   2> 1730239 DEBUG (jetty-launcher-6951-thread-3) [n:127.0.0.1:39860_solr     ] o.a.s.c.c.ZkStateReader Updated live nodes from ZooKeeper... [] -> [127.0.0.1:35106_solr, 127.0.0.1:39359_solr, 127.0.0.1:39601_solr, 127.0.0.1:39860_solr]
   [junit4]   2> 1730268 DEBUG (jetty-launcher-6951-thread-3) [n:127.0.0.1:39860_solr     ] o.a.s.c.c.ZkStateReader clusterStateSet: legacy [0] interesting [0] watched [0] lazy [0] total [0]
   [junit4]   2> 1730270 INFO  (jetty-launcher-6951-thread-3) [n:127.0.0.1:39860_solr     ] o.a.s.c.s.i.ZkClientClusterStateProvider Cluster at 127.0.0.1:46604/solr ready
   [junit4]   2> 1730271 INFO  (jetty-launcher-6951-thread-3) [n:127.0.0.1:39860_solr     ] o.a.s.c.PackageManager clusterprops.json changed , version -1
   [junit4]   2> 1730290 INFO  (jetty-launcher-6951-thread-1) [n:127.0.0.1:39601_solr     ] o.a.s.m.r.SolrJmxReporter JMX monitoring for 'solr_39601.solr.node' (registry 'solr.node') enabled at server: com.sun.jmx.mbeanserver.JmxMBeanServer@431179e4
   [junit4]   2> 1730310 INFO  (jetty-launcher-6951-thread-2) [n:127.0.0.1:35106_solr     ] o.a.s.m.r.SolrJmxReporter JMX monitoring for 'solr_35106.solr.jvm' (registry 'solr.jvm') enabled at server: com.sun.jmx.mbeanserver.JmxMBeanServer@431179e4
   [junit4]   2> 1730310 INFO  (jetty-launcher-6951-thread-2) [n:127.0.0.1:35106_solr     ] o.a.s.m.r.SolrJmxReporter JMX monitoring for 'solr_35106.solr.jetty' (registry 'solr.jetty') enabled at server: com.sun.jmx.mbeanserver.JmxMBeanServer@431179e4
   [junit4]   2> 1730311 INFO  (jetty-launcher-6951-thread-2) [n:127.0.0.1:35106_solr     ] o.a.s.c.CorePropertiesLocator Found 0 core definitions underneath /home/jenkins/jenkins-slave/workspace/Lucene-Solr-Tests-8.x/solr/build/solr-core/test/J0/temp/solr.handler.TestContainerReqHandler_9C3BBC3A2BE2DEBD-001/tempDir-001/node2/.
   [junit4]   2> 1730361 INFO  (jetty-launcher-6951-thread-1) [n:127.0.0.1:39601_solr     ] o.a.s.m.r.SolrJmxReporter JMX monitoring for 'solr_39601.solr.jvm' (registry 'solr.jvm') enabled at server: com.sun.jmx.mbeanserver.JmxMBeanServer@431179e4
   [junit4]   2> 1730361 INFO  (jetty-launcher-6951-thread-1) [n:127.0.0.1:39601_solr     ] o.a.s.m.r.SolrJmxReporter JMX monitoring for 'solr_39601.solr.jetty' (registry 'solr.jetty') enabled at server: com.sun.jmx.mbeanserver.JmxMBeanServer@431179e4
   [junit4]   2> 1730362 INFO  (jetty-launcher-6951-thread-1) [n:127.0.0.1:39601_solr     ] o.a.s.c.CorePropertiesLocator Found 0 core definitions underneath /home/jenkins/jenkins-slave/workspace/Lucene-Solr-Tests-8.x/solr/build/solr-core/test/J0/temp/solr.handler.TestContainerReqHandler_9C3BBC3A2BE2DEBD-001/tempDir-001/node1/.
   [junit4]   2> 1730449 INFO  (jetty-launcher-6951-thread-3) [n:127.0.0.1:39860_solr     ] o.a.s.h.a.MetricsHistoryHandler No .system collection, keeping metrics history in memory.
   [junit4]   2> 1730582 INFO  (jetty-launcher-6951-thread-3) [n:127.0.0.1:39860_solr     ] o.a.s.m.r.SolrJmxReporter JMX monitoring for 'solr_39860.solr.node' (registry 'solr.node') enabled at server: com.sun.jmx.mbeanserver.JmxMBeanServer@431179e4
   [junit4]   2> 1730716 INFO  (jetty-launcher-6951-thread-3) [n:127.0.0.1:39860_solr     ] o.a.s.m.r.SolrJmxReporter JMX monitoring for 'solr_39860.solr.jvm' (registry 'solr.jvm') enabled at server: com.sun.jmx.mbeanserver.JmxMBeanServer@431179e4
   [junit4]   2> 1730716 INFO  (jetty-launcher-6951-thread-3) [n:127.0.0.1:39860_solr     ] o.a.s.m.r.SolrJmxReporter JMX monitoring for 'solr_39860.solr.jetty' (registry 'solr.jetty') enabled at server: com.sun.jmx.mbeanserver.JmxMBeanServer@431179e4
   [junit4]   2> 1730749 INFO  (jetty-launcher-6951-thread-3) [n:127.0.0.1:39860_solr     ] o.a.s.c.CorePropertiesLocator Found 0 core definitions underneath /home/jenkins/jenkins-slave/workspace/Lucene-Solr-Tests-8.x/solr/build/solr-core/test/J0/temp/solr.handler.TestContainerReqHandler_9C3BBC3A2BE2DEBD-001/tempDir-001/node3/.
   [junit4]   2> 1731106 INFO  (TEST-TestContainerReqHandler.testRuntimeLibWithSig2048-seed#[9C3BBC3A2BE2DEBD]) [     ] o.a.s.c.MiniSolrCloudCluster waitForAllNodes: numServers=4
   [junit4]   2> 1731122 INFO  (TEST-TestContainerReqHandler.testRuntimeLibWithSig2048-seed#[9C3BBC3A2BE2DEBD]) [     ] o.a.s.c.c.ConnectionManager Waiting for client to connect to ZooKeeper
   [junit4]   2> 1731124 INFO  (zkConnectionManagerCallback-7032-thread-1) [     ] o.a.s.c.c.ConnectionManager zkClient has connected
   [junit4]   2> 1731124 INFO  (TEST-TestContainerReqHandler.testRuntimeLibWithSig2048-seed#[9C3BBC3A2BE2DEBD]) [     ] o.a.s.c.c.ConnectionManager Client is connected to ZooKeeper
   [junit4]   2> 1731124 DEBUG (TEST-TestContainerReqHandler.testRuntimeLibWithSig2048-seed#[9C3BBC3A2BE2DEBD]) [     ] o.a.s.c.c.ZkStateReader Updating cluster state from ZooKeeper...
   [junit4]   2> 1731125 DEBUG (TEST-TestContainerReqHandler.testRuntimeLibWithSig2048-seed#[9C3BBC3A2BE2DEBD]) [     ] o.a.s.c.c.ZkStateReader Loaded empty cluster properties
   [junit4]   2> 1731126 INFO  (TEST-TestContainerReqHandler.testRuntimeLibWithSig2048-seed#[9C3BBC3A2BE2DEBD]) [     ] o.a.s.c.c.ZkStateReader Updated live nodes from ZooKeeper... (0) -> (4)
   [junit4]   2> 1731126 DEBUG (TEST-TestContainerReqHandler.testRuntimeLibWithSig2048-seed#[9C3BBC3A2BE2DEBD]) [     ] o.a.s.c.c.ZkStateReader Updated live nodes from ZooKeeper... [] -> [127.0.0.1:35106_solr, 127.0.0.1:39359_solr, 127.0.0.1:39601_solr, 127.0.0.1:39860_solr]
   [junit4]   2> 1731143 DEBUG (TEST-TestContainerReqHandler.testRuntimeLibWithSig2048-seed#[9C3BBC3A2BE2DEBD]) [     ] o.a.s.c.c.ZkStateReader clusterStateSet: legacy [0] interesting [0] watched [0] lazy [0] total [0]
   [junit4]   2> 1731144 INFO  (TEST-TestContainerReqHandler.testRuntimeLibWithSig2048-seed#[9C3BBC3A2BE2DEBD]) [     ] o.a.s.c.s.i.ZkClientClusterStateProvider Cluster at 127.0.0.1:46604/solr ready
   [junit4]   2> 1731223 ERROR (qtp1775631358-18735) [n:127.0.0.1:35106_solr     ] o.a.s.c.RuntimeLib Signature verifying error
   [junit4]   2>           => org.apache.solr.common.SolrException: No key matched signature for jar : global version: null
   [junit4]   2> at org.apache.solr.core.RuntimeLib.verifyJarSignature(RuntimeLib.java:219)
   [junit4]   2> org.apache.solr.common.SolrException: No key matched signature for jar : global version: null
   [junit4]   2> at org.apache.solr.core.RuntimeLib.verifyJarSignature(RuntimeLib.java:219) ~[java/:?]
   [junit4]   2> at org.apache.solr.core.RuntimeLib.init(RuntimeLib.java:114) ~[java/:?]
   [junit4]   2> at org.apache.solr.handler.admin.CollectionHandlerApi.addUpdatePackage(CollectionHandlerApi.java:230) ~[java/:?]
   [junit4]   2> at org.apache.solr.handler.admin.CollectionHandlerApi.lambda$wrap$0(CollectionHandlerApi.java:119) ~[java/:?]
   [junit4]   2> at org.apache.solr.handler.admin.CollectionHandlerApi$2.invoke(CollectionHandlerApi.java:317) ~[java/:?]
   [junit4]   2> at org.apache.solr.handler.admin.BaseHandlerApiSupport$1.call(BaseHandlerApiSupport.java:100) ~[java/:?]
   [junit4]   2> at org.apache.solr.api.V2HttpCall.handleAdmin(V2HttpCall.java:341) ~[java/:?]
   [junit4]   2> at org.apache.solr.servlet.HttpSolrCall.handleAdminRequest(HttpSolrCall.java:786) ~[java/:?]
   [junit4]   2> at org.apache.solr.servlet.HttpSolrCall.call(HttpSolrCall.java:546) ~[java/:?]
   [junit4]   2> at org.apache.solr.servlet.SolrDispatchFilter.doFilter(SolrDispatchFilter.java:424) ~[java/:?]
   [junit4]   2> at org.apache.solr.servlet.SolrDispatchFilter.doFilter(SolrDispatchFilter.java:351) ~[java/:?]
   [junit4]   2> at org.eclipse.jetty.servlet.ServletHandler$CachedChain.doFilter(ServletHandler.java:1610) ~[jetty-servlet-9.4.19.v20190610.jar:9.4.19.v20190610]
   [junit4]   2> at org.apache.solr.client.solrj.embedded.JettySolrRunner$DebugFilter.doFilter(JettySolrRunner.java:167) ~[java/:?]
   [junit4]   2> at org.eclipse.jetty.servlet.ServletHandler$CachedChain.doFilter(ServletHandler.java:1610) ~[jetty-servlet-9.4.19.v20190610.jar:9.4.19.v20190610]
   [junit4]   2> at org.eclipse.jetty.servlet.ServletHandler.doHandle(ServletHandler.java:540) ~[jetty-servlet-9.4.19.v20190610.jar:9.4.19.v20190610]
   [junit4]   2> at org.eclipse.jetty.server.handler.ScopedHandler.nextHandle(ScopedHandler.java:255) ~[jetty-server-9.4.19.v20190610.jar:9.4.19.v20190610]
   [junit4]   2> at org.eclipse.jetty.server.session.SessionHandler.doHandle(SessionHandler.java:1711) ~[jetty-server-9.4.19.v20190610.jar:9.4.19.v20190610]
   [junit4]   2> at org.eclipse.jetty.server.handler.ScopedHandler.nextHandle(ScopedHandler.java:255) ~[jetty-server-9.4.19.v20190610.jar:9.4.19.v20190610]
   [junit4]   2> at org.eclipse.jetty.server.handler.ContextHandler.doHandle(ContextHandler.java:1347) ~[jetty-server-9.4.19.v20190610.jar:9.4.19.v20190610]
   [junit4]   2> at org.eclipse.jetty.server.handler.ScopedHandler.nextScope(ScopedHandler.java:203) ~[jetty-server-9.4.19.v20190610.jar:9.4.19.v20190610]
   [junit4]   2> at org.eclipse.jetty.servlet.ServletHandler.doScope(ServletHandler.java:480) ~[jetty-servlet-9.4.19.v20190610.jar:9.4.19.v20190610]
   [junit4]   2> at org.eclipse.jetty.server.session.SessionHandler.doScope(SessionHandler.java:1678) ~[jetty-server-9.4.19.v20190610.jar:9.4.19.v20190610]
   [junit4]   2> at org.eclipse.jetty.server.handler.ScopedHandler.nextScope(ScopedHandler.java:201) ~[jetty-server-9.4.19.v20190610.jar:9.4.19.v20190610]
   [junit4]   2> at org.eclipse.jetty.server.handler.ContextHandler.doScope(ContextHandler.java:1249) ~[jetty-server-9.4.19.v20190610.jar:9.4.19.v20190610]
   [junit4]   2> at org.eclipse.jetty.server.handler.ScopedHandler.handle(ScopedHandler.java:144) ~[jetty-server-9.4.19.v20190610.jar:9.4.19.v20190610]
   [junit4]   2> at org.eclipse.jetty.server.handler.HandlerWrapper.handle(HandlerWrapper.java:132) ~[jetty-server-9.4.19.v20190610.jar:9.4.19.v20190610]
   [junit4]   2> at org.eclipse.jetty.rewrite.handler.RewriteHandler.handle(RewriteHandler.java:335) ~[jetty-rewrite-9.4.19.v20190610.jar:9.4.19.v20190610]
   [junit4]   2> at org.eclipse.jetty.server.handler.gzip.GzipHandler.handle(GzipHandler.java:703) ~[jetty-server-9.4.19.v20190610.jar:9.4.19.v20190610]
   [junit4]   2> at org.eclipse.jetty.server.handler.HandlerWrapper.handle(HandlerWrapper.java:132) ~[jetty-server-9.4.19.v20190610.jar:9.4.19.v20190610]
   [junit4]   2> at org.eclipse.jetty.server.Server.handle(Server.java:505) ~[jetty-server-9.4.19.v20190610.jar:9.4.19.v20190610]
   [junit4]   2> at org.eclipse.jetty.server.HttpChannel.handle(HttpChannel.java:370) ~[jetty-server-9.4.19.v20190610.jar:9.4.19.v20190610]
   [junit4]   2> at org.eclipse.jetty.server.HttpConnection.onFillable(HttpConnection.java:267) ~[jetty-server-9.4.19.v20190610.jar:9.4.19.v20190610]
   [junit4]   2> at org.eclipse.jetty.io.AbstractConnection$ReadCallback.succeeded(AbstractConnection.java:305) ~[jetty-io-9.4.19.v20190610.jar:9.4.19.v20190610]
   [junit4]   2> at org.eclipse.jetty.io.FillInterest.fillable(FillInterest.java:103) ~[jetty-io-9.4.19.v20190610.jar:9.4.19.v20190610]
   [junit4]   2> at org.eclipse.jetty.io.ChannelEndPoint$2.run(ChannelEndPoint.java:117) ~[jetty-io-9.4.19.v20190610.jar:9.4.19.v20190610]
   [junit4]   2> at org.eclipse.jetty.util.thread.QueuedThreadPool.runJob(QueuedThreadPool.java:781) ~[jetty-util-9.4.19.v20190610.jar:9.4.19.v20190610]
   [junit4]   2> at org.eclipse.jetty.util.thread.QueuedThreadPool$Runner.run(QueuedThreadPool.java:917) ~[jetty-util-9.4.19.v20190610.jar:9.4.19.v20190610]
   [junit4]   2> at java.lang.Thread.run(Thread.java:748) [?:1.8.0_191]
   [junit4]   2> 1731224 ERROR (qtp1775631358-18735) [n:127.0.0.1:35106_solr     ] o.a.s.h.a.CollectionHandlerApi Error loading runtimelib
   [junit4]   2>           => org.apache.solr.common.SolrException: No key matched signature for jar : global version: null
   [junit4]   2> at org.apache.solr.core.RuntimeLib.verifyJarSignature(RuntimeLib.java:219)
   [junit4]   2> org.apache.solr.common.SolrException: No key matched signature for jar : global version: null
   [junit4]   2> at org.apache.solr.core.RuntimeLib.verifyJarSignature(RuntimeLib.java:219) ~[java/:?]
   [junit4]   2> at org.apache.solr.core.RuntimeLib.init(RuntimeLib.java:114) ~[java/:?]
   [junit4]   2> at org.apache.solr.handler.admin.CollectionHandlerApi.addUpdatePackage(CollectionHandlerApi.java:230) ~[java/:?]
   [junit4]   2> at org.apache.solr.handler.admin.CollectionHandlerApi.lambda$wrap$0(CollectionHandlerApi.java:119) ~[java/:?]
   [junit4]   2> at org.apache.solr.handler.admin.CollectionHandlerApi$2.invoke(CollectionHandlerApi.java:317) ~[java/:?]
   [junit4]   2> at org.apache.solr.handler.admin.BaseHandlerApiSupport$1.call(BaseHandlerApiSupport.java:100) ~[java/:?]
   [junit4]   2> at org.apache.solr.api.V2HttpCall.handleAdmin(V2HttpCall.java:341) ~[java/:?]
   [junit4]   2> at org.apache.solr.servlet.HttpSolrCall.handleAdminRequest(HttpSolrCall.java:786) ~[java/:?]
   [junit4]   2> at org.apache.solr.servlet.HttpSolrCall.call(HttpSolrCall.java:546) ~[java/:?]
   [junit4]   2> at org.apache.solr.servlet.SolrDispatchFilter.doFilter(SolrDispatchFilter.java:424) ~[java/:?]
   [junit4]   2> at org.apache.solr.servlet.SolrDispatchFilter.doFilter(SolrDispatchFilter.java:351) ~[java/:?]
   [junit4]   2> at org.eclipse.jetty.servlet.ServletHandler$CachedChain.doFilter(ServletHandler.java:1610) ~[jetty-servlet-9.4.19.v20190610.jar:9.4.19.v20190610]
   [junit4]   2> at org.apache.solr.client.solrj.embedded.JettySolrRunner$DebugFilter.doFilter(JettySolrRunner.java:167) ~[java/:?]
   [junit4]   2> at org.eclipse.jetty.servlet.ServletHandler$CachedChain.doFilter(ServletHandler.java:1610) ~[jetty-servlet-9.4.19.v20190610.jar:9.4.19.v20190610]
   [junit4]   2> at org.eclipse.jetty.servlet.ServletHandler.doHandle(ServletHandler.java:540) ~[jetty-servlet-9.4.19.v20190610.jar:9.4.19.v20190610]
   [junit4]   2> at org.eclipse.jetty.server.handler.ScopedHandler.nextHandle(ScopedHandler.java:255) ~[jetty-server-9.4.19.v20190610.jar:9.4.19.v20190610]
   [junit4]   2> at org.eclipse.jetty.server.session.SessionHandler.doHandle(SessionHandler.java:1711) ~[jetty-server-9.4.19.v20190610.jar:9.4.19.v20190610]
   [junit4]   2> at org.eclipse.jetty.server.handler.ScopedHandler.nextHandle(ScopedHandler.java:255) ~[jetty-server-9.4.19.v20190610.jar:9.4.19.v20190610]
   [junit4]   2> at org.eclipse.jetty.server.handler.ContextHandler.doHandle(ContextHandler.java:1347) ~[jetty-server-9.4.19.v20190610.jar:9.4.19.v20190610]
   [junit4]   2> at org.eclipse.jetty.server.handler.ScopedHandler.nextScope(ScopedHandler.java:203) ~[jetty-server-9.4.19.v20190610.jar:9.4.19.v20190610]
   [junit4]   2> at org.eclipse.jetty.servlet.ServletHandler.doScope(ServletHandler.java:480) ~[jetty-servlet-9.4.19.v20190610.jar:9.4.19.v20190610]
   [junit4]   2> at org.eclipse.jetty.server.session.SessionHandler.doScope(SessionHandler.java:1678) ~[jetty-server-9.4.19.v20190610.jar:9.4.19.v20190610]
   [junit4]   2> at org.eclipse.jetty.server.handler.ScopedHandler.nextScope(ScopedHandler.java:201) ~[jetty-server-9.4.19.v20190610.jar:9.4.19.v20190610]
   [junit4]   2> at org.eclipse.jetty.server.handler.ContextHandler.doScope(ContextHandler.java:1249) ~[jetty-server-9.4.19.v20190610.jar:9.4.19.v20190610]
   [junit4]   2> at org.eclipse.jetty.server.handler.ScopedHandler.handle(ScopedHandler.java:144) ~[jetty-server-9.4.19.v20190610.jar:9.4.19.v20190610]
   [junit4]   2> at org.eclipse.jetty.server.handler.HandlerWrapper.handle(HandlerWrapper.java:132) ~[jetty-server-9.4.19.v20190610.jar:9.4.19.v20190610]
   [junit4]   2> at org.eclipse.jetty.rewrite.handler.RewriteHandler.handle(RewriteHandler.java:335) ~[jetty-rewrite-9.4.19.v20190610.jar:9.4.19.v20190610]
   [junit4]   2> at org.eclipse.jetty.server.handler.gzip.GzipHandler.handle(GzipHandler.java:703) ~[jetty-server-9.4.19.v20190610.jar:9.4.19.v20190610]
   [junit4]   2> at org.eclipse.jetty.server.handler.HandlerWrapper.handle(HandlerWrapper.java:132) ~[jetty-server-9.4.19.v20190610.jar:9.4.19.v20190610]
   [junit4]   2> at org.eclipse.jetty.server.Server.handle(Server.java:505) ~[jetty-server-9.4.19.v20190610.jar:9.4.19.v20190610]
   [junit4]   2> at org.eclipse.jetty.server.HttpChannel.handle(HttpChannel.java:370) ~[jetty-server-9.4.19.v20190610.jar:9.4.19.v20190610]
   [junit4]   2> at org.eclipse.jetty.server.HttpConnection.onFillable(HttpConnection.java:267) ~[jetty-server-9.4.19.v20190610.jar:9.4.19.v20190610]
   [junit4]   2> at org.eclipse.jetty.io.AbstractConnection$ReadCallback.succeeded(AbstractConnection.java:305) ~[jetty-io-9.4.19.v20190610.jar:9.4.19.v20190610]
   [junit4]   2> at org.eclipse.jetty.io.FillInterest.fillable(FillInterest.java:103) ~[jetty-io-9.4.19.v20190610.jar:9.4.19.v20190610]
   [junit4]   2> at org.eclipse.jetty.io.ChannelEndPoint$2.run(ChannelEndPoint.java:117) ~[jetty-io-9.4.19.v20190610.jar:9.4.19.v20190610]
   [junit4]   2> at org.eclipse.jetty.util.thread.QueuedThreadPool.runJob(QueuedThreadPool.java:781) ~[jetty-util-9.4.19.v20190610.jar:9.4.19.v20190610]
   [junit4]   2> at org.eclipse.jetty.util.thread.QueuedThreadPool$Runner.run(QueuedThreadPool.java:917) ~[jetty-util-9.4.19.v20190610.jar:9.4.19.v20190610]
   [junit4]   2> at java.lang.Thread.run(Thread.java:748) [?:1.8.0_191]
   [junit4]   2> 1731227 ERROR (qtp1775631358-18735) [n:127.0.0.1:35106_solr     ] o.a.s.h.a.CollectionHandlerApi Error in running command {
   [junit4]   2>   "add-package":{
   [junit4]   2>     "name":"global",
   [junit4]   2>     "url":"http://localhost:38093/jar1.jar",
   [junit4]   2>     "sig":"EdYkvRpMZbvElN93/xUmyKXcj6xHP16AVk71TlTascEwCb5cFQ2AeKhPIlwYpkLWXEOcLZKfeXoWwOLaV5ZNhg==",
   [junit4]   2>     "sha256":"e1f9e23988c19619402f1040c9251556dcd6e02b9d3e3b966a129ea1be5c70fc"},
   [junit4]   2>   "errors":["No key matched signature for jar : global version: null"]} , current clusterprops.json : {}
   [junit4]   2> 1731227 INFO  (qtp1775631358-18735) [n:127.0.0.1:35106_solr     ] o.a.s.s.HttpSolrCall [admin] webapp=null path=/cluster params={wt=javabin&version=2} status=400 QTime=65
   [junit4]   2> 1731239 INFO  (qtp1673023622-18727) [n:127.0.0.1:39359_solr     ] o.a.s.c.RuntimeLib Jar global signed with pub_key2048.der successfully verified
   [junit4]   2> 1731266 INFO  (qtp1673023622-18727) [n:127.0.0.1:39359_solr     ] o.a.s.c.PackageManager clusterprops.json changed , version -1
   [junit4]   2> 1731266 DEBUG (zkCallback-6994-thread-1) [     ] o.a.s.c.c.ZkStateReader Loaded cluster properties: {package={global={name=global, url=http://localhost:38093/jar1.jar, sig=NaTm3+i99/ZhS8YRsLc3NLz2Y6VuwEbu7DihY8GAWwWIGm+jpXgn1JiuaenfxFCcfNKCC9WgZmEgbTZTzmV/OZMVn90u642YJbF3vTnzelW1pHB43ZRAJ1iesH0anM37w03n3es+vFWQtuxc+2Go888fJoMkUX2C6Zk6Jn116KE45DWjeyPM4mp3vvGzwGvdRxP5K9Q3suA+iuI/ULXM7m9mV4ruvs/MZvL+ELm5Jnmk1bBtixVJhQwJP2z++8tQKJghhyBxPIC/2fkAHobQpkhZrXu56JjP+v33ul3Ku4bbvfVMY/LVwCAEnxlvhk+C6uRCKCeFMrzQ/k5inasXLw==, sha256=e1f9e23988c19619402f1040c9251556dcd6e02b9d3e3b966a129ea1be5c70fc}}} to version 0
   [junit4]   2> 1731266 DEBUG (zkCallback-6978-thread-2) [     ] o.a.s.c.c.ZkStateReader Loaded cluster properties: {package={global={name=global, url=http://localhost:38093/jar1.jar, sig=NaTm3+i99/ZhS8YRsLc3NLz2Y6VuwEbu7DihY8GAWwWIGm+jpXgn1JiuaenfxFCcfNKCC9WgZmEgbTZTzmV/OZMVn90u642YJbF3vTnzelW1pHB43ZRAJ1iesH0anM37w03n3es+vFWQtuxc+2Go888fJoMkUX2C6Zk6Jn116KE45DWjeyPM4mp3vvGzwGvdRxP5K9Q3suA+iuI/ULXM7m9mV4ruvs/MZvL+ELm5Jnmk1bBtixVJhQwJP2z++8tQKJghhyBxPIC/2fkAHobQpkhZrXu56JjP+v33ul3Ku4bbvfVMY/LVwCAEnxlvhk+C6uRCKCeFMrzQ/k5inasXLw==, sha256=e1f9e23988c19619402f1040c9251556dcd6e02b9d3e3b966a129ea1be5c70fc}}} to version 0
   [junit4]   2> 1731266 INFO  (zkCallback-6978-thread-2) [     ] o.a.s.c.PackageManager clusterprops.json changed , version 0
   [junit4]   2> 1731330 DEBUG (zkCallback-7003-thread-1) [     ] o.a.s.c.c.ZkStateReader Loaded cluster properties: {package={global={name=global, url=http://localhost:38093/jar1.jar, sig=NaTm3+i99/ZhS8YRsLc3NLz2Y6VuwEbu7DihY8GAWwWIGm+jpXgn1JiuaenfxFCcfNKCC9WgZmEgbTZTzmV/OZMVn90u642YJbF3vTnzelW1pHB43ZRAJ1iesH0anM37w03n3es+vFWQtuxc+2Go888fJoMkUX2C6Zk6Jn116KE45DWjeyPM4mp3vvGzwGvdRxP5K9Q3suA+iuI/ULXM7m9mV4ruvs/MZvL+ELm5Jnmk1bBtixVJhQwJP2z++8tQKJghhyBxPIC/2fkAHobQpkhZrXu56JjP+v33ul3Ku4bbvfVMY/LVwCAEnxlvhk+C6uRCKCeFMrzQ/k5inasXLw==, sha256=e1f9e23988c19619402f1040c9251556dcd6e02b9d3e3b966a129ea1be5c70fc}}} to version 0
   [junit4]   2> 1731330 INFO  (zkCallback-7003-thread-1) [     ] o.a.s.c.PackageManager clusterprops.json changed , version 0
   [junit4]   2> 1731330 DEBUG (zkCallback-7023-thread-1) [     ] o.a.s.c.c.ZkStateReader Loaded cluster properties: {package={global={name=global, url=http://localhost:38093/jar1.jar, sig=NaTm3+i99/ZhS8YRsLc3NLz2Y6VuwEbu7DihY8GAWwWIGm+jpXgn1JiuaenfxFCcfNKCC9WgZmEgbTZTzmV/OZMVn90u642YJbF3vTnzelW1pHB43ZRAJ1iesH0anM37w03n3es+vFWQtuxc+2Go888fJoMkUX2C6Zk6Jn116KE45DWjeyPM4mp3vvGzwGvdRxP5K9Q3suA+iuI/ULXM7m9mV4ruvs/MZvL+ELm5Jnmk1bBtixVJhQwJP2z++8tQKJghhyBxPIC/2fkAHobQpkhZrXu56JjP+v33ul3Ku4bbvfVMY/LVwCAEnxlvhk+C6uRCKCeFMrzQ/k5inasXLw==, sha256=e1f9e23988c19619402f1040c9251556dcd6e02b9d3e3b966a129ea1be5c70fc}}} to version 0
   [junit4]   2> 1731334 DEBUG (zkCallback-7031-thread-1) [     ] o.a.s.c.c.ZkStateReader Loaded cluster properties: {package={global={name=global, url=http://localhost:38093/jar1.jar, sig=NaTm3+i99/ZhS8YRsLc3NLz2Y6VuwEbu7DihY8GAWwWIGm+jpXgn1JiuaenfxFCcfNKCC9WgZmEgbTZTzmV/OZMVn90u642YJbF3vTnzelW1pHB43ZRAJ1iesH0anM37w03n3es+vFWQtuxc+2Go888fJoMkUX2C6Zk6Jn116KE45DWjeyPM4mp3vvGzwGvdRxP5K9Q3suA+iuI/ULXM7m9mV4ruvs/MZvL+ELm5Jnmk1bBtixVJhQwJP2z++8tQKJghhyBxPIC/2fkAHobQpkhZrXu56JjP+v33ul3Ku4bbvfVMY/LVwCAEnxlvhk+C6uRCKCeFMrzQ/k5inasXLw==, sha256=e1f9e23988c19619402f1040c9251556dcd6e02b9d3e3b966a129ea1be5c70fc}}} to version 0
   [junit4]   2> 1731334 DEBUG (zkCallback-7001-thread-1) [     ] o.a.s.c.c.ZkStateReader Loaded cluster properties: {package={global={name=global, url=http://localhost:38093/jar1.jar, sig=NaTm3+i99/ZhS8YRsLc3NLz2Y6VuwEbu7DihY8GAWwWIGm+jpXgn1JiuaenfxFCcfNKCC9WgZmEgbTZTzmV/OZMVn90u642YJbF3vTnzelW1pHB43ZRAJ1iesH0anM37w03n3es+vFWQtuxc+2Go888fJoMkUX2C6Zk6Jn116KE45DWjeyPM4mp3vvGzwGvdRxP5K9Q3suA+iuI/ULXM7m9mV4ruvs/MZvL+ELm5Jnmk1bBtixVJhQwJP2z++8tQKJghhyBxPIC/2fkAHobQpkhZrXu56JjP+v33ul3Ku4bbvfVMY/LVwCAEnxlvhk+C6uRCKCeFMrzQ/k5inasXLw==, sha256=e1f9e23988c19619402f1040c9251556dcd6e02b9d3e3b966a129ea1be5c70fc}}} to version 0
   [junit4]   2> 1731334 INFO  (zkCallback-7001-thread-1) [     ] o.a.s.c.PackageManager clusterprops.json changed , version 0
   [junit4]   2> 1731334 DEBUG (zkCallback-6976-thread-1) [     ] o.a.s.c.c.ZkStateReader Loaded cluster properties: {package={global={name=global, url=http://localhost:38093/jar1.jar, sig=NaTm3+i99/ZhS8YRsLc3NLz2Y6VuwEbu7DihY8GAWwWIGm+jpXgn1JiuaenfxFCcfNKCC9WgZmEgbTZTzmV/OZMVn90u642YJbF3vTnzelW1pHB43ZRAJ1iesH0anM37w03n3es+vFWQtuxc+2Go888fJoMkUX2C6Zk6Jn116KE45DWjeyPM4mp3vvGzwGvdRxP5K9Q3suA+iuI/ULXM7m9mV4ruvs/MZvL+ELm5Jnmk1bBtixVJhQwJP2z++8tQKJghhyBxPIC/2fkAHobQpkhZrXu56JjP+v33ul3Ku4bbvfVMY/LVwCAEnxlvhk+C6uRCKCeFMrzQ/k5inasXLw==, sha256=e1f9e23988c19619402f1040c9251556dcd6e02b9d3e3b966a129ea1be5c70fc}}} to version 0
   [junit4]   2> 1731335 INFO  (zkCallback-6976-thread-1) [     ] o.a.s.c.PackageManager clusterprops.json changed , version 0
   [junit4]   2> 1731345 DEBUG (zkCallback-7012-thread-1) [     ] o.a.s.c.c.ZkStateReader Loaded cluster properties: {package={global={name=global, url=http://localhost:38093/jar1.jar, sig=NaTm3+i99/ZhS8YRsLc3NLz2Y6VuwEbu7DihY8GAWwWIGm+jpXgn1JiuaenfxFCcfNKCC9WgZmEgbTZTzmV/OZMVn90u642YJbF3vTnzelW1pHB43ZRAJ1iesH0anM37w03n3es+vFWQtuxc+2Go888fJoMkUX2C6Zk6Jn116KE45DWjeyPM4mp3vvGzwGvdRxP5K9Q3suA+iuI/ULXM7m9mV4ruvs/MZvL+ELm5Jnmk1bBtixVJhQwJP2z++8tQKJghhyBxPIC/2fkAHobQpkhZrXu56JjP+v33ul3Ku4bbvfVMY/LVwCAEnxlvhk+C6uRCKCeFMrzQ/k5inasXLw==, sha256=e1f9e23988c19619402f1040c9251556dcd6e02b9d3e3b966a129ea1be5c70fc}}} to version 0
   [junit4]   2> 1731363 DEBUG (zkCallback-7018-thread-1) [     ] o.a.s.c.c.ZkStateReader Loaded cluster properties: {package={global={name=global, url=http://localhost:38093/jar1.jar, sig=NaTm3+i99/ZhS8YRsLc3NLz2Y6VuwEbu7DihY8GAWwWIGm+jpXgn1JiuaenfxFCcfNKCC9WgZmEgbTZTzmV/OZMVn90u642YJbF3vTnzelW1pHB43ZRAJ1iesH0anM37w03n3es+vFWQtuxc+2Go888fJoMkUX2C6Zk6Jn116KE45DWjeyPM4mp3vvGzwGvdRxP5K9Q3suA+iuI/ULXM7m9mV4ruvs/MZvL+ELm5Jnmk1bBtixVJhQwJP2z++8tQKJghhyBxPIC/2fkAHobQpkhZrXu56JjP+v33ul3Ku4bbvfVMY/LVwCAEnxlvhk+C6uRCKCeFMrzQ/k5inasXLw==, sha256=e1f9e23988c19619402f1040c9251556dcd6e02b9d3e3b966a129ea1be5c70fc}}} to version 0
   [junit4]   2> 1731366 INFO  (zkCallback-7003-thread-1) [     ] o.a.s.c.RuntimeLib Jar global signed with pub_key2048.der successfully verified
   [junit4]   2> 1731374 INFO  (zkCallback-6976-thread-1) [     ] o.a.s.c.RuntimeLib Jar global signed with pub_key2048.der successfully verified
   [junit4]   2> 1731402 INFO  (qtp1673023622-18727) [n:127.0.0.1:39359_solr     ] o.a.s.c.RuntimeLib Jar global signed with pub_key2048.der successfully verified
   [junit4]   2> 1731403 INFO  (zkCallback-6978-thread-2) [     ] o.a.s.c.RuntimeLib Jar global signed with pub_key2048.der successfully verified
   [junit4]   2> 1731435 INFO  (zkCallback-6978-thread-2) [     ] o.a.s.c.PackageManager Libraries changed. New memclassloader created with jars [http://localhost:38093/jar1.jar]
   [junit4]   2> 1731435 INFO  (zkCallback-7003-thread-1) [     ] o.a.s.c.PackageManager Libraries changed. New memclassloader created with jars [http://localhost:38093/jar1.jar]
   [junit4]   2> 1731435 INFO  (qtp1673023622-18727) [n:127.0.0.1:39359_solr     ] o.a.s.c.PackageManager Libraries changed. New memclassloader created with jars [http://localhost:38093/jar1.jar]
   [junit4]   2> 1731435 INFO  (qtp1673023622-18727) [n:127.0.0.1:39359_solr     ] o.a.s.h.a.CollectionHandlerApi current version of clusterprops.json is 0 , trying to get every node to update
   [junit4]   2> 1731435 DEBUG (qtp1673023622-18727) [n:127.0.0.1:39359_solr     ] o.a.s.h.a.CollectionHandlerApi The current clusterprops.json:  {package={global={name=global, url=http://localhost:38093/jar1.jar, sig=NaTm3+i99/ZhS8YRsLc3NLz2Y6VuwEbu7DihY8GAWwWIGm+jpXgn1JiuaenfxFCcfNKCC9WgZmEgbTZTzmV/OZMVn90u642YJbF3vTnzelW1pHB43ZRAJ1iesH0anM37w03n3es+vFWQtuxc+2Go888fJoMkUX2C6Zk6Jn116KE45DWjeyPM4mp3vvGzwGvdRxP5K9Q3suA+iuI/ULXM7m9mV4ruvs/MZvL+ELm5Jnmk1bBtixVJhQwJP2z++8tQKJghhyBxPIC/2fkAHobQpkhZrXu56JjP+v33ul3Ku4bbvfVMY/LVwCAEnxlvhk+C6uRCKCeFMrzQ/k5inasXLw==, sha256=e1f9e23988c19619402f1040c9251556dcd6e02b9d3e3b966a129ea1be5c70fc}}}
   [junit4]   2> 1731437 INFO  (qtp1673023622-18727) [n:127.0.0.1:39359_solr     ] o.a.s.h.a.CollectionHandlerApi Waiting up to 30 secs for 4 nodes to update clusterprops to be of version 0
   [junit4]   2> 1731469 INFO  (zkCallback-7001-thread-1) [     ] o.a.s.c.RuntimeLib Jar global signed with pub_key2048.der successfully verified
   [junit4]   2> 1731471 INFO  (zkCallback-6976-thread-1) [     ] o.a.s.c.PackageManager Libraries changed. New memclassloader created with jars [http://localhost:38093/jar1.jar]
   [junit4]   2> 1731507 INFO  (zkCallback-7001-thread-1) [     ] o.a.s.c.PackageManager Libraries changed. New memclassloader created with jars [http://localhost:38093/jar1.jar]
   [junit4]   2> 1731546 INFO  (solrHandlerExecutor-5840-thread-1-processing-n:127.0.0.1:39359_solr) [n:127.0.0.1:39359_solr     ] o.a.s.h.SolrConfigHandler Time elapsed : 0 secs, maxWait 30
   [junit4]   2> 1731560 INFO  (solrHandlerExecutor-5840-thread-2-processing-n:127.0.0.1:39359_solr) [n:127.0.0.1:39359_solr     ] o.a.s.h.SolrConfigHandler Time elapsed : 0 secs, maxWait 30
   [junit4]   2> 1731596 INFO  (solrHandlerExecutor-5840-thread-4-processing-n:127.0.0.1:39359_solr) [n:127.0.0.1:39359_solr     ] o.a.s.h.SolrConfigHandler Time elapsed : 0 secs, maxWait 30
   [junit4]   2> 1731599 INFO  (solrHandlerExecutor-5840-thread-3-processing-n:127.0.0.1:39359_solr) [n:127.0.0.1:39359_solr     ] o.a.s.h.SolrConfigHandler Time elapsed : 0 secs, maxWait 30
   [junit4]   2> 1731655 DEBUG (qtp1775631358-18737) [n:127.0.0.1:35106_solr     ] o.a.s.c.PackageManager expected version : 0 , my version 0
   [junit4]   2> 1731655 DEBUG (qtp1775631358-18737) [n:127.0.0.1:35106_solr     ] o.a.s.c.c.ZkStateReader Expected version of clusterprops.json is 0 , my version is 0
   [junit4]   2> 1731656 INFO  (qtp1775631358-18737) [n:127.0.0.1:35106_solr     ] o.a.s.s.HttpSolrCall [admin] webapp=null path=/node/ext params={znodeVersion=0&wt=javabin&version=2} status=0 QTime=0
   [junit4]   2> 1731779 DEBUG (qtp1673023622-18729) [n:127.0.0.1:39359_solr     ] o.a.s.c.PackageManager expected version : 0 , my version -1
   [junit4]   2> 1731779 DEBUG (qtp1673023622-18729) [n:127.0.0.1:39359_solr     ] o.a.s.c.c.ZkStateReader Expected version of clusterprops.json is 0 , my version is 0
   [junit4]   2> 1731779 INFO  (qtp1673023622-18729) [n:127.0.0.1:39359_solr     ] o.a.s.s.HttpSolrCall [admin] webapp=null path=/node/ext params={znodeVersion=0&wt=javabin&version=2} status=0 QTime=0
   [junit4]   2> 1731779 DEBUG (qtp221694821-18723) [n:127.0.0.1:39601_solr     ] o.a.s.c.PackageManager expected version : 0 , my version 0
   [junit4]   2> 1731779 DEBUG (qtp221694821-18723) [n:127.0.0.1:39601_solr     ] o.a.s.c.c.ZkStateReader Expected version of clusterprops.json is 0 , my version is 0
   [junit4]   2> 1731779 INFO  (qtp221694821-18723) [n:127.0.0.1:39601_solr     ] o.a.s.s.HttpSolrCall [admin] webapp=null path=/node/ext params={znodeVersion=0&wt=javabin&version=2} status=0 QTime=0
   [junit4]   2> 1731780 DEBUG (qtp2002490481-18712) [n:127.0.0.1:39860_solr     ] o.a.s.c.PackageManager expected version : 0 , my version 0
   [junit4]   2> 1731780 DEBUG (qtp2002490481-18712) [n:127.0.0.1:39860_solr     ] o.a.s.c.c.ZkStateReader Expected version of clusterprops.json is 0 , my version is 0
   [junit4]   2> 1731780 INFO  (qtp2002490481-18712) [n:127.0.0.1:39860_solr     ] o.a.s.s.HttpSolrCall [admin] webapp=null path=/node/ext params={znodeVersion=0&wt=javabin&version=2} status=0 QTime=0
   [junit4]   2> 1731800 INFO  (qtp1673023622-18727) [n:127.0.0.1:39359_solr     ] o.a.s.h.a.CollectionHandlerApi Took 363.0ms to update the clusterprops to be of version 0  on 4 nodes
   [junit4]   2> 1731800 INFO  (qtp1673023622-18727) [n:127.0.0.1:39359_solr     ] o.a.s.s.HttpSolrCall [admin] webapp=null path=/cluster params={wt=javabin&version=2} status=0 QTime=567
   [junit4]   2> 1731909 DEBUG (zkCallback-7018-thread-1) [     ] o.a.s.c.c.ZkStateReader Loaded cluster properties: {package={global={name=global, url=http://localhost:38093/jar1.jar, sig=NaTm3+i99/ZhS8YRsLc3NLz2Y6VuwEbu7DihY8GAWwWIGm+jpXgn1JiuaenfxFCcfNKCC9WgZmEgbTZTzmV/OZMVn90u642YJbF3vTnzelW1pHB43ZRAJ1iesH0anM37w03n3es+vFWQtuxc+2Go888fJoMkUX2C6Zk6Jn116KE45DWjeyPM4mp3vvGzwGvdRxP5K9Q3suA+iuI/ULXM7m9mV4ruvs/MZvL+ELm5Jnmk1bBtixVJhQwJP2z++8tQKJghhyBxPIC/2fkAHobQpkhZrXu56JjP+v33ul3Ku4bbvfVMY/LVwCAEnxlvhk+C6uRCKCeFMrzQ/k5inasXLw==, sha256=e1f9e23988c19619402f1040c9251556dcd6e02b9d3e3b966a129ea1be5c70fc}}, requestHandler={bar={name=bar, class=org.apache.solr.core.RuntimeLibReqHandler, package=global}}} to version 1
   [junit4]   2> 1731909 DEBUG (zkCallback-6994-thread-1) [     ] o.a.s.c.c.ZkStateReader Loaded cluster properties: {package={global={name=global, url=http://localhost:38093/jar1.jar, sig=NaTm3+i99/ZhS8YRsLc3NLz2Y6VuwEbu7DihY8GAWwWIGm+jpXgn1JiuaenfxFCcfNKCC9WgZmEgbTZTzmV/OZMVn90u642YJbF3vTnzelW1pHB43ZRAJ1iesH0anM37w03n3es+vFWQtuxc+2Go888fJoMkUX2C6Zk6Jn116KE45DWjeyPM4mp3vvGzwGvdRxP5K9Q3suA+iuI/ULXM7m9mV4ruvs/MZvL+ELm5Jnmk1bBtixVJhQwJP2z++8tQKJghhyBxPIC/2fkAHobQpkhZrXu56JjP+v33ul3Ku4bbvfVMY/LVwCAEnxlvhk+C6uRCKCeFMrzQ/k5inasXLw==, sha256=e1f9e23988c19619402f1040c9251556dcd6e02b9d3e3b966a129ea1be5c70fc}}, requestHandler={bar={name=bar, class=org.apache.solr.core.RuntimeLibReqHandler, package=global}}} to version 1
   [junit4]   2> 1731909 DEBUG (zkCallback-7003-thread-1) [     ] o.a.s.c.c.ZkStateReader Loaded cluster properties: {package={global={name=global, url=http://localhost:38093/jar1.jar, sig=NaTm3+i99/ZhS8YRsLc3NLz2Y6VuwEbu7DihY8GAWwWIGm+jpXgn1JiuaenfxFCcfNKCC9WgZmEgbTZTzmV/OZMVn90u642YJbF3vTnzelW1pHB43ZRAJ1iesH0anM37w03n3es+vFWQtuxc+2Go888fJoMkUX2C6Zk6Jn116KE45DWjeyPM4mp3vvGzwGvdRxP5K9Q3suA+iuI/ULXM7m9mV4ruvs/MZvL+ELm5Jnmk1bBtixVJhQwJP2z++8tQKJghhyBxPIC/2fkAHobQpkhZrXu56JjP+v33ul3Ku4bbvfVMY/LVwCAEnxlvhk+C6uRCKCeFMrzQ/k5inasXLw==, sha256=e1f9e23988c19619402f1040c9251556dcd6e02b9d3e3b966a129ea1be5c70fc}}, requestHandler={bar={name=bar, class=org.apache.solr.core.RuntimeLibReqHandler, package=global}}} to version 1
   [junit4]   2> 1731909 INFO  (zkCallback-7003-thread-1) [     ] o.a.s.c.PackageManager clusterprops.json changed , version 1
   [junit4]   2> 1731910 DEBUG (zkCallback-7031-thread-1) [     ] o.a.s.c.c.ZkStateReader Loaded cluster properties: {package={global={name=global, url=http://localhost:38093/jar1.jar, sig=NaTm3+i99/ZhS8YRsLc3NLz2Y6VuwEbu7DihY8GAWwWIGm+jpXgn1JiuaenfxFCcfNKCC9WgZmEgbTZTzmV/OZMVn90u642YJbF3vTnzelW1pHB43ZRAJ1iesH0anM37w03n3es+vFWQtuxc+2Go888fJoMkUX2C6Zk6Jn116KE45DWjeyPM4mp3vvGzwGvdRxP5K9Q3suA+iuI/ULXM7m9mV4ruvs/MZvL+ELm5Jnmk1bBtixVJhQwJP2z++8tQKJghhyBxPIC/2fkAHobQpkhZrXu56JjP+v33ul3Ku4bbvfVMY/LVwCAEnxlvhk+C6uRCKCeFMrzQ/k5inasXLw==, sha256=e1f9e23988c19619402f1040c9251556dcd6e02b9d3e3b966a129ea1be5c70fc}}, requestHandler={bar={name=bar, class=org.apache.solr.core.RuntimeLibReqHandler, package=global}}} to version 1
   [junit4]   2> 1731910 DEBUG (zkCallback-7001-thread-1) [     ] o.a.s.c.c.ZkStateReader Loaded cluster properties: {package={global={name=global, url=http://localhost:38093/jar1.jar, sig=NaTm3+i99/ZhS8YRsLc3NLz2Y6VuwEbu7DihY8GAWwWIGm+jpXgn1JiuaenfxFCcfNKCC9WgZmEgbTZTzmV/OZMVn90u642YJbF3vTnzelW1pHB43ZRAJ1iesH0anM37w03n3es+vFWQtuxc+2Go888fJoMkUX2C6Zk6Jn116KE45DWjeyPM4mp3vvGzwGvdRxP5K9Q3suA+iuI/ULXM7m9mV4ruvs/MZvL+ELm5Jnmk1bBtixVJhQwJP2z++8tQKJghhyBxPIC/2fkAHobQpkhZrXu56JjP+v33ul3Ku4bbvfVMY/LVwCAEnxlvhk+C6uRCKCeFMrzQ/k5inasXLw==, sha256=e1f9e23988c19619402f1040c9251556dcd6e02b9d3e3b966a129ea1be5c70fc}}, requestHandler={bar={name=bar, class=org.apache.solr.core.RuntimeLibReqHandler, package=global}}} to version 1
   [junit4]   2> 1731910 INFO  (zkCallback-7001-thread-1) [     ] o.a.s.c.PackageManager clusterprops.json changed , version 1
   [junit4]   2> 1731910 DEBUG (zkCallback-7023-thread-1) [     ] o.a.s.c.c.ZkStateReader Loaded cluster properties: {package={global={name=global, url=http://localhost:38093/jar1.jar, sig=NaTm3+i99/ZhS8YRsLc3NLz2Y6VuwEbu7DihY8GAWwWIGm+jpXgn1JiuaenfxFCcfNKCC9WgZmEgbTZTzmV/OZMVn90u642YJbF3vTnzelW1pHB43ZRAJ1iesH0anM37w03n3es+vFWQtuxc+2Go888fJoMkUX2C6Zk6Jn116KE45DWjeyPM4mp3vvGzwGvdRxP5K9Q3suA+iuI/ULXM7m9mV4ruvs/MZvL+ELm5Jnmk1bBtixVJhQwJP2z++8tQKJghhyBxPIC/2fkAHobQpkhZrXu56JjP+v33ul3Ku4bbvfVMY/LVwCAEnxlvhk+C6uRCKCeFMrzQ/k5inasXLw==, sha256=e1f9e23988c19619402f1040c9251556dcd6e02b9d3e3b966a129ea1be5c70fc}}, requestHandler={bar={name=bar, class=org.apache.solr.core.RuntimeLibReqHandler, package=global}}} to version 1
   [junit4]   2> 1731930 DEBUG (zkCallback-6976-thread-1) [     ] o.a.s.c.c.ZkStateReader Loaded cluster properties: {package={global={name=global, url=http://localhost:38093/jar1.jar, sig=NaTm3+i99/ZhS8YRsLc3NLz2Y6VuwEbu7DihY8GAWwWIGm+jpXgn1JiuaenfxFCcfNKCC9WgZmEgbTZTzmV/OZMVn90u642YJbF3vTnzelW1pHB43ZRAJ1iesH0anM37w03n3es+vFWQtuxc+2Go888fJoMkUX2C6Zk6Jn116KE45DWjeyPM4mp3vvGzwGvdRxP5K9Q3suA+iuI/ULXM7m9mV4ruvs/MZvL+ELm5Jnmk1bBtixVJhQwJP2z++8tQKJghhyBxPIC/2fkAHobQpkhZrXu56JjP+v33ul3Ku4bbvfVMY/LVwCAEnxlvhk+C6uRCKCeFMrzQ/k5inasXLw==, sha256=e1f9e23988c19619402f1040c9251556dcd6e02b9d3e3b966a129ea1be5c70fc}}, requestHandler={bar={name=bar, class=org.apache.solr.core.RuntimeLibReqHandler, package=global}}} to version 1
   [junit4]   2> 1731930 INFO  (zkCallback-6976-thread-1) [     ] o.a.s.c.PackageManager clusterprops.json changed , version 1
   [junit4]   2> 1731930 INFO  (qtp2002490481-18711) [n:127.0.0.1:39860_solr     ] o.a.s.c.PackageManager clusterprops.json changed , version 1
   [junit4]   2> 1731931 DEBUG (zkCallback-7012-thread-1) [     ] o.a.s.c.c.ZkState

[...truncated too long message...]

ttings :: file = /home/jenkins/jenkins-slave/workspace/Lucene-Solr-Tests-8.x/lucene/top-level-ivy-settings.xml

resolve:

ivy-availability-check:
[loadresource] Do not set property disallowed.ivy.jars.list as its length is 0.

-ivy-fail-disallowed-ivy-version:

ivy-fail:

ivy-configure:
[ivy:configure] :: loading settings :: file = /home/jenkins/jenkins-slave/workspace/Lucene-Solr-Tests-8.x/lucene/top-level-ivy-settings.xml

resolve:

ivy-availability-check:
[loadresource] Do not set property disallowed.ivy.jars.list as its length is 0.

-ivy-fail-disallowed-ivy-version:

ivy-fail:

ivy-fail:

ivy-configure:
[ivy:configure] :: loading settings :: file = /home/jenkins/jenkins-slave/workspace/Lucene-Solr-Tests-8.x/lucene/top-level-ivy-settings.xml

resolve:

ivy-availability-check:
[loadresource] Do not set property disallowed.ivy.jars.list as its length is 0.

-ivy-fail-disallowed-ivy-version:

ivy-fail:

ivy-configure:
[ivy:configure] :: loading settings :: file = /home/jenkins/jenkins-slave/workspace/Lucene-Solr-Tests-8.x/lucene/top-level-ivy-settings.xml

resolve:

ivy-availability-check:
[loadresource] Do not set property disallowed.ivy.jars.list as its length is 0.

-ivy-fail-disallowed-ivy-version:

ivy-fail:

ivy-fail:

ivy-configure:
[ivy:configure] :: loading settings :: file = /home/jenkins/jenkins-slave/workspace/Lucene-Solr-Tests-8.x/lucene/top-level-ivy-settings.xml

resolve:

ivy-availability-check:
[loadresource] Do not set property disallowed.ivy.jars.list as its length is 0.

-ivy-fail-disallowed-ivy-version:

ivy-fail:

ivy-fail:

ivy-configure:
[ivy:configure] :: loading settings :: file = /home/jenkins/jenkins-slave/workspace/Lucene-Solr-Tests-8.x/lucene/top-level-ivy-settings.xml

resolve:

ivy-availability-check:
[loadresource] Do not set property disallowed.ivy.jars.list as its length is 0.

-ivy-fail-disallowed-ivy-version:

ivy-fail:

ivy-fail:

ivy-configure:
[ivy:configure] :: loading settings :: file = /home/jenkins/jenkins-slave/workspace/Lucene-Solr-Tests-8.x/lucene/top-level-ivy-settings.xml

resolve:

ivy-availability-check:
[loadresource] Do not set property disallowed.ivy.jars.list as its length is 0.

-ivy-fail-disallowed-ivy-version:

ivy-fail:

ivy-fail:

ivy-configure:
[ivy:configure] :: loading settings :: file = /home/jenkins/jenkins-slave/workspace/Lucene-Solr-Tests-8.x/lucene/top-level-ivy-settings.xml

resolve:

ivy-availability-check:
[loadresource] Do not set property disallowed.ivy.jars.list as its length is 0.

-ivy-fail-disallowed-ivy-version:

ivy-fail:

ivy-fail:

ivy-configure:
[ivy:configure] :: loading settings :: file = /home/jenkins/jenkins-slave/workspace/Lucene-Solr-Tests-8.x/lucene/top-level-ivy-settings.xml

resolve:

ivy-availability-check:
[loadresource] Do not set property disallowed.ivy.jars.list as its length is 0.

-ivy-fail-disallowed-ivy-version:

ivy-fail:

ivy-fail:

ivy-configure:
[ivy:configure] :: loading settings :: file = /home/jenkins/jenkins-slave/workspace/Lucene-Solr-Tests-8.x/lucene/top-level-ivy-settings.xml

resolve:

ivy-availability-check:
[loadresource] Do not set property disallowed.ivy.jars.list as its length is 0.

-ivy-fail-disallowed-ivy-version:

ivy-fail:

ivy-fail:

ivy-configure:
[ivy:configure] :: loading settings :: file = /home/jenkins/jenkins-slave/workspace/Lucene-Solr-Tests-8.x/lucene/top-level-ivy-settings.xml

resolve:

ivy-availability-check:
[loadresource] Do not set property disallowed.ivy.jars.list as its length is 0.

-ivy-fail-disallowed-ivy-version:

ivy-fail:

ivy-fail:

ivy-configure:
[ivy:configure] :: loading settings :: file = /home/jenkins/jenkins-slave/workspace/Lucene-Solr-Tests-8.x/lucene/top-level-ivy-settings.xml

resolve:

ivy-availability-check:
[loadresource] Do not set property disallowed.ivy.jars.list as its length is 0.

-ivy-fail-disallowed-ivy-version:

ivy-fail:

ivy-fail:

ivy-configure:
[ivy:configure] :: loading settings :: file = /home/jenkins/jenkins-slave/workspace/Lucene-Solr-Tests-8.x/lucene/top-level-ivy-settings.xml

resolve:

ivy-availability-check:
[loadresource] Do not set property disallowed.ivy.jars.list as its length is 0.

-ivy-fail-disallowed-ivy-version:

ivy-fail:

ivy-fail:

ivy-configure:
[ivy:configure] :: loading settings :: file = /home/jenkins/jenkins-slave/workspace/Lucene-Solr-Tests-8.x/lucene/top-level-ivy-settings.xml

resolve:

ivy-availability-check:
[loadresource] Do not set property disallowed.ivy.jars.list as its length is 0.

-ivy-fail-disallowed-ivy-version:

ivy-fail:

ivy-fail:

ivy-configure:
[ivy:configure] :: loading settings :: file = /home/jenkins/jenkins-slave/workspace/Lucene-Solr-Tests-8.x/lucene/top-level-ivy-settings.xml

resolve:

jar-checksums:
    [mkdir] Created dir: /home/jenkins/jenkins-slave/workspace/Lucene-Solr-Tests-8.x/solr/null963558651
     [copy] Copying 249 files to /home/jenkins/jenkins-slave/workspace/Lucene-Solr-Tests-8.x/solr/null963558651
   [delete] Deleting directory /home/jenkins/jenkins-slave/workspace/Lucene-Solr-Tests-8.x/solr/null963558651

check-working-copy:
[ivy:cachepath] :: resolving dependencies :: #;[hidden email]
[ivy:cachepath] confs: [default]
[ivy:cachepath] found org.eclipse.jgit#org.eclipse.jgit;5.3.0.201903130848-r in public
[ivy:cachepath] found com.jcraft#jsch;0.1.54 in public
[ivy:cachepath] found com.jcraft#jzlib;1.1.1 in public
[ivy:cachepath] found com.googlecode.javaewah#JavaEWAH;1.1.6 in public
[ivy:cachepath] found org.slf4j#slf4j-api;1.7.2 in public
[ivy:cachepath] found org.bouncycastle#bcpg-jdk15on;1.60 in public
[ivy:cachepath] found org.bouncycastle#bcprov-jdk15on;1.60 in public
[ivy:cachepath] found org.bouncycastle#bcpkix-jdk15on;1.60 in public
[ivy:cachepath] found org.slf4j#slf4j-nop;1.7.2 in public
[ivy:cachepath] :: resolution report :: resolve 34ms :: artifacts dl 5ms
        ---------------------------------------------------------------------
        |                  |            modules            ||   artifacts   |
        |       conf       | number| search|dwnlded|evicted|| number|dwnlded|
        ---------------------------------------------------------------------
        |      default     |   9   |   0   |   0   |   0   ||   9   |   0   |
        ---------------------------------------------------------------------
[wc-checker] Initializing working copy...
[wc-checker] Checking working copy status...

-jenkins-base:

BUILD SUCCESSFUL
Total time: 201 minutes 0 seconds
Archiving artifacts
java.lang.InterruptedException: no matches found within 10000
        at hudson.FilePath$ValidateAntFileMask.hasMatch(FilePath.java:2847)
        at hudson.FilePath$ValidateAntFileMask.invoke(FilePath.java:2726)
        at hudson.FilePath$ValidateAntFileMask.invoke(FilePath.java:2707)
        at hudson.FilePath$FileCallableWrapper.call(FilePath.java:3086)
Also:   hudson.remoting.Channel$CallSiteStackTrace: Remote call to lucene2
                at hudson.remoting.Channel.attachCallSiteStackTrace(Channel.java:1741)
                at hudson.remoting.UserRequest$ExceptionResponse.retrieve(UserRequest.java:357)
                at hudson.remoting.Channel.call(Channel.java:955)
                at hudson.FilePath.act(FilePath.java:1072)
                at hudson.FilePath.act(FilePath.java:1061)
                at hudson.FilePath.validateAntFileMask(FilePath.java:2705)
                at hudson.tasks.ArtifactArchiver.perform(ArtifactArchiver.java:243)
                at hudson.tasks.BuildStepCompatibilityLayer.perform(BuildStepCompatibilityLayer.java:81)
                at hudson.tasks.BuildStepMonitor$1.perform(BuildStepMonitor.java:20)
                at hudson.model.AbstractBuild$AbstractBuildExecution.perform(AbstractBuild.java:744)
                at hudson.model.AbstractBuild$AbstractBuildExecution.performAllBuildSteps(AbstractBuild.java:690)
                at hudson.model.Build$BuildExecution.post2(Build.java:186)
                at hudson.model.AbstractBuild$AbstractBuildExecution.post(AbstractBuild.java:635)
                at hudson.model.Run.execute(Run.java:1835)
                at hudson.model.FreeStyleBuild.run(FreeStyleBuild.java:43)
                at hudson.model.ResourceController.execute(ResourceController.java:97)
                at hudson.model.Executor.run(Executor.java:429)
Caused: hudson.FilePath$TunneledInterruptedException
        at hudson.FilePath$FileCallableWrapper.call(FilePath.java:3088)
        at hudson.remoting.UserRequest.perform(UserRequest.java:212)
        at hudson.remoting.UserRequest.perform(UserRequest.java:54)
        at hudson.remoting.Request$2.run(Request.java:369)
        at hudson.remoting.InterceptingExecutorService$1.call(InterceptingExecutorService.java:72)
        at java.util.concurrent.FutureTask.run(FutureTask.java:266)
        at java.util.concurrent.ThreadPoolExecutor.runWorker(ThreadPoolExecutor.java:1142)
        at java.util.concurrent.ThreadPoolExecutor$Worker.run(ThreadPoolExecutor.java:617)
        at java.lang.Thread.run(Thread.java:748)
Caused: java.lang.InterruptedException: java.lang.InterruptedException: no matches found within 10000
        at hudson.FilePath.act(FilePath.java:1074)
        at hudson.FilePath.act(FilePath.java:1061)
        at hudson.FilePath.validateAntFileMask(FilePath.java:2705)
        at hudson.tasks.ArtifactArchiver.perform(ArtifactArchiver.java:243)
        at hudson.tasks.BuildStepCompatibilityLayer.perform(BuildStepCompatibilityLayer.java:81)
        at hudson.tasks.BuildStepMonitor$1.perform(BuildStepMonitor.java:20)
        at hudson.model.AbstractBuild$AbstractBuildExecution.perform(AbstractBuild.java:744)
        at hudson.model.AbstractBuild$AbstractBuildExecution.performAllBuildSteps(AbstractBuild.java:690)
        at hudson.model.Build$BuildExecution.post2(Build.java:186)
        at hudson.model.AbstractBuild$AbstractBuildExecution.post(AbstractBuild.java:635)
        at hudson.model.Run.execute(Run.java:1835)
        at hudson.model.FreeStyleBuild.run(FreeStyleBuild.java:43)
        at hudson.model.ResourceController.execute(ResourceController.java:97)
        at hudson.model.Executor.run(Executor.java:429)
No artifacts found that match the file pattern "**/*.events,heapdumps/**,**/hs_err_pid*". Configuration error?
Recording test results
Build step 'Publish JUnit test result report' changed build result to UNSTABLE
Email was triggered for: Unstable (Test Failures)
Sending email for trigger: Unstable (Test Failures)


---------------------------------------------------------------------
To unsubscribe, e-mail: [hidden email]
For additional commands, e-mail: [hidden email]