[JENKINS] Lucene-Solr-Tests-8.x - Build # 518 - Unstable

classic Classic list List threaded Threaded
1 message Options
Reply | Threaded
Open this post in threaded view
|

[JENKINS] Lucene-Solr-Tests-8.x - Build # 518 - Unstable

Apache Jenkins Server-2
Build: https://builds.apache.org/job/Lucene-Solr-Tests-8.x/518/

1 tests failed.
FAILED:  org.apache.solr.cloud.autoscaling.sim.TestSimComputePlanAction.testNodeAdded

Error Message:
OverseerTriggerThread never caught up to the latest znodeVersion

Stack Trace:
java.util.concurrent.TimeoutException: OverseerTriggerThread never caught up to the latest znodeVersion
        at __randomizedtesting.SeedInfo.seed([67E6B1C02ED91327:225E7B78C7ABB24]:0)
        at org.apache.solr.util.TimeOut.waitFor(TimeOut.java:66)
        at org.apache.solr.cloud.autoscaling.sim.SimSolrCloudTestCase.assertAutoscalingUpdateComplete(SimSolrCloudTestCase.java:98)
        at org.apache.solr.cloud.autoscaling.sim.TestSimComputePlanAction.init(TestSimComputePlanAction.java:103)
        at sun.reflect.NativeMethodAccessorImpl.invoke0(Native Method)
        at sun.reflect.NativeMethodAccessorImpl.invoke(NativeMethodAccessorImpl.java:62)
        at sun.reflect.DelegatingMethodAccessorImpl.invoke(DelegatingMethodAccessorImpl.java:43)
        at java.lang.reflect.Method.invoke(Method.java:498)
        at com.carrotsearch.randomizedtesting.RandomizedRunner.invoke(RandomizedRunner.java:1750)
        at com.carrotsearch.randomizedtesting.RandomizedRunner$9.evaluate(RandomizedRunner.java:972)
        at com.carrotsearch.randomizedtesting.RandomizedRunner$10.evaluate(RandomizedRunner.java:988)
        at com.carrotsearch.randomizedtesting.rules.SystemPropertiesRestoreRule$1.evaluate(SystemPropertiesRestoreRule.java:57)
        at org.apache.lucene.util.TestRuleSetupTeardownChained$1.evaluate(TestRuleSetupTeardownChained.java:49)
        at org.apache.lucene.util.AbstractBeforeAfterRule$1.evaluate(AbstractBeforeAfterRule.java:45)
        at org.apache.lucene.util.TestRuleThreadAndTestName$1.evaluate(TestRuleThreadAndTestName.java:48)
        at org.apache.lucene.util.TestRuleIgnoreAfterMaxFailures$1.evaluate(TestRuleIgnoreAfterMaxFailures.java:64)
        at org.apache.lucene.util.TestRuleMarkFailure$1.evaluate(TestRuleMarkFailure.java:47)
        at com.carrotsearch.randomizedtesting.rules.StatementAdapter.evaluate(StatementAdapter.java:36)
        at com.carrotsearch.randomizedtesting.ThreadLeakControl$StatementRunner.run(ThreadLeakControl.java:368)
        at com.carrotsearch.randomizedtesting.ThreadLeakControl.forkTimeoutingTask(ThreadLeakControl.java:817)
        at com.carrotsearch.randomizedtesting.ThreadLeakControl$3.evaluate(ThreadLeakControl.java:468)
        at com.carrotsearch.randomizedtesting.RandomizedRunner.runSingleTest(RandomizedRunner.java:947)
        at com.carrotsearch.randomizedtesting.RandomizedRunner$5.evaluate(RandomizedRunner.java:832)
        at com.carrotsearch.randomizedtesting.RandomizedRunner$6.evaluate(RandomizedRunner.java:883)
        at com.carrotsearch.randomizedtesting.RandomizedRunner$7.evaluate(RandomizedRunner.java:894)
        at com.carrotsearch.randomizedtesting.rules.StatementAdapter.evaluate(StatementAdapter.java:36)
        at com.carrotsearch.randomizedtesting.rules.SystemPropertiesRestoreRule$1.evaluate(SystemPropertiesRestoreRule.java:57)
        at org.apache.lucene.util.AbstractBeforeAfterRule$1.evaluate(AbstractBeforeAfterRule.java:45)
        at com.carrotsearch.randomizedtesting.rules.StatementAdapter.evaluate(StatementAdapter.java:36)
        at org.apache.lucene.util.TestRuleStoreClassName$1.evaluate(TestRuleStoreClassName.java:41)
        at com.carrotsearch.randomizedtesting.rules.NoShadowingOrOverridesOnMethodsRule$1.evaluate(NoShadowingOrOverridesOnMethodsRule.java:40)
        at com.carrotsearch.randomizedtesting.rules.NoShadowingOrOverridesOnMethodsRule$1.evaluate(NoShadowingOrOverridesOnMethodsRule.java:40)
        at com.carrotsearch.randomizedtesting.rules.StatementAdapter.evaluate(StatementAdapter.java:36)
        at com.carrotsearch.randomizedtesting.rules.StatementAdapter.evaluate(StatementAdapter.java:36)
        at com.carrotsearch.randomizedtesting.rules.StatementAdapter.evaluate(StatementAdapter.java:36)
        at org.apache.lucene.util.TestRuleAssertionsRequired$1.evaluate(TestRuleAssertionsRequired.java:53)
        at org.apache.lucene.util.TestRuleMarkFailure$1.evaluate(TestRuleMarkFailure.java:47)
        at org.apache.lucene.util.TestRuleIgnoreAfterMaxFailures$1.evaluate(TestRuleIgnoreAfterMaxFailures.java:64)
        at org.apache.lucene.util.TestRuleIgnoreTestSuites$1.evaluate(TestRuleIgnoreTestSuites.java:54)
        at com.carrotsearch.randomizedtesting.rules.StatementAdapter.evaluate(StatementAdapter.java:36)
        at com.carrotsearch.randomizedtesting.ThreadLeakControl$StatementRunner.run(ThreadLeakControl.java:368)
        at java.lang.Thread.run(Thread.java:748)




Build Log:
[...truncated 13643 lines...]
   [junit4] Suite: org.apache.solr.cloud.autoscaling.sim.TestSimComputePlanAction
   [junit4]   2> 348156 INFO  (SUITE-TestSimComputePlanAction-seed#[67E6B1C02ED91327]-worker) [     ] o.a.s.SolrTestCaseJ4 Created dataDir: /home/jenkins/jenkins-slave/workspace/Lucene-Solr-Tests-8.x/solr/build/solr-core/test/J2/temp/solr.cloud.autoscaling.sim.TestSimComputePlanAction_67E6B1C02ED91327-001/data-dir-51-001
   [junit4]   2> 348156 WARN  (SUITE-TestSimComputePlanAction-seed#[67E6B1C02ED91327]-worker) [     ] o.a.s.SolrTestCaseJ4 startTrackingSearchers: numOpens=2 numCloses=2
   [junit4]   2> 348157 INFO  (SUITE-TestSimComputePlanAction-seed#[67E6B1C02ED91327]-worker) [     ] o.a.s.SolrTestCaseJ4 Using PointFields (NUMERIC_POINTS_SYSPROP=true) w/NUMERIC_DOCVALUES_SYSPROP=true
   [junit4]   2> 348160 INFO  (SUITE-TestSimComputePlanAction-seed#[67E6B1C02ED91327]-worker) [     ] o.a.s.SolrTestCaseJ4 Randomized ssl (true) and clientAuth (true) via: @org.apache.solr.util.RandomizeSSL(reason=, ssl=NaN, value=NaN, clientAuth=NaN)
   [junit4] IGNOR/A 0.00s J2 | TestSimComputePlanAction.testNodeLost
   [junit4]    > Assumption #1: 'awaitsfix' test group is disabled (@AwaitsFix(bugUrl=https://issues.apache.org/jira/browse/SOLR-12028))
   [junit4]   2> 348161 INFO  (SUITE-TestSimComputePlanAction-seed#[67E6B1C02ED91327]-worker) [     ] o.a.s.SolrTestCaseJ4 SecureRandom sanity checks: test.solr.allowed.securerandom=null & java.security.egd=file:/dev/./urandom
   [junit4]   2> 348166 INFO  (TEST-TestSimComputePlanAction.testNodeWithMultipleReplicasLost-seed#[67E6B1C02ED91327]) [     ] o.a.s.SolrTestCaseJ4 ###Starting testNodeWithMultipleReplicasLost
   [junit4]   2> 348190 DEBUG (TEST-TestSimComputePlanAction.testNodeWithMultipleReplicasLost-seed#[67E6B1C02ED91327]) [     ] o.a.s.c.a.s.SimClusterStateProvider --- new Overseer leader: 127.0.0.1:10002_solr
   [junit4]   2> 348190 DEBUG (Simulated OverseerAutoScalingTriggerThread) [     ] o.a.s.c.a.OverseerTriggerThread Adding .auto_add_replicas and .scheduled_maintenance triggers
   [junit4]   2> 348190 DEBUG (Simulated OverseerAutoScalingTriggerThread) [     ] o.a.s.c.a.OverseerTriggerThread Refreshing /autoscaling.json with znode version 1
   [junit4]   2> 348191 DEBUG (Simulated OverseerAutoScalingTriggerThread) [     ] o.a.s.c.a.OverseerTriggerThread Current znodeVersion 1, lastZnodeVersion 0
   [junit4]   2> 348191 DEBUG (Simulated OverseerAutoScalingTriggerThread) [     ] o.a.s.c.a.OverseerTriggerThread Processed trigger updates upto znodeVersion 1
   [junit4]   2> 348194 DEBUG (Simulated OverseerAutoScalingTriggerThread) [     ] o.a.s.c.a.NodeLostTrigger NodeLostTrigger .auto_add_replicas - Initial livenodes: [127.0.0.1:10002_solr]
   [junit4]   2> 348194 DEBUG (TEST-TestSimComputePlanAction.testNodeWithMultipleReplicasLost-seed#[67E6B1C02ED91327]) [     ] o.a.s.c.a.s.SimClusterStateProvider ** creating new collection states, currentVersion=0
   [junit4]   2> 348194 DEBUG (TEST-TestSimComputePlanAction.testNodeWithMultipleReplicasLost-seed#[67E6B1C02ED91327]) [     ] o.a.s.c.a.s.SimClusterStateProvider ** saved cluster state version 0
   [junit4]   2> 348194 INFO  (TEST-TestSimComputePlanAction.testNodeWithMultipleReplicasLost-seed#[67E6B1C02ED91327]) [     ] o.a.s.h.a.MetricsHistoryHandler No .system collection, keeping metrics history in memory.
   [junit4]   2> 348194 DEBUG (Simulated OverseerAutoScalingTriggerThread) [     ] o.a.s.c.a.OverseerTriggerThread -- cleaning old nodeLost / nodeAdded markers
   [junit4]   2> 348194 DEBUG (Simulated OverseerAutoScalingTriggerThread) [     ] o.a.s.c.a.OverseerTriggerThread Current znodeVersion 1, lastZnodeVersion 1
   [junit4]   2> 348195 DEBUG (ScheduledTrigger-1687-thread-2) [     ] o.a.s.c.a.NodeLostTrigger Running NodeLostTrigger: .auto_add_replicas with currently live nodes: 1 and last live nodes: 1
   [junit4]   2> 348217 DEBUG (ScheduledTrigger-1687-thread-4) [     ] o.a.s.c.a.NodeLostTrigger Running NodeLostTrigger: .auto_add_replicas with currently live nodes: 1 and last live nodes: 1
   [junit4]   2> 348222 DEBUG (simCloudManagerPool-1686-thread-1) [     ] o.a.s.c.a.AutoScalingHandler Verified autoscaling configuration
   [junit4]   2> 348224 DEBUG (simCloudManagerPool-1686-thread-1) [     ] o.a.s.c.a.OverseerTriggerThread Refreshing /autoscaling.json with znode version 2
   [junit4]   2> 348225 DEBUG (Simulated OverseerAutoScalingTriggerThread) [     ] o.a.s.c.a.OverseerTriggerThread Processed trigger updates upto znodeVersion 2
   [junit4]   2> 348225 DEBUG (Simulated OverseerAutoScalingTriggerThread) [     ] o.a.s.c.a.OverseerTriggerThread -- cleaning old nodeLost / nodeAdded markers
   [junit4]   2> 348225 DEBUG (Simulated OverseerAutoScalingTriggerThread) [     ] o.a.s.c.a.OverseerTriggerThread Current znodeVersion 2, lastZnodeVersion 2
   [junit4]   2> 348227 DEBUG (simCloudManagerPool-1686-thread-2) [     ] o.a.s.c.a.AutoScalingHandler Verified autoscaling configuration
   [junit4]   2> 348227 DEBUG (simCloudManagerPool-1686-thread-2) [     ] o.a.s.c.a.OverseerTriggerThread Refreshing /autoscaling.json with znode version 3
   [junit4]   2> 348228 DEBUG (Simulated OverseerAutoScalingTriggerThread) [     ] o.a.s.c.a.OverseerTriggerThread Processed trigger updates upto znodeVersion 3
   [junit4]   2> 348228 DEBUG (Simulated OverseerAutoScalingTriggerThread) [     ] o.a.s.c.a.OverseerTriggerThread -- cleaning old nodeLost / nodeAdded markers
   [junit4]   2> 348228 DEBUG (Simulated OverseerAutoScalingTriggerThread) [     ] o.a.s.c.a.OverseerTriggerThread Current znodeVersion 3, lastZnodeVersion 3
   [junit4]   2> 348237 DEBUG (ScheduledTrigger-1687-thread-3) [     ] o.a.s.c.a.NodeLostTrigger Running NodeLostTrigger: .auto_add_replicas with currently live nodes: 1 and last live nodes: 1
   [junit4]   2> 348257 DEBUG (ScheduledTrigger-1687-thread-1) [     ] o.a.s.c.a.NodeLostTrigger Running NodeLostTrigger: .auto_add_replicas with currently live nodes: 1 and last live nodes: 1
   [junit4]   2> 348277 DEBUG (ScheduledTrigger-1687-thread-3) [     ] o.a.s.c.a.NodeLostTrigger Running NodeLostTrigger: .auto_add_replicas with currently live nodes: 1 and last live nodes: 1
   [junit4]   2> 348297 DEBUG (ScheduledTrigger-1687-thread-1) [     ] o.a.s.c.a.NodeLostTrigger Running NodeLostTrigger: .auto_add_replicas with currently live nodes: 1 and last live nodes: 1
   [junit4]   2> 348317 DEBUG (ScheduledTrigger-1687-thread-2) [     ] o.a.s.c.a.NodeLostTrigger Running NodeLostTrigger: .auto_add_replicas with currently live nodes: 1 and last live nodes: 1
   [junit4]   2> 348332 DEBUG (simCloudManagerPool-1686-thread-3) [     ] o.a.s.c.a.AutoScalingHandler Verified autoscaling configuration
   [junit4]   2> 348332 DEBUG (simCloudManagerPool-1686-thread-3) [     ] o.a.s.c.a.OverseerTriggerThread Refreshing /autoscaling.json with znode version 4
   [junit4]   2> 348333 DEBUG (Simulated OverseerAutoScalingTriggerThread) [     ] o.a.s.c.a.OverseerTriggerThread Processed trigger updates upto znodeVersion 4
   [junit4]   2> 348333 DEBUG (Simulated OverseerAutoScalingTriggerThread) [     ] o.a.s.c.a.NodeLostTrigger NodeLostTrigger node_lost_trigger - Initial livenodes: [127.0.0.1:10004_solr, 127.0.0.1:10005_solr, 127.0.0.1:10002_solr, 127.0.0.1:10003_solr]
   [junit4]   2> 348333 DEBUG (Simulated OverseerAutoScalingTriggerThread) [     ] o.a.s.c.a.OverseerTriggerThread -- cleaning old nodeLost / nodeAdded markers
   [junit4]   2> 348334 DEBUG (Simulated OverseerAutoScalingTriggerThread) [     ] o.a.s.c.a.OverseerTriggerThread Current znodeVersion 4, lastZnodeVersion 4
   [junit4]   2> 348334 DEBUG (ScheduledTrigger-1687-thread-3) [     ] o.a.s.c.a.NodeLostTrigger Running NodeLostTrigger: node_lost_trigger with currently live nodes: 4 and last live nodes: 4
   [junit4]   2> 348338 DEBUG (ScheduledTrigger-1687-thread-2) [     ] o.a.s.c.a.NodeLostTrigger Running NodeLostTrigger: .auto_add_replicas with currently live nodes: 4 and last live nodes: 1
   [junit4]   2> 348341 DEBUG (simCloudManagerPool-1686-thread-4) [     ] o.a.s.c.a.s.SimClusterStateProvider -- simCreateCollection testNodeWithMultipleReplicasLost, currentVersion=1
   [junit4]   2> 348341 DEBUG (simCloudManagerPool-1686-thread-4) [     ] o.a.s.c.a.s.SimClusterStateProvider ** creating new collection states, currentVersion=1
   [junit4]   2> 348342 DEBUG (simCloudManagerPool-1686-thread-4) [     ] o.a.s.c.a.s.SimClusterStateProvider ** saved cluster state version 1
   [junit4]   2> 348342 DEBUG (simCloudManagerPool-1686-thread-4) [     ] o.a.s.c.o.ClusterStateMutator building a new cName: testNodeWithMultipleReplicasLost
   [junit4]   2> 348354 DEBUG (ScheduledTrigger-1687-thread-4) [     ] o.a.s.c.a.NodeLostTrigger Running NodeLostTrigger: node_lost_trigger with currently live nodes: 4 and last live nodes: 4
   [junit4]   2> 348356 DEBUG (simCloudManagerPool-1686-thread-4) [     ] o.a.s.c.a.s.SimClusterStateProvider ** creating new collection states, currentVersion=2
   [junit4]   2> 348358 DEBUG (ScheduledTrigger-1687-thread-1) [     ] o.a.s.c.a.NodeLostTrigger Running NodeLostTrigger: .auto_add_replicas with currently live nodes: 4 and last live nodes: 4
   [junit4]   2> 348360 DEBUG (simCloudManagerPool-1686-thread-4) [     ] o.a.s.c.a.s.SimClusterStateProvider ** saved cluster state version 2
   [junit4]   2> 348372 DEBUG (simCloudManagerPool-1686-thread-4) [     ] o.a.s.c.s.c.a.PolicyHelper Creating a new session
   [junit4]   2> 348374 DEBUG (ScheduledTrigger-1687-thread-3) [     ] o.a.s.c.a.NodeLostTrigger Running NodeLostTrigger: node_lost_trigger with currently live nodes: 4 and last live nodes: 4
   [junit4]   2> 348376 DEBUG (simCloudManagerPool-1686-thread-4) [     ] o.a.s.c.s.c.a.PolicyHelper New session created
   [junit4]   2> 348378 DEBUG (ScheduledTrigger-1687-thread-1) [     ] o.a.s.c.a.NodeLostTrigger Running NodeLostTrigger: .auto_add_replicas with currently live nodes: 4 and last live nodes: 4
   [junit4]   2> 348395 DEBUG (ScheduledTrigger-1687-thread-2) [     ] o.a.s.c.a.NodeLostTrigger Running NodeLostTrigger: node_lost_trigger with currently live nodes: 4 and last live nodes: 4
   [junit4]   2> 348399 DEBUG (ScheduledTrigger-1687-thread-4) [     ] o.a.s.c.a.NodeLostTrigger Running NodeLostTrigger: .auto_add_replicas with currently live nodes: 4 and last live nodes: 4
   [junit4]   2> 348415 DEBUG (ScheduledTrigger-1687-thread-4) [     ] o.a.s.c.a.NodeLostTrigger Running NodeLostTrigger: node_lost_trigger with currently live nodes: 4 and last live nodes: 4
   [junit4]   2> 348420 DEBUG (ScheduledTrigger-1687-thread-3) [     ] o.a.s.c.a.NodeLostTrigger Running NodeLostTrigger: .auto_add_replicas with currently live nodes: 4 and last live nodes: 4
   [junit4]   2> 348420 DEBUG (simCloudManagerPool-1686-thread-4) [     ] o.a.s.c.s.c.a.PolicyHelper returnSession, curr-time 3971067242 sessionWrapper.createTime 3971065021671447, this.sessionWrapper.createTime 3971065021671447
   [junit4]   2> 348420 DEBUG (simCloudManagerPool-1686-thread-4) [     ] o.a.s.c.s.c.a.PolicyHelper session set to NULL
   [junit4]   2> 348435 DEBUG (ScheduledTrigger-1687-thread-2) [     ] o.a.s.c.a.NodeLostTrigger Running NodeLostTrigger: node_lost_trigger with currently live nodes: 4 and last live nodes: 4
   [junit4]   2> 348440 DEBUG (ScheduledTrigger-1687-thread-4) [     ] o.a.s.c.a.NodeLostTrigger Running NodeLostTrigger: .auto_add_replicas with currently live nodes: 4 and last live nodes: 4
   [junit4]   2> 348449 DEBUG (simCloudManagerPool-1686-thread-5) [     ] o.a.s.c.a.s.SimClusterStateProvider ** creating new collection states, currentVersion=3
   [junit4]   2> 348450 DEBUG (simCloudManagerPool-1686-thread-5) [     ] o.a.s.c.a.s.SimClusterStateProvider ** saved cluster state version 3
   [junit4]   2> 348450 DEBUG (simCloudManagerPool-1686-thread-5) [     ] o.a.s.c.a.s.SimClusterStateProvider Running leader election (testNodeWithMultipleReplicasLost / shard1)
   [junit4]   2> 348455 DEBUG (ScheduledTrigger-1687-thread-4) [     ] o.a.s.c.a.NodeLostTrigger Running NodeLostTrigger: node_lost_trigger with currently live nodes: 4 and last live nodes: 4
   [junit4]   2> 348452 DEBUG (simCloudManagerPool-1686-thread-5) [     ] o.a.s.c.a.s.SimClusterStateProvider -- elected new leader for testNodeWithMultipleReplicasLost / shard1 (currentVersion=4): {"core_node1":{
   [junit4]   2>     "core":"testNodeWithMultipleReplicasLost_shard1_replica_n1",
   [junit4]   2>     "shard":"shard1",
   [junit4]   2>     "collection":"testNodeWithMultipleReplicasLost",
   [junit4]   2>     "node_name":"127.0.0.1:10003_solr",
   [junit4]   2>     "type":"NRT",
   [junit4]   2>     "leader":"true",
   [junit4]   2>     "SEARCHER.searcher.maxDoc":0,
   [junit4]   2>     "SEARCHER.searcher.deletedDocs":0,
   [junit4]   2>     "INDEX.sizeInBytes":10240,
   [junit4]   2>     "state":"active",
   [junit4]   2>     "INDEX.sizeInGB":9.5367431640625E-6,
   [junit4]   2>     "SEARCHER.searcher.numDocs":0}}
   [junit4]   2> 348460 DEBUG (ScheduledTrigger-1687-thread-2) [     ] o.a.s.c.a.NodeLostTrigger Running NodeLostTrigger: .auto_add_replicas with currently live nodes: 4 and last live nodes: 4
   [junit4]   2> 348466 DEBUG (simCloudManagerPool-1686-thread-6) [     ] o.a.s.c.a.s.SimClusterStateProvider ** creating new collection states, currentVersion=4
   [junit4]   2> 348466 DEBUG (simCloudManagerPool-1686-thread-6) [     ] o.a.s.c.a.s.SimClusterStateProvider ** saved cluster state version 4
   [junit4]   2> 348476 DEBUG (ScheduledTrigger-1687-thread-2) [     ] o.a.s.c.a.NodeLostTrigger Running NodeLostTrigger: node_lost_trigger with currently live nodes: 4 and last live nodes: 4
   [junit4]   2> 348477 DEBUG (simCloudManagerPool-1686-thread-7) [     ] o.a.s.c.a.s.SimClusterStateProvider ** creating new collection states, currentVersion=5
   [junit4]   2> 348478 DEBUG (simCloudManagerPool-1686-thread-7) [     ] o.a.s.c.a.s.SimClusterStateProvider ** saved cluster state version 5
   [junit4]   2> 348480 DEBUG (ScheduledTrigger-1687-thread-4) [     ] o.a.s.c.a.NodeLostTrigger Running NodeLostTrigger: .auto_add_replicas with currently live nodes: 4 and last live nodes: 4
   [junit4]   2> 348488 DEBUG (simCloudManagerPool-1686-thread-8) [     ] o.a.s.c.a.s.SimClusterStateProvider ** creating new collection states, currentVersion=6
   [junit4]   2> 348489 DEBUG (simCloudManagerPool-1686-thread-8) [     ] o.a.s.c.a.s.SimClusterStateProvider ** saved cluster state version 6
   [junit4]   2> 348489 DEBUG (simCloudManagerPool-1686-thread-8) [     ] o.a.s.c.a.s.SimClusterStateProvider Running leader election (testNodeWithMultipleReplicasLost / shard2)
   [junit4]   2> 348489 DEBUG (simCloudManagerPool-1686-thread-8) [     ] o.a.s.c.a.s.SimClusterStateProvider -- elected new leader for testNodeWithMultipleReplicasLost / shard2 (currentVersion=7): {"core_node4":{
   [junit4]   2>     "core":"testNodeWithMultipleReplicasLost_shard2_replica_n4",
   [junit4]   2>     "shard":"shard2",
   [junit4]   2>     "collection":"testNodeWithMultipleReplicasLost",
   [junit4]   2>     "node_name":"127.0.0.1:10004_solr",
   [junit4]   2>     "type":"NRT",
   [junit4]   2>     "leader":"true",
   [junit4]   2>     "SEARCHER.searcher.maxDoc":0,
   [junit4]   2>     "SEARCHER.searcher.deletedDocs":0,
   [junit4]   2>     "INDEX.sizeInBytes":10240,
   [junit4]   2>     "state":"active",
   [junit4]   2>     "INDEX.sizeInGB":9.5367431640625E-6,
   [junit4]   2>     "SEARCHER.searcher.numDocs":0}}
   [junit4]   2> 348496 DEBUG (ScheduledTrigger-1687-thread-3) [     ] o.a.s.c.a.NodeLostTrigger Running NodeLostTrigger: node_lost_trigger with currently live nodes: 4 and last live nodes: 4
   [junit4]   2> 348500 DEBUG (simCloudManagerPool-1686-thread-9) [     ] o.a.s.c.a.s.SimClusterStateProvider ** creating new collection states, currentVersion=7
   [junit4]   2> 348500 DEBUG (simCloudManagerPool-1686-thread-9) [     ] o.a.s.c.a.s.SimClusterStateProvider ** saved cluster state version 7
   [junit4]   2> 348500 DEBUG (ScheduledTrigger-1687-thread-2) [     ] o.a.s.c.a.NodeLostTrigger Running NodeLostTrigger: .auto_add_replicas with currently live nodes: 4 and last live nodes: 4
   [junit4]   2> 348500 DEBUG (simCloudManagerPool-1686-thread-4) [     ] o.a.s.c.a.s.SimClusterStateProvider -- finished createCollection testNodeWithMultipleReplicasLost, currentVersion=8
   [junit4]   2> 348511 DEBUG (simCloudManagerPool-1686-thread-10) [     ] o.a.s.c.a.s.SimClusterStateProvider ** creating new collection states, currentVersion=8
   [junit4]   2> 348512 DEBUG (simCloudManagerPool-1686-thread-10) [     ] o.a.s.c.a.s.SimClusterStateProvider ** saved cluster state version 8
   [junit4]   2> 348512 DEBUG (TEST-TestSimComputePlanAction.testNodeWithMultipleReplicasLost-seed#[67E6B1C02ED91327]) [     ] o.a.s.c.a.s.SimClusterStateProvider ** creating new collection states, currentVersion=9
   [junit4]   2> 348512 DEBUG (TEST-TestSimComputePlanAction.testNodeWithMultipleReplicasLost-seed#[67E6B1C02ED91327]) [     ] o.a.s.c.a.s.SimClusterStateProvider ** saved cluster state version 9
   [junit4]   2> 348512 DEBUG (TEST-TestSimComputePlanAction.testNodeWithMultipleReplicasLost-seed#[67E6B1C02ED91327]) [     ] o.a.s.c.a.s.TestSimComputePlanAction -- cluster state: znodeVersion: 10
   [junit4]   2> live nodes:[127.0.0.1:10004_solr, 127.0.0.1:10002_solr, 127.0.0.1:10003_solr, 127.0.0.1:10005_solr]
   [junit4]   2> collections:{testNodeWithMultipleReplicasLost=DocCollection(testNodeWithMultipleReplicasLost//clusterstate.json/9)={
   [junit4]   2>   "replicationFactor":"1",
   [junit4]   2>   "pullReplicas":"0",
   [junit4]   2>   "router":{"name":"compositeId"},
   [junit4]   2>   "maxShardsPerNode":"2",
   [junit4]   2>   "autoAddReplicas":"false",
   [junit4]   2>   "nrtReplicas":"3",
   [junit4]   2>   "tlogReplicas":"0",
   [junit4]   2>   "autoCreated":"true",
   [junit4]   2>   "shards":{
   [junit4]   2>     "shard2":{
   [junit4]   2>       "replicas":{
   [junit4]   2>         "core_node6":{
   [junit4]   2>           "core":"testNodeWithMultipleReplicasLost_shard2_replica_n6",
   [junit4]   2>           "SEARCHER.searcher.maxDoc":0,
   [junit4]   2>           "SEARCHER.searcher.deletedDocs":0,
   [junit4]   2>           "INDEX.sizeInBytes":10240,
   [junit4]   2>           "node_name":"127.0.0.1:10002_solr",
   [junit4]   2>           "state":"active",
   [junit4]   2>           "type":"NRT",
   [junit4]   2>           "INDEX.sizeInGB":9.5367431640625E-6,
   [junit4]   2>           "SEARCHER.searcher.numDocs":0},
   [junit4]   2>         "core_node4":{
   [junit4]   2>           "core":"testNodeWithMultipleReplicasLost_shard2_replica_n4",
   [junit4]   2>           "leader":"true",
   [junit4]   2>           "SEARCHER.searcher.maxDoc":0,
   [junit4]   2>           "SEARCHER.searcher.deletedDocs":0,
   [junit4]   2>           "INDEX.sizeInBytes":10240,
   [junit4]   2>           "node_name":"127.0.0.1:10004_solr",
   [junit4]   2>           "state":"active",
   [junit4]   2>           "type":"NRT",
   [junit4]   2>           "INDEX.sizeInGB":9.5367431640625E-6,
   [junit4]   2>           "SEARCHER.searcher.numDocs":0},
   [junit4]   2>         "core_node5":{
   [junit4]   2>           "core":"testNodeWithMultipleReplicasLost_shard2_replica_n5",
   [junit4]   2>           "SEARCHER.searcher.maxDoc":0,
   [junit4]   2>           "SEARCHER.searcher.deletedDocs":0,
   [junit4]   2>           "INDEX.sizeInBytes":10240,
   [junit4]   2>           "node_name":"127.0.0.1:10005_solr",
   [junit4]   2>           "state":"active",
   [junit4]   2>           "type":"NRT",
   [junit4]   2>           "INDEX.sizeInGB":9.5367431640625E-6,
   [junit4]   2>           "SEARCHER.searcher.numDocs":0}},
   [junit4]   2>       "range":"0-7fffffff",
   [junit4]   2>       "state":"active"},
   [junit4]   2>     "shard1":{
   [junit4]   2>       "replicas":{
   [junit4]   2>         "core_node1":{
   [junit4]   2>           "core":"testNodeWithMultipleReplicasLost_shard1_replica_n1",
   [junit4]   2>           "leader":"true",
   [junit4]   2>           "SEARCHER.searcher.maxDoc":0,
   [junit4]   2>           "SEARCHER.searcher.deletedDocs":0,
   [junit4]   2>           "INDEX.sizeInBytes":10240,
   [junit4]   2>           "node_name":"127.0.0.1:10003_solr",
   [junit4]   2>           "state":"active",
   [junit4]   2>           "type":"NRT",
   [junit4]   2>           "INDEX.sizeInGB":9.5367431640625E-6,
   [junit4]   2>           "SEARCHER.searcher.numDocs":0},
   [junit4]   2>         "core_node2":{
   [junit4]   2>           "core":"testNodeWithMultipleReplicasLost_shard1_replica_n2",
   [junit4]   2>           "SEARCHER.searcher.maxDoc":0,
   [junit4]   2>           "SEARCHER.searcher.deletedDocs":0,
   [junit4]   2>           "INDEX.sizeInBytes":10240,
   [junit4]   2>           "node_name":"127.0.0.1:10002_solr",
   [junit4]   2>           "state":"active",
   [junit4]   2>           "type":"NRT",
   [junit4]   2>           "INDEX.sizeInGB":9.5367431640625E-6,
   [junit4]   2>           "SEARCHER.searcher.numDocs":0},
   [junit4]   2>         "core_node3":{
   [junit4]   2>           "core":"testNodeWithMultipleReplicasLost_shard1_replica_n3",
   [junit4]   2>           "SEARCHER.searcher.maxDoc":0,
   [junit4]   2>           "SEARCHER.searcher.deletedDocs":0,
   [junit4]   2>           "INDEX.sizeInBytes":10240,
   [junit4]   2>           "node_name":"127.0.0.1:10005_solr",
   [junit4]   2>           "state":"active",
   [junit4]   2>           "type":"NRT",
   [junit4]   2>           "INDEX.sizeInGB":9.5367431640625E-6,
   [junit4]   2>           "SEARCHER.searcher.numDocs":0}},
   [junit4]   2>       "range":"80000000-ffffffff",
   [junit4]   2>       "state":"active"}}}}
   [junit4]   2> 348514 DEBUG (TEST-TestSimComputePlanAction.testNodeWithMultipleReplicasLost-seed#[67E6B1C02ED91327]) [     ] o.a.s.c.a.s.SimClusterStateProvider  -- created marker: /autoscaling/nodeLost/127.0.0.1:10005_solr
   [junit4]   2> 348514 DEBUG (TEST-TestSimComputePlanAction.testNodeWithMultipleReplicasLost-seed#[67E6B1C02ED91327]) [     ] o.a.s.c.a.s.SimClusterStateProvider ** creating new collection states, currentVersion=10
   [junit4]   2> 348514 DEBUG (TEST-TestSimComputePlanAction.testNodeWithMultipleReplicasLost-seed#[67E6B1C02ED91327]) [     ] o.a.s.c.a.s.SimClusterStateProvider ** saved cluster state version 10
   [junit4]   2> 348516 DEBUG (ScheduledTrigger-1687-thread-1) [     ] o.a.s.c.a.NodeLostTrigger Running NodeLostTrigger: node_lost_trigger with currently live nodes: 3 and last live nodes: 4
   [junit4]   2> 348516 DEBUG (ScheduledTrigger-1687-thread-1) [     ] o.a.s.c.a.NodeLostTrigger Tracking lost node: 127.0.0.1:10005_solr
   [junit4]   2> 348520 DEBUG (ScheduledTrigger-1687-thread-1) [     ] o.a.s.c.a.NodeLostTrigger Running NodeLostTrigger: .auto_add_replicas with currently live nodes: 3 and last live nodes: 4
   [junit4]   2> 348521 DEBUG (ScheduledTrigger-1687-thread-1) [     ] o.a.s.c.a.NodeLostTrigger Tracking lost node: 127.0.0.1:10005_solr
   [junit4]   2> 348525 DEBUG (simCloudManagerPool-1686-thread-12) [     ] o.a.s.c.a.s.SimClusterStateProvider ** creating new collection states, currentVersion=11
   [junit4]   2> 348525 DEBUG (simCloudManagerPool-1686-thread-12) [     ] o.a.s.c.a.s.SimClusterStateProvider ** saved cluster state version 11
   [junit4]   2> 348536 DEBUG (ScheduledTrigger-1687-thread-1) [     ] o.a.s.c.a.NodeLostTrigger Running NodeLostTrigger: node_lost_trigger with currently live nodes: 3 and last live nodes: 3
   [junit4]   2> 348537 DEBUG (ScheduledTrigger-1687-thread-1) [     ] o.a.s.c.a.NodeLostTrigger NodeLostTrigger firing registered processor for lost nodes: [127.0.0.1:10005_solr]
   [junit4]   2> 348537 DEBUG (ScheduledTrigger-1687-thread-1) [     ] o.a.s.c.a.ScheduledTriggers ++++++++ Cooldown inactive - processing event: {
   [junit4]   2>   "id":"e1bab41bba8a5Tb6stopt3rc1aeh3ftgvf0fkyb",
   [junit4]   2>   "source":"node_lost_trigger",
   [junit4]   2>   "eventTime":3971072030124197,
   [junit4]   2>   "eventType":"NODELOST",
   [junit4]   2>   "properties":{
   [junit4]   2>     "eventTimes":[3971072030124197],
   [junit4]   2>     "preferredOperation":"movereplica",
   [junit4]   2>     "nodeNames":["127.0.0.1:10005_solr"]}}
   [junit4]   2> 348537 DEBUG (ScheduledTrigger-1687-thread-1) [     ] o.a.s.c.a.ScheduledTriggers Pausing all triggers: [.auto_add_replicas, .scheduled_maintenance, node_lost_trigger]
   [junit4]   2> 348538 DEBUG (ScheduledTrigger-1687-thread-1) [     ] o.a.s.c.a.s.SimClusterStateProvider ** creating new collection states, currentVersion=12
   [junit4]   2> 348538 DEBUG (ScheduledTrigger-1687-thread-1) [     ] o.a.s.c.a.s.SimClusterStateProvider ** saved cluster state version 12
   [junit4]   2> 348538 DEBUG (ScheduledTrigger-1687-thread-1) [     ] o.a.s.c.a.SystemLogListener Collection .system missing, skip sending event {
   [junit4]   2>   "id":"e1bab41bba8a5Tb6stopt3rc1aeh3ftgvf0fkyb",
   [junit4]   2>   "source":"node_lost_trigger",
   [junit4]   2>   "eventTime":3971072030124197,
   [junit4]   2>   "eventType":"NODELOST",
   [junit4]   2>   "properties":{
   [junit4]   2>     "eventTimes":[3971072030124197],
   [junit4]   2>     "preferredOperation":"movereplica",
   [junit4]   2>     "_enqueue_time_":3971073101881397,
   [junit4]   2>     "nodeNames":["127.0.0.1:10005_solr"]}}
   [junit4]   2> 348540 DEBUG (AutoscalingActionExecutor-1688-thread-1) [     ] o.a.s.c.a.ScheduledTriggers -- processing actions for {
   [junit4]   2>   "id":"e1bab41bba8a5Tb6stopt3rc1aeh3ftgvf0fkyb",
   [junit4]   2>   "source":"node_lost_trigger",
   [junit4]   2>   "eventTime":3971072030124197,
   [junit4]   2>   "eventType":"NODELOST",
   [junit4]   2>   "properties":{
   [junit4]   2>     "eventTimes":[3971072030124197],
   [junit4]   2>     "preferredOperation":"movereplica",
   [junit4]   2>     "_enqueue_time_":3971073101881397,
   [junit4]   2>     "nodeNames":["127.0.0.1:10005_solr"]}}
   [junit4]   2> 348541 DEBUG (AutoscalingActionExecutor-1688-thread-1) [     ] o.a.s.c.a.ComputePlanAction -- processing event: {
   [junit4]   2>   "id":"e1bab41bba8a5Tb6stopt3rc1aeh3ftgvf0fkyb",
   [junit4]   2>   "source":"node_lost_trigger",
   [junit4]   2>   "eventTime":3971072030124197,
   [junit4]   2>   "eventType":"NODELOST",
   [junit4]   2>   "properties":{
   [junit4]   2>     "eventTimes":[3971072030124197],
   [junit4]   2>     "preferredOperation":"movereplica",
   [junit4]   2>     "_enqueue_time_":3971073101881397,
   [junit4]   2>     "nodeNames":["127.0.0.1:10005_solr"]}} with context properties: {BEFORE_ACTION=[compute_plan]}
   [junit4]   2> 348541 DEBUG (AutoscalingActionExecutor-1688-thread-1) [     ] o.a.s.c.s.c.a.PolicyHelper Creating a new session
   [junit4]   2> 348543 DEBUG (AutoscalingActionExecutor-1688-thread-1) [     ] o.a.s.c.s.c.a.PolicyHelper New session created
   [junit4]   2> 348554 DEBUG (AutoscalingActionExecutor-1688-thread-1) [     ] o.a.s.c.a.ComputePlanAction Computed Plan: action=MOVEREPLICA&collection=testNodeWithMultipleReplicasLost&targetNode=127.0.0.1:10003_solr&inPlaceMove=true&replica=core_node5
   [junit4]   2> 348555 DEBUG (AutoscalingActionExecutor-1688-thread-1) [     ] o.a.s.c.a.ComputePlanAction Computed Plan: action=MOVEREPLICA&collection=testNodeWithMultipleReplicasLost&targetNode=127.0.0.1:10004_solr&inPlaceMove=true&replica=core_node3
   [junit4]   2> 348556 DEBUG (AutoscalingActionExecutor-1688-thread-1) [     ] o.a.s.c.s.c.a.PolicyHelper returnSession, curr-time 3971074009 sessionWrapper.createTime 3971073385247647, this.sessionWrapper.createTime 3971073385247647
   [junit4]   2> 348556 DEBUG (AutoscalingActionExecutor-1688-thread-1) [     ] o.a.s.c.s.c.a.PolicyHelper session set to NULL
   [junit4]   2> 348556 DEBUG (AutoscalingActionExecutor-1688-thread-1) [     ] o.a.s.c.a.SystemLogListener Collection .system missing, skip sending event {
   [junit4]   2>   "id":"e1bab41bba8a5Tb6stopt3rc1aeh3ftgvf0fkyb",
   [junit4]   2>   "source":"node_lost_trigger",
   [junit4]   2>   "eventTime":3971072030124197,
   [junit4]   2>   "eventType":"NODELOST",
   [junit4]   2>   "properties":{
   [junit4]   2>     "eventTimes":[3971072030124197],
   [junit4]   2>     "preferredOperation":"movereplica",
   [junit4]   2>     "_enqueue_time_":3971073101881397,
   [junit4]   2>     "nodeNames":["127.0.0.1:10005_solr"]}}
   [junit4]   2> 348557 INFO  (TEST-TestSimComputePlanAction.testNodeWithMultipleReplicasLost-seed#[67E6B1C02ED91327]) [     ] o.a.s.c.a.s.TestSimComputePlanAction action=MOVEREPLICA&collection=testNodeWithMultipleReplicasLost&targetNode=127.0.0.1:10003_solr&inPlaceMove=true&replica=core_node5
   [junit4]   2> 348557 INFO  (TEST-TestSimComputePlanAction.testNodeWithMultipleReplicasLost-seed#[67E6B1C02ED91327]) [     ] o.a.s.c.a.s.TestSimComputePlanAction action=MOVEREPLICA&collection=testNodeWithMultipleReplicasLost&targetNode=127.0.0.1:10004_solr&inPlaceMove=true&replica=core_node3
   [junit4]   2> 348557 INFO  (TEST-TestSimComputePlanAction.testNodeWithMultipleReplicasLost-seed#[67E6B1C02ED91327]) [     ] o.a.s.c.a.s.TestSimComputePlanAction -------------_ FINAL STATE --------------
   [junit4]   2> 348557 INFO  (TEST-TestSimComputePlanAction.testNodeWithMultipleReplicasLost-seed#[67E6B1C02ED91327]) [     ] o.a.s.c.a.s.TestSimComputePlanAction * Node values: {
   [junit4]   2>   "127.0.0.1:10004_solr":{
   [junit4]   2>     "sysprop.java.vendor":"Oracle Corporation",
   [junit4]   2>     "cores":1,
   [junit4]   2>     "host":"127.0.0.1",
   [junit4]   2>     "freedisk":1023.9999904632568,
   [junit4]   2>     "sysprop.java.version":"1.8.0_191",
   [junit4]   2>     "ip_1":"127",
   [junit4]   2>     "ip_3":"0",
   [junit4]   2>     "ip_2":"0",
   [junit4]   2>     "ip_4":"1",
   [junit4]   2>     "node":"127.0.0.1:10004_solr",
   [junit4]   2>     "metrics:solr.jvm:buffers.direct.Count":0,
   [junit4]   2>     "port":10004,
   [junit4]   2>     "heapUsage":123450000,
   [junit4]   2>     "sysLoadAvg":1.0,
   [junit4]   2>     "metrics:solr.node:ADMIN./admin/authorization.clientErrors:count":0,
   [junit4]   2>     "totaldisk":10240},
   [junit4]   2>   "127.0.0.1:10005_solr":{
   [junit4]   2>     "sysprop.java.vendor":"Oracle Corporation",
   [junit4]   2>     "cores":2,
   [junit4]   2>     "host":"127.0.0.1",
   [junit4]   2>     "freedisk":1023.9999809265137,
   [junit4]   2>     "sysprop.java.version":"1.8.0_191",
   [junit4]   2>     "ip_1":"127",
   [junit4]   2>     "ip_3":"0",
   [junit4]   2>     "ip_2":"0",
   [junit4]   2>     "ip_4":"1",
   [junit4]   2>     "node":"127.0.0.1:10005_solr",
   [junit4]   2>     "metrics:solr.jvm:buffers.direct.Count":0,
   [junit4]   2>     "port":10005,
   [junit4]   2>     "heapUsage":123450000,
   [junit4]   2>     "sysLoadAvg":1.0,
   [junit4]   2>     "metrics:solr.node:ADMIN./admin/authorization.clientErrors:count":0,
   [junit4]   2>     "totaldisk":10240},
   [junit4]   2>   "127.0.0.1:10002_solr":{
   [junit4]   2>     "sysprop.java.vendor":"Oracle Corporation",
   [junit4]   2>     "cores":2,
   [junit4]   2>     "host":"127.0.0.1",
   [junit4]   2>     "freedisk":1023.9999809265137,
   [junit4]   2>     "sysprop.java.version":"1.8.0_191",
   [junit4]   2>     "ip_1":"127",
   [junit4]   2>     "ip_3":"0",
   [junit4]   2>     "ip_2":"0",
   [junit4]   2>     "ip_4":"1",
   [junit4]   2>     "node":"127.0.0.1:10002_solr",
   [junit4]   2>     "metrics:solr.jvm:buffers.direct.Count":0,
   [junit4]   2>     "port":10002,
   [junit4]   2>     "heapUsage":123450000,
   [junit4]   2>     "sysLoadAvg":1.0,
   [junit4]   2>     "metrics:solr.node:ADMIN./admin/authorization.clientErrors:count":0,
   [junit4]   2>     "totaldisk":10240},
   [junit4]   2>   "127.0.0.1:10003_solr":{
   [junit4]   2>     "sysprop.java.vendor":"Oracle Corporation",
   [junit4]   2>     "cores":1,
   [junit4]   2>     "host":"127.0.0.1",
   [junit4]   2>     "freedisk":1023.9999904632568,
   [junit4]   2>     "sysprop.java.version":"1.8.0_191",
   [junit4]   2>     "ip_1":"127",
   [junit4]   2>     "ip_3":"0",
   [junit4]   2>     "ip_2":"0",
   [junit4]   2>     "ip_4":"1",
   [junit4]   2>     "node":"127.0.0.1:10003_solr",
   [junit4]   2>     "metrics:solr.jvm:buffers.direct.Count":0,
   [junit4]   2>     "port":10003,
   [junit4]   2>     "heapUsage":123450000,
   [junit4]   2>     "sysLoadAvg":1.0,
   [junit4]   2>     "metrics:solr.node:ADMIN./admin/authorization.clientErrors:count":0,
   [junit4]   2>     "totaldisk":10240}}
   [junit4]   2> 348557 INFO  (TEST-TestSimComputePlanAction.testNodeWithMultipleReplicasLost-seed#[67E6B1C02ED91327]) [     ] o.a.s.c.a.s.TestSimComputePlanAction * Live nodes: [127.0.0.1:10004_solr, 127.0.0.1:10002_solr, 127.0.0.1:10003_solr]
   [junit4]   2> 348557 INFO  (TEST-TestSimComputePlanAction.testNodeWithMultipleReplicasLost-seed#[67E6B1C02ED91327]) [     ] o.a.s.c.a.s.TestSimComputePlanAction * Collection testNodeWithMultipleReplicasLost state: DocCollection(testNodeWithMultipleReplicasLost//clusterstate.json/12)={
   [junit4]   2>   "replicationFactor":"1",
   [junit4]   2>   "pullReplicas":"0",
   [junit4]   2>   "router":{"name":"compositeId"},
   [junit4]   2>   "maxShardsPerNode":"2",
   [junit4]   2>   "autoAddReplicas":"false",
   [junit4]   2>   "nrtReplicas":"3",
   [junit4]   2>   "tlogReplicas":"0",
   [junit4]   2>   "autoCreated":"true",
   [junit4]   2>   "shards":{
   [junit4]   2>     "shard2":{
   [junit4]   2>       "replicas":{
   [junit4]   2>         "core_node6":{
   [junit4]   2>           "core":"testNodeWithMultipleReplicasLost_shard2_replica_n6",
   [junit4]   2>           "SEARCHER.searcher.maxDoc":0,
   [junit4]   2>           "SEARCHER.searcher.deletedDocs":0,
   [junit4]   2>           "INDEX.sizeInBytes":10240,
   [junit4]   2>           "node_name":"127.0.0.1:10002_solr",
   [junit4]   2>           "state":"active",
   [junit4]   2>           "type":"NRT",
   [junit4]   2>           "INDEX.sizeInGB":9.5367431640625E-6,
   [junit4]   2>           "SEARCHER.searcher.numDocs":0},
   [junit4]   2>         "core_node4":{
   [junit4]   2>           "core":"testNodeWithMultipleReplicasLost_shard2_replica_n4",
   [junit4]   2>           "leader":"true",
   [junit4]   2>           "SEARCHER.searcher.maxDoc":0,
   [junit4]   2>           "SEARCHER.searcher.deletedDocs":0,
   [junit4]   2>           "INDEX.sizeInBytes":10240,
   [junit4]   2>           "node_name":"127.0.0.1:10004_solr",
   [junit4]   2>           "state":"active",
   [junit4]   2>           "type":"NRT",
   [junit4]   2>           "INDEX.sizeInGB":9.5367431640625E-6,
   [junit4]   2>           "SEARCHER.searcher.numDocs":0},
   [junit4]   2>         "core_node5":{
   [junit4]   2>           "core":"testNodeWithMultipleReplicasLost_shard2_replica_n5",
   [junit4]   2>           "SEARCHER.searcher.maxDoc":0,
   [junit4]   2>           "SEARCHER.searcher.deletedDocs":0,
   [junit4]   2>           "INDEX.sizeInBytes":10240,
   [junit4]   2>           "node_name":"127.0.0.1:10005_solr",
   [junit4]   2>           "state":"down",
   [junit4]   2>           "type":"NRT",
   [junit4]   2>           "INDEX.sizeInGB":9.5367431640625E-6,
   [junit4]   2>           "SEARCHER.searcher.numDocs":0}},
   [junit4]   2>       "range":"0-7fffffff",
   [junit4]   2>       "state":"active"},
   [junit4]   2>     "shard1":{
   [junit4]   2>       "replicas":{
   [junit4]   2>         "core_node1":{
   [junit4]   2>           "core":"testNodeWithMultipleReplicasLost_shard1_replica_n1",
   [junit4]   2>           "leader":"true",
   [junit4]   2>           "SEARCHER.searcher.maxDoc":0,
   [junit4]   2>           "SEARCHER.searcher.deletedDocs":0,
   [junit4]   2>           "INDEX.sizeInBytes":10240,
   [junit4]   2>           "node_name":"127.0.0.1:10003_solr",
   [junit4]   2>           "state":"active",
   [junit4]   2>           "type":"NRT",
   [junit4]   2>           "INDEX.sizeInGB":9.5367431640625E-6,
   [junit4]   2>           "SEARCHER.searcher.numDocs":0},
   [junit4]   2>         "core_node2":{
   [junit4]   2>           "core":"testNodeWithMultipleReplicasLost_shard1_replica_n2",
   [junit4]   2>           "SEARCHER.searcher.maxDoc":0,
   [junit4]   2>           "SEARCHER.searcher.deletedDocs":0,
   [junit4]   2>           "INDEX.sizeInBytes":10240,
   [junit4]   2>           "node_name":"127.0.0.1:10002_solr",
   [junit4]   2>           "state":"active",
   [junit4]   2>           "type":"NRT",
   [junit4]   2>           "INDEX.sizeInGB":9.5367431640625E-6,
   [junit4]   2>           "SEARCHER.searcher.numDocs":0},
   [junit4]   2>         "core_node3":{
   [junit4]   2>           "core":"testNodeWithMultipleReplicasLost_shard1_replica_n3",
   [junit4]   2>           "SEARCHER.searcher.maxDoc":0,
   [junit4]   2>           "SEARCHER.searcher.deletedDocs":0,
   [junit4]   2>           "INDEX.sizeInBytes":10240,
   [junit4]   2>           "node_name":"127.0.0.1:10005_solr",
   [junit4]   2>           "state":"down",
   [junit4]   2>           "type":"NRT",
   [junit4]   2>           "INDEX.sizeInGB":9.5367431640625E-6,
   [junit4]   2>           "SEARCHER.searcher.numDocs":0}},
   [junit4]   2>       "range":"80000000-ffffffff",
   [junit4]   2>       "state":"active"}}}
   [junit4]   2> 348558 DEBUG (AutoscalingActionExecutor-1688-thread-1) [     ] o.a.s.c.a.SystemLogListener Collection .system missing, skip sending event {
   [junit4]   2>   "id":"e1bab41bba8a5Tb6stopt3rc1aeh3ftgvf0fkyb",
   [junit4]   2>   "source":"node_lost_trigger",
   [junit4]   2>   "eventTime":3971072030124197,
   [junit4]   2>   "eventType":"NODELOST",
   [junit4]   2>   "properties":{
   [junit4]   2>     "eventTimes":[3971072030124197],
   [junit4]   2>     "preferredOperation":"movereplica",
   [junit4]   2>     "_enqueue_time_":3971073101881397,
   [junit4]   2>     "nodeNames":["127.0.0.1:10005_solr"]}}
   [junit4]   2> 348558 DEBUG (AutoscalingActionExecutor-1688-thread-1) [     ] o.a.s.c.a.SystemLogListener Collection .system missing, skip sending event {
   [junit4]   2>   "id":"e1bab41bba8a5Tb6stopt3rc1aeh3ftgvf0fkyb",
   [junit4]   2>   "source":"node_lost_trigger",
   [junit4]   2>   "eventTime":3971072030124197,
   [junit4]   2>   "eventType":"NODELOST",
   [junit4]   2>   "properties":{
   [junit4]   2>     "eventTimes":[3971072030124197],
   [junit4]   2>     "preferredOperation":"movereplica",
   [junit4]   2>     "_enqueue_time_":3971073101881397,
   [junit4]   2>     "nodeNames":["127.0.0.1:10005_solr"]}}
   [junit4]   2> 348559 INFO  (Simulated OverseerAutoScalingTriggerThread) [     ] o.a.s.c.a.OverseerTriggerThread OverseerTriggerThread woken up but we are closed, exiting.
   [junit4]   2> 348559 DEBUG (TEST-TestSimComputePlanAction.testNodeWithMultipleReplicasLost-seed#[67E6B1C02ED91327]) [     ] o.a.s.c.a.ScheduledTriggers Shutting down scheduled thread pool executor now
   [junit4]   2> 348560 DEBUG (TEST-TestSimComputePlanAction.testNodeWithMultipleReplicasLost-seed#[67E6B1C02ED91327]) [     ] o.a.s.c.a.ScheduledTriggers Shutting down action executor now
   [junit4]   2> 348560 DEBUG (TEST-TestSimComputePlanAction.testNodeWithMultipleReplicasLost-seed#[67E6B1C02ED91327]) [     ] o.a.s.c.a.ScheduledTriggers Awaiting termination for action executor
   [junit4]   2> 348560 DEBUG (AutoscalingActionExecutor-1688-thread-1) [     ] o.a.s.c.a.ScheduledTriggers -- processing took 999 ms for event id=e1bab41bba8a5Tb6stopt3rc1aeh3ftgvf0fkyb
   [junit4]   2> 348560 DEBUG (TEST-TestSimComputePlanAction.testNodeWithMultipleReplicasLost-seed#[67E6B1C02ED91327]) [     ] o.a.s.c.a.ScheduledTriggers Awaiting termination for scheduled thread pool executor
   [junit4]   2> 348560 DEBUG (TEST-TestSimComputePlanAction.testNodeWithMultipleReplicasLost-seed#[67E6B1C02ED91327]) [     ] o.a.s.c.a.ScheduledTriggers ScheduledTriggers closed completely
   [junit4]   2> 348560 DEBUG (TEST-TestSimComputePlanAction.testNodeWithMultipleReplicasLost-seed#[67E6B1C02ED91327]) [     ] o.a.s.c.a.OverseerTriggerThread OverseerTriggerThread has been closed explicitly
   [junit4]   2> 348561 INFO  (TEST-TestSimComputePlanAction.testNodeWithMultipleReplicasLost-seed#[67E6B1C02ED91327]) [     ] o.a.s.SolrTestCaseJ4 ###Ending testNodeWithMultipleReplicasLost
   [junit4]   2> 348564 INFO  (TEST-TestSimComputePlanAction.testNodeAdded-seed#[67E6B1C02ED91327]) [     ] o.a.s.SolrTestCaseJ4 ###Starting testNodeAdded
   [junit4]   2> 348573 DEBUG (TEST-TestSimComputePlanAction.testNodeAdded-seed#[67E6B1C02ED91327]) [     ] o.a.s.c.a.s.SimClusterStateProvider --- new Overseer leader: 127.0.0.1:10006_solr
   [junit4]   2> 348574 DEBUG (Simulated OverseerAutoScalingTriggerThread) [     ] o.a.s.c.a.OverseerTriggerThread Adding .auto_add_replicas and .scheduled_maintenance triggers
   [junit4]   2> 348576 DEBUG (TEST-TestSimComputePlanAction.testNodeAdded-seed#[67E6B1C02ED91327]) [     ] o.a.s.c.a.s.SimClusterStateProvider ** creating new collection states, currentVersion=0
   [junit4]   2> 348576 DEBUG (TEST-TestSimComputePlanAction.testNodeAdded-seed#[67E6B1C02ED91327]) [     ] o.a.s.c.a.s.SimClusterStateProvider ** saved cluster state version 0
   [junit4]   2> 348576 INFO  (TEST-TestSimComputePlanAction.testNodeAdded-seed#[67E6B1C02ED91327]) [     ] o.a.s.h.a.MetricsHistoryHandler No .system collection, keeping metrics history in memory.
   [junit4]   2> 348578 DEBUG (simCloudManagerPool-1692-thread-1) [     ] o.a.s.c.a.AutoScalingHandler Verified autoscaling configuration
   [junit4]   2> 348578 DEBUG (Simulated OverseerAutoScalingTriggerThread) [     ] o.a.s.c.a.OverseerTriggerThread Refreshing /autoscaling.json with znode version 1
   [junit4]   2> 348578 DEBUG (Simulated OverseerAutoScalingTriggerThread) [     ] o.a.s.c.a.OverseerTriggerThread Current znodeVersion 1, lastZnodeVersion 0
   [junit4]   2> 348578 DEBUG (Simulated OverseerAutoScalingTriggerThread) [     ] o.a.s.c.a.OverseerTriggerThread Processed trigger updates upto znodeVersion 1
   [junit4]   2> 348579 DEBUG (Simulated OverseerAutoScalingTriggerThread) [     ] o.a.s.c.a.NodeLostTrigger NodeLostTrigger .auto_add_replicas - Initial livenodes: [127.0.0.1:10006_solr]
   [junit4]   2> 348580 DEBUG (simCloudManagerPool-1692-thread-2) [     ] o.a.s.c.a.AutoScalingHandler Verified autoscaling configuration
   [junit4]   2> 348581 DEBUG (Simulated OverseerAutoScalingTriggerThread) [     ] o.a.s.c.a.OverseerTriggerThread -- cleaning old nodeLost / nodeAdded markers
   [junit4]   2> 348581 DEBUG (Simulated OverseerAutoScalingTriggerThread) [     ] o.a.s.c.a.OverseerTriggerThread Current znodeVersion 1, lastZnodeVersion 1
   [junit4]   2> 348581 DEBUG (ScheduledTrigger-1693-thread-2) [     ] o.a.s.c.a.NodeLostTrigger Running NodeLostTrigger: .auto_add_replicas with currently live nodes: 1 and last live nodes: 1
   [junit4]   2> 348602 DEBUG (ScheduledTrigger-1693-thread-1) [     ] o.a.s.c.a.NodeLostTrigger Running NodeLostTrigger: .auto_add_replicas with currently live nodes: 1 and last live nodes: 1
   [junit4]   2> 348622 DEBUG (ScheduledTrigger-1693-thread-4) [     ] o.a.s.c.a.NodeLostTrigger Running NodeLostTrigger: .auto_add_replicas with currently live nodes: 1 and last live nodes: 1
   [junit4]   2> 348642 DEBUG (ScheduledTrigger-1693-thread-3) [     ] o.a.s.c.a.NodeLostTrigger Running NodeLostTrigger: .auto_add_replicas with currently live nodes: 1 and last live nodes: 1
   [junit4]   2> 348663 DEBUG (ScheduledTrigger-1693-thread-4) [     ] o.a.s.c.a.NodeLostTrigger Running NodeLostTrigger: .auto_add_replicas with currently live nodes: 1 and last live nodes: 1
   [junit4]   2> 348683 DEBUG (ScheduledTrigger-1693-thread-3) [     ] o.a.s.c.a.NodeLostTrigger Running NodeLostTrigger: .auto_add_replicas with currently live nodes: 1 and last live nodes: 1
   [junit4]   2> 348703 DEBUG (ScheduledTrigger-1693-thread-4) [     ] o.a.s.c.a.NodeLostTrigger Running NodeLostTrigger: .auto_add_replicas with currently live nodes: 1 and last live nodes: 1
   [junit4]   2> 348723 DEBUG (ScheduledTrigger-1693-thread-3) [     ] o.a.s.c.a.NodeLostTrigger Running NodeLostTrigger: .auto_add_replicas with currently live nodes: 1 and last live nodes: 1
   [junit4]   2> 348744 DEBUG (ScheduledTrigger-1693-thread-4) [     ] o.a.s.c.a.NodeLostTrigger Running NodeLostTrigger: .auto_add_replicas with currently live nodes: 1 and last live nodes: 1
   [junit4]   2> 348764 DEBUG (ScheduledTrigger-1693-thread-3) [     ] o.a.s.c.a.NodeLostTrigger Running NodeLostTrigger: .auto_add_replicas with currently live nodes: 1 and last live nodes: 1
   [junit4]   2> 348784 DEBUG (ScheduledTrigger-1693-thread-4) [     ] o.a.s.c.a.NodeLostTrigger Running NodeLostTrigger: .auto_add_replicas with currently live nodes: 1 and last live nodes: 1
   [junit4]   2> 348804 DEBUG (ScheduledTrigger-1693-thread-3) [     ] o.a.s.c.a.NodeLostTrigger Running NodeLostTrigger: .auto_add_replicas with currently live nodes: 1 and last live nodes: 1
   [junit4]   2> 348824 DEBUG (ScheduledTrigger-1693-thread-4) [     ] o.a.s.c.a.NodeLostTrigger Running NodeLostTrigger: .auto_add_replicas with currently live nodes: 1 and last live nodes: 1
   [junit4]   2> 348845 DEBUG (ScheduledTrigger-1693-thread-3) [     ] o.a.s.c.a.NodeLostTrigger Running NodeLostTrigger: .auto_add_replicas with currently live nodes: 1 and last live nodes: 1
   [junit4]   2> 348865 DEBUG (ScheduledTrigger-1693-thread-4) [     ] o.a.s.c.a.NodeLostTrigger Running NodeLostTrigger: .auto_add_replicas with currently live nodes: 1 and last live nodes: 1
   [junit4]   2> 348885 DEBUG (ScheduledTrigger-1693-thread-3) [     ] o.a.s.c.a.NodeLostTrigger Running NodeLostTrigger: .auto_add_replicas with currently live nodes: 1 and last live nodes: 1
   [junit4]   2> 348905 DEBUG (ScheduledTrigger-1693-thread-4) [     ] o.a.s.c.a.NodeLostTrigger Running NodeLostTrigger: .auto_add_replicas with currently live nodes: 1 and last live nodes: 1
   [junit4]   2> 348926 DEBUG (ScheduledTrigger-1693-thread-1) [     ] o.a.s.c.a.NodeLostTrigger Running NodeLostTrigger: .auto_add_replicas with currently live nodes: 1 and last live nodes: 1
   [junit4]   2> 348946 DEBUG (ScheduledTrigger-1693-thread-1) [     ] o.a.s.c.a.NodeLostTrigger Running NodeLostTrigger: .auto_add_replicas with currently live nodes: 1 and last live nodes: 1
   [junit4]   2> 348966 DEBUG (ScheduledTrigger-1693-thread-2) [     ] o.a.s.c.a.NodeLostTrigger Running NodeLostTrigger: .auto_add_replicas with currently live nodes: 1 and last live nodes: 1
   [junit4]   2> 348986 DEBUG (ScheduledTrigger-1693-thread-1) [     ] o.a.s.c.a.NodeLostTrigger Running NodeLostTrigger: .auto_add_replicas with currently live nodes: 1 and last live nodes: 1
   [junit4]   2> 349007 DEBUG (ScheduledTrigger-1693-thread-2) [     ] o.a.s.c.a.NodeLostTrigger Running NodeLostTrigger: .auto_add_replicas with currently live nodes: 1 and last live nodes: 1
   [junit4]   2> 349027 DEBUG (ScheduledTrigger-1693-thread-1) [     ] o.a.s.c.a.NodeLostTrigger Running NodeLostTrigger: .auto_add_replicas with currently live nodes: 1 and last live nodes: 1
   [junit4]   2> 349047 DEBUG (ScheduledTrigger-1693-thread-2) [     ] o.a.s.c.a.NodeLostTrigger Running NodeLostTrigger: .auto_add_replicas with currently live nodes: 1 and last live nodes: 1
   [junit4]   2> 349067 DEBUG (ScheduledTrigger-1693-thread-1) [     ] o.a.s.c.a.NodeLostTrigger Running NodeLostTrigger: .auto_add_replicas with currently live nodes: 1 and last live nodes: 1
   [junit4]   2> 349087 DEBUG (ScheduledTrigger-1693-thread-4) [     ] o.a.s.c.a.NodeLostTrigger Running NodeLostTrigger: .auto_add_replicas with currently live nodes: 1 and last live nodes: 1
   [junit4]   2> 349108 DEBUG (ScheduledTrigger-1693-thread-1) [     ] o.a.s.c.a.NodeLostTrigger Running NodeLostTrigger: .auto_add_replicas with currently live nodes: 1 and last live nodes: 1
   [junit4]   2> 349128 DEBUG (ScheduledTrigger-1693-thread-4) [     ] o.a.s.c.a.NodeLostTrigger Running NodeLostTrigger: .auto_add_replicas with currently live nodes: 1 and last live nodes: 1
   [junit4]   2> 349148 DEBUG (ScheduledTrigger-1693-thread-1) [     ] o.a.s.c.a.NodeLostTrigger Running NodeLostTrigger: .auto_add_replicas with currently live nodes: 1 and last live nodes: 1
   [junit4]   2> 349168 DEBUG (ScheduledTrigger-1693-thread-4) [     ] o.a.s.c.a.NodeLostTrigger Running NodeLostTrigger: .auto_add_replicas with currently live nodes: 1 and last live nodes: 1
   [junit4]   2> 349182 INFO  (TEST-TestSimComputePlanAction.testNodeAdded-seed#[67E6B1C02ED91327]) [     ] o.a.s.c.a.s.TestSimComputePlanAction -------------_ FINAL STATE --------------
   [junit4]   2> 349182 INFO  (TEST-TestSimComputePlanAction.testNodeAdded-seed#[67E6B1C02ED91327]) [     ] o.a.s.c.a.s.TestSimComputePlanAction * Node values: {"127.0.0.1:10006_solr":{
   [junit4]   2>     "sysprop.java.vendor":"Oracle Corporation",
   [junit4]   2>     "cores":0,
   [junit4]   2>     "host":"127.0.0.1",
   [junit4]   2>     "freedisk":1024,
   [junit4]   2>     "sysprop.java.version":"1.8.0_191",
   [junit4]   2>     "ip_1":"127",
   [junit4]   2>     "ip_3":"0",
   [junit4]   2>     "ip_2":"0",
   [junit4]   2>     "ip_4":"1",
   [junit4]   2>     "node":"127.0.0.1:10006_solr",
   [junit4]   2>     "metrics:solr.jvm:buffers.direct.Count":0,
   [junit4]   2>     "port":10006,
   [junit4]   2>     "heapUsage":123450000,
   [junit4]   2>     "sysLoadAvg":1.0,
   [junit4]   2>     "metrics:solr.node:ADMIN./admin/authorization.clientErrors:count":0,
   [junit4]   2>     "totaldisk":10240}}
   [junit4]   2> 349182 INFO  (TEST-TestSimComputePlanAction.testNodeAdded-seed#[67E6B1C02ED91327]) [     ] o.a.s.c.a.s.TestSimComputePlanAction * Live nodes: [127.0.0.1:10006_solr]
   [junit4]   2> 349183 WARN  (Simulated OverseerAutoScalingTriggerThread) [     ] o.a.s.c.a.OverseerTriggerThread Interrupted
   [junit4]   2>           => java.lang.InterruptedException
   [junit4]   2> at java.util.concurrent.locks.AbstractQueuedSynchronizer$ConditionObject.reportInterruptAfterWait(AbstractQueuedSynchronizer.java:2014)
   [junit4]   2> java.lang.InterruptedException: null
   [junit4]   2> at java.util.concurrent.locks.AbstractQueuedSynchronizer$ConditionObject.reportInterruptAfterWait(AbstractQueuedSynchronizer.java:2014) ~[?:1.8.0_191]
   [junit4]   2> at java.util.concurrent.locks.AbstractQueuedSynchronizer$ConditionObject.await(AbstractQueuedSynchronizer.java:2048) ~[?:1.8.0_191]
   [junit4]   2> at org.apache.solr.cloud.autoscaling.OverseerTriggerThread.run(OverseerTriggerThread.java:200) ~[java/:?]
   [junit4]   2> at java.lang.Thread.run(Thread.java:748) [?:1.8.0_191]
   [junit4]   2> 349184 DEBUG (TEST-TestSimComputePlanAction.testNodeAdded-seed#[67E6B1C02ED91327]) [     ] o.a.s.c.a.ScheduledTriggers Shutting down scheduled thread pool executor now
   [junit4]   2> 349184 DEBUG (TEST-TestSimComputePlanAction.testNodeAdded-seed#[67E6B1C02ED91327]) [     ] o.a.s.c.a.ScheduledTriggers Shutting down action executor now
   [junit4]   2> 349184 DEBUG (TEST-TestSimComputePlanAction.testNodeAdded-seed#[67E6B1C02ED91327]) [     ] o.a.s.c.a.ScheduledTriggers Awaiting termination for action executor
   [junit4]   2> 349184 DEBUG (TEST-TestSimComputePlanAction.testNodeAdded-seed#[67E6B1C02ED91327]) [     ] o.a.s.c.a.ScheduledTriggers Awaiting termination for scheduled thread pool executor
   [junit4]   2> 349184 DEBUG (TEST-TestSimComputePlanAction.testNodeAdded-seed#[67E6B1C02ED91327]) [     ] o.a.s.c.a.ScheduledTriggers ScheduledTriggers closed completely
   [junit4]   2> 349184 DEBUG (TEST-TestSimComputePlanAction.testNodeAdded-seed#[67E6B1C02ED91327]) [     ] o.a.s.c.a.OverseerTriggerThread OverseerTriggerThread has been closed explicitly
   [junit4]   2> 349185 INFO  (TEST-TestSimComputePlanAction.testNodeAdded-seed#[67E6B1C02ED91327]) [     ] o.a.s.SolrTestCaseJ4 ###Ending testNodeAdded
   [junit4]   2> NOTE: reproduce with: ant test  -Dtestcase=TestSimComputePlanAction -Dtests.method=testNodeAdded -Dtests.seed=67E6B1C02ED91327 -Dtests.multiplier=2 -Dtests.slow=true -Dtests.locale=vi -Dtests.timezone=Africa/Lagos -Dtests.asserts=true -Dtests.file.encoding=US-ASCII
   [junit4] ERROR   0.63s J2 | TestSimComputePlanAction.testNodeAdded <<<
   [junit4]    > Throwable #1: java.util.concurrent.TimeoutException: OverseerTriggerThread never caught up to the latest znodeVersion
   [junit4]    > at __randomizedtesting.SeedInfo.seed([67E6B1C02ED91327:225E7B78C7ABB24]:0)
   [junit4]    > at org.apache.solr.util.TimeOut.waitFor(TimeOut.java:66)
   [junit4]    > at org.apache.solr.cloud.autoscaling.sim.SimSolrCloudTestCase.assertAutoscalingUpdateComplete(SimSolrCloudTestCase.java:98)
   [junit4]    > at org.apache.solr.cloud.autoscaling.sim.TestSimComputePlanAction.init(TestSimComputePlanAction.java:103)
   [junit4]    > at java.lang.Thread.run(Thread.java:748)
   [junit4]   2> NOTE: leaving temporary files on disk at: /home/jenkins/jenkins-slave/workspace/Lucene-Solr-Tests-8.x/solr/build/solr-core/test/J2/temp/solr.cloud.autoscaling.sim.TestSimComputePlanAction_67E6B1C02ED91327-001
   [junit4]   2> NOTE: test params are: codec=Asserting(Lucene80), sim=Asserting(org.apache.lucene.search.similarities.AssertingSimilarity@3d7f1ca6), locale=vi, timezone=Africa/Lagos
   [junit4]   2> NOTE: Linux 4.15.0-54-generic amd64/Oracle Corporation 1.8.0_191 (64-bit)/cpus=4,threads=1,free=274088672,total=529006592
   [junit4]   2> NOTE: All tests run in this JVM: [TestLegacyFieldCache, TestHighFrequencyDictionaryFactory, UtilsToolTest, TestMergePolicyConfig, TestSolrCoreSnapshots, NodeAddedTriggerIntegrationTest, OpenExchangeRatesOrgProviderTest, TestHashQParserPlugin, TestSolrFieldCacheBean, BlockDirectoryTest, TestNestedUpdateProcessor, IgnoreLargeDocumentProcessorFactoryTest, TestCoreDiscovery, TestLogWatcher, SOLR749Test, ConvertedLegacyTest, TestFieldCache, TestSolrDeletionPolicy2, TestSearcherReuse, TestSolr4Spatial, AtomicUpdatesTest, TestLockTree, CdcrUpdateLogTest, TestTlogReplica, SignificantTermsQParserPluginTest, CoreSorterTest, TestConfigSetProperties, DocValuesNotIndexedTest, TestInitParams, TestConfig, TestCloudJSONFacetJoinDomain, ZkShardTermsTest, TestSimpleTextCodec, TestReplicaProperties, EmbeddedSolrNoSerializeTest, HdfsWriteToMultipleCollectionsTest, V2StandaloneTest, NodeLostTriggerTest, UniqFieldsUpdateProcessorFactoryTest, HdfsRecoveryZkTest, TestFaceting, DocValuesMultiTest, CheckHdfsIndexTest, OverseerTaskQueueTest, TestFileDictionaryLookup, TestRandomCollapseQParserPlugin, ScheduledMaintenanceTriggerTest, ManagedSchemaRoundRobinCloudTest, TestNamedUpdateProcessors, TestStreamBody, ShowFileRequestHandlerTest, TestSimComputePlanAction]
   [junit4] Completed [145/875 (1!)] on J2 in 1.26s, 3 tests, 1 error, 1 skipped <<< FAILURES!

[...truncated 54641 lines...]
[asciidoctor:convert] asciidoctor: ERROR: about-this-guide.adoc: line 1: invalid part, must have at least one section (e.g., chapter, appendix, etc.)
[asciidoctor:convert] asciidoctor: ERROR: solr-glossary.adoc: line 1: invalid part, must have at least one section (e.g., chapter, appendix, etc.)
     [java] Processed 2594 links (2120 relative) to 3410 anchors in 259 files
     [echo] Validated Links & Anchors via: /home/jenkins/jenkins-slave/workspace/Lucene-Solr-Tests-8.x/solr/build/solr-ref-guide/bare-bones-html/

-documentation-lint:
    [jtidy] Checking for broken html (such as invalid tags)...
   [delete] Deleting directory /home/jenkins/jenkins-slave/workspace/Lucene-Solr-Tests-8.x/lucene/build/jtidy_tmp
     [echo] Checking for broken links...
     [exec]
     [exec] Crawl/parse...
     [exec]
     [exec] Verify...
     [echo] Checking for malformed docs...

jar-checksums:

resolve:

ivy-availability-check:
[loadresource] Do not set property disallowed.ivy.jars.list as its length is 0.

-ivy-fail-disallowed-ivy-version:

ivy-fail:

ivy-configure:
[ivy:configure] :: loading settings :: file = /home/jenkins/jenkins-slave/workspace/Lucene-Solr-Tests-8.x/lucene/top-level-ivy-settings.xml

resolve:

ivy-availability-check:
[loadresource] Do not set property disallowed.ivy.jars.list as its length is 0.

-ivy-fail-disallowed-ivy-version:

ivy-fail:

ivy-configure:
[ivy:configure] :: loading settings :: file = /home/jenkins/jenkins-slave/workspace/Lucene-Solr-Tests-8.x/lucene/top-level-ivy-settings.xml

resolve:

resolve:

ivy-availability-check:
[loadresource] Do not set property disallowed.ivy.jars.list as its length is 0.

-ivy-fail-disallowed-ivy-version:

ivy-fail:

ivy-configure:
[ivy:configure] :: loading settings :: file = /home/jenkins/jenkins-slave/workspace/Lucene-Solr-Tests-8.x/lucene/top-level-ivy-settings.xml

resolve:

ivy-availability-check:
[loadresource] Do not set property disallowed.ivy.jars.list as its length is 0.

-ivy-fail-disallowed-ivy-version:

ivy-fail:

ivy-configure:
[ivy:configure] :: loading settings :: file = /home/jenkins/jenkins-slave/workspace/Lucene-Solr-Tests-8.x/lucene/top-level-ivy-settings.xml

resolve:

ivy-availability-check:
[loadresource] Do not set property disallowed.ivy.jars.list as its length is 0.

-ivy-fail-disallowed-ivy-version:

ivy-fail:

ivy-configure:
[ivy:configure] :: loading settings :: file = /home/jenkins/jenkins-slave/workspace/Lucene-Solr-Tests-8.x/lucene/top-level-ivy-settings.xml

resolve:

ivy-availability-check:
[loadresource] Do not set property disallowed.ivy.jars.list as its length is 0.

-ivy-fail-disallowed-ivy-version:

ivy-fail:

ivy-configure:
[ivy:configure] :: loading settings :: file = /home/jenkins/jenkins-slave/workspace/Lucene-Solr-Tests-8.x/lucene/top-level-ivy-settings.xml

resolve:

ivy-availability-check:
[loadresource] Do not set property disallowed.ivy.jars.list as its length is 0.

-ivy-fail-disallowed-ivy-version:

ivy-fail:

ivy-configure:
[ivy:configure] :: loading settings :: file = /home/jenkins/jenkins-slave/workspace/Lucene-Solr-Tests-8.x/lucene/top-level-ivy-settings.xml

resolve:

ivy-availability-check:
[loadresource] Do not set property disallowed.ivy.jars.list as its length is 0.

-ivy-fail-disallowed-ivy-version:

ivy-fail:

ivy-configure:
[ivy:configure] :: loading settings :: file = /home/jenkins/jenkins-slave/workspace/Lucene-Solr-Tests-8.x/lucene/top-level-ivy-settings.xml

resolve:

ivy-availability-check:
[loadresource] Do not set property disallowed.ivy.jars.list as its length is 0.

-ivy-fail-disallowed-ivy-version:

ivy-fail:

ivy-configure:
[ivy:configure] :: loading settings :: file = /home/jenkins/jenkins-slave/workspace/Lucene-Solr-Tests-8.x/lucene/top-level-ivy-settings.xml

resolve:

ivy-availability-check:
[loadresource] Do not set property disallowed.ivy.jars.list as its length is 0.

-ivy-fail-disallowed-ivy-version:

ivy-fail:

ivy-configure:
[ivy:configure] :: loading settings :: file = /home/jenkins/jenkins-slave/workspace/Lucene-Solr-Tests-8.x/lucene/top-level-ivy-settings.xml

resolve:

ivy-availability-check:
[loadresource] Do not set property disallowed.ivy.jars.list as its length is 0.

-ivy-fail-disallowed-ivy-version:

ivy-fail:

ivy-configure:
[ivy:configure] :: loading settings :: file = /home/jenkins/jenkins-slave/workspace/Lucene-Solr-Tests-8.x/lucene/top-level-ivy-settings.xml

resolve:

ivy-availability-check:
[loadresource] Do not set property disallowed.ivy.jars.list as its length is 0.

-ivy-fail-disallowed-ivy-version:

ivy-fail:

ivy-configure:
[ivy:configure] :: loading settings :: file = /home/jenkins/jenkins-slave/workspace/Lucene-Solr-Tests-8.x/lucene/top-level-ivy-settings.xml

resolve:

ivy-availability-check:
[loadresource] Do not set property disallowed.ivy.jars.list as its length is 0.

-ivy-fail-disallowed-ivy-version:

ivy-fail:

ivy-configure:
[ivy:configure] :: loading settings :: file = /home/jenkins/jenkins-slave/workspace/Lucene-Solr-Tests-8.x/lucene/top-level-ivy-settings.xml

resolve:

ivy-availability-check:
[loadresource] Do not set property disallowed.ivy.jars.list as its length is 0.

-ivy-fail-disallowed-ivy-version:

ivy-fail:

ivy-configure:
[ivy:configure] :: loading settings :: file = /home/jenkins/jenkins-slave/workspace/Lucene-Solr-Tests-8.x/lucene/top-level-ivy-settings.xml

resolve:

ivy-availability-check:
[loadresource] Do not set property disallowed.ivy.jars.list as its length is 0.

-ivy-fail-disallowed-ivy-version:

ivy-fail:

ivy-configure:
[ivy:configure] :: loading settings :: file = /home/jenkins/jenkins-slave/workspace/Lucene-Solr-Tests-8.x/lucene/top-level-ivy-settings.xml

resolve:

ivy-availability-check:
[loadresource] Do not set property disallowed.ivy.jars.list as its length is 0.

-ivy-fail-disallowed-ivy-version:

ivy-fail:

ivy-configure:
[ivy:configure] :: loading settings :: file = /home/jenkins/jenkins-slave/workspace/Lucene-Solr-Tests-8.x/lucene/top-level-ivy-settings.xml

resolve:

ivy-availability-check:
[loadresource] Do not set property disallowed.ivy.jars.list as its length is 0.

-ivy-fail-disallowed-ivy-version:

ivy-fail:

ivy-configure:
[ivy:configure] :: loading settings :: file = /home/jenkins/jenkins-slave/workspace/Lucene-Solr-Tests-8.x/lucene/top-level-ivy-settings.xml

resolve:

ivy-availability-check:
[loadresource] Do not set property disallowed.ivy.jars.list as its length is 0.

-ivy-fail-disallowed-ivy-version:

ivy-fail:

ivy-configure:
[ivy:configure] :: loading settings :: file = /home/jenkins/jenkins-slave/workspace/Lucene-Solr-Tests-8.x/lucene/top-level-ivy-settings.xml

resolve:

ivy-availability-check:
[loadresource] Do not set property disallowed.ivy.jars.list as its length is 0.

-ivy-fail-disallowed-ivy-version:

ivy-fail:

ivy-configure:
[ivy:configure] :: loading settings :: file = /home/jenkins/jenkins-slave/workspace/Lucene-Solr-Tests-8.x/lucene/top-level-ivy-settings.xml

resolve:

ivy-availability-check:
[loadresource] Do not set property disallowed.ivy.jars.list as its length is 0.

-ivy-fail-disallowed-ivy-version:

ivy-fail:

ivy-configure:
[ivy:configure] :: loading settings :: file = /home/jenkins/jenkins-slave/workspace/Lucene-Solr-Tests-8.x/lucene/top-level-ivy-settings.xml

resolve:

ivy-availability-check:
[loadresource] Do not set property disallowed.ivy.jars.list as its length is 0.

-ivy-fail-disallowed-ivy-version:

ivy-fail:

ivy-configure:
[ivy:configure] :: loading settings :: file = /home/jenkins/jenkins-slave/workspace/Lucene-Solr-Tests-8.x/lucene/top-level-ivy-settings.xml

resolve:

ivy-availability-check:
[loadresource] Do not set property disallowed.ivy.jars.list as its length is 0.

-ivy-fail-disallowed-ivy-version:

ivy-fail:

ivy-configure:
[ivy:configure] :: loading settings :: file = /home/jenkins/jenkins-slave/workspace/Lucene-Solr-Tests-8.x/lucene/top-level-ivy-settings.xml

resolve:

ivy-availability-check:
[loadresource] Do not set property disallowed.ivy.jars.list as its length is 0.

-ivy-fail-disallowed-ivy-version:

ivy-fail:

ivy-configure:
[ivy:configure] :: loading settings :: file = /home/jenkins/jenkins-slave/workspace/Lucene-Solr-Tests-8.x/lucene/top-level-ivy-settings.xml

resolve:

ivy-availability-check:
[loadresource] Do not set property disallowed.ivy.jars.list as its length is 0.

-ivy-fail-disallowed-ivy-version:

ivy-fail:

ivy-configure:
[ivy:configure] :: loading settings :: file = /home/jenkins/jenkins-slave/workspace/Lucene-Solr-Tests-8.x/lucene/top-level-ivy-settings.xml

resolve:

ivy-availability-check:
[loadresource] Do not set property disallowed.ivy.jars.list as its length is 0.

-ivy-fail-disallowed-ivy-version:

ivy-fail:

ivy-configure:
[ivy:configure] :: loading settings :: file = /home/jenkins/jenkins-slave/workspace/Lucene-Solr-Tests-8.x/lucene/top-level-ivy-settings.xml

resolve:

ivy-availability-check:
[loadresource] Do not set property disallowed.ivy.jars.list as its length is 0.

-ivy-fail-disallowed-ivy-version:

ivy-fail:

ivy-configure:
[ivy:configure] :: loading settings :: file = /home/jenkins/jenkins-slave/workspace/Lucene-Solr-Tests-8.x/lucene/top-level-ivy-settings.xml

resolve:

ivy-availability-check:
[loadresource] Do not set property disallowed.ivy.jars.list as its length is 0.

-ivy-fail-disallowed-ivy-version:

ivy-fail:

ivy-configure:
[ivy:configure] :: loading settings :: file = /home/jenkins/jenkins-slave/workspace/Lucene-Solr-Tests-8.x/lucene/top-level-ivy-settings.xml

resolve:

ivy-availability-check:
[loadresource] Do not set property disallowed.ivy.jars.list as its length is 0.

-ivy-fail-disallowed-ivy-version:

ivy-fail:

ivy-configure:
[ivy:configure] :: loading settings :: file = /home/jenkins/jenkins-slave/workspace/Lucene-Solr-Tests-8.x/lucene/top-level-ivy-settings.xml

common.resolve:

resolve:

ivy-availability-check:
[loadresource] Do not set property disallowed.ivy.jars.list as its length is 0.

-ivy-fail-disallowed-ivy-version:

ivy-fail:

ivy-configure:
[ivy:configure] :: loading settings :: file = /home/jenkins/jenkins-slave/workspace/Lucene-Solr-Tests-8.x/lucene/top-level-ivy-settings.xml

resolve:

ivy-availability-check:
[loadresource] Do not set property disallowed.ivy.jars.list as its length is 0.

-ivy-fail-disallowed-ivy-version:

ivy-fail:

ivy-configure:
[ivy:configure] :: loading settings :: file = /home/jenkins/jenkins-slave/workspace/Lucene-Solr-Tests-8.x/lucene/top-level-ivy-settings.xml

resolve:

ivy-availability-check:
[loadresource] Do not set property disallowed.ivy.jars.list as its length is 0.

-ivy-fail-disallowed-ivy-version:

ivy-fail:

ivy-configure:
[ivy:configure] :: loading settings :: file = /home/jenkins/jenkins-slave/workspace/Lucene-Solr-Tests-8.x/lucene/top-level-ivy-settings.xml

resolve:

ivy-availability-check:
[loadresource] Do not set property disallowed.ivy.jars.list as its length is 0.

-ivy-fail-disallowed-ivy-version:

ivy-fail:

ivy-configure:
[ivy:configure] :: loading settings :: file = /home/jenkins/jenkins-slave/workspace/Lucene-Solr-Tests-8.x/lucene/top-level-ivy-settings.xml

resolve:

ivy-availability-check:
[loadresource] Do not set property disallowed.ivy.jars.list as its length is 0.

-ivy-fail-disallowed-ivy-version:

ivy-fail:

ivy-configure:
[ivy:configure] :: loading settings :: file = /home/jenkins/jenkins-slave/workspace/Lucene-Solr-Tests-8.x/lucene/top-level-ivy-settings.xml

resolve:

jar-checksums:
    [mkdir] Created dir: /home/jenkins/jenkins-slave/workspace/Lucene-Solr-Tests-8.x/lucene/null1431689981
     [copy] Copying 38 files to /home/jenkins/jenkins-slave/workspace/Lucene-Solr-Tests-8.x/lucene/null1431689981
   [delete] Deleting directory /home/jenkins/jenkins-slave/workspace/Lucene-Solr-Tests-8.x/lucene/null1431689981

resolve-example:

ivy-availability-check:
[loadresource] Do not set property disallowed.ivy.jars.list as its length is 0.

-ivy-fail-disallowed-ivy-version:

ivy-fail:

ivy-configure:
[ivy:configure] :: loading settings :: file = /home/jenkins/jenkins-slave/workspace/Lucene-Solr-Tests-8.x/lucene/top-level-ivy-settings.xml

resolve:

resolve-server:

ivy-availability-check:
[loadresource] Do not set property disallowed.ivy.jars.list as its length is 0.

-ivy-fail-disallowed-ivy-version:

ivy-fail:

ivy-fail:

ivy-configure:
[ivy:configure] :: loading settings :: file = /home/jenkins/jenkins-slave/workspace/Lucene-Solr-Tests-8.x/lucene/top-level-ivy-settings.xml

resolve:

resolve:

ivy-availability-check:
[loadresource] Do not set property disallowed.ivy.jars.list as its length is 0.

-ivy-fail-disallowed-ivy-version:

ivy-fail:

ivy-fail:

ivy-configure:
[ivy:configure] :: loading settings :: file = /home/jenkins/jenkins-slave/workspace/Lucene-Solr-Tests-8.x/lucene/top-level-ivy-settings.xml

resolve:

ivy-availability-check:
[loadresource] Do not set property disallowed.ivy.jars.list as its length is 0.

-ivy-fail-disallowed-ivy-version:

ivy-fail:

ivy-fail:

ivy-configure:
[ivy:configure] :: loading settings :: file = /home/jenkins/jenkins-slave/workspace/Lucene-Solr-Tests-8.x/lucene/top-level-ivy-settings.xml

resolve:

ivy-availability-check:
[loadresource] Do not set property disallowed.ivy.jars.list as its length is 0.

-ivy-fail-disallowed-ivy-version:

ivy-fail:

ivy-configure:
[ivy:configure] :: loading settings :: file = /home/jenkins/jenkins-slave/workspace/Lucene-Solr-Tests-8.x/lucene/top-level-ivy-settings.xml

resolve:

ivy-availability-check:
[loadresource] Do not set property disallowed.ivy.jars.list as its length is 0.

-ivy-fail-disallowed-ivy-version:

ivy-fail:

ivy-fail:

ivy-configure:
[ivy:configure] :: loading settings :: file = /home/jenkins/jenkins-slave/workspace/Lucene-Solr-Tests-8.x/lucene/top-level-ivy-settings.xml

resolve:

ivy-availability-check:
[loadresource] Do not set property disallowed.ivy.jars.list as its length is 0.

-ivy-fail-disallowed-ivy-version:

ivy-fail:

ivy-configure:
[ivy:configure] :: loading settings :: file = /home/jenkins/jenkins-slave/workspace/Lucene-Solr-Tests-8.x/lucene/top-level-ivy-settings.xml

resolve:

ivy-availability-check:
[loadresource] Do not set property disallowed.ivy.jars.list as its length is 0.

-ivy-fail-disallowed-ivy-version:

ivy-fail:

ivy-fail:

ivy-configure:
[ivy:configure] :: loading settings :: file = /home/jenkins/jenkins-slave/workspace/Lucene-Solr-Tests-8.x/lucene/top-level-ivy-settings.xml

resolve:

ivy-availability-check:
[loadresource] Do not set property disallowed.ivy.jars.list as its length is 0.

-ivy-fail-disallowed-ivy-version:

ivy-fail:

ivy-fail:

ivy-configure:
[ivy:configure] :: loading settings :: file = /home/jenkins/jenkins-slave/workspace/Lucene-Solr-Tests-8.x/lucene/top-level-ivy-settings.xml

resolve:

ivy-availability-check:
[loadresource] Do not set property disallowed.ivy.jars.list as its length is 0.

-ivy-fail-disallowed-ivy-version:

ivy-fail:

ivy-fail:

ivy-configure:
[ivy:configure] :: loading settings :: file = /home/jenkins/jenkins-slave/workspace/Lucene-Solr-Tests-8.x/lucene/top-level-ivy-settings.xml

resolve:

ivy-availability-check:
[loadresource] Do not set property disallowed.ivy.jars.list as its length is 0.

-ivy-fail-disallowed-ivy-version:

ivy-fail:

ivy-fail:

ivy-configure:
[ivy:configure] :: loading settings :: file = /home/jenkins/jenkins-slave/workspace/Lucene-Solr-Tests-8.x/lucene/top-level-ivy-settings.xml

resolve:

ivy-availability-check:
[loadresource] Do not set property disallowed.ivy.jars.list as its length is 0.

-ivy-fail-disallowed-ivy-version:

ivy-fail:

ivy-fail:

ivy-configure:
[ivy:configure] :: loading settings :: file = /home/jenkins/jenkins-slave/workspace/Lucene-Solr-Tests-8.x/lucene/top-level-ivy-settings.xml

resolve:

ivy-availability-check:
[loadresource] Do not set property disallowed.ivy.jars.list as its length is 0.

-ivy-fail-disallowed-ivy-version:

ivy-fail:

ivy-fail:

ivy-configure:
[ivy:configure] :: loading settings :: file = /home/jenkins/jenkins-slave/workspace/Lucene-Solr-Tests-8.x/lucene/top-level-ivy-settings.xml

resolve:

ivy-availability-check:
[loadresource] Do not set property disallowed.ivy.jars.list as its length is 0.

-ivy-fail-disallowed-ivy-version:

ivy-fail:

ivy-fail:

ivy-configure:
[ivy:configure] :: loading settings :: file = /home/jenkins/jenkins-slave/workspace/Lucene-Solr-Tests-8.x/lucene/top-level-ivy-settings.xml

resolve:

ivy-availability-check:
[loadresource] Do not set property disallowed.ivy.jars.list as its length is 0.

-ivy-fail-disallowed-ivy-version:

ivy-fail:

ivy-fail:

ivy-configure:
[ivy:configure] :: loading settings :: file = /home/jenkins/jenkins-slave/workspace/Lucene-Solr-Tests-8.x/lucene/top-level-ivy-settings.xml

resolve:

ivy-availability-check:
[loadresource] Do not set property disallowed.ivy.jars.list as its length is 0.

-ivy-fail-disallowed-ivy-version:

ivy-fail:

ivy-fail:

ivy-configure:
[ivy:configure] :: loading settings :: file = /home/jenkins/jenkins-slave/workspace/Lucene-Solr-Tests-8.x/lucene/top-level-ivy-settings.xml

resolve:

ivy-availability-check:
[loadresource] Do not set property disallowed.ivy.jars.list as its length is 0.

-ivy-fail-disallowed-ivy-version:

ivy-fail:

ivy-fail:

ivy-configure:
[ivy:configure] :: loading settings :: file = /home/jenkins/jenkins-slave/workspace/Lucene-Solr-Tests-8.x/lucene/top-level-ivy-settings.xml

resolve:

ivy-availability-check:
[loadresource] Do not set property disallowed.ivy.jars.list as its length is 0.

-ivy-fail-disallowed-ivy-version:

ivy-fail:

ivy-fail:

ivy-configure:
[ivy:configure] :: loading settings :: file = /home/jenkins/jenkins-slave/workspace/Lucene-Solr-Tests-8.x/lucene/top-level-ivy-settings.xml

resolve:

jar-checksums:
    [mkdir] Created dir: /home/jenkins/jenkins-slave/workspace/Lucene-Solr-Tests-8.x/solr/null1652416924
     [copy] Copying 249 files to /home/jenkins/jenkins-slave/workspace/Lucene-Solr-Tests-8.x/solr/null1652416924
   [delete] Deleting directory /home/jenkins/jenkins-slave/workspace/Lucene-Solr-Tests-8.x/solr/null1652416924

check-working-copy:
[ivy:cachepath] :: resolving dependencies :: #;working@lucene1-us-west
[ivy:cachepath] confs: [default]
[ivy:cachepath] found org.eclipse.jgit#org.eclipse.jgit;5.3.0.201903130848-r in public
[ivy:cachepath] found com.jcraft#jsch;0.1.54 in public
[ivy:cachepath] found com.jcraft#jzlib;1.1.1 in public
[ivy:cachepath] found com.googlecode.javaewah#JavaEWAH;1.1.6 in public
[ivy:cachepath] found org.slf4j#slf4j-api;1.7.2 in public
[ivy:cachepath] found org.bouncycastle#bcpg-jdk15on;1.60 in public
[ivy:cachepath] found org.bouncycastle#bcprov-jdk15on;1.60 in public
[ivy:cachepath] found org.bouncycastle#bcpkix-jdk15on;1.60 in public
[ivy:cachepath] found org.slf4j#slf4j-nop;1.7.2 in public
[ivy:cachepath] :: resolution report :: resolve 33ms :: artifacts dl 2ms
        ---------------------------------------------------------------------
        |                  |            modules            ||   artifacts   |
        |       conf       | number| search|dwnlded|evicted|| number|dwnlded|
        ---------------------------------------------------------------------
        |      default     |   9   |   0   |   0   |   0   ||   9   |   0   |
        ---------------------------------------------------------------------
[wc-checker] Initializing working copy...
[wc-checker] Checking working copy status...

-jenkins-base:

BUILD SUCCESSFUL
Total time: 118 minutes 2 seconds
Archiving artifacts
java.lang.InterruptedException: no matches found within 10000
        at hudson.FilePath$ValidateAntFileMask.hasMatch(FilePath.java:2847)
        at hudson.FilePath$ValidateAntFileMask.invoke(FilePath.java:2726)
        at hudson.FilePath$ValidateAntFileMask.invoke(FilePath.java:2707)
        at hudson.FilePath$FileCallableWrapper.call(FilePath.java:3086)
Also:   hudson.remoting.Channel$CallSiteStackTrace: Remote call to lucene
                at hudson.remoting.Channel.attachCallSiteStackTrace(Channel.java:1741)
                at hudson.remoting.UserRequest$ExceptionResponse.retrieve(UserRequest.java:357)
                at hudson.remoting.Channel.call(Channel.java:955)
                at hudson.FilePath.act(FilePath.java:1072)
                at hudson.FilePath.act(FilePath.java:1061)
                at hudson.FilePath.validateAntFileMask(FilePath.java:2705)
                at hudson.tasks.ArtifactArchiver.perform(ArtifactArchiver.java:243)
                at hudson.tasks.BuildStepCompatibilityLayer.perform(BuildStepCompatibilityLayer.java:81)
                at hudson.tasks.BuildStepMonitor$1.perform(BuildStepMonitor.java:20)
                at hudson.model.AbstractBuild$AbstractBuildExecution.perform(AbstractBuild.java:744)
                at hudson.model.AbstractBuild$AbstractBuildExecution.performAllBuildSteps(AbstractBuild.java:690)
                at hudson.model.Build$BuildExecution.post2(Build.java:186)
                at hudson.model.AbstractBuild$AbstractBuildExecution.post(AbstractBuild.java:635)
                at hudson.model.Run.execute(Run.java:1835)
                at hudson.model.FreeStyleBuild.run(FreeStyleBuild.java:43)
                at hudson.model.ResourceController.execute(ResourceController.java:97)
                at hudson.model.Executor.run(Executor.java:429)
Caused: hudson.FilePath$TunneledInterruptedException
        at hudson.FilePath$FileCallableWrapper.call(FilePath.java:3088)
        at hudson.remoting.UserRequest.perform(UserRequest.java:212)
        at hudson.remoting.UserRequest.perform(UserRequest.java:54)
        at hudson.remoting.Request$2.run(Request.java:369)
        at hudson.remoting.InterceptingExecutorService$1.call(InterceptingExecutorService.java:72)
        at java.util.concurrent.FutureTask.run(FutureTask.java:266)
        at java.util.concurrent.ThreadPoolExecutor.runWorker(ThreadPoolExecutor.java:1142)
        at java.util.concurrent.ThreadPoolExecutor$Worker.run(ThreadPoolExecutor.java:617)
        at java.lang.Thread.run(Thread.java:744)
Caused: java.lang.InterruptedException: java.lang.InterruptedException: no matches found within 10000
        at hudson.FilePath.act(FilePath.java:1074)
        at hudson.FilePath.act(FilePath.java:1061)
        at hudson.FilePath.validateAntFileMask(FilePath.java:2705)
        at hudson.tasks.ArtifactArchiver.perform(ArtifactArchiver.java:243)
        at hudson.tasks.BuildStepCompatibilityLayer.perform(BuildStepCompatibilityLayer.java:81)
        at hudson.tasks.BuildStepMonitor$1.perform(BuildStepMonitor.java:20)
        at hudson.model.AbstractBuild$AbstractBuildExecution.perform(AbstractBuild.java:744)
        at hudson.model.AbstractBuild$AbstractBuildExecution.performAllBuildSteps(AbstractBuild.java:690)
        at hudson.model.Build$BuildExecution.post2(Build.java:186)
        at hudson.model.AbstractBuild$AbstractBuildExecution.post(AbstractBuild.java:635)
        at hudson.model.Run.execute(Run.java:1835)
        at hudson.model.FreeStyleBuild.run(FreeStyleBuild.java:43)
        at hudson.model.ResourceController.execute(ResourceController.java:97)
        at hudson.model.Executor.run(Executor.java:429)
No artifacts found that match the file pattern "**/*.events,heapdumps/**,**/hs_err_pid*". Configuration error?
Recording test results
Build step 'Publish JUnit test result report' changed build result to UNSTABLE
Email was triggered for: Unstable (Test Failures)
Sending email for trigger: Unstable (Test Failures)


---------------------------------------------------------------------
To unsubscribe, e-mail: [hidden email]
For additional commands, e-mail: [hidden email]