[JENKINS] Lucene-Solr-Tests-8.x - Build # 526 - Unstable

classic Classic list List threaded Threaded
1 message Options
Reply | Threaded
Open this post in threaded view
|

[JENKINS] Lucene-Solr-Tests-8.x - Build # 526 - Unstable

Apache Jenkins Server-2
Build: https://builds.apache.org/job/Lucene-Solr-Tests-8.x/526/

1 tests failed.
FAILED:  org.apache.lucene.search.TestQueryRescorer.testRescoreIsIdempotent

Error Message:
Hit 18 docnumbers don't match Hits length1=45 length2=45 hit=0: doc50=0.028545419 shardIndex=0,  doc50=0.028545419 shardIndex=0 hit=1: doc5=0.028516848 shardIndex=0,  doc5=0.028516848 shardIndex=0 hit=2: doc11=0.028494034 shardIndex=0,  doc11=0.028494034 shardIndex=0 hit=3: doc74=0.028488334 shardIndex=0,  doc74=0.028488334 shardIndex=0 hit=4: doc66=0.027504537 shardIndex=0,  doc66=0.027504537 shardIndex=0 hit=5: doc82=0.026187908 shardIndex=0,  doc82=0.026187908 shardIndex=0 hit=6: doc98=0.026187908 shardIndex=0,  doc98=0.026187908 shardIndex=0 hit=7: doc28=0.024195362 shardIndex=0,  doc28=0.024195362 shardIndex=0 hit=8: doc39=0.024195362 shardIndex=0,  doc39=0.024195362 shardIndex=0 hit=9: doc59=0.022912268 shardIndex=0,  doc59=0.022912268 shardIndex=0 hit=10: doc92=0.022912268 shardIndex=0,  doc92=0.022912268 shardIndex=0 hit=11: doc0=0.02248841 shardIndex=0,  doc0=0.02248841 shardIndex=0 hit=12: doc32=0.02248841 shardIndex=0,  doc32=0.02248841 shardIndex=0 hit=13: doc35=0.02248841 shardIndex=0,  doc35=0.02248841 shardIndex=0 hit=14: doc24=0.02145426 shardIndex=0,  doc24=0.02145426 shardIndex=0 hit=15: doc84=0.02145426 shardIndex=0,  doc84=0.02145426 shardIndex=0 hit=16: doc48=0.021009266 shardIndex=0,  doc48=0.021009266 shardIndex=0 hit=17: doc62=0.020176288 shardIndex=0,  doc62=0.020176288 shardIndex=0 hit=18: doc53=0.019383933 shardIndex=0,  doc14=0.019714825 shardIndex=0 hit=19: doc73=0.01934877 shardIndex=0,  doc61=0.019714825 shardIndex=0 hit=20: doc14=0.019714825 shardIndex=0,  doc86=0.019714825 shardIndex=0 hit=21: doc61=0.019714825 shardIndex=0,  doc53=0.019383933 shardIndex=0 hit=22: doc86=0.019714825 shardIndex=0,  doc73=0.01934877 shardIndex=0 hit=23: doc63=0.019046407 shardIndex=0,  doc63=0.019046407 shardIndex=0 hit=24: doc88=0.019046407 shardIndex=0,  doc88=0.019046407 shardIndex=0 hit=25: doc31=0.018039875 shardIndex=0,  doc31=0.018039875 shardIndex=0 hit=26: doc45=0.018039875 shardIndex=0,  doc45=0.018039875 shardIndex=0 hit=27: doc49=0.015943797 shardIndex=0,  doc49=0.015943797 shardIndex=0 hit=28: doc78=0.013575318 shardIndex=0,  doc78=0.013575318 shardIndex=0 hit=29: doc76=0.012321989 shardIndex=0,  doc76=0.012321989 shardIndex=0 hit=30: doc95=0.011944253 shardIndex=0,  doc95=0.011944253 shardIndex=0 hit=31: doc80=0.011621977 shardIndex=0,  doc80=0.011621977 shardIndex=0 hit=32: doc9=0.011131212 shardIndex=0,  doc9=0.011131212 shardIndex=0 hit=33: doc10=0.0034166228 shardIndex=0,  doc10=0.0034166228 shardIndex=0 hit=34: doc25=0.0034166228 shardIndex=0,  doc25=0.0034166228 shardIndex=0 hit=35: doc33=0.0034166228 shardIndex=0,  doc33=0.0034166228 shardIndex=0 hit=36: doc36=0.0034166228 shardIndex=0,  doc36=0.0034166228 shardIndex=0 hit=37: doc51=0.0034166228 shardIndex=0,  doc51=0.0034166228 shardIndex=0 hit=38: doc67=0.0034166228 shardIndex=0,  doc67=0.0034166228 shardIndex=0 hit=39: doc71=0.0034166228 shardIndex=0,  doc71=0.0034166228 shardIndex=0 hit=40: doc79=0.0034166228 shardIndex=0,  doc79=0.0034166228 shardIndex=0 hit=41: doc83=0.0034166228 shardIndex=0,  doc83=0.0034166228 shardIndex=0 hit=42: doc27=0.0034106532 shardIndex=0,  doc27=0.0034106532 shardIndex=0 hit=43: doc34=0.0034106532 shardIndex=0,  doc34=0.0034106532 shardIndex=0 hit=44: doc55=0.0032936397 shardIndex=0,  doc55=0.0032936397 shardIndex=0 for query:field:"river river"~1

Stack Trace:
junit.framework.AssertionFailedError: Hit 18 docnumbers don't match
Hits length1=45 length2=45
hit=0: doc50=0.028545419 shardIndex=0, doc50=0.028545419 shardIndex=0
hit=1: doc5=0.028516848 shardIndex=0, doc5=0.028516848 shardIndex=0
hit=2: doc11=0.028494034 shardIndex=0, doc11=0.028494034 shardIndex=0
hit=3: doc74=0.028488334 shardIndex=0, doc74=0.028488334 shardIndex=0
hit=4: doc66=0.027504537 shardIndex=0, doc66=0.027504537 shardIndex=0
hit=5: doc82=0.026187908 shardIndex=0, doc82=0.026187908 shardIndex=0
hit=6: doc98=0.026187908 shardIndex=0, doc98=0.026187908 shardIndex=0
hit=7: doc28=0.024195362 shardIndex=0, doc28=0.024195362 shardIndex=0
hit=8: doc39=0.024195362 shardIndex=0, doc39=0.024195362 shardIndex=0
hit=9: doc59=0.022912268 shardIndex=0, doc59=0.022912268 shardIndex=0
hit=10: doc92=0.022912268 shardIndex=0, doc92=0.022912268 shardIndex=0
hit=11: doc0=0.02248841 shardIndex=0, doc0=0.02248841 shardIndex=0
hit=12: doc32=0.02248841 shardIndex=0, doc32=0.02248841 shardIndex=0
hit=13: doc35=0.02248841 shardIndex=0, doc35=0.02248841 shardIndex=0
hit=14: doc24=0.02145426 shardIndex=0, doc24=0.02145426 shardIndex=0
hit=15: doc84=0.02145426 shardIndex=0, doc84=0.02145426 shardIndex=0
hit=16: doc48=0.021009266 shardIndex=0, doc48=0.021009266 shardIndex=0
hit=17: doc62=0.020176288 shardIndex=0, doc62=0.020176288 shardIndex=0
hit=18: doc53=0.019383933 shardIndex=0, doc14=0.019714825 shardIndex=0
hit=19: doc73=0.01934877 shardIndex=0, doc61=0.019714825 shardIndex=0
hit=20: doc14=0.019714825 shardIndex=0, doc86=0.019714825 shardIndex=0
hit=21: doc61=0.019714825 shardIndex=0, doc53=0.019383933 shardIndex=0
hit=22: doc86=0.019714825 shardIndex=0, doc73=0.01934877 shardIndex=0
hit=23: doc63=0.019046407 shardIndex=0, doc63=0.019046407 shardIndex=0
hit=24: doc88=0.019046407 shardIndex=0, doc88=0.019046407 shardIndex=0
hit=25: doc31=0.018039875 shardIndex=0, doc31=0.018039875 shardIndex=0
hit=26: doc45=0.018039875 shardIndex=0, doc45=0.018039875 shardIndex=0
hit=27: doc49=0.015943797 shardIndex=0, doc49=0.015943797 shardIndex=0
hit=28: doc78=0.013575318 shardIndex=0, doc78=0.013575318 shardIndex=0
hit=29: doc76=0.012321989 shardIndex=0, doc76=0.012321989 shardIndex=0
hit=30: doc95=0.011944253 shardIndex=0, doc95=0.011944253 shardIndex=0
hit=31: doc80=0.011621977 shardIndex=0, doc80=0.011621977 shardIndex=0
hit=32: doc9=0.011131212 shardIndex=0, doc9=0.011131212 shardIndex=0
hit=33: doc10=0.0034166228 shardIndex=0, doc10=0.0034166228 shardIndex=0
hit=34: doc25=0.0034166228 shardIndex=0, doc25=0.0034166228 shardIndex=0
hit=35: doc33=0.0034166228 shardIndex=0, doc33=0.0034166228 shardIndex=0
hit=36: doc36=0.0034166228 shardIndex=0, doc36=0.0034166228 shardIndex=0
hit=37: doc51=0.0034166228 shardIndex=0, doc51=0.0034166228 shardIndex=0
hit=38: doc67=0.0034166228 shardIndex=0, doc67=0.0034166228 shardIndex=0
hit=39: doc71=0.0034166228 shardIndex=0, doc71=0.0034166228 shardIndex=0
hit=40: doc79=0.0034166228 shardIndex=0, doc79=0.0034166228 shardIndex=0
hit=41: doc83=0.0034166228 shardIndex=0, doc83=0.0034166228 shardIndex=0
hit=42: doc27=0.0034106532 shardIndex=0, doc27=0.0034106532 shardIndex=0
hit=43: doc34=0.0034106532 shardIndex=0, doc34=0.0034106532 shardIndex=0
hit=44: doc55=0.0032936397 shardIndex=0, doc55=0.0032936397 shardIndex=0
for query:field:"river river"~1
        at __randomizedtesting.SeedInfo.seed([FA021620C7AC6BA7:30E44633C7B8974F]:0)
        at junit.framework.Assert.fail(Assert.java:57)
        at org.apache.lucene.search.CheckHits.checkEqual(CheckHits.java:205)
        at org.apache.lucene.search.TestQueryRescorer.testRescoreIsIdempotent(TestQueryRescorer.java:143)
        at sun.reflect.NativeMethodAccessorImpl.invoke0(Native Method)
        at sun.reflect.NativeMethodAccessorImpl.invoke(NativeMethodAccessorImpl.java:62)
        at sun.reflect.DelegatingMethodAccessorImpl.invoke(DelegatingMethodAccessorImpl.java:43)
        at java.lang.reflect.Method.invoke(Method.java:498)
        at com.carrotsearch.randomizedtesting.RandomizedRunner.invoke(RandomizedRunner.java:1750)
        at com.carrotsearch.randomizedtesting.RandomizedRunner$8.evaluate(RandomizedRunner.java:938)
        at com.carrotsearch.randomizedtesting.RandomizedRunner$9.evaluate(RandomizedRunner.java:974)
        at com.carrotsearch.randomizedtesting.RandomizedRunner$10.evaluate(RandomizedRunner.java:988)
        at org.apache.lucene.util.TestRuleSetupTeardownChained$1.evaluate(TestRuleSetupTeardownChained.java:49)
        at org.apache.lucene.util.AbstractBeforeAfterRule$1.evaluate(AbstractBeforeAfterRule.java:45)
        at org.apache.lucene.util.TestRuleThreadAndTestName$1.evaluate(TestRuleThreadAndTestName.java:48)
        at org.apache.lucene.util.TestRuleIgnoreAfterMaxFailures$1.evaluate(TestRuleIgnoreAfterMaxFailures.java:64)
        at org.apache.lucene.util.TestRuleMarkFailure$1.evaluate(TestRuleMarkFailure.java:47)
        at com.carrotsearch.randomizedtesting.rules.StatementAdapter.evaluate(StatementAdapter.java:36)
        at com.carrotsearch.randomizedtesting.ThreadLeakControl$StatementRunner.run(ThreadLeakControl.java:368)
        at com.carrotsearch.randomizedtesting.ThreadLeakControl.forkTimeoutingTask(ThreadLeakControl.java:817)
        at com.carrotsearch.randomizedtesting.ThreadLeakControl$3.evaluate(ThreadLeakControl.java:468)
        at com.carrotsearch.randomizedtesting.RandomizedRunner.runSingleTest(RandomizedRunner.java:947)
        at com.carrotsearch.randomizedtesting.RandomizedRunner$5.evaluate(RandomizedRunner.java:832)
        at com.carrotsearch.randomizedtesting.RandomizedRunner$6.evaluate(RandomizedRunner.java:883)
        at com.carrotsearch.randomizedtesting.RandomizedRunner$7.evaluate(RandomizedRunner.java:894)
        at org.apache.lucene.util.AbstractBeforeAfterRule$1.evaluate(AbstractBeforeAfterRule.java:45)
        at com.carrotsearch.randomizedtesting.rules.StatementAdapter.evaluate(StatementAdapter.java:36)
        at org.apache.lucene.util.TestRuleStoreClassName$1.evaluate(TestRuleStoreClassName.java:41)
        at com.carrotsearch.randomizedtesting.rules.NoShadowingOrOverridesOnMethodsRule$1.evaluate(NoShadowingOrOverridesOnMethodsRule.java:40)
        at com.carrotsearch.randomizedtesting.rules.NoShadowingOrOverridesOnMethodsRule$1.evaluate(NoShadowingOrOverridesOnMethodsRule.java:40)
        at com.carrotsearch.randomizedtesting.rules.StatementAdapter.evaluate(StatementAdapter.java:36)
        at com.carrotsearch.randomizedtesting.rules.StatementAdapter.evaluate(StatementAdapter.java:36)
        at com.carrotsearch.randomizedtesting.rules.StatementAdapter.evaluate(StatementAdapter.java:36)
        at org.apache.lucene.util.TestRuleAssertionsRequired$1.evaluate(TestRuleAssertionsRequired.java:53)
        at org.apache.lucene.util.TestRuleMarkFailure$1.evaluate(TestRuleMarkFailure.java:47)
        at org.apache.lucene.util.TestRuleIgnoreAfterMaxFailures$1.evaluate(TestRuleIgnoreAfterMaxFailures.java:64)
        at org.apache.lucene.util.TestRuleIgnoreTestSuites$1.evaluate(TestRuleIgnoreTestSuites.java:54)
        at com.carrotsearch.randomizedtesting.rules.StatementAdapter.evaluate(StatementAdapter.java:36)
        at com.carrotsearch.randomizedtesting.ThreadLeakControl$StatementRunner.run(ThreadLeakControl.java:368)
        at java.lang.Thread.run(Thread.java:748)




Build Log:
[...truncated 614 lines...]
   [junit4] Suite: org.apache.lucene.search.TestQueryRescorer
   [junit4]   2> NOTE: reproduce with: ant test  -Dtestcase=TestQueryRescorer -Dtests.method=testRescoreIsIdempotent -Dtests.seed=FA021620C7AC6BA7 -Dtests.multiplier=2 -Dtests.slow=true -Dtests.locale=th -Dtests.timezone=Etc/GMT+2 -Dtests.asserts=true -Dtests.file.encoding=UTF-8
   [junit4] FAILURE 0.07s J1 | TestQueryRescorer.testRescoreIsIdempotent <<<
   [junit4]    > Throwable #1: junit.framework.AssertionFailedError: Hit 18 docnumbers don't match
   [junit4]    > Hits length1=45 length2=45
   [junit4]    > hit=0: doc50=0.028545419 shardIndex=0, doc50=0.028545419 shardIndex=0
   [junit4]    > hit=1: doc5=0.028516848 shardIndex=0, doc5=0.028516848 shardIndex=0
   [junit4]    > hit=2: doc11=0.028494034 shardIndex=0, doc11=0.028494034 shardIndex=0
   [junit4]    > hit=3: doc74=0.028488334 shardIndex=0, doc74=0.028488334 shardIndex=0
   [junit4]    > hit=4: doc66=0.027504537 shardIndex=0, doc66=0.027504537 shardIndex=0
   [junit4]    > hit=5: doc82=0.026187908 shardIndex=0, doc82=0.026187908 shardIndex=0
   [junit4]    > hit=6: doc98=0.026187908 shardIndex=0, doc98=0.026187908 shardIndex=0
   [junit4]    > hit=7: doc28=0.024195362 shardIndex=0, doc28=0.024195362 shardIndex=0
   [junit4]    > hit=8: doc39=0.024195362 shardIndex=0, doc39=0.024195362 shardIndex=0
   [junit4]    > hit=9: doc59=0.022912268 shardIndex=0, doc59=0.022912268 shardIndex=0
   [junit4]    > hit=10: doc92=0.022912268 shardIndex=0, doc92=0.022912268 shardIndex=0
   [junit4]    > hit=11: doc0=0.02248841 shardIndex=0, doc0=0.02248841 shardIndex=0
   [junit4]    > hit=12: doc32=0.02248841 shardIndex=0, doc32=0.02248841 shardIndex=0
   [junit4]    > hit=13: doc35=0.02248841 shardIndex=0, doc35=0.02248841 shardIndex=0
   [junit4]    > hit=14: doc24=0.02145426 shardIndex=0, doc24=0.02145426 shardIndex=0
   [junit4]    > hit=15: doc84=0.02145426 shardIndex=0, doc84=0.02145426 shardIndex=0
   [junit4]    > hit=16: doc48=0.021009266 shardIndex=0, doc48=0.021009266 shardIndex=0
   [junit4]    > hit=17: doc62=0.020176288 shardIndex=0, doc62=0.020176288 shardIndex=0
   [junit4]    > hit=18: doc53=0.019383933 shardIndex=0, doc14=0.019714825 shardIndex=0
   [junit4]    > hit=19: doc73=0.01934877 shardIndex=0, doc61=0.019714825 shardIndex=0
   [junit4]    > hit=20: doc14=0.019714825 shardIndex=0, doc86=0.019714825 shardIndex=0
   [junit4]    > hit=21: doc61=0.019714825 shardIndex=0, doc53=0.019383933 shardIndex=0
   [junit4]    > hit=22: doc86=0.019714825 shardIndex=0, doc73=0.01934877 shardIndex=0
   [junit4]    > hit=23: doc63=0.019046407 shardIndex=0, doc63=0.019046407 shardIndex=0
   [junit4]    > hit=24: doc88=0.019046407 shardIndex=0, doc88=0.019046407 shardIndex=0
   [junit4]    > hit=25: doc31=0.018039875 shardIndex=0, doc31=0.018039875 shardIndex=0
   [junit4]    > hit=26: doc45=0.018039875 shardIndex=0, doc45=0.018039875 shardIndex=0
   [junit4]    > hit=27: doc49=0.015943797 shardIndex=0, doc49=0.015943797 shardIndex=0
   [junit4]    > hit=28: doc78=0.013575318 shardIndex=0, doc78=0.013575318 shardIndex=0
   [junit4]    > hit=29: doc76=0.012321989 shardIndex=0, doc76=0.012321989 shardIndex=0
   [junit4]    > hit=30: doc95=0.011944253 shardIndex=0, doc95=0.011944253 shardIndex=0
   [junit4]    > hit=31: doc80=0.011621977 shardIndex=0, doc80=0.011621977 shardIndex=0
   [junit4]    > hit=32: doc9=0.011131212 shardIndex=0, doc9=0.011131212 shardIndex=0
   [junit4]    > hit=33: doc10=0.0034166228 shardIndex=0, doc10=0.0034166228 shardIndex=0
   [junit4]    > hit=34: doc25=0.0034166228 shardIndex=0, doc25=0.0034166228 shardIndex=0
   [junit4]    > hit=35: doc33=0.0034166228 shardIndex=0, doc33=0.0034166228 shardIndex=0
   [junit4]    > hit=36: doc36=0.0034166228 shardIndex=0, doc36=0.0034166228 shardIndex=0
   [junit4]    > hit=37: doc51=0.0034166228 shardIndex=0, doc51=0.0034166228 shardIndex=0
   [junit4]    > hit=38: doc67=0.0034166228 shardIndex=0, doc67=0.0034166228 shardIndex=0
   [junit4]    > hit=39: doc71=0.0034166228 shardIndex=0, doc71=0.0034166228 shardIndex=0
   [junit4]    > hit=40: doc79=0.0034166228 shardIndex=0, doc79=0.0034166228 shardIndex=0
   [junit4]    > hit=41: doc83=0.0034166228 shardIndex=0, doc83=0.0034166228 shardIndex=0
   [junit4]    > hit=42: doc27=0.0034106532 shardIndex=0, doc27=0.0034106532 shardIndex=0
   [junit4]    > hit=43: doc34=0.0034106532 shardIndex=0, doc34=0.0034106532 shardIndex=0
   [junit4]    > hit=44: doc55=0.0032936397 shardIndex=0, doc55=0.0032936397 shardIndex=0
   [junit4]    > for query:field:"river river"~1
   [junit4]    > at __randomizedtesting.SeedInfo.seed([FA021620C7AC6BA7:30E44633C7B8974F]:0)
   [junit4]    > at junit.framework.Assert.fail(Assert.java:57)
   [junit4]    > at org.apache.lucene.search.CheckHits.checkEqual(CheckHits.java:205)
   [junit4]    > at org.apache.lucene.search.TestQueryRescorer.testRescoreIsIdempotent(TestQueryRescorer.java:143)
   [junit4]    > at java.lang.Thread.run(Thread.java:748)
   [junit4]   2> NOTE: test params are: codec=Asserting(Lucene80): {field=PostingsFormat(name=MockRandom), id=FST50}, docValues:{field=DocValuesFormat(name=Lucene80), num=DocValuesFormat(name=Lucene80), id=DocValuesFormat(name=Asserting)}, maxPointsInLeafNode=797, maxMBSortInHeap=6.298234043082523, sim=Asserting(org.apache.lucene.search.similarities.AssertingSimilarity@50f5afcf), locale=th, timezone=Etc/GMT+2
   [junit4]   2> NOTE: Linux 4.15.0-54-generic amd64/Oracle Corporation 1.8.0_191 (64-bit)/cpus=4,threads=1,free=179644144,total=278921216
   [junit4]   2> NOTE: All tests run in this JVM: [TestDuelingCodecs, TestPersistentSnapshotDeletionPolicy, TestNeverDelete, TestTopDocsCollector, TestIndexWriterDeleteByQuery, TestFilterCodecReader, TestCustomNorms, TestDocIdsWriter, TestMmapDirectory, TestFilterWeight, TestNearSpansOrdered, TestOmitTf, TestLucene80NormsFormatMergeInstance, TestIndexOrDocValuesQuery, TestConstantScoreScorer, TestIndexableField, TestStressAdvance, TestLiveFieldValues, TestLucene50StoredFieldsFormatHighCompression, TestSentinelIntSet, TestFeatureField, TestNoMergePolicy, TestPendingDeletes, TestTermVectors, TestExitableDirectoryReader, TestConsistentFieldNumbers, TestDocValuesIndexing, TestMatchAllDocsQuery, TestRegExp, TestRateLimiter, TestMaxPosition, TestAxiomaticF2EXP, TestIndexCommit, TestNot, TestIndexWriterThreadsToSegments, TestUsageTrackingFilterCachingPolicy, TestParallelTermEnum, TestLongsRef, TestIndexedDISI, TestIndexWriterMaxDocs, Test2BPostings, TestSortedNumericSortField, TestFilterMergePolicy, TestNRTReaderCleanup, TestBlockPostingsFormat2, TestTermRangeQuery, TestQueryRescorer]
   [junit4] Completed [79/525 (1!)] on J1 in 1.71s, 8 tests, 1 failure <<< FAILURES!

[...truncated 67692 lines...]
[asciidoctor:convert] asciidoctor: ERROR: about-this-guide.adoc: line 1: invalid part, must have at least one section (e.g., chapter, appendix, etc.)
[asciidoctor:convert] asciidoctor: ERROR: solr-glossary.adoc: line 1: invalid part, must have at least one section (e.g., chapter, appendix, etc.)
     [java] Processed 2594 links (2120 relative) to 3410 anchors in 259 files
     [echo] Validated Links & Anchors via: /home/jenkins/jenkins-slave/workspace/Lucene-Solr-Tests-8.x/solr/build/solr-ref-guide/bare-bones-html/

-documentation-lint:
    [jtidy] Checking for broken html (such as invalid tags)...
   [delete] Deleting directory /home/jenkins/jenkins-slave/workspace/Lucene-Solr-Tests-8.x/lucene/build/jtidy_tmp
     [echo] Checking for broken links...
     [exec]
     [exec] Crawl/parse...
     [exec]
     [exec] Verify...
     [echo] Checking for malformed docs...

jar-checksums:

resolve:

ivy-availability-check:
[loadresource] Do not set property disallowed.ivy.jars.list as its length is 0.

-ivy-fail-disallowed-ivy-version:

ivy-fail:

ivy-configure:
[ivy:configure] :: loading settings :: file = /home/jenkins/jenkins-slave/workspace/Lucene-Solr-Tests-8.x/lucene/top-level-ivy-settings.xml

resolve:

ivy-availability-check:
[loadresource] Do not set property disallowed.ivy.jars.list as its length is 0.

-ivy-fail-disallowed-ivy-version:

ivy-fail:

ivy-configure:
[ivy:configure] :: loading settings :: file = /home/jenkins/jenkins-slave/workspace/Lucene-Solr-Tests-8.x/lucene/top-level-ivy-settings.xml

resolve:

resolve:

ivy-availability-check:
[loadresource] Do not set property disallowed.ivy.jars.list as its length is 0.

-ivy-fail-disallowed-ivy-version:

ivy-fail:

ivy-configure:
[ivy:configure] :: loading settings :: file = /home/jenkins/jenkins-slave/workspace/Lucene-Solr-Tests-8.x/lucene/top-level-ivy-settings.xml

resolve:

ivy-availability-check:
[loadresource] Do not set property disallowed.ivy.jars.list as its length is 0.

-ivy-fail-disallowed-ivy-version:

ivy-fail:

ivy-configure:
[ivy:configure] :: loading settings :: file = /home/jenkins/jenkins-slave/workspace/Lucene-Solr-Tests-8.x/lucene/top-level-ivy-settings.xml

resolve:

ivy-availability-check:
[loadresource] Do not set property disallowed.ivy.jars.list as its length is 0.

-ivy-fail-disallowed-ivy-version:

ivy-fail:

ivy-configure:
[ivy:configure] :: loading settings :: file = /home/jenkins/jenkins-slave/workspace/Lucene-Solr-Tests-8.x/lucene/top-level-ivy-settings.xml

resolve:

ivy-availability-check:
[loadresource] Do not set property disallowed.ivy.jars.list as its length is 0.

-ivy-fail-disallowed-ivy-version:

ivy-fail:

ivy-configure:
[ivy:configure] :: loading settings :: file = /home/jenkins/jenkins-slave/workspace/Lucene-Solr-Tests-8.x/lucene/top-level-ivy-settings.xml

resolve:

ivy-availability-check:
[loadresource] Do not set property disallowed.ivy.jars.list as its length is 0.

-ivy-fail-disallowed-ivy-version:

ivy-fail:

ivy-configure:
[ivy:configure] :: loading settings :: file = /home/jenkins/jenkins-slave/workspace/Lucene-Solr-Tests-8.x/lucene/top-level-ivy-settings.xml

resolve:

ivy-availability-check:
[loadresource] Do not set property disallowed.ivy.jars.list as its length is 0.

-ivy-fail-disallowed-ivy-version:

ivy-fail:

ivy-configure:
[ivy:configure] :: loading settings :: file = /home/jenkins/jenkins-slave/workspace/Lucene-Solr-Tests-8.x/lucene/top-level-ivy-settings.xml

resolve:

ivy-availability-check:
[loadresource] Do not set property disallowed.ivy.jars.list as its length is 0.

-ivy-fail-disallowed-ivy-version:

ivy-fail:

ivy-configure:
[ivy:configure] :: loading settings :: file = /home/jenkins/jenkins-slave/workspace/Lucene-Solr-Tests-8.x/lucene/top-level-ivy-settings.xml

resolve:

ivy-availability-check:
[loadresource] Do not set property disallowed.ivy.jars.list as its length is 0.

-ivy-fail-disallowed-ivy-version:

ivy-fail:

ivy-configure:
[ivy:configure] :: loading settings :: file = /home/jenkins/jenkins-slave/workspace/Lucene-Solr-Tests-8.x/lucene/top-level-ivy-settings.xml

resolve:

ivy-availability-check:
[loadresource] Do not set property disallowed.ivy.jars.list as its length is 0.

-ivy-fail-disallowed-ivy-version:

ivy-fail:

ivy-configure:
[ivy:configure] :: loading settings :: file = /home/jenkins/jenkins-slave/workspace/Lucene-Solr-Tests-8.x/lucene/top-level-ivy-settings.xml

resolve:

ivy-availability-check:
[loadresource] Do not set property disallowed.ivy.jars.list as its length is 0.

-ivy-fail-disallowed-ivy-version:

ivy-fail:

ivy-configure:
[ivy:configure] :: loading settings :: file = /home/jenkins/jenkins-slave/workspace/Lucene-Solr-Tests-8.x/lucene/top-level-ivy-settings.xml

resolve:

ivy-availability-check:
[loadresource] Do not set property disallowed.ivy.jars.list as its length is 0.

-ivy-fail-disallowed-ivy-version:

ivy-fail:

ivy-configure:
[ivy:configure] :: loading settings :: file = /home/jenkins/jenkins-slave/workspace/Lucene-Solr-Tests-8.x/lucene/top-level-ivy-settings.xml

resolve:

ivy-availability-check:
[loadresource] Do not set property disallowed.ivy.jars.list as its length is 0.

-ivy-fail-disallowed-ivy-version:

ivy-fail:

ivy-configure:
[ivy:configure] :: loading settings :: file = /home/jenkins/jenkins-slave/workspace/Lucene-Solr-Tests-8.x/lucene/top-level-ivy-settings.xml

resolve:

ivy-availability-check:
[loadresource] Do not set property disallowed.ivy.jars.list as its length is 0.

-ivy-fail-disallowed-ivy-version:

ivy-fail:

ivy-configure:
[ivy:configure] :: loading settings :: file = /home/jenkins/jenkins-slave/workspace/Lucene-Solr-Tests-8.x/lucene/top-level-ivy-settings.xml

resolve:

ivy-availability-check:
[loadresource] Do not set property disallowed.ivy.jars.list as its length is 0.

-ivy-fail-disallowed-ivy-version:

ivy-fail:

ivy-configure:
[ivy:configure] :: loading settings :: file = /home/jenkins/jenkins-slave/workspace/Lucene-Solr-Tests-8.x/lucene/top-level-ivy-settings.xml

resolve:

ivy-availability-check:
[loadresource] Do not set property disallowed.ivy.jars.list as its length is 0.

-ivy-fail-disallowed-ivy-version:

ivy-fail:

ivy-configure:
[ivy:configure] :: loading settings :: file = /home/jenkins/jenkins-slave/workspace/Lucene-Solr-Tests-8.x/lucene/top-level-ivy-settings.xml

resolve:

ivy-availability-check:
[loadresource] Do not set property disallowed.ivy.jars.list as its length is 0.

-ivy-fail-disallowed-ivy-version:

ivy-fail:

ivy-configure:
[ivy:configure] :: loading settings :: file = /home/jenkins/jenkins-slave/workspace/Lucene-Solr-Tests-8.x/lucene/top-level-ivy-settings.xml

resolve:

ivy-availability-check:
[loadresource] Do not set property disallowed.ivy.jars.list as its length is 0.

-ivy-fail-disallowed-ivy-version:

ivy-fail:

ivy-configure:
[ivy:configure] :: loading settings :: file = /home/jenkins/jenkins-slave/workspace/Lucene-Solr-Tests-8.x/lucene/top-level-ivy-settings.xml

resolve:

ivy-availability-check:
[loadresource] Do not set property disallowed.ivy.jars.list as its length is 0.

-ivy-fail-disallowed-ivy-version:

ivy-fail:

ivy-configure:
[ivy:configure] :: loading settings :: file = /home/jenkins/jenkins-slave/workspace/Lucene-Solr-Tests-8.x/lucene/top-level-ivy-settings.xml

resolve:

ivy-availability-check:
[loadresource] Do not set property disallowed.ivy.jars.list as its length is 0.

-ivy-fail-disallowed-ivy-version:

ivy-fail:

ivy-configure:
[ivy:configure] :: loading settings :: file = /home/jenkins/jenkins-slave/workspace/Lucene-Solr-Tests-8.x/lucene/top-level-ivy-settings.xml

resolve:

ivy-availability-check:
[loadresource] Do not set property disallowed.ivy.jars.list as its length is 0.

-ivy-fail-disallowed-ivy-version:

ivy-fail:

ivy-configure:
[ivy:configure] :: loading settings :: file = /home/jenkins/jenkins-slave/workspace/Lucene-Solr-Tests-8.x/lucene/top-level-ivy-settings.xml

resolve:

ivy-availability-check:
[loadresource] Do not set property disallowed.ivy.jars.list as its length is 0.

-ivy-fail-disallowed-ivy-version:

ivy-fail:

ivy-configure:
[ivy:configure] :: loading settings :: file = /home/jenkins/jenkins-slave/workspace/Lucene-Solr-Tests-8.x/lucene/top-level-ivy-settings.xml

resolve:

ivy-availability-check:
[loadresource] Do not set property disallowed.ivy.jars.list as its length is 0.

-ivy-fail-disallowed-ivy-version:

ivy-fail:

ivy-configure:
[ivy:configure] :: loading settings :: file = /home/jenkins/jenkins-slave/workspace/Lucene-Solr-Tests-8.x/lucene/top-level-ivy-settings.xml

resolve:

ivy-availability-check:
[loadresource] Do not set property disallowed.ivy.jars.list as its length is 0.

-ivy-fail-disallowed-ivy-version:

ivy-fail:

ivy-configure:
[ivy:configure] :: loading settings :: file = /home/jenkins/jenkins-slave/workspace/Lucene-Solr-Tests-8.x/lucene/top-level-ivy-settings.xml

resolve:

ivy-availability-check:
[loadresource] Do not set property disallowed.ivy.jars.list as its length is 0.

-ivy-fail-disallowed-ivy-version:

ivy-fail:

ivy-configure:
[ivy:configure] :: loading settings :: file = /home/jenkins/jenkins-slave/workspace/Lucene-Solr-Tests-8.x/lucene/top-level-ivy-settings.xml

resolve:

ivy-availability-check:
[loadresource] Do not set property disallowed.ivy.jars.list as its length is 0.

-ivy-fail-disallowed-ivy-version:

ivy-fail:

ivy-configure:
[ivy:configure] :: loading settings :: file = /home/jenkins/jenkins-slave/workspace/Lucene-Solr-Tests-8.x/lucene/top-level-ivy-settings.xml

resolve:

ivy-availability-check:
[loadresource] Do not set property disallowed.ivy.jars.list as its length is 0.

-ivy-fail-disallowed-ivy-version:

ivy-fail:

ivy-configure:
[ivy:configure] :: loading settings :: file = /home/jenkins/jenkins-slave/workspace/Lucene-Solr-Tests-8.x/lucene/top-level-ivy-settings.xml

common.resolve:

resolve:

ivy-availability-check:
[loadresource] Do not set property disallowed.ivy.jars.list as its length is 0.

-ivy-fail-disallowed-ivy-version:

ivy-fail:

ivy-configure:
[ivy:configure] :: loading settings :: file = /home/jenkins/jenkins-slave/workspace/Lucene-Solr-Tests-8.x/lucene/top-level-ivy-settings.xml

resolve:

ivy-availability-check:
[loadresource] Do not set property disallowed.ivy.jars.list as its length is 0.

-ivy-fail-disallowed-ivy-version:

ivy-fail:

ivy-configure:
[ivy:configure] :: loading settings :: file = /home/jenkins/jenkins-slave/workspace/Lucene-Solr-Tests-8.x/lucene/top-level-ivy-settings.xml

resolve:

ivy-availability-check:
[loadresource] Do not set property disallowed.ivy.jars.list as its length is 0.

-ivy-fail-disallowed-ivy-version:

ivy-fail:

ivy-configure:
[ivy:configure] :: loading settings :: file = /home/jenkins/jenkins-slave/workspace/Lucene-Solr-Tests-8.x/lucene/top-level-ivy-settings.xml

resolve:

ivy-availability-check:
[loadresource] Do not set property disallowed.ivy.jars.list as its length is 0.

-ivy-fail-disallowed-ivy-version:

ivy-fail:

ivy-configure:
[ivy:configure] :: loading settings :: file = /home/jenkins/jenkins-slave/workspace/Lucene-Solr-Tests-8.x/lucene/top-level-ivy-settings.xml

resolve:

ivy-availability-check:
[loadresource] Do not set property disallowed.ivy.jars.list as its length is 0.

-ivy-fail-disallowed-ivy-version:

ivy-fail:

ivy-configure:
[ivy:configure] :: loading settings :: file = /home/jenkins/jenkins-slave/workspace/Lucene-Solr-Tests-8.x/lucene/top-level-ivy-settings.xml

resolve:

jar-checksums:
    [mkdir] Created dir: /home/jenkins/jenkins-slave/workspace/Lucene-Solr-Tests-8.x/lucene/null1553316469
     [copy] Copying 38 files to /home/jenkins/jenkins-slave/workspace/Lucene-Solr-Tests-8.x/lucene/null1553316469
   [delete] Deleting directory /home/jenkins/jenkins-slave/workspace/Lucene-Solr-Tests-8.x/lucene/null1553316469

resolve-example:

ivy-availability-check:
[loadresource] Do not set property disallowed.ivy.jars.list as its length is 0.

-ivy-fail-disallowed-ivy-version:

ivy-fail:

ivy-configure:
[ivy:configure] :: loading settings :: file = /home/jenkins/jenkins-slave/workspace/Lucene-Solr-Tests-8.x/lucene/top-level-ivy-settings.xml

resolve:

resolve-server:

ivy-availability-check:
[loadresource] Do not set property disallowed.ivy.jars.list as its length is 0.

-ivy-fail-disallowed-ivy-version:

ivy-fail:

ivy-fail:

ivy-configure:
[ivy:configure] :: loading settings :: file = /home/jenkins/jenkins-slave/workspace/Lucene-Solr-Tests-8.x/lucene/top-level-ivy-settings.xml

resolve:

resolve:

ivy-availability-check:
[loadresource] Do not set property disallowed.ivy.jars.list as its length is 0.

-ivy-fail-disallowed-ivy-version:

ivy-fail:

ivy-fail:

ivy-configure:
[ivy:configure] :: loading settings :: file = /home/jenkins/jenkins-slave/workspace/Lucene-Solr-Tests-8.x/lucene/top-level-ivy-settings.xml

resolve:

ivy-availability-check:
[loadresource] Do not set property disallowed.ivy.jars.list as its length is 0.

-ivy-fail-disallowed-ivy-version:

ivy-fail:

ivy-fail:

ivy-configure:
[ivy:configure] :: loading settings :: file = /home/jenkins/jenkins-slave/workspace/Lucene-Solr-Tests-8.x/lucene/top-level-ivy-settings.xml

resolve:

ivy-availability-check:
[loadresource] Do not set property disallowed.ivy.jars.list as its length is 0.

-ivy-fail-disallowed-ivy-version:

ivy-fail:

ivy-configure:
[ivy:configure] :: loading settings :: file = /home/jenkins/jenkins-slave/workspace/Lucene-Solr-Tests-8.x/lucene/top-level-ivy-settings.xml

resolve:

ivy-availability-check:
[loadresource] Do not set property disallowed.ivy.jars.list as its length is 0.

-ivy-fail-disallowed-ivy-version:

ivy-fail:

ivy-fail:

ivy-configure:
[ivy:configure] :: loading settings :: file = /home/jenkins/jenkins-slave/workspace/Lucene-Solr-Tests-8.x/lucene/top-level-ivy-settings.xml

resolve:

ivy-availability-check:
[loadresource] Do not set property disallowed.ivy.jars.list as its length is 0.

-ivy-fail-disallowed-ivy-version:

ivy-fail:

ivy-configure:
[ivy:configure] :: loading settings :: file = /home/jenkins/jenkins-slave/workspace/Lucene-Solr-Tests-8.x/lucene/top-level-ivy-settings.xml

resolve:

ivy-availability-check:
[loadresource] Do not set property disallowed.ivy.jars.list as its length is 0.

-ivy-fail-disallowed-ivy-version:

ivy-fail:

ivy-fail:

ivy-configure:
[ivy:configure] :: loading settings :: file = /home/jenkins/jenkins-slave/workspace/Lucene-Solr-Tests-8.x/lucene/top-level-ivy-settings.xml

resolve:

ivy-availability-check:
[loadresource] Do not set property disallowed.ivy.jars.list as its length is 0.

-ivy-fail-disallowed-ivy-version:

ivy-fail:

ivy-fail:

ivy-configure:
[ivy:configure] :: loading settings :: file = /home/jenkins/jenkins-slave/workspace/Lucene-Solr-Tests-8.x/lucene/top-level-ivy-settings.xml

resolve:

ivy-availability-check:
[loadresource] Do not set property disallowed.ivy.jars.list as its length is 0.

-ivy-fail-disallowed-ivy-version:

ivy-fail:

ivy-fail:

ivy-configure:
[ivy:configure] :: loading settings :: file = /home/jenkins/jenkins-slave/workspace/Lucene-Solr-Tests-8.x/lucene/top-level-ivy-settings.xml

resolve:

ivy-availability-check:
[loadresource] Do not set property disallowed.ivy.jars.list as its length is 0.

-ivy-fail-disallowed-ivy-version:

ivy-fail:

ivy-fail:

ivy-configure:
[ivy:configure] :: loading settings :: file = /home/jenkins/jenkins-slave/workspace/Lucene-Solr-Tests-8.x/lucene/top-level-ivy-settings.xml

resolve:

ivy-availability-check:
[loadresource] Do not set property disallowed.ivy.jars.list as its length is 0.

-ivy-fail-disallowed-ivy-version:

ivy-fail:

ivy-fail:

ivy-configure:
[ivy:configure] :: loading settings :: file = /home/jenkins/jenkins-slave/workspace/Lucene-Solr-Tests-8.x/lucene/top-level-ivy-settings.xml

resolve:

ivy-availability-check:
[loadresource] Do not set property disallowed.ivy.jars.list as its length is 0.

-ivy-fail-disallowed-ivy-version:

ivy-fail:

ivy-fail:

ivy-configure:
[ivy:configure] :: loading settings :: file = /home/jenkins/jenkins-slave/workspace/Lucene-Solr-Tests-8.x/lucene/top-level-ivy-settings.xml

resolve:

ivy-availability-check:
[loadresource] Do not set property disallowed.ivy.jars.list as its length is 0.

-ivy-fail-disallowed-ivy-version:

ivy-fail:

ivy-fail:

ivy-configure:
[ivy:configure] :: loading settings :: file = /home/jenkins/jenkins-slave/workspace/Lucene-Solr-Tests-8.x/lucene/top-level-ivy-settings.xml

resolve:

ivy-availability-check:
[loadresource] Do not set property disallowed.ivy.jars.list as its length is 0.

-ivy-fail-disallowed-ivy-version:

ivy-fail:

ivy-fail:

ivy-configure:
[ivy:configure] :: loading settings :: file = /home/jenkins/jenkins-slave/workspace/Lucene-Solr-Tests-8.x/lucene/top-level-ivy-settings.xml

resolve:

ivy-availability-check:
[loadresource] Do not set property disallowed.ivy.jars.list as its length is 0.

-ivy-fail-disallowed-ivy-version:

ivy-fail:

ivy-fail:

ivy-configure:
[ivy:configure] :: loading settings :: file = /home/jenkins/jenkins-slave/workspace/Lucene-Solr-Tests-8.x/lucene/top-level-ivy-settings.xml

resolve:

ivy-availability-check:
[loadresource] Do not set property disallowed.ivy.jars.list as its length is 0.

-ivy-fail-disallowed-ivy-version:

ivy-fail:

ivy-fail:

ivy-configure:
[ivy:configure] :: loading settings :: file = /home/jenkins/jenkins-slave/workspace/Lucene-Solr-Tests-8.x/lucene/top-level-ivy-settings.xml

resolve:

ivy-availability-check:
[loadresource] Do not set property disallowed.ivy.jars.list as its length is 0.

-ivy-fail-disallowed-ivy-version:

ivy-fail:

ivy-fail:

ivy-configure:
[ivy:configure] :: loading settings :: file = /home/jenkins/jenkins-slave/workspace/Lucene-Solr-Tests-8.x/lucene/top-level-ivy-settings.xml

resolve:

jar-checksums:
    [mkdir] Created dir: /home/jenkins/jenkins-slave/workspace/Lucene-Solr-Tests-8.x/solr/null1465700631
     [copy] Copying 249 files to /home/jenkins/jenkins-slave/workspace/Lucene-Solr-Tests-8.x/solr/null1465700631
   [delete] Deleting directory /home/jenkins/jenkins-slave/workspace/Lucene-Solr-Tests-8.x/solr/null1465700631

check-working-copy:
[ivy:cachepath] :: resolving dependencies :: #;working@lucene1-us-west
[ivy:cachepath] confs: [default]
[ivy:cachepath] found org.eclipse.jgit#org.eclipse.jgit;5.3.0.201903130848-r in public
[ivy:cachepath] found com.jcraft#jsch;0.1.54 in public
[ivy:cachepath] found com.jcraft#jzlib;1.1.1 in public
[ivy:cachepath] found com.googlecode.javaewah#JavaEWAH;1.1.6 in public
[ivy:cachepath] found org.slf4j#slf4j-api;1.7.2 in public
[ivy:cachepath] found org.bouncycastle#bcpg-jdk15on;1.60 in public
[ivy:cachepath] found org.bouncycastle#bcprov-jdk15on;1.60 in public
[ivy:cachepath] found org.bouncycastle#bcpkix-jdk15on;1.60 in public
[ivy:cachepath] found org.slf4j#slf4j-nop;1.7.2 in public
[ivy:cachepath] :: resolution report :: resolve 267ms :: artifacts dl 3ms
        ---------------------------------------------------------------------
        |                  |            modules            ||   artifacts   |
        |       conf       | number| search|dwnlded|evicted|| number|dwnlded|
        ---------------------------------------------------------------------
        |      default     |   9   |   0   |   0   |   0   ||   9   |   0   |
        ---------------------------------------------------------------------
[wc-checker] Initializing working copy...
[wc-checker] Checking working copy status...

-jenkins-base:

BUILD SUCCESSFUL
Total time: 117 minutes 52 seconds
Archiving artifacts
java.lang.InterruptedException: no matches found within 10000
        at hudson.FilePath$ValidateAntFileMask.hasMatch(FilePath.java:2847)
        at hudson.FilePath$ValidateAntFileMask.invoke(FilePath.java:2726)
        at hudson.FilePath$ValidateAntFileMask.invoke(FilePath.java:2707)
        at hudson.FilePath$FileCallableWrapper.call(FilePath.java:3086)
Also:   hudson.remoting.Channel$CallSiteStackTrace: Remote call to lucene
                at hudson.remoting.Channel.attachCallSiteStackTrace(Channel.java:1741)
                at hudson.remoting.UserRequest$ExceptionResponse.retrieve(UserRequest.java:357)
                at hudson.remoting.Channel.call(Channel.java:955)
                at hudson.FilePath.act(FilePath.java:1072)
                at hudson.FilePath.act(FilePath.java:1061)
                at hudson.FilePath.validateAntFileMask(FilePath.java:2705)
                at hudson.tasks.ArtifactArchiver.perform(ArtifactArchiver.java:243)
                at hudson.tasks.BuildStepCompatibilityLayer.perform(BuildStepCompatibilityLayer.java:81)
                at hudson.tasks.BuildStepMonitor$1.perform(BuildStepMonitor.java:20)
                at hudson.model.AbstractBuild$AbstractBuildExecution.perform(AbstractBuild.java:744)
                at hudson.model.AbstractBuild$AbstractBuildExecution.performAllBuildSteps(AbstractBuild.java:690)
                at hudson.model.Build$BuildExecution.post2(Build.java:186)
                at hudson.model.AbstractBuild$AbstractBuildExecution.post(AbstractBuild.java:635)
                at hudson.model.Run.execute(Run.java:1835)
                at hudson.model.FreeStyleBuild.run(FreeStyleBuild.java:43)
                at hudson.model.ResourceController.execute(ResourceController.java:97)
                at hudson.model.Executor.run(Executor.java:429)
Caused: hudson.FilePath$TunneledInterruptedException
        at hudson.FilePath$FileCallableWrapper.call(FilePath.java:3088)
        at hudson.remoting.UserRequest.perform(UserRequest.java:212)
        at hudson.remoting.UserRequest.perform(UserRequest.java:54)
        at hudson.remoting.Request$2.run(Request.java:369)
        at hudson.remoting.InterceptingExecutorService$1.call(InterceptingExecutorService.java:72)
        at java.util.concurrent.FutureTask.run(FutureTask.java:266)
        at java.util.concurrent.ThreadPoolExecutor.runWorker(ThreadPoolExecutor.java:1142)
        at java.util.concurrent.ThreadPoolExecutor$Worker.run(ThreadPoolExecutor.java:617)
        at java.lang.Thread.run(Thread.java:744)
Caused: java.lang.InterruptedException: java.lang.InterruptedException: no matches found within 10000
        at hudson.FilePath.act(FilePath.java:1074)
        at hudson.FilePath.act(FilePath.java:1061)
        at hudson.FilePath.validateAntFileMask(FilePath.java:2705)
        at hudson.tasks.ArtifactArchiver.perform(ArtifactArchiver.java:243)
        at hudson.tasks.BuildStepCompatibilityLayer.perform(BuildStepCompatibilityLayer.java:81)
        at hudson.tasks.BuildStepMonitor$1.perform(BuildStepMonitor.java:20)
        at hudson.model.AbstractBuild$AbstractBuildExecution.perform(AbstractBuild.java:744)
        at hudson.model.AbstractBuild$AbstractBuildExecution.performAllBuildSteps(AbstractBuild.java:690)
        at hudson.model.Build$BuildExecution.post2(Build.java:186)
        at hudson.model.AbstractBuild$AbstractBuildExecution.post(AbstractBuild.java:635)
        at hudson.model.Run.execute(Run.java:1835)
        at hudson.model.FreeStyleBuild.run(FreeStyleBuild.java:43)
        at hudson.model.ResourceController.execute(ResourceController.java:97)
        at hudson.model.Executor.run(Executor.java:429)
No artifacts found that match the file pattern "**/*.events,heapdumps/**,**/hs_err_pid*". Configuration error?
Recording test results
Build step 'Publish JUnit test result report' changed build result to UNSTABLE
Email was triggered for: Unstable (Test Failures)
Sending email for trigger: Unstable (Test Failures)


---------------------------------------------------------------------
To unsubscribe, e-mail: [hidden email]
For additional commands, e-mail: [hidden email]