[JENKINS] Lucene-Solr-Tests-8.x - Build # 562 - Unstable

classic Classic list List threaded Threaded
1 message Options
Reply | Threaded
Open this post in threaded view
|

[JENKINS] Lucene-Solr-Tests-8.x - Build # 562 - Unstable

Apache Jenkins Server-2
Build: https://builds.apache.org/job/Lucene-Solr-Tests-8.x/562/

1 tests failed.
FAILED:  junit.framework.TestSuite.org.apache.solr.handler.TestReplicationHandler

Error Message:
ObjectTracker found 9 object(s) that were not released!!! [SolrCore, MockDirectoryWrapper, MockDirectoryWrapper, MockDirectoryWrapper, SolrCore, InternalHttpClient, MockDirectoryWrapper, MockDirectoryWrapper, InternalHttpClient] org.apache.solr.common.util.ObjectReleaseTracker$ObjectTrackerException: org.apache.solr.core.SolrCore  at org.apache.solr.common.util.ObjectReleaseTracker.track(ObjectReleaseTracker.java:42)  at org.apache.solr.core.SolrCore.<init>(SolrCore.java:1093)  at org.apache.solr.core.SolrCore.<init>(SolrCore.java:914)  at org.apache.solr.core.CoreContainer.createFromDescriptor(CoreContainer.java:1252)  at org.apache.solr.core.CoreContainer.lambda$load$13(CoreContainer.java:766)  at com.codahale.metrics.InstrumentedExecutorService$InstrumentedCallable.call(InstrumentedExecutorService.java:202)  at java.util.concurrent.FutureTask.run(FutureTask.java:266)  at org.apache.solr.common.util.ExecutorUtil$MDCAwareThreadPoolExecutor.lambda$execute$0(ExecutorUtil.java:210)  at java.util.concurrent.ThreadPoolExecutor.runWorker(ThreadPoolExecutor.java:1149)  at java.util.concurrent.ThreadPoolExecutor$Worker.run(ThreadPoolExecutor.java:624)  at java.lang.Thread.run(Thread.java:748)  org.apache.solr.common.util.ObjectReleaseTracker$ObjectTrackerException: org.apache.lucene.store.MockDirectoryWrapper  at org.apache.solr.common.util.ObjectReleaseTracker.track(ObjectReleaseTracker.java:42)  at org.apache.solr.core.CachingDirectoryFactory.get(CachingDirectoryFactory.java:348)  at org.apache.solr.update.SolrIndexWriter.create(SolrIndexWriter.java:99)  at org.apache.solr.core.SolrCore.initIndex(SolrCore.java:805)  at org.apache.solr.core.SolrCore.<init>(SolrCore.java:1003)  at org.apache.solr.core.SolrCore.<init>(SolrCore.java:914)  at org.apache.solr.core.CoreContainer.createFromDescriptor(CoreContainer.java:1252)  at org.apache.solr.core.CoreContainer.lambda$load$13(CoreContainer.java:766)  at com.codahale.metrics.InstrumentedExecutorService$InstrumentedCallable.call(InstrumentedExecutorService.java:202)  at java.util.concurrent.FutureTask.run(FutureTask.java:266)  at org.apache.solr.common.util.ExecutorUtil$MDCAwareThreadPoolExecutor.lambda$execute$0(ExecutorUtil.java:210)  at java.util.concurrent.ThreadPoolExecutor.runWorker(ThreadPoolExecutor.java:1149)  at java.util.concurrent.ThreadPoolExecutor$Worker.run(ThreadPoolExecutor.java:624)  at java.lang.Thread.run(Thread.java:748)  org.apache.solr.common.util.ObjectReleaseTracker$ObjectTrackerException: org.apache.lucene.store.MockDirectoryWrapper  at org.apache.solr.common.util.ObjectReleaseTracker.track(ObjectReleaseTracker.java:42)  at org.apache.solr.core.CachingDirectoryFactory.get(CachingDirectoryFactory.java:348)  at org.apache.solr.core.SolrCore.getNewIndexDir(SolrCore.java:396)  at org.apache.solr.core.SolrCore.initIndex(SolrCore.java:773)  at org.apache.solr.core.SolrCore.<init>(SolrCore.java:1003)  at org.apache.solr.core.SolrCore.<init>(SolrCore.java:914)  at org.apache.solr.core.CoreContainer.createFromDescriptor(CoreContainer.java:1252)  at org.apache.solr.core.CoreContainer.lambda$load$13(CoreContainer.java:766)  at com.codahale.metrics.InstrumentedExecutorService$InstrumentedCallable.call(InstrumentedExecutorService.java:202)  at java.util.concurrent.FutureTask.run(FutureTask.java:266)  at org.apache.solr.common.util.ExecutorUtil$MDCAwareThreadPoolExecutor.lambda$execute$0(ExecutorUtil.java:210)  at java.util.concurrent.ThreadPoolExecutor.runWorker(ThreadPoolExecutor.java:1149)  at java.util.concurrent.ThreadPoolExecutor$Worker.run(ThreadPoolExecutor.java:624)  at java.lang.Thread.run(Thread.java:748)  org.apache.solr.common.util.ObjectReleaseTracker$ObjectTrackerException: org.apache.lucene.store.MockDirectoryWrapper  at org.apache.solr.common.util.ObjectReleaseTracker.track(ObjectReleaseTracker.java:42)  at org.apache.solr.core.CachingDirectoryFactory.get(CachingDirectoryFactory.java:348)  at org.apache.solr.update.SolrIndexWriter.create(SolrIndexWriter.java:99)  at org.apache.solr.core.SolrCore.initIndex(SolrCore.java:805)  at org.apache.solr.core.SolrCore.<init>(SolrCore.java:1003)  at org.apache.solr.core.SolrCore.<init>(SolrCore.java:914)  at org.apache.solr.core.CoreContainer.createFromDescriptor(CoreContainer.java:1252)  at org.apache.solr.core.CoreContainer.lambda$load$13(CoreContainer.java:766)  at com.codahale.metrics.InstrumentedExecutorService$InstrumentedCallable.call(InstrumentedExecutorService.java:202)  at java.util.concurrent.FutureTask.run(FutureTask.java:266)  at org.apache.solr.common.util.ExecutorUtil$MDCAwareThreadPoolExecutor.lambda$execute$0(ExecutorUtil.java:210)  at java.util.concurrent.ThreadPoolExecutor.runWorker(ThreadPoolExecutor.java:1149)  at java.util.concurrent.ThreadPoolExecutor$Worker.run(ThreadPoolExecutor.java:624)  at java.lang.Thread.run(Thread.java:748)  org.apache.solr.common.util.ObjectReleaseTracker$ObjectTrackerException: org.apache.solr.core.SolrCore  at org.apache.solr.common.util.ObjectReleaseTracker.track(ObjectReleaseTracker.java:42)  at org.apache.solr.core.SolrCore.<init>(SolrCore.java:1093)  at org.apache.solr.core.SolrCore.<init>(SolrCore.java:914)  at org.apache.solr.core.CoreContainer.createFromDescriptor(CoreContainer.java:1252)  at org.apache.solr.core.CoreContainer.lambda$load$13(CoreContainer.java:766)  at com.codahale.metrics.InstrumentedExecutorService$InstrumentedCallable.call(InstrumentedExecutorService.java:202)  at java.util.concurrent.FutureTask.run(FutureTask.java:266)  at org.apache.solr.common.util.ExecutorUtil$MDCAwareThreadPoolExecutor.lambda$execute$0(ExecutorUtil.java:210)  at java.util.concurrent.ThreadPoolExecutor.runWorker(ThreadPoolExecutor.java:1149)  at java.util.concurrent.ThreadPoolExecutor$Worker.run(ThreadPoolExecutor.java:624)  at java.lang.Thread.run(Thread.java:748)  org.apache.solr.common.util.ObjectReleaseTracker$ObjectTrackerException: org.apache.http.impl.client.InternalHttpClient  at org.apache.solr.common.util.ObjectReleaseTracker.track(ObjectReleaseTracker.java:42)  at org.apache.solr.client.solrj.impl.HttpClientUtil.createClient(HttpClientUtil.java:321)  at org.apache.solr.client.solrj.impl.HttpClientUtil.createClient(HttpClientUtil.java:330)  at org.apache.solr.handler.IndexFetcher.createHttpClient(IndexFetcher.java:230)  at org.apache.solr.handler.IndexFetcher.<init>(IndexFetcher.java:272)  at org.apache.solr.handler.ReplicationHandler.inform(ReplicationHandler.java:1224)  at org.apache.solr.core.SolrResourceLoader.inform(SolrResourceLoader.java:696)  at org.apache.solr.core.SolrCore.<init>(SolrCore.java:1039)  at org.apache.solr.core.SolrCore.<init>(SolrCore.java:914)  at org.apache.solr.core.CoreContainer.createFromDescriptor(CoreContainer.java:1252)  at org.apache.solr.core.CoreContainer.lambda$load$13(CoreContainer.java:766)  at com.codahale.metrics.InstrumentedExecutorService$InstrumentedCallable.call(InstrumentedExecutorService.java:202)  at java.util.concurrent.FutureTask.run(FutureTask.java:266)  at org.apache.solr.common.util.ExecutorUtil$MDCAwareThreadPoolExecutor.lambda$execute$0(ExecutorUtil.java:210)  at java.util.concurrent.ThreadPoolExecutor.runWorker(ThreadPoolExecutor.java:1149)  at java.util.concurrent.ThreadPoolExecutor$Worker.run(ThreadPoolExecutor.java:624)  at java.lang.Thread.run(Thread.java:748)  org.apache.solr.common.util.ObjectReleaseTracker$ObjectTrackerException: org.apache.lucene.store.MockDirectoryWrapper  at org.apache.solr.common.util.ObjectReleaseTracker.track(ObjectReleaseTracker.java:42)  at org.apache.solr.core.CachingDirectoryFactory.get(CachingDirectoryFactory.java:348)  at org.apache.solr.core.SolrCore.initSnapshotMetaDataManager(SolrCore.java:544)  at org.apache.solr.core.SolrCore.<init>(SolrCore.java:995)  at org.apache.solr.core.SolrCore.<init>(SolrCore.java:914)  at org.apache.solr.core.CoreContainer.createFromDescriptor(CoreContainer.java:1252)  at org.apache.solr.core.CoreContainer.lambda$load$13(CoreContainer.java:766)  at com.codahale.metrics.InstrumentedExecutorService$InstrumentedCallable.call(InstrumentedExecutorService.java:202)  at java.util.concurrent.FutureTask.run(FutureTask.java:266)  at org.apache.solr.common.util.ExecutorUtil$MDCAwareThreadPoolExecutor.lambda$execute$0(ExecutorUtil.java:210)  at java.util.concurrent.ThreadPoolExecutor.runWorker(ThreadPoolExecutor.java:1149)  at java.util.concurrent.ThreadPoolExecutor$Worker.run(ThreadPoolExecutor.java:624)  at java.lang.Thread.run(Thread.java:748)  org.apache.solr.common.util.ObjectReleaseTracker$ObjectTrackerException: org.apache.lucene.store.MockDirectoryWrapper  at org.apache.solr.common.util.ObjectReleaseTracker.track(ObjectReleaseTracker.java:42)  at org.apache.solr.core.CachingDirectoryFactory.get(CachingDirectoryFactory.java:348)  at org.apache.solr.core.SolrCore.getNewIndexDir(SolrCore.java:396)  at org.apache.solr.core.SolrCore.initIndex(SolrCore.java:773)  at org.apache.solr.core.SolrCore.<init>(SolrCore.java:1003)  at org.apache.solr.core.SolrCore.<init>(SolrCore.java:914)  at org.apache.solr.core.CoreContainer.createFromDescriptor(CoreContainer.java:1252)  at org.apache.solr.core.CoreContainer.lambda$load$13(CoreContainer.java:766)  at com.codahale.metrics.InstrumentedExecutorService$InstrumentedCallable.call(InstrumentedExecutorService.java:202)  at java.util.concurrent.FutureTask.run(FutureTask.java:266)  at org.apache.solr.common.util.ExecutorUtil$MDCAwareThreadPoolExecutor.lambda$execute$0(ExecutorUtil.java:210)  at java.util.concurrent.ThreadPoolExecutor.runWorker(ThreadPoolExecutor.java:1149)  at java.util.concurrent.ThreadPoolExecutor$Worker.run(ThreadPoolExecutor.java:624)  at java.lang.Thread.run(Thread.java:748)  org.apache.solr.common.util.ObjectReleaseTracker$ObjectTrackerException: org.apache.http.impl.client.InternalHttpClient  at org.apache.solr.common.util.ObjectReleaseTracker.track(ObjectReleaseTracker.java:42)  at org.apache.solr.client.solrj.impl.HttpClientUtil.createClient(HttpClientUtil.java:321)  at org.apache.solr.client.solrj.impl.HttpClientUtil.createClient(HttpClientUtil.java:330)  at org.apache.solr.handler.IndexFetcher.createHttpClient(IndexFetcher.java:230)  at org.apache.solr.handler.IndexFetcher.<init>(IndexFetcher.java:272)  at org.apache.solr.handler.ReplicationHandler.inform(ReplicationHandler.java:1224)  at org.apache.solr.core.SolrResourceLoader.inform(SolrResourceLoader.java:696)  at org.apache.solr.core.SolrCore.<init>(SolrCore.java:1039)  at org.apache.solr.core.SolrCore.<init>(SolrCore.java:914)  at org.apache.solr.core.CoreContainer.createFromDescriptor(CoreContainer.java:1252)  at org.apache.solr.core.CoreContainer.lambda$load$13(CoreContainer.java:766)  at com.codahale.metrics.InstrumentedExecutorService$InstrumentedCallable.call(InstrumentedExecutorService.java:202)  at java.util.concurrent.FutureTask.run(FutureTask.java:266)  at org.apache.solr.common.util.ExecutorUtil$MDCAwareThreadPoolExecutor.lambda$execute$0(ExecutorUtil.java:210)  at java.util.concurrent.ThreadPoolExecutor.runWorker(ThreadPoolExecutor.java:1149)  at java.util.concurrent.ThreadPoolExecutor$Worker.run(ThreadPoolExecutor.java:624)  at java.lang.Thread.run(Thread.java:748)   expected null, but was:<ObjectTracker found 9 object(s) that were not released!!! [SolrCore, MockDirectoryWrapper, MockDirectoryWrapper, MockDirectoryWrapper, SolrCore, InternalHttpClient, MockDirectoryWrapper, MockDirectoryWrapper, InternalHttpClient] org.apache.solr.common.util.ObjectReleaseTracker$ObjectTrackerException: org.apache.solr.core.SolrCore  at org.apache.solr.common.util.ObjectReleaseTracker.track(ObjectReleaseTracker.java:42)  at org.apache.solr.core.SolrCore.<init>(SolrCore.java:1093)  at org.apache.solr.core.SolrCore.<init>(SolrCore.java:914)  at org.apache.solr.core.CoreContainer.createFromDescriptor(CoreContainer.java:1252)  at org.apache.solr.core.CoreContainer.lambda$load$13(CoreContainer.java:766)  at com.codahale.metrics.InstrumentedExecutorService$InstrumentedCallable.call(InstrumentedExecutorService.java:202)  at java.util.concurrent.FutureTask.run(FutureTask.java:266)  at org.apache.solr.common.util.ExecutorUtil$MDCAwareThreadPoolExecutor.lambda$execute$0(ExecutorUtil.java:210)  at java.util.concurrent.ThreadPoolExecutor.runWorker(ThreadPoolExecutor.java:1149)  at java.util.concurrent.ThreadPoolExecutor$Worker.run(ThreadPoolExecutor.java:624)  at java.lang.Thread.run(Thread.java:748)  org.apache.solr.common.util.ObjectReleaseTracker$ObjectTrackerException: org.apache.lucene.store.MockDirectoryWrapper  at org.apache.solr.common.util.ObjectReleaseTracker.track(ObjectReleaseTracker.java:42)  at org.apache.solr.core.CachingDirectoryFactory.get(CachingDirectoryFactory.java:348)  at org.apache.solr.update.SolrIndexWriter.create(SolrIndexWriter.java:99)  at org.apache.solr.core.SolrCore.initIndex(SolrCore.java:805)  at org.apache.solr.core.SolrCore.<init>(SolrCore.java:1003)  at org.apache.solr.core.SolrCore.<init>(SolrCore.java:914)  at org.apache.solr.core.CoreContainer.createFromDescriptor(CoreContainer.java:1252)  at org.apache.solr.core.CoreContainer.lambda$load$13(CoreContainer.java:766)  at com.codahale.metrics.InstrumentedExecutorService$InstrumentedCallable.call(InstrumentedExecutorService.java:202)  at java.util.concurrent.FutureTask.run(FutureTask.java:266)  at org.apache.solr.common.util.ExecutorUtil$MDCAwareThreadPoolExecutor.lambda$execute$0(ExecutorUtil.java:210)  at java.util.concurrent.ThreadPoolExecutor.runWorker(ThreadPoolExecutor.java:1149)  at java.util.concurrent.ThreadPoolExecutor$Worker.run(ThreadPoolExecutor.java:624)  at java.lang.Thread.run(Thread.java:748)  org.apache.solr.common.util.ObjectReleaseTracker$ObjectTrackerException: org.apache.lucene.store.MockDirectoryWrapper  at org.apache.solr.common.util.ObjectReleaseTracker.track(ObjectReleaseTracker.java:42)  at org.apache.solr.core.CachingDirectoryFactory.get(CachingDirectoryFactory.java:348)  at org.apache.solr.core.SolrCore.getNewIndexDir(SolrCore.java:396)  at org.apache.solr.core.SolrCore.initIndex(SolrCore.java:773)  at org.apache.solr.core.SolrCore.<init>(SolrCore.java:1003)  at org.apache.solr.core.SolrCore.<init>(SolrCore.java:914)  at org.apache.solr.core.CoreContainer.createFromDescriptor(CoreContainer.java:1252)  at org.apache.solr.core.CoreContainer.lambda$load$13(CoreContainer.java:766)  at com.codahale.metrics.InstrumentedExecutorService$InstrumentedCallable.call(InstrumentedExecutorService.java:202)  at java.util.concurrent.FutureTask.run(FutureTask.java:266)  at org.apache.solr.common.util.ExecutorUtil$MDCAwareThreadPoolExecutor.lambda$execute$0(ExecutorUtil.java:210)  at java.util.concurrent.ThreadPoolExecutor.runWorker(ThreadPoolExecutor.java:1149)  at java.util.concurrent.ThreadPoolExecutor$Worker.run(ThreadPoolExecutor.java:624)  at java.lang.Thread.run(Thread.java:748)  org.apache.solr.common.util.ObjectReleaseTracker$ObjectTrackerException: org.apache.lucene.store.MockDirectoryWrapper  at org.apache.solr.common.util.ObjectReleaseTracker.track(ObjectReleaseTracker.java:42)  at org.apache.solr.core.CachingDirectoryFactory.get(CachingDirectoryFactory.java:348)  at org.apache.solr.update.SolrIndexWriter.create(SolrIndexWriter.java:99)  at org.apache.solr.core.SolrCore.initIndex(SolrCore.java:805)  at org.apache.solr.core.SolrCore.<init>(SolrCore.java:1003)  at org.apache.solr.core.SolrCore.<init>(SolrCore.java:914)  at org.apache.solr.core.CoreContainer.createFromDescriptor(CoreContainer.java:1252)  at org.apache.solr.core.CoreContainer.lambda$load$13(CoreContainer.java:766)  at com.codahale.metrics.InstrumentedExecutorService$InstrumentedCallable.call(InstrumentedExecutorService.java:202)  at java.util.concurrent.FutureTask.run(FutureTask.java:266)  at org.apache.solr.common.util.ExecutorUtil$MDCAwareThreadPoolExecutor.lambda$execute$0(ExecutorUtil.java:210)  at java.util.concurrent.ThreadPoolExecutor.runWorker(ThreadPoolExecutor.java:1149)  at java.util.concurrent.ThreadPoolExecutor$Worker.run(ThreadPoolExecutor.java:624)  at java.lang.Thread.run(Thread.java:748)  org.apache.solr.common.util.ObjectReleaseTracker$ObjectTrackerException: org.apache.solr.core.SolrCore  at org.apache.solr.common.util.ObjectReleaseTracker.track(ObjectReleaseTracker.java:42)  at org.apache.solr.core.SolrCore.<init>(SolrCore.java:1093)  at org.apache.solr.core.SolrCore.<init>(SolrCore.java:914)  at org.apache.solr.core.CoreContainer.createFromDescriptor(CoreContainer.java:1252)  at org.apache.solr.core.CoreContainer.lambda$load$13(CoreContainer.java:766)  at com.codahale.metrics.InstrumentedExecutorService$InstrumentedCallable.call(InstrumentedExecutorService.java:202)  at java.util.concurrent.FutureTask.run(FutureTask.java:266)  at org.apache.solr.common.util.ExecutorUtil$MDCAwareThreadPoolExecutor.lambda$execute$0(ExecutorUtil.java:210)  at java.util.concurrent.ThreadPoolExecutor.runWorker(ThreadPoolExecutor.java:1149)  at java.util.concurrent.ThreadPoolExecutor$Worker.run(ThreadPoolExecutor.java:624)  at java.lang.Thread.run(Thread.java:748)  org.apache.solr.common.util.ObjectReleaseTracker$ObjectTrackerException: org.apache.http.impl.client.InternalHttpClient  at org.apache.solr.common.util.ObjectReleaseTracker.track(ObjectReleaseTracker.java:42)  at org.apache.solr.client.solrj.impl.HttpClientUtil.createClient(HttpClientUtil.java:321)  at org.apache.solr.client.solrj.impl.HttpClientUtil.createClient(HttpClientUtil.java:330)  at org.apache.solr.handler.IndexFetcher.createHttpClient(IndexFetcher.java:230)  at org.apache.solr.handler.IndexFetcher.<init>(IndexFetcher.java:272)  at org.apache.solr.handler.ReplicationHandler.inform(ReplicationHandler.java:1224)  at org.apache.solr.core.SolrResourceLoader.inform(SolrResourceLoader.java:696)  at org.apache.solr.core.SolrCore.<init>(SolrCore.java:1039)  at org.apache.solr.core.SolrCore.<init>(SolrCore.java:914)  at org.apache.solr.core.CoreContainer.createFromDescriptor(CoreContainer.java:1252)  at org.apache.solr.core.CoreContainer.lambda$load$13(CoreContainer.java:766)  at com.codahale.metrics.InstrumentedExecutorService$InstrumentedCallable.call(InstrumentedExecutorService.java:202)  at java.util.concurrent.FutureTask.run(FutureTask.java:266)  at org.apache.solr.common.util.ExecutorUtil$MDCAwareThreadPoolExecutor.lambda$execute$0(ExecutorUtil.java:210)  at java.util.concurrent.ThreadPoolExecutor.runWorker(ThreadPoolExecutor.java:1149)  at java.util.concurrent.ThreadPoolExecutor$Worker.run(ThreadPoolExecutor.java:624)  at java.lang.Thread.run(Thread.java:748)  org.apache.solr.common.util.ObjectReleaseTracker$ObjectTrackerException: org.apache.lucene.store.MockDirectoryWrapper  at org.apache.solr.common.util.ObjectReleaseTracker.track(ObjectReleaseTracker.java:42)  at org.apache.solr.core.CachingDirectoryFactory.get(CachingDirectoryFactory.java:348)  at org.apache.solr.core.SolrCore.initSnapshotMetaDataManager(SolrCore.java:544)  at org.apache.solr.core.SolrCore.<init>(SolrCore.java:995)  at org.apache.solr.core.SolrCore.<init>(SolrCore.java:914)  at org.apache.solr.core.CoreContainer.createFromDescriptor(CoreContainer.java:1252)  at org.apache.solr.core.CoreContainer.lambda$load$13(CoreContainer.java:766)  at com.codahale.metrics.InstrumentedExecutorService$InstrumentedCallable.call(InstrumentedExecutorService.java:202)  at java.util.concurrent.FutureTask.run(FutureTask.java:266)  at org.apache.solr.common.util.ExecutorUtil$MDCAwareThreadPoolExecutor.lambda$execute$0(ExecutorUtil.java:210)  at java.util.concurrent.ThreadPoolExecutor.runWorker(ThreadPoolExecutor.java:1149)  at java.util.concurrent.ThreadPoolExecutor$Worker.run(ThreadPoolExecutor.java:624)  at java.lang.Thread.run(Thread.java:748)  org.apache.solr.common.util.ObjectReleaseTracker$ObjectTrackerException: org.apache.lucene.store.MockDirectoryWrapper  at org.apache.solr.common.util.ObjectReleaseTracker.track(ObjectReleaseTracker.java:42)  at org.apache.solr.core.CachingDirectoryFactory.get(CachingDirectoryFactory.java:348)  at org.apache.solr.core.SolrCore.getNewIndexDir(SolrCore.java:396)  at org.apache.solr.core.SolrCore.initIndex(SolrCore.java:773)  at org.apache.solr.core.SolrCore.<init>(SolrCore.java:1003)  at org.apache.solr.core.SolrCore.<init>(SolrCore.java:914)  at org.apache.solr.core.CoreContainer.createFromDescriptor(CoreContainer.java:1252)  at org.apache.solr.core.CoreContainer.lambda$load$13(CoreContainer.java:766)  at com.codahale.metrics.InstrumentedExecutorService$InstrumentedCallable.call(InstrumentedExecutorService.java:202)  at java.util.concurrent.FutureTask.run(FutureTask.java:266)  at org.apache.solr.common.util.ExecutorUtil$MDCAwareThreadPoolExecutor.lambda$execute$0(ExecutorUtil.java:210)  at java.util.concurrent.ThreadPoolExecutor.runWorker(ThreadPoolExecutor.java:1149)  at java.util.concurrent.ThreadPoolExecutor$Worker.run(ThreadPoolExecutor.java:624)  at java.lang.Thread.run(Thread.java:748)  org.apache.solr.common.util.ObjectReleaseTracker$ObjectTrackerException: org.apache.http.impl.client.InternalHttpClient  at org.apache.solr.common.util.ObjectReleaseTracker.track(ObjectReleaseTracker.java:42)  at org.apache.solr.client.solrj.impl.HttpClientUtil.createClient(HttpClientUtil.java:321)  at org.apache.solr.client.solrj.impl.HttpClientUtil.createClient(HttpClientUtil.java:330)  at org.apache.solr.handler.IndexFetcher.createHttpClient(IndexFetcher.java:230)  at org.apache.solr.handler.IndexFetcher.<init>(IndexFetcher.java:272)  at org.apache.solr.handler.ReplicationHandler.inform(ReplicationHandler.java:1224)  at org.apache.solr.core.SolrResourceLoader.inform(SolrResourceLoader.java:696)  at org.apache.solr.core.SolrCore.<init>(SolrCore.java:1039)  at org.apache.solr.core.SolrCore.<init>(SolrCore.java:914)  at org.apache.solr.core.CoreContainer.createFromDescriptor(CoreContainer.java:1252)  at org.apache.solr.core.CoreContainer.lambda$load$13(CoreContainer.java:766)  at com.codahale.metrics.InstrumentedExecutorService$InstrumentedCallable.call(InstrumentedExecutorService.java:202)  at java.util.concurrent.FutureTask.run(FutureTask.java:266)  at org.apache.solr.common.util.ExecutorUtil$MDCAwareThreadPoolExecutor.lambda$execute$0(ExecutorUtil.java:210)  at java.util.concurrent.ThreadPoolExecutor.runWorker(ThreadPoolExecutor.java:1149)  at java.util.concurrent.ThreadPoolExecutor$Worker.run(ThreadPoolExecutor.java:624)  at java.lang.Thread.run(Thread.java:748)  >

Stack Trace:
java.lang.AssertionError: ObjectTracker found 9 object(s) that were not released!!! [SolrCore, MockDirectoryWrapper, MockDirectoryWrapper, MockDirectoryWrapper, SolrCore, InternalHttpClient, MockDirectoryWrapper, MockDirectoryWrapper, InternalHttpClient]
org.apache.solr.common.util.ObjectReleaseTracker$ObjectTrackerException: org.apache.solr.core.SolrCore
        at org.apache.solr.common.util.ObjectReleaseTracker.track(ObjectReleaseTracker.java:42)
        at org.apache.solr.core.SolrCore.<init>(SolrCore.java:1093)
        at org.apache.solr.core.SolrCore.<init>(SolrCore.java:914)
        at org.apache.solr.core.CoreContainer.createFromDescriptor(CoreContainer.java:1252)
        at org.apache.solr.core.CoreContainer.lambda$load$13(CoreContainer.java:766)
        at com.codahale.metrics.InstrumentedExecutorService$InstrumentedCallable.call(InstrumentedExecutorService.java:202)
        at java.util.concurrent.FutureTask.run(FutureTask.java:266)
        at org.apache.solr.common.util.ExecutorUtil$MDCAwareThreadPoolExecutor.lambda$execute$0(ExecutorUtil.java:210)
        at java.util.concurrent.ThreadPoolExecutor.runWorker(ThreadPoolExecutor.java:1149)
        at java.util.concurrent.ThreadPoolExecutor$Worker.run(ThreadPoolExecutor.java:624)
        at java.lang.Thread.run(Thread.java:748)

org.apache.solr.common.util.ObjectReleaseTracker$ObjectTrackerException: org.apache.lucene.store.MockDirectoryWrapper
        at org.apache.solr.common.util.ObjectReleaseTracker.track(ObjectReleaseTracker.java:42)
        at org.apache.solr.core.CachingDirectoryFactory.get(CachingDirectoryFactory.java:348)
        at org.apache.solr.update.SolrIndexWriter.create(SolrIndexWriter.java:99)
        at org.apache.solr.core.SolrCore.initIndex(SolrCore.java:805)
        at org.apache.solr.core.SolrCore.<init>(SolrCore.java:1003)
        at org.apache.solr.core.SolrCore.<init>(SolrCore.java:914)
        at org.apache.solr.core.CoreContainer.createFromDescriptor(CoreContainer.java:1252)
        at org.apache.solr.core.CoreContainer.lambda$load$13(CoreContainer.java:766)
        at com.codahale.metrics.InstrumentedExecutorService$InstrumentedCallable.call(InstrumentedExecutorService.java:202)
        at java.util.concurrent.FutureTask.run(FutureTask.java:266)
        at org.apache.solr.common.util.ExecutorUtil$MDCAwareThreadPoolExecutor.lambda$execute$0(ExecutorUtil.java:210)
        at java.util.concurrent.ThreadPoolExecutor.runWorker(ThreadPoolExecutor.java:1149)
        at java.util.concurrent.ThreadPoolExecutor$Worker.run(ThreadPoolExecutor.java:624)
        at java.lang.Thread.run(Thread.java:748)

org.apache.solr.common.util.ObjectReleaseTracker$ObjectTrackerException: org.apache.lucene.store.MockDirectoryWrapper
        at org.apache.solr.common.util.ObjectReleaseTracker.track(ObjectReleaseTracker.java:42)
        at org.apache.solr.core.CachingDirectoryFactory.get(CachingDirectoryFactory.java:348)
        at org.apache.solr.core.SolrCore.getNewIndexDir(SolrCore.java:396)
        at org.apache.solr.core.SolrCore.initIndex(SolrCore.java:773)
        at org.apache.solr.core.SolrCore.<init>(SolrCore.java:1003)
        at org.apache.solr.core.SolrCore.<init>(SolrCore.java:914)
        at org.apache.solr.core.CoreContainer.createFromDescriptor(CoreContainer.java:1252)
        at org.apache.solr.core.CoreContainer.lambda$load$13(CoreContainer.java:766)
        at com.codahale.metrics.InstrumentedExecutorService$InstrumentedCallable.call(InstrumentedExecutorService.java:202)
        at java.util.concurrent.FutureTask.run(FutureTask.java:266)
        at org.apache.solr.common.util.ExecutorUtil$MDCAwareThreadPoolExecutor.lambda$execute$0(ExecutorUtil.java:210)
        at java.util.concurrent.ThreadPoolExecutor.runWorker(ThreadPoolExecutor.java:1149)
        at java.util.concurrent.ThreadPoolExecutor$Worker.run(ThreadPoolExecutor.java:624)
        at java.lang.Thread.run(Thread.java:748)

org.apache.solr.common.util.ObjectReleaseTracker$ObjectTrackerException: org.apache.lucene.store.MockDirectoryWrapper
        at org.apache.solr.common.util.ObjectReleaseTracker.track(ObjectReleaseTracker.java:42)
        at org.apache.solr.core.CachingDirectoryFactory.get(CachingDirectoryFactory.java:348)
        at org.apache.solr.update.SolrIndexWriter.create(SolrIndexWriter.java:99)
        at org.apache.solr.core.SolrCore.initIndex(SolrCore.java:805)
        at org.apache.solr.core.SolrCore.<init>(SolrCore.java:1003)
        at org.apache.solr.core.SolrCore.<init>(SolrCore.java:914)
        at org.apache.solr.core.CoreContainer.createFromDescriptor(CoreContainer.java:1252)
        at org.apache.solr.core.CoreContainer.lambda$load$13(CoreContainer.java:766)
        at com.codahale.metrics.InstrumentedExecutorService$InstrumentedCallable.call(InstrumentedExecutorService.java:202)
        at java.util.concurrent.FutureTask.run(FutureTask.java:266)
        at org.apache.solr.common.util.ExecutorUtil$MDCAwareThreadPoolExecutor.lambda$execute$0(ExecutorUtil.java:210)
        at java.util.concurrent.ThreadPoolExecutor.runWorker(ThreadPoolExecutor.java:1149)
        at java.util.concurrent.ThreadPoolExecutor$Worker.run(ThreadPoolExecutor.java:624)
        at java.lang.Thread.run(Thread.java:748)

org.apache.solr.common.util.ObjectReleaseTracker$ObjectTrackerException: org.apache.solr.core.SolrCore
        at org.apache.solr.common.util.ObjectReleaseTracker.track(ObjectReleaseTracker.java:42)
        at org.apache.solr.core.SolrCore.<init>(SolrCore.java:1093)
        at org.apache.solr.core.SolrCore.<init>(SolrCore.java:914)
        at org.apache.solr.core.CoreContainer.createFromDescriptor(CoreContainer.java:1252)
        at org.apache.solr.core.CoreContainer.lambda$load$13(CoreContainer.java:766)
        at com.codahale.metrics.InstrumentedExecutorService$InstrumentedCallable.call(InstrumentedExecutorService.java:202)
        at java.util.concurrent.FutureTask.run(FutureTask.java:266)
        at org.apache.solr.common.util.ExecutorUtil$MDCAwareThreadPoolExecutor.lambda$execute$0(ExecutorUtil.java:210)
        at java.util.concurrent.ThreadPoolExecutor.runWorker(ThreadPoolExecutor.java:1149)
        at java.util.concurrent.ThreadPoolExecutor$Worker.run(ThreadPoolExecutor.java:624)
        at java.lang.Thread.run(Thread.java:748)

org.apache.solr.common.util.ObjectReleaseTracker$ObjectTrackerException: org.apache.http.impl.client.InternalHttpClient
        at org.apache.solr.common.util.ObjectReleaseTracker.track(ObjectReleaseTracker.java:42)
        at org.apache.solr.client.solrj.impl.HttpClientUtil.createClient(HttpClientUtil.java:321)
        at org.apache.solr.client.solrj.impl.HttpClientUtil.createClient(HttpClientUtil.java:330)
        at org.apache.solr.handler.IndexFetcher.createHttpClient(IndexFetcher.java:230)
        at org.apache.solr.handler.IndexFetcher.<init>(IndexFetcher.java:272)
        at org.apache.solr.handler.ReplicationHandler.inform(ReplicationHandler.java:1224)
        at org.apache.solr.core.SolrResourceLoader.inform(SolrResourceLoader.java:696)
        at org.apache.solr.core.SolrCore.<init>(SolrCore.java:1039)
        at org.apache.solr.core.SolrCore.<init>(SolrCore.java:914)
        at org.apache.solr.core.CoreContainer.createFromDescriptor(CoreContainer.java:1252)
        at org.apache.solr.core.CoreContainer.lambda$load$13(CoreContainer.java:766)
        at com.codahale.metrics.InstrumentedExecutorService$InstrumentedCallable.call(InstrumentedExecutorService.java:202)
        at java.util.concurrent.FutureTask.run(FutureTask.java:266)
        at org.apache.solr.common.util.ExecutorUtil$MDCAwareThreadPoolExecutor.lambda$execute$0(ExecutorUtil.java:210)
        at java.util.concurrent.ThreadPoolExecutor.runWorker(ThreadPoolExecutor.java:1149)
        at java.util.concurrent.ThreadPoolExecutor$Worker.run(ThreadPoolExecutor.java:624)
        at java.lang.Thread.run(Thread.java:748)

org.apache.solr.common.util.ObjectReleaseTracker$ObjectTrackerException: org.apache.lucene.store.MockDirectoryWrapper
        at org.apache.solr.common.util.ObjectReleaseTracker.track(ObjectReleaseTracker.java:42)
        at org.apache.solr.core.CachingDirectoryFactory.get(CachingDirectoryFactory.java:348)
        at org.apache.solr.core.SolrCore.initSnapshotMetaDataManager(SolrCore.java:544)
        at org.apache.solr.core.SolrCore.<init>(SolrCore.java:995)
        at org.apache.solr.core.SolrCore.<init>(SolrCore.java:914)
        at org.apache.solr.core.CoreContainer.createFromDescriptor(CoreContainer.java:1252)
        at org.apache.solr.core.CoreContainer.lambda$load$13(CoreContainer.java:766)
        at com.codahale.metrics.InstrumentedExecutorService$InstrumentedCallable.call(InstrumentedExecutorService.java:202)
        at java.util.concurrent.FutureTask.run(FutureTask.java:266)
        at org.apache.solr.common.util.ExecutorUtil$MDCAwareThreadPoolExecutor.lambda$execute$0(ExecutorUtil.java:210)
        at java.util.concurrent.ThreadPoolExecutor.runWorker(ThreadPoolExecutor.java:1149)
        at java.util.concurrent.ThreadPoolExecutor$Worker.run(ThreadPoolExecutor.java:624)
        at java.lang.Thread.run(Thread.java:748)

org.apache.solr.common.util.ObjectReleaseTracker$ObjectTrackerException: org.apache.lucene.store.MockDirectoryWrapper
        at org.apache.solr.common.util.ObjectReleaseTracker.track(ObjectReleaseTracker.java:42)
        at org.apache.solr.core.CachingDirectoryFactory.get(CachingDirectoryFactory.java:348)
        at org.apache.solr.core.SolrCore.getNewIndexDir(SolrCore.java:396)
        at org.apache.solr.core.SolrCore.initIndex(SolrCore.java:773)
        at org.apache.solr.core.SolrCore.<init>(SolrCore.java:1003)
        at org.apache.solr.core.SolrCore.<init>(SolrCore.java:914)
        at org.apache.solr.core.CoreContainer.createFromDescriptor(CoreContainer.java:1252)
        at org.apache.solr.core.CoreContainer.lambda$load$13(CoreContainer.java:766)
        at com.codahale.metrics.InstrumentedExecutorService$InstrumentedCallable.call(InstrumentedExecutorService.java:202)
        at java.util.concurrent.FutureTask.run(FutureTask.java:266)
        at org.apache.solr.common.util.ExecutorUtil$MDCAwareThreadPoolExecutor.lambda$execute$0(ExecutorUtil.java:210)
        at java.util.concurrent.ThreadPoolExecutor.runWorker(ThreadPoolExecutor.java:1149)
        at java.util.concurrent.ThreadPoolExecutor$Worker.run(ThreadPoolExecutor.java:624)
        at java.lang.Thread.run(Thread.java:748)

org.apache.solr.common.util.ObjectReleaseTracker$ObjectTrackerException: org.apache.http.impl.client.InternalHttpClient
        at org.apache.solr.common.util.ObjectReleaseTracker.track(ObjectReleaseTracker.java:42)
        at org.apache.solr.client.solrj.impl.HttpClientUtil.createClient(HttpClientUtil.java:321)
        at org.apache.solr.client.solrj.impl.HttpClientUtil.createClient(HttpClientUtil.java:330)
        at org.apache.solr.handler.IndexFetcher.createHttpClient(IndexFetcher.java:230)
        at org.apache.solr.handler.IndexFetcher.<init>(IndexFetcher.java:272)
        at org.apache.solr.handler.ReplicationHandler.inform(ReplicationHandler.java:1224)
        at org.apache.solr.core.SolrResourceLoader.inform(SolrResourceLoader.java:696)
        at org.apache.solr.core.SolrCore.<init>(SolrCore.java:1039)
        at org.apache.solr.core.SolrCore.<init>(SolrCore.java:914)
        at org.apache.solr.core.CoreContainer.createFromDescriptor(CoreContainer.java:1252)
        at org.apache.solr.core.CoreContainer.lambda$load$13(CoreContainer.java:766)
        at com.codahale.metrics.InstrumentedExecutorService$InstrumentedCallable.call(InstrumentedExecutorService.java:202)
        at java.util.concurrent.FutureTask.run(FutureTask.java:266)
        at org.apache.solr.common.util.ExecutorUtil$MDCAwareThreadPoolExecutor.lambda$execute$0(ExecutorUtil.java:210)
        at java.util.concurrent.ThreadPoolExecutor.runWorker(ThreadPoolExecutor.java:1149)
        at java.util.concurrent.ThreadPoolExecutor$Worker.run(ThreadPoolExecutor.java:624)
        at java.lang.Thread.run(Thread.java:748)

 expected null, but was:<ObjectTracker found 9 object(s) that were not released!!! [SolrCore, MockDirectoryWrapper, MockDirectoryWrapper, MockDirectoryWrapper, SolrCore, InternalHttpClient, MockDirectoryWrapper, MockDirectoryWrapper, InternalHttpClient]
org.apache.solr.common.util.ObjectReleaseTracker$ObjectTrackerException: org.apache.solr.core.SolrCore
        at org.apache.solr.common.util.ObjectReleaseTracker.track(ObjectReleaseTracker.java:42)
        at org.apache.solr.core.SolrCore.<init>(SolrCore.java:1093)
        at org.apache.solr.core.SolrCore.<init>(SolrCore.java:914)
        at org.apache.solr.core.CoreContainer.createFromDescriptor(CoreContainer.java:1252)
        at org.apache.solr.core.CoreContainer.lambda$load$13(CoreContainer.java:766)
        at com.codahale.metrics.InstrumentedExecutorService$InstrumentedCallable.call(InstrumentedExecutorService.java:202)
        at java.util.concurrent.FutureTask.run(FutureTask.java:266)
        at org.apache.solr.common.util.ExecutorUtil$MDCAwareThreadPoolExecutor.lambda$execute$0(ExecutorUtil.java:210)
        at java.util.concurrent.ThreadPoolExecutor.runWorker(ThreadPoolExecutor.java:1149)
        at java.util.concurrent.ThreadPoolExecutor$Worker.run(ThreadPoolExecutor.java:624)
        at java.lang.Thread.run(Thread.java:748)

org.apache.solr.common.util.ObjectReleaseTracker$ObjectTrackerException: org.apache.lucene.store.MockDirectoryWrapper
        at org.apache.solr.common.util.ObjectReleaseTracker.track(ObjectReleaseTracker.java:42)
        at org.apache.solr.core.CachingDirectoryFactory.get(CachingDirectoryFactory.java:348)
        at org.apache.solr.update.SolrIndexWriter.create(SolrIndexWriter.java:99)
        at org.apache.solr.core.SolrCore.initIndex(SolrCore.java:805)
        at org.apache.solr.core.SolrCore.<init>(SolrCore.java:1003)
        at org.apache.solr.core.SolrCore.<init>(SolrCore.java:914)
        at org.apache.solr.core.CoreContainer.createFromDescriptor(CoreContainer.java:1252)
        at org.apache.solr.core.CoreContainer.lambda$load$13(CoreContainer.java:766)
        at com.codahale.metrics.InstrumentedExecutorService$InstrumentedCallable.call(InstrumentedExecutorService.java:202)
        at java.util.concurrent.FutureTask.run(FutureTask.java:266)
        at org.apache.solr.common.util.ExecutorUtil$MDCAwareThreadPoolExecutor.lambda$execute$0(ExecutorUtil.java:210)
        at java.util.concurrent.ThreadPoolExecutor.runWorker(ThreadPoolExecutor.java:1149)
        at java.util.concurrent.ThreadPoolExecutor$Worker.run(ThreadPoolExecutor.java:624)
        at java.lang.Thread.run(Thread.java:748)

org.apache.solr.common.util.ObjectReleaseTracker$ObjectTrackerException: org.apache.lucene.store.MockDirectoryWrapper
        at org.apache.solr.common.util.ObjectReleaseTracker.track(ObjectReleaseTracker.java:42)
        at org.apache.solr.core.CachingDirectoryFactory.get(CachingDirectoryFactory.java:348)
        at org.apache.solr.core.SolrCore.getNewIndexDir(SolrCore.java:396)
        at org.apache.solr.core.SolrCore.initIndex(SolrCore.java:773)
        at org.apache.solr.core.SolrCore.<init>(SolrCore.java:1003)
        at org.apache.solr.core.SolrCore.<init>(SolrCore.java:914)
        at org.apache.solr.core.CoreContainer.createFromDescriptor(CoreContainer.java:1252)
        at org.apache.solr.core.CoreContainer.lambda$load$13(CoreContainer.java:766)
        at com.codahale.metrics.InstrumentedExecutorService$InstrumentedCallable.call(InstrumentedExecutorService.java:202)
        at java.util.concurrent.FutureTask.run(FutureTask.java:266)
        at org.apache.solr.common.util.ExecutorUtil$MDCAwareThreadPoolExecutor.lambda$execute$0(ExecutorUtil.java:210)
        at java.util.concurrent.ThreadPoolExecutor.runWorker(ThreadPoolExecutor.java:1149)
        at java.util.concurrent.ThreadPoolExecutor$Worker.run(ThreadPoolExecutor.java:624)
        at java.lang.Thread.run(Thread.java:748)

org.apache.solr.common.util.ObjectReleaseTracker$ObjectTrackerException: org.apache.lucene.store.MockDirectoryWrapper
        at org.apache.solr.common.util.ObjectReleaseTracker.track(ObjectReleaseTracker.java:42)
        at org.apache.solr.core.CachingDirectoryFactory.get(CachingDirectoryFactory.java:348)
        at org.apache.solr.update.SolrIndexWriter.create(SolrIndexWriter.java:99)
        at org.apache.solr.core.SolrCore.initIndex(SolrCore.java:805)
        at org.apache.solr.core.SolrCore.<init>(SolrCore.java:1003)
        at org.apache.solr.core.SolrCore.<init>(SolrCore.java:914)
        at org.apache.solr.core.CoreContainer.createFromDescriptor(CoreContainer.java:1252)
        at org.apache.solr.core.CoreContainer.lambda$load$13(CoreContainer.java:766)
        at com.codahale.metrics.InstrumentedExecutorService$InstrumentedCallable.call(InstrumentedExecutorService.java:202)
        at java.util.concurrent.FutureTask.run(FutureTask.java:266)
        at org.apache.solr.common.util.ExecutorUtil$MDCAwareThreadPoolExecutor.lambda$execute$0(ExecutorUtil.java:210)
        at java.util.concurrent.ThreadPoolExecutor.runWorker(ThreadPoolExecutor.java:1149)
        at java.util.concurrent.ThreadPoolExecutor$Worker.run(ThreadPoolExecutor.java:624)
        at java.lang.Thread.run(Thread.java:748)

org.apache.solr.common.util.ObjectReleaseTracker$ObjectTrackerException: org.apache.solr.core.SolrCore
        at org.apache.solr.common.util.ObjectReleaseTracker.track(ObjectReleaseTracker.java:42)
        at org.apache.solr.core.SolrCore.<init>(SolrCore.java:1093)
        at org.apache.solr.core.SolrCore.<init>(SolrCore.java:914)
        at org.apache.solr.core.CoreContainer.createFromDescriptor(CoreContainer.java:1252)
        at org.apache.solr.core.CoreContainer.lambda$load$13(CoreContainer.java:766)
        at com.codahale.metrics.InstrumentedExecutorService$InstrumentedCallable.call(InstrumentedExecutorService.java:202)
        at java.util.concurrent.FutureTask.run(FutureTask.java:266)
        at org.apache.solr.common.util.ExecutorUtil$MDCAwareThreadPoolExecutor.lambda$execute$0(ExecutorUtil.java:210)
        at java.util.concurrent.ThreadPoolExecutor.runWorker(ThreadPoolExecutor.java:1149)
        at java.util.concurrent.ThreadPoolExecutor$Worker.run(ThreadPoolExecutor.java:624)
        at java.lang.Thread.run(Thread.java:748)

org.apache.solr.common.util.ObjectReleaseTracker$ObjectTrackerException: org.apache.http.impl.client.InternalHttpClient
        at org.apache.solr.common.util.ObjectReleaseTracker.track(ObjectReleaseTracker.java:42)
        at org.apache.solr.client.solrj.impl.HttpClientUtil.createClient(HttpClientUtil.java:321)
        at org.apache.solr.client.solrj.impl.HttpClientUtil.createClient(HttpClientUtil.java:330)
        at org.apache.solr.handler.IndexFetcher.createHttpClient(IndexFetcher.java:230)
        at org.apache.solr.handler.IndexFetcher.<init>(IndexFetcher.java:272)
        at org.apache.solr.handler.ReplicationHandler.inform(ReplicationHandler.java:1224)
        at org.apache.solr.core.SolrResourceLoader.inform(SolrResourceLoader.java:696)
        at org.apache.solr.core.SolrCore.<init>(SolrCore.java:1039)
        at org.apache.solr.core.SolrCore.<init>(SolrCore.java:914)
        at org.apache.solr.core.CoreContainer.createFromDescriptor(CoreContainer.java:1252)
        at org.apache.solr.core.CoreContainer.lambda$load$13(CoreContainer.java:766)
        at com.codahale.metrics.InstrumentedExecutorService$InstrumentedCallable.call(InstrumentedExecutorService.java:202)
        at java.util.concurrent.FutureTask.run(FutureTask.java:266)
        at org.apache.solr.common.util.ExecutorUtil$MDCAwareThreadPoolExecutor.lambda$execute$0(ExecutorUtil.java:210)
        at java.util.concurrent.ThreadPoolExecutor.runWorker(ThreadPoolExecutor.java:1149)
        at java.util.concurrent.ThreadPoolExecutor$Worker.run(ThreadPoolExecutor.java:624)
        at java.lang.Thread.run(Thread.java:748)

org.apache.solr.common.util.ObjectReleaseTracker$ObjectTrackerException: org.apache.lucene.store.MockDirectoryWrapper
        at org.apache.solr.common.util.ObjectReleaseTracker.track(ObjectReleaseTracker.java:42)
        at org.apache.solr.core.CachingDirectoryFactory.get(CachingDirectoryFactory.java:348)
        at org.apache.solr.core.SolrCore.initSnapshotMetaDataManager(SolrCore.java:544)
        at org.apache.solr.core.SolrCore.<init>(SolrCore.java:995)
        at org.apache.solr.core.SolrCore.<init>(SolrCore.java:914)
        at org.apache.solr.core.CoreContainer.createFromDescriptor(CoreContainer.java:1252)
        at org.apache.solr.core.CoreContainer.lambda$load$13(CoreContainer.java:766)
        at com.codahale.metrics.InstrumentedExecutorService$InstrumentedCallable.call(InstrumentedExecutorService.java:202)
        at java.util.concurrent.FutureTask.run(FutureTask.java:266)
        at org.apache.solr.common.util.ExecutorUtil$MDCAwareThreadPoolExecutor.lambda$execute$0(ExecutorUtil.java:210)
        at java.util.concurrent.ThreadPoolExecutor.runWorker(ThreadPoolExecutor.java:1149)
        at java.util.concurrent.ThreadPoolExecutor$Worker.run(ThreadPoolExecutor.java:624)
        at java.lang.Thread.run(Thread.java:748)

org.apache.solr.common.util.ObjectReleaseTracker$ObjectTrackerException: org.apache.lucene.store.MockDirectoryWrapper
        at org.apache.solr.common.util.ObjectReleaseTracker.track(ObjectReleaseTracker.java:42)
        at org.apache.solr.core.CachingDirectoryFactory.get(CachingDirectoryFactory.java:348)
        at org.apache.solr.core.SolrCore.getNewIndexDir(SolrCore.java:396)
        at org.apache.solr.core.SolrCore.initIndex(SolrCore.java:773)
        at org.apache.solr.core.SolrCore.<init>(SolrCore.java:1003)
        at org.apache.solr.core.SolrCore.<init>(SolrCore.java:914)
        at org.apache.solr.core.CoreContainer.createFromDescriptor(CoreContainer.java:1252)
        at org.apache.solr.core.CoreContainer.lambda$load$13(CoreContainer.java:766)
        at com.codahale.metrics.InstrumentedExecutorService$InstrumentedCallable.call(InstrumentedExecutorService.java:202)
        at java.util.concurrent.FutureTask.run(FutureTask.java:266)
        at org.apache.solr.common.util.ExecutorUtil$MDCAwareThreadPoolExecutor.lambda$execute$0(ExecutorUtil.java:210)
        at java.util.concurrent.ThreadPoolExecutor.runWorker(ThreadPoolExecutor.java:1149)
        at java.util.concurrent.ThreadPoolExecutor$Worker.run(ThreadPoolExecutor.java:624)
        at java.lang.Thread.run(Thread.java:748)

org.apache.solr.common.util.ObjectReleaseTracker$ObjectTrackerException: org.apache.http.impl.client.InternalHttpClient
        at org.apache.solr.common.util.ObjectReleaseTracker.track(ObjectReleaseTracker.java:42)
        at org.apache.solr.client.solrj.impl.HttpClientUtil.createClient(HttpClientUtil.java:321)
        at org.apache.solr.client.solrj.impl.HttpClientUtil.createClient(HttpClientUtil.java:330)
        at org.apache.solr.handler.IndexFetcher.createHttpClient(IndexFetcher.java:230)
        at org.apache.solr.handler.IndexFetcher.<init>(IndexFetcher.java:272)
        at org.apache.solr.handler.ReplicationHandler.inform(ReplicationHandler.java:1224)
        at org.apache.solr.core.SolrResourceLoader.inform(SolrResourceLoader.java:696)
        at org.apache.solr.core.SolrCore.<init>(SolrCore.java:1039)
        at org.apache.solr.core.SolrCore.<init>(SolrCore.java:914)
        at org.apache.solr.core.CoreContainer.createFromDescriptor(CoreContainer.java:1252)
        at org.apache.solr.core.CoreContainer.lambda$load$13(CoreContainer.java:766)
        at com.codahale.metrics.InstrumentedExecutorService$InstrumentedCallable.call(InstrumentedExecutorService.java:202)
        at java.util.concurrent.FutureTask.run(FutureTask.java:266)
        at org.apache.solr.common.util.ExecutorUtil$MDCAwareThreadPoolExecutor.lambda$execute$0(ExecutorUtil.java:210)
        at java.util.concurrent.ThreadPoolExecutor.runWorker(ThreadPoolExecutor.java:1149)
        at java.util.concurrent.ThreadPoolExecutor$Worker.run(ThreadPoolExecutor.java:624)
        at java.lang.Thread.run(Thread.java:748)

>
        at __randomizedtesting.SeedInfo.seed([80617765E3A24AA8]:0)
        at org.junit.Assert.fail(Assert.java:88)
        at org.junit.Assert.failNotNull(Assert.java:755)
        at org.junit.Assert.assertNull(Assert.java:737)
        at org.apache.solr.SolrTestCaseJ4.teardownTestCases(SolrTestCaseJ4.java:340)
        at sun.reflect.GeneratedMethodAccessor40.invoke(Unknown Source)
        at sun.reflect.DelegatingMethodAccessorImpl.invoke(DelegatingMethodAccessorImpl.java:43)
        at java.lang.reflect.Method.invoke(Method.java:498)
        at com.carrotsearch.randomizedtesting.RandomizedRunner.invoke(RandomizedRunner.java:1750)
        at com.carrotsearch.randomizedtesting.RandomizedRunner$7.evaluate(RandomizedRunner.java:901)
        at com.carrotsearch.randomizedtesting.rules.StatementAdapter.evaluate(StatementAdapter.java:36)
        at com.carrotsearch.randomizedtesting.rules.SystemPropertiesRestoreRule$1.evaluate(SystemPropertiesRestoreRule.java:57)
        at org.apache.lucene.util.AbstractBeforeAfterRule$1.evaluate(AbstractBeforeAfterRule.java:45)
        at com.carrotsearch.randomizedtesting.rules.StatementAdapter.evaluate(StatementAdapter.java:36)
        at org.apache.lucene.util.TestRuleStoreClassName$1.evaluate(TestRuleStoreClassName.java:41)
        at com.carrotsearch.randomizedtesting.rules.NoShadowingOrOverridesOnMethodsRule$1.evaluate(NoShadowingOrOverridesOnMethodsRule.java:40)
        at com.carrotsearch.randomizedtesting.rules.NoShadowingOrOverridesOnMethodsRule$1.evaluate(NoShadowingOrOverridesOnMethodsRule.java:40)
        at com.carrotsearch.randomizedtesting.rules.StatementAdapter.evaluate(StatementAdapter.java:36)
        at com.carrotsearch.randomizedtesting.rules.StatementAdapter.evaluate(StatementAdapter.java:36)
        at com.carrotsearch.randomizedtesting.rules.StatementAdapter.evaluate(StatementAdapter.java:36)
        at org.apache.lucene.util.TestRuleAssertionsRequired$1.evaluate(TestRuleAssertionsRequired.java:53)
        at org.apache.lucene.util.TestRuleMarkFailure$1.evaluate(TestRuleMarkFailure.java:47)
        at org.apache.lucene.util.TestRuleIgnoreAfterMaxFailures$1.evaluate(TestRuleIgnoreAfterMaxFailures.java:64)
        at org.apache.lucene.util.TestRuleIgnoreTestSuites$1.evaluate(TestRuleIgnoreTestSuites.java:54)
        at com.carrotsearch.randomizedtesting.rules.StatementAdapter.evaluate(StatementAdapter.java:36)
        at com.carrotsearch.randomizedtesting.ThreadLeakControl$StatementRunner.run(ThreadLeakControl.java:368)
        at java.lang.Thread.run(Thread.java:748)




Build Log:
[...truncated 14064 lines...]
   [junit4] Suite: org.apache.solr.handler.TestReplicationHandler
   [junit4]   2> 1491651 INFO  (SUITE-TestReplicationHandler-seed#[80617765E3A24AA8]-worker) [     ] o.a.s.SolrTestCaseJ4 SecureRandom sanity checks: test.solr.allowed.securerandom=null & java.security.egd=file:/dev/./urandom
   [junit4]   2> 1491652 INFO  (SUITE-TestReplicationHandler-seed#[80617765E3A24AA8]-worker) [     ] o.a.s.SolrTestCaseJ4 Created dataDir: /home/jenkins/jenkins-slave/workspace/Lucene-Solr-Tests-8.x/solr/build/solr-core/test/J0/temp/solr.handler.TestReplicationHandler_80617765E3A24AA8-001/data-dir-72-001
   [junit4]   2> 1491652 WARN  (SUITE-TestReplicationHandler-seed#[80617765E3A24AA8]-worker) [     ] o.a.s.SolrTestCaseJ4 startTrackingSearchers: numOpens=10 numCloses=10
   [junit4]   2> 1491652 INFO  (SUITE-TestReplicationHandler-seed#[80617765E3A24AA8]-worker) [     ] o.a.s.SolrTestCaseJ4 Using PointFields (NUMERIC_POINTS_SYSPROP=true) w/NUMERIC_DOCVALUES_SYSPROP=true
   [junit4]   2> 1491654 INFO  (SUITE-TestReplicationHandler-seed#[80617765E3A24AA8]-worker) [     ] o.a.s.SolrTestCaseJ4 Randomized ssl (false) and clientAuth (false) via: @org.apache.solr.SolrTestCaseJ4$SuppressSSL(bugUrl=None)
   [junit4]   2> 1491671 INFO  (TEST-TestReplicationHandler.doTestReplicateAfterCoreReload-seed#[80617765E3A24AA8]) [     ] o.a.s.SolrTestCaseJ4 ###Starting doTestReplicateAfterCoreReload
   [junit4]   2> 1491672 INFO  (TEST-TestReplicationHandler.doTestReplicateAfterCoreReload-seed#[80617765E3A24AA8]) [     ] o.a.s.SolrTestCaseJ4 Writing core.properties file to /home/jenkins/jenkins-slave/workspace/Lucene-Solr-Tests-8.x/solr/build/solr-core/test/J0/temp/solr.handler.TestReplicationHandler_80617765E3A24AA8-001/solr-instance-001/collection1
   [junit4]   2> 1491675 WARN  (TEST-TestReplicationHandler.doTestReplicateAfterCoreReload-seed#[80617765E3A24AA8]) [     ] o.e.j.s.AbstractConnector Ignoring deprecated socket close linger time
   [junit4]   2> 1491676 INFO  (TEST-TestReplicationHandler.doTestReplicateAfterCoreReload-seed#[80617765E3A24AA8]) [     ] o.a.s.c.s.e.JettySolrRunner Start Jetty (original configured port=0)
   [junit4]   2> 1491676 INFO  (TEST-TestReplicationHandler.doTestReplicateAfterCoreReload-seed#[80617765E3A24AA8]) [     ] o.a.s.c.s.e.JettySolrRunner Trying to start Jetty on port 0 try number 1 ...
   [junit4]   2> 1491676 INFO  (TEST-TestReplicationHandler.doTestReplicateAfterCoreReload-seed#[80617765E3A24AA8]) [     ] o.e.j.s.Server jetty-9.4.19.v20190610; built: 2019-06-10T16:30:51.723Z; git: afcf563148970e98786327af5e07c261fda175d3; jvm 1.8.0_191-b12
   [junit4]   2> 1491676 INFO  (TEST-TestReplicationHandler.doTestReplicateAfterCoreReload-seed#[80617765E3A24AA8]) [     ] o.e.j.s.session DefaultSessionIdManager workerName=node0
   [junit4]   2> 1491676 INFO  (TEST-TestReplicationHandler.doTestReplicateAfterCoreReload-seed#[80617765E3A24AA8]) [     ] o.e.j.s.session No SessionScavenger set, using defaults
   [junit4]   2> 1491676 INFO  (TEST-TestReplicationHandler.doTestReplicateAfterCoreReload-seed#[80617765E3A24AA8]) [     ] o.e.j.s.session node0 Scavenging every 600000ms
   [junit4]   2> 1491677 INFO  (TEST-TestReplicationHandler.doTestReplicateAfterCoreReload-seed#[80617765E3A24AA8]) [     ] o.e.j.s.h.ContextHandler Started o.e.j.s.ServletContextHandler@28b68b6{/solr,null,AVAILABLE}
   [junit4]   2> 1491681 INFO  (TEST-TestReplicationHandler.doTestReplicateAfterCoreReload-seed#[80617765E3A24AA8]) [     ] o.e.j.s.AbstractConnector Started ServerConnector@14a3c1fb{HTTP/1.1,[http/1.1, h2c]}{127.0.0.1:38523}
   [junit4]   2> 1491681 INFO  (TEST-TestReplicationHandler.doTestReplicateAfterCoreReload-seed#[80617765E3A24AA8]) [     ] o.e.j.s.Server Started @1491757ms
   [junit4]   2> 1491681 INFO  (TEST-TestReplicationHandler.doTestReplicateAfterCoreReload-seed#[80617765E3A24AA8]) [     ] o.a.s.c.s.e.JettySolrRunner Jetty properties: {solr.data.dir=/home/jenkins/jenkins-slave/workspace/Lucene-Solr-Tests-8.x/solr/build/solr-core/test/J0/temp/solr.handler.TestReplicationHandler_80617765E3A24AA8-001/solr-instance-001/collection1/data, hostContext=/solr, hostPort=38523}
   [junit4]   2> 1491692 ERROR (TEST-TestReplicationHandler.doTestReplicateAfterCoreReload-seed#[80617765E3A24AA8]) [     ] o.a.s.u.StartupLoggingUtils Missing Java Option solr.log.dir. Logging may be missing or incomplete.
   [junit4]   2> 1491692 INFO  (TEST-TestReplicationHandler.doTestReplicateAfterCoreReload-seed#[80617765E3A24AA8]) [     ] o.a.s.s.SolrDispatchFilter Using logger factory org.apache.logging.slf4j.Log4jLoggerFactory
   [junit4]   2> 1491692 INFO  (TEST-TestReplicationHandler.doTestReplicateAfterCoreReload-seed#[80617765E3A24AA8]) [     ] o.a.s.s.SolrDispatchFilter  ___      _       Welcome to Apache Solr™ version 8.3.0
   [junit4]   2> 1491692 INFO  (TEST-TestReplicationHandler.doTestReplicateAfterCoreReload-seed#[80617765E3A24AA8]) [     ] o.a.s.s.SolrDispatchFilter / __| ___| |_ _   Starting in standalone mode on port null
   [junit4]   2> 1491692 INFO  (TEST-TestReplicationHandler.doTestReplicateAfterCoreReload-seed#[80617765E3A24AA8]) [     ] o.a.s.s.SolrDispatchFilter \__ \/ _ \ | '_|  Install dir: null
   [junit4]   2> 1491692 INFO  (TEST-TestReplicationHandler.doTestReplicateAfterCoreReload-seed#[80617765E3A24AA8]) [     ] o.a.s.s.SolrDispatchFilter |___/\___/_|_|    Start time: 2019-09-11T16:30:59.315Z
   [junit4]   2> 1491692 INFO  (TEST-TestReplicationHandler.doTestReplicateAfterCoreReload-seed#[80617765E3A24AA8]) [     ] o.a.s.c.SolrXmlConfig Loading container configuration from /home/jenkins/jenkins-slave/workspace/Lucene-Solr-Tests-8.x/solr/build/solr-core/test/J0/temp/solr.handler.TestReplicationHandler_80617765E3A24AA8-001/solr-instance-001/solr.xml
   [junit4]   2> 1491696 INFO  (TEST-TestReplicationHandler.doTestReplicateAfterCoreReload-seed#[80617765E3A24AA8]) [     ] o.a.s.c.SolrXmlConfig Configuration parameter autoReplicaFailoverWorkLoopDelay is ignored
   [junit4]   2> 1491696 INFO  (TEST-TestReplicationHandler.doTestReplicateAfterCoreReload-seed#[80617765E3A24AA8]) [     ] o.a.s.c.SolrXmlConfig Configuration parameter autoReplicaFailoverBadNodeExpiration is ignored
   [junit4]   2> 1491697 INFO  (TEST-TestReplicationHandler.doTestReplicateAfterCoreReload-seed#[80617765E3A24AA8]) [     ] o.a.s.c.SolrXmlConfig MBean server found: com.sun.jmx.mbeanserver.JmxMBeanServer@5745c229, but no JMX reporters were configured - adding default JMX reporter.
   [junit4]   2> 1491740 INFO  (TEST-TestReplicationHandler.doTestReplicateAfterCoreReload-seed#[80617765E3A24AA8]) [     ] o.a.s.h.c.HttpShardHandlerFactory Host whitelist initialized: WhitelistHostChecker [whitelistHosts=null, whitelistHostCheckingEnabled=true]
   [junit4]   2> 1491741 WARN  (TEST-TestReplicationHandler.doTestReplicateAfterCoreReload-seed#[80617765E3A24AA8]) [     ] o.e.j.u.s.S.config Trusting all certificates configured for Client@1fa97477[provider=null,keyStore=null,trustStore=null]
   [junit4]   2> 1491741 WARN  (TEST-TestReplicationHandler.doTestReplicateAfterCoreReload-seed#[80617765E3A24AA8]) [     ] o.e.j.u.s.S.config No Client EndPointIdentificationAlgorithm configured for Client@1fa97477[provider=null,keyStore=null,trustStore=null]
   [junit4]   2> 1491744 WARN  (TEST-TestReplicationHandler.doTestReplicateAfterCoreReload-seed#[80617765E3A24AA8]) [     ] o.e.j.u.s.S.config Trusting all certificates configured for Client@75dcb914[provider=null,keyStore=null,trustStore=null]
   [junit4]   2> 1491744 WARN  (TEST-TestReplicationHandler.doTestReplicateAfterCoreReload-seed#[80617765E3A24AA8]) [     ] o.e.j.u.s.S.config No Client EndPointIdentificationAlgorithm configured for Client@75dcb914[provider=null,keyStore=null,trustStore=null]
   [junit4]   2> 1491773 INFO  (TEST-TestReplicationHandler.doTestReplicateAfterCoreReload-seed#[80617765E3A24AA8]) [     ] o.a.s.c.TransientSolrCoreCacheDefault Allocating transient cache for 4 transient cores
   [junit4]   2> 1491773 INFO  (TEST-TestReplicationHandler.doTestReplicateAfterCoreReload-seed#[80617765E3A24AA8]) [     ] o.a.s.h.a.MetricsHistoryHandler No .system collection, keeping metrics history in memory.
   [junit4]   2> 1491788 INFO  (TEST-TestReplicationHandler.doTestReplicateAfterCoreReload-seed#[80617765E3A24AA8]) [     ] o.a.s.m.r.SolrJmxReporter JMX monitoring for 'solr.node' (registry 'solr.node') enabled at server: com.sun.jmx.mbeanserver.JmxMBeanServer@5745c229
   [junit4]   2> 1491806 INFO  (TEST-TestReplicationHandler.doTestReplicateAfterCoreReload-seed#[80617765E3A24AA8]) [     ] o.a.s.m.r.SolrJmxReporter JMX monitoring for 'solr.jvm' (registry 'solr.jvm') enabled at server: com.sun.jmx.mbeanserver.JmxMBeanServer@5745c229
   [junit4]   2> 1491806 INFO  (TEST-TestReplicationHandler.doTestReplicateAfterCoreReload-seed#[80617765E3A24AA8]) [     ] o.a.s.m.r.SolrJmxReporter JMX monitoring for 'solr.jetty' (registry 'solr.jetty') enabled at server: com.sun.jmx.mbeanserver.JmxMBeanServer@5745c229
   [junit4]   2> 1491808 INFO  (TEST-TestReplicationHandler.doTestReplicateAfterCoreReload-seed#[80617765E3A24AA8]) [     ] o.a.s.c.CorePropertiesLocator Found 1 core definitions underneath /home/jenkins/jenkins-slave/workspace/Lucene-Solr-Tests-8.x/solr/build/solr-core/test/J0/temp/solr.handler.TestReplicationHandler_80617765E3A24AA8-001/solr-instance-001/.
   [junit4]   2> 1491808 INFO  (TEST-TestReplicationHandler.doTestReplicateAfterCoreReload-seed#[80617765E3A24AA8]) [     ] o.a.s.c.CorePropertiesLocator Cores are: [collection1]
   [junit4]   2> 1491817 INFO  (coreLoadExecutor-2566-thread-1) [    x:collection1 ] o.a.s.c.SolrConfig Using Lucene MatchVersion: 8.3.0
   [junit4]   2> 1491835 INFO  (coreLoadExecutor-2566-thread-1) [    x:collection1 ] o.a.s.s.IndexSchema [collection1] Schema name=test
   [junit4]   2> 1491837 INFO  (coreLoadExecutor-2566-thread-1) [    x:collection1 ] o.a.s.s.IndexSchema Loaded schema test/1.2 with uniqueid field id
   [junit4]   2> 1491837 INFO  (coreLoadExecutor-2566-thread-1) [    x:collection1 ] o.a.s.c.CoreContainer Creating SolrCore 'collection1' using configuration from instancedir /home/jenkins/jenkins-slave/workspace/Lucene-Solr-Tests-8.x/solr/build/solr-core/test/J0/temp/solr.handler.TestReplicationHandler_80617765E3A24AA8-001/solr-instance-001/./collection1, trusted=true
   [junit4]   2> 1491837 INFO  (coreLoadExecutor-2566-thread-1) [    x:collection1 ] o.a.s.m.r.SolrJmxReporter JMX monitoring for 'solr.core.collection1' (registry 'solr.core.collection1') enabled at server: com.sun.jmx.mbeanserver.JmxMBeanServer@5745c229
   [junit4]   2> 1491837 INFO  (coreLoadExecutor-2566-thread-1) [    x:collection1 ] o.a.s.c.SolrCore [[collection1] ] Opening new SolrCore at [/home/jenkins/jenkins-slave/workspace/Lucene-Solr-Tests-8.x/solr/build/solr-core/test/J0/temp/solr.handler.TestReplicationHandler_80617765E3A24AA8-001/solr-instance-001/collection1], dataDir=[/home/jenkins/jenkins-slave/workspace/Lucene-Solr-Tests-8.x/solr/build/solr-core/test/J0/temp/solr.handler.TestReplicationHandler_80617765E3A24AA8-001/solr-instance-001/./collection1/data/]
   [junit4]   2> 1491838 INFO  (coreLoadExecutor-2566-thread-1) [    x:collection1 ] o.a.s.u.RandomMergePolicy RandomMergePolicy wrapping class org.apache.lucene.index.LogByteSizeMergePolicy: [LogByteSizeMergePolicy: minMergeSize=1677721, mergeFactor=21, maxMergeSize=2147483648, maxMergeSizeForForcedMerge=9223372036854775807, calibrateSizeByDeletes=true, maxMergeDocs=2147483647, maxCFSSegmentSizeMB=8.796093022207999E12, noCFSRatio=1.0]
   [junit4]   2> 1491874 INFO  (coreLoadExecutor-2566-thread-1) [    x:collection1 ] o.a.s.u.CommitTracker Hard AutoCommit: disabled
   [junit4]   2> 1491874 INFO  (coreLoadExecutor-2566-thread-1) [    x:collection1 ] o.a.s.u.CommitTracker Soft AutoCommit: disabled
   [junit4]   2> 1491875 INFO  (coreLoadExecutor-2566-thread-1) [    x:collection1 ] o.a.s.u.RandomMergePolicy RandomMergePolicy wrapping class org.apache.lucene.index.TieredMergePolicy: [TieredMergePolicy: maxMergeAtOnce=22, maxMergeAtOnceExplicit=49, maxMergedSegmentMB=74.669921875, floorSegmentMB=0.5703125, forceMergeDeletesPctAllowed=11.615943875999314, segmentsPerTier=46.0, maxCFSSegmentSizeMB=8.796093022207999E12, noCFSRatio=1.0, deletesPctAllowed=22.447767070295058
   [junit4]   2> 1491875 INFO  (coreLoadExecutor-2566-thread-1) [    x:collection1 ] o.a.s.s.SolrIndexSearcher Opening [Searcher@65a307e5[collection1] main]
   [junit4]   2> 1491876 INFO  (coreLoadExecutor-2566-thread-1) [    x:collection1 ] o.a.s.r.ManagedResourceStorage File-based storage initialized to use dir: /home/jenkins/jenkins-slave/workspace/Lucene-Solr-Tests-8.x/solr/build/solr-core/test/J0/temp/solr.handler.TestReplicationHandler_80617765E3A24AA8-001/solr-instance-001/collection1/conf
   [junit4]   2> 1491877 INFO  (coreLoadExecutor-2566-thread-1) [    x:collection1 ] o.a.s.h.ReplicationHandler Replication enabled for following config files: schema.xml,xslt/dummy.xsl
   [junit4]   2> 1491877 INFO  (coreLoadExecutor-2566-thread-1) [    x:collection1 ] o.a.s.h.ReplicationHandler Commits will be reserved for 10000ms.
   [junit4]   2> 1491877 INFO  (searcherExecutor-2567-thread-1-processing-x:collection1) [    x:collection1 ] o.a.s.c.SolrCore [collection1] Registered new searcher Searcher@65a307e5[collection1] main{ExitableDirectoryReader(UninvertingDirectoryReader())}
   [junit4]   2> 1491887 INFO  (TEST-TestReplicationHandler.doTestReplicateAfterCoreReload-seed#[80617765E3A24AA8]) [     ] o.a.s.SolrTestCaseJ4 Writing core.properties file to /home/jenkins/jenkins-slave/workspace/Lucene-Solr-Tests-8.x/solr/build/solr-core/test/J0/temp/solr.handler.TestReplicationHandler_80617765E3A24AA8-001/solr-instance-002/collection1
   [junit4]   2> 1491889 WARN  (TEST-TestReplicationHandler.doTestReplicateAfterCoreReload-seed#[80617765E3A24AA8]) [     ] o.e.j.s.AbstractConnector Ignoring deprecated socket close linger time
   [junit4]   2> 1491889 INFO  (TEST-TestReplicationHandler.doTestReplicateAfterCoreReload-seed#[80617765E3A24AA8]) [     ] o.a.s.c.s.e.JettySolrRunner Start Jetty (original configured port=0)
   [junit4]   2> 1491889 INFO  (TEST-TestReplicationHandler.doTestReplicateAfterCoreReload-seed#[80617765E3A24AA8]) [     ] o.a.s.c.s.e.JettySolrRunner Trying to start Jetty on port 0 try number 1 ...
   [junit4]   2> 1491889 INFO  (TEST-TestReplicationHandler.doTestReplicateAfterCoreReload-seed#[80617765E3A24AA8]) [     ] o.e.j.s.Server jetty-9.4.19.v20190610; built: 2019-06-10T16:30:51.723Z; git: afcf563148970e98786327af5e07c261fda175d3; jvm 1.8.0_191-b12
   [junit4]   2> 1491890 INFO  (TEST-TestReplicationHandler.doTestReplicateAfterCoreReload-seed#[80617765E3A24AA8]) [     ] o.e.j.s.session DefaultSessionIdManager workerName=node0
   [junit4]   2> 1491890 INFO  (TEST-TestReplicationHandler.doTestReplicateAfterCoreReload-seed#[80617765E3A24AA8]) [     ] o.e.j.s.session No SessionScavenger set, using defaults
   [junit4]   2> 1491890 INFO  (TEST-TestReplicationHandler.doTestReplicateAfterCoreReload-seed#[80617765E3A24AA8]) [     ] o.e.j.s.session node0 Scavenging every 600000ms
   [junit4]   2> 1491891 INFO  (TEST-TestReplicationHandler.doTestReplicateAfterCoreReload-seed#[80617765E3A24AA8]) [     ] o.e.j.s.h.ContextHandler Started o.e.j.s.ServletContextHandler@bd1f5a2{/solr,null,AVAILABLE}
   [junit4]   2> 1491891 INFO  (TEST-TestReplicationHandler.doTestReplicateAfterCoreReload-seed#[80617765E3A24AA8]) [     ] o.e.j.s.AbstractConnector Started ServerConnector@6b2a4aa6{HTTP/1.1,[http/1.1, h2c]}{127.0.0.1:34212}
   [junit4]   2> 1491891 INFO  (TEST-TestReplicationHandler.doTestReplicateAfterCoreReload-seed#[80617765E3A24AA8]) [     ] o.e.j.s.Server Started @1491967ms
   [junit4]   2> 1491891 INFO  (TEST-TestReplicationHandler.doTestReplicateAfterCoreReload-seed#[80617765E3A24AA8]) [     ] o.a.s.c.s.e.JettySolrRunner Jetty properties: {solr.data.dir=/home/jenkins/jenkins-slave/workspace/Lucene-Solr-Tests-8.x/solr/build/solr-core/test/J0/temp/solr.handler.TestReplicationHandler_80617765E3A24AA8-001/solr-instance-002/collection1/data, hostContext=/solr, hostPort=34212}
   [junit4]   2> 1491891 ERROR (TEST-TestReplicationHandler.doTestReplicateAfterCoreReload-seed#[80617765E3A24AA8]) [     ] o.a.s.u.StartupLoggingUtils Missing Java Option solr.log.dir. Logging may be missing or incomplete.
   [junit4]   2> 1491891 INFO  (TEST-TestReplicationHandler.doTestReplicateAfterCoreReload-seed#[80617765E3A24AA8]) [     ] o.a.s.s.SolrDispatchFilter Using logger factory org.apache.logging.slf4j.Log4jLoggerFactory
   [junit4]   2> 1491891 INFO  (TEST-TestReplicationHandler.doTestReplicateAfterCoreReload-seed#[80617765E3A24AA8]) [     ] o.a.s.s.SolrDispatchFilter  ___      _       Welcome to Apache Solr™ version 8.3.0
   [junit4]   2> 1491892 INFO  (TEST-TestReplicationHandler.doTestReplicateAfterCoreReload-seed#[80617765E3A24AA8]) [     ] o.a.s.s.SolrDispatchFilter / __| ___| |_ _   Starting in standalone mode on port null
   [junit4]   2> 1491892 INFO  (TEST-TestReplicationHandler.doTestReplicateAfterCoreReload-seed#[80617765E3A24AA8]) [     ] o.a.s.s.SolrDispatchFilter \__ \/ _ \ | '_|  Install dir: null
   [junit4]   2> 1491892 INFO  (TEST-TestReplicationHandler.doTestReplicateAfterCoreReload-seed#[80617765E3A24AA8]) [     ] o.a.s.s.SolrDispatchFilter |___/\___/_|_|    Start time: 2019-09-11T16:30:59.515Z
   [junit4]   2> 1491892 INFO  (TEST-TestReplicationHandler.doTestReplicateAfterCoreReload-seed#[80617765E3A24AA8]) [     ] o.a.s.c.SolrXmlConfig Loading container configuration from /home/jenkins/jenkins-slave/workspace/Lucene-Solr-Tests-8.x/solr/build/solr-core/test/J0/temp/solr.handler.TestReplicationHandler_80617765E3A24AA8-001/solr-instance-002/solr.xml
   [junit4]   2> 1491895 INFO  (TEST-TestReplicationHandler.doTestReplicateAfterCoreReload-seed#[80617765E3A24AA8]) [     ] o.a.s.c.SolrXmlConfig Configuration parameter autoReplicaFailoverWorkLoopDelay is ignored
   [junit4]   2> 1491895 INFO  (TEST-TestReplicationHandler.doTestReplicateAfterCoreReload-seed#[80617765E3A24AA8]) [     ] o.a.s.c.SolrXmlConfig Configuration parameter autoReplicaFailoverBadNodeExpiration is ignored
   [junit4]   2> 1491897 INFO  (TEST-TestReplicationHandler.doTestReplicateAfterCoreReload-seed#[80617765E3A24AA8]) [     ] o.a.s.c.SolrXmlConfig MBean server found: com.sun.jmx.mbeanserver.JmxMBeanServer@5745c229, but no JMX reporters were configured - adding default JMX reporter.
   [junit4]   2> 1492177 INFO  (TEST-TestReplicationHandler.doTestReplicateAfterCoreReload-seed#[80617765E3A24AA8]) [     ] o.a.s.h.c.HttpShardHandlerFactory Host whitelist initialized: WhitelistHostChecker [whitelistHosts=null, whitelistHostCheckingEnabled=true]
   [junit4]   2> 1492178 WARN  (TEST-TestReplicationHandler.doTestReplicateAfterCoreReload-seed#[80617765E3A24AA8]) [     ] o.e.j.u.s.S.config Trusting all certificates configured for Client@ff91198[provider=null,keyStore=null,trustStore=null]
   [junit4]   2> 1492178 WARN  (TEST-TestReplicationHandler.doTestReplicateAfterCoreReload-seed#[80617765E3A24AA8]) [     ] o.e.j.u.s.S.config No Client EndPointIdentificationAlgorithm configured for Client@ff91198[provider=null,keyStore=null,trustStore=null]
   [junit4]   2> 1492186 WARN  (TEST-TestReplicationHandler.doTestReplicateAfterCoreReload-seed#[80617765E3A24AA8]) [     ] o.e.j.u.s.S.config Trusting all certificates configured for Client@2605e8a7[provider=null,keyStore=null,trustStore=null]
   [junit4]   2> 1492186 WARN  (TEST-TestReplicationHandler.doTestReplicateAfterCoreReload-seed#[80617765E3A24AA8]) [     ] o.e.j.u.s.S.config No Client EndPointIdentificationAlgorithm configured for Client@2605e8a7[provider=null,keyStore=null,trustStore=null]
   [junit4]   2> 1492221 INFO  (TEST-TestReplicationHandler.doTestReplicateAfterCoreReload-seed#[80617765E3A24AA8]) [     ] o.a.s.c.TransientSolrCoreCacheDefault Allocating transient cache for 4 transient cores
   [junit4]   2> 1492221 INFO  (TEST-TestReplicationHandler.doTestReplicateAfterCoreReload-seed#[80617765E3A24AA8]) [     ] o.a.s.h.a.MetricsHistoryHandler No .system collection, keeping metrics history in memory.
   [junit4]   2> 1492263 INFO  (TEST-TestReplicationHandler.doTestReplicateAfterCoreReload-seed#[80617765E3A24AA8]) [     ] o.a.s.m.r.SolrJmxReporter JMX monitoring for 'solr.node' (registry 'solr.node') enabled at server: com.sun.jmx.mbeanserver.JmxMBeanServer@5745c229
   [junit4]   2> 1492283 INFO  (TEST-TestReplicationHandler.doTestReplicateAfterCoreReload-seed#[80617765E3A24AA8]) [     ] o.a.s.m.r.SolrJmxReporter JMX monitoring for 'solr.jvm' (registry 'solr.jvm') enabled at server: com.sun.jmx.mbeanserver.JmxMBeanServer@5745c229
   [junit4]   2> 1492283 INFO  (TEST-TestReplicationHandler.doTestReplicateAfterCoreReload-seed#[80617765E3A24AA8]) [     ] o.a.s.m.r.SolrJmxReporter JMX monitoring for 'solr.jetty' (registry 'solr.jetty') enabled at server: com.sun.jmx.mbeanserver.JmxMBeanServer@5745c229
   [junit4]   2> 1492285 INFO  (TEST-TestReplicationHandler.doTestReplicateAfterCoreReload-seed#[80617765E3A24AA8]) [     ] o.a.s.c.CorePropertiesLocator Found 1 core definitions underneath /home/jenkins/jenkins-slave/workspace/Lucene-Solr-Tests-8.x/solr/build/solr-core/test/J0/temp/solr.handler.TestReplicationHandler_80617765E3A24AA8-001/solr-instance-002/.
   [junit4]   2> 1492285 INFO  (TEST-TestReplicationHandler.doTestReplicateAfterCoreReload-seed#[80617765E3A24AA8]) [     ] o.a.s.c.CorePropertiesLocator Cores are: [collection1]
   [junit4]   2> 1492317 INFO  (coreLoadExecutor-2579-thread-1) [    x:collection1 ] o.a.s.c.SolrConfig Using Lucene MatchVersion: 8.3.0
   [junit4]   2> 1492326 INFO  (coreLoadExecutor-2579-thread-1) [    x:collection1 ] o.a.s.s.IndexSchema [collection1] Schema name=test
   [junit4]   2> 1492328 INFO  (coreLoadExecutor-2579-thread-1) [    x:collection1 ] o.a.s.s.IndexSchema Loaded schema test/1.2 with uniqueid field id
   [junit4]   2> 1492328 INFO  (coreLoadExecutor-2579-thread-1) [    x:collection1 ] o.a.s.c.CoreContainer Creating SolrCore 'collection1' using configuration from instancedir /home/jenkins/jenkins-slave/workspace/Lucene-Solr-Tests-8.x/solr/build/solr-core/test/J0/temp/solr.handler.TestReplicationHandler_80617765E3A24AA8-001/solr-instance-002/./collection1, trusted=true
   [junit4]   2> 1492340 INFO  (coreLoadExecutor-2579-thread-1) [    x:collection1 ] o.a.s.m.r.SolrJmxReporter JMX monitoring for 'solr.core.collection1' (registry 'solr.core.collection1') enabled at server: com.sun.jmx.mbeanserver.JmxMBeanServer@5745c229
   [junit4]   2> 1492340 INFO  (coreLoadExecutor-2579-thread-1) [    x:collection1 ] o.a.s.c.SolrCore [[collection1] ] Opening new SolrCore at [/home/jenkins/jenkins-slave/workspace/Lucene-Solr-Tests-8.x/solr/build/solr-core/test/J0/temp/solr.handler.TestReplicationHandler_80617765E3A24AA8-001/solr-instance-002/collection1], dataDir=[/home/jenkins/jenkins-slave/workspace/Lucene-Solr-Tests-8.x/solr/build/solr-core/test/J0/temp/solr.handler.TestReplicationHandler_80617765E3A24AA8-001/solr-instance-002/./collection1/data/]
   [junit4]   2> 1492344 INFO  (coreLoadExecutor-2579-thread-1) [    x:collection1 ] o.a.s.u.RandomMergePolicy RandomMergePolicy wrapping class org.apache.lucene.index.LogByteSizeMergePolicy: [LogByteSizeMergePolicy: minMergeSize=1677721, mergeFactor=21, maxMergeSize=2147483648, maxMergeSizeForForcedMerge=9223372036854775807, calibrateSizeByDeletes=true, maxMergeDocs=2147483647, maxCFSSegmentSizeMB=8.796093022207999E12, noCFSRatio=1.0]
   [junit4]   2> 1492446 INFO  (coreLoadExecutor-2579-thread-1) [    x:collection1 ] o.a.s.u.CommitTracker Hard AutoCommit: disabled
   [junit4]   2> 1492446 INFO  (coreLoadExecutor-2579-thread-1) [    x:collection1 ] o.a.s.u.CommitTracker Soft AutoCommit: disabled
   [junit4]   2> 1492447 INFO  (coreLoadExecutor-2579-thread-1) [    x:collection1 ] o.a.s.u.RandomMergePolicy RandomMergePolicy wrapping class org.apache.lucene.index.TieredMergePolicy: [TieredMergePolicy: maxMergeAtOnce=22, maxMergeAtOnceExplicit=49, maxMergedSegmentMB=74.669921875, floorSegmentMB=0.5703125, forceMergeDeletesPctAllowed=11.615943875999314, segmentsPerTier=46.0, maxCFSSegmentSizeMB=8.796093022207999E12, noCFSRatio=1.0, deletesPctAllowed=22.447767070295058
   [junit4]   2> 1492447 INFO  (coreLoadExecutor-2579-thread-1) [    x:collection1 ] o.a.s.s.SolrIndexSearcher Opening [Searcher@1e7b6d50[collection1] main]
   [junit4]   2> 1492447 INFO  (coreLoadExecutor-2579-thread-1) [    x:collection1 ] o.a.s.r.ManagedResourceStorage File-based storage initialized to use dir: /home/jenkins/jenkins-slave/workspace/Lucene-Solr-Tests-8.x/solr/build/solr-core/test/J0/temp/solr.handler.TestReplicationHandler_80617765E3A24AA8-001/solr-instance-002/collection1/conf
   [junit4]   2> 1492460 INFO  (coreLoadExecutor-2579-thread-1) [    x:collection1 ] o.a.s.h.ReplicationHandler Poll scheduled at an interval of 1000ms
   [junit4]   2> 1492461 INFO  (coreLoadExecutor-2579-thread-1) [    x:collection1 ] o.a.s.h.ReplicationHandler Commits will be reserved for 10000ms.
   [junit4]   2> 1492462 INFO  (searcherExecutor-2580-thread-1-processing-x:collection1) [    x:collection1 ] o.a.s.c.SolrCore [collection1] Registered new searcher Searcher@1e7b6d50[collection1] main{ExitableDirectoryReader(UninvertingDirectoryReader())}
   [junit4]   2> 1492485 INFO  (TEST-TestReplicationHandler.doTestReplicateAfterCoreReload-seed#[80617765E3A24AA8]) [     ] o.a.s.c.CoreContainer Shutting down CoreContainer instance=1063014309
   [junit4]   2> 1492500 INFO  (qtp648280969-9778) [    x:collection1 ] o.a.s.c.S.Request [collection1]  webapp=/solr path=/replication params={qt=/replication&wt=javabin&version=2&command=indexversion} status=0 QTime=0
   [junit4]   2> 1492500 INFO  (indexFetcher-2584-thread-1) [     ] o.a.s.h.IndexFetcher Master's generation: 1
   [junit4]   2> 1492500 INFO  (indexFetcher-2584-thread-1) [     ] o.a.s.h.IndexFetcher Master's version: 0
   [junit4]   2> 1492500 INFO  (indexFetcher-2584-thread-1) [     ] o.a.s.h.IndexFetcher Slave's generation: 1
   [junit4]   2> 1492500 INFO  (indexFetcher-2584-thread-1) [     ] o.a.s.h.IndexFetcher Slave's version: 0
   [junit4]   2> 1492500 INFO  (indexFetcher-2584-thread-1) [     ] o.a.s.h.IndexFetcher New index in Master. Deleting mine...
   [junit4]   2> 1492501 INFO  (coreCloseExecutor-2585-thread-1) [    x:collection1 ] o.a.s.c.SolrCore [collection1]  CLOSING SolrCore org.apache.solr.core.SolrCore@64c3ce14
   [junit4]   2> 1492502 INFO  (coreCloseExecutor-2585-thread-1) [    x:collection1 ] o.a.s.m.SolrMetricManager Closing metric reporters for registry=solr.core.collection1, tag=64c3ce14
   [junit4]   2> 1492502 INFO  (coreCloseExecutor-2585-thread-1) [    x:collection1 ] o.a.s.m.r.SolrJmxReporter Closing reporter [org.apache.solr.metrics.reporters.SolrJmxReporter@6e5820a9: rootName = null, domain = solr.core.collection1, service url = null, agent id = null] for registry solr.core.collection1 / com.codahale.metrics.MetricRegistry@3ea24f11
   [junit4]   2> 1492503 ERROR (indexFetcher-2584-thread-1) [     ] o.a.s.h.ReplicationHandler Index fetch failed :java.lang.NullPointerException
   [junit4]   2> at org.apache.solr.handler.IndexFetcher.openNewSearcherAndUpdateCommitPoint(IndexFetcher.java:922)
   [junit4]   2> at org.apache.solr.handler.IndexFetcher.fetchLatestIndex(IndexFetcher.java:463)
   [junit4]   2> at org.apache.solr.handler.IndexFetcher.fetchLatestIndex(IndexFetcher.java:351)
   [junit4]   2> at org.apache.solr.handler.ReplicationHandler.doFetch(ReplicationHandler.java:424)
   [junit4]   2> at org.apache.solr.handler.ReplicationHandler.lambda$setupPolling$13(ReplicationHandler.java:1193)
   [junit4]   2> at java.util.concurrent.Executors$RunnableAdapter.call(Executors.java:511)
   [junit4]   2> at java.util.concurrent.FutureTask.runAndReset(FutureTask.java:308)
   [junit4]   2> at java.util.concurrent.ScheduledThreadPoolExecutor$ScheduledFutureTask.access$301(ScheduledThreadPoolExecutor.java:180)
   [junit4]   2> at java.util.concurrent.ScheduledThreadPoolExecutor$ScheduledFutureTask.run(ScheduledThreadPoolExecutor.java:294)
   [junit4]   2> at java.util.concurrent.ThreadPoolExecutor.runWorker(ThreadPoolExecutor.java:1149)
   [junit4]   2> at java.util.concurrent.ThreadPoolExecutor$Worker.run(ThreadPoolExecutor.java:624)
   [junit4]   2> at java.lang.Thread.run(Thread.java:748)
   [junit4]   2>
   [junit4]   2> 1492528 INFO  (TEST-TestReplicationHandler.doTestReplicateAfterCoreReload-seed#[80617765E3A24AA8]) [     ] o.a.s.m.SolrMetricManager Closing metric reporters for registry=solr.node, tag=null
   [junit4]   2> 1492528 INFO  (TEST-TestReplicationHandler.doTestReplicateAfterCoreReload-seed#[80617765E3A24AA8]) [     ] o.a.s.m.r.SolrJmxReporter Closing reporter [org.apache.solr.metrics.reporters.SolrJmxReporter@1985f25e: rootName = null, domain = solr.node, service url = null, agent id = null] for registry solr.node / com.codahale.metrics.MetricRegistry@3eb4cee3
   [junit4]   2> 1492533 INFO  (TEST-TestReplicationHandler.doTestReplicateAfterCoreReload-seed#[80617765E3A24AA8]) [     ] o.a.s.m.SolrMetricManager Closing metric reporters for registry=solr.jvm, tag=null
   [junit4]   2> 1492533 INFO  (TEST-TestReplicationHandler.doTestReplicateAfterCoreReload-seed#[80617765E3A24AA8]) [     ] o.a.s.m.r.SolrJmxReporter Closing reporter [org.apache.solr.metrics.reporters.SolrJmxReporter@5895a8b6: rootName = null, domain = solr.jvm, service url = null, agent id = null] for registry solr.jvm / com.codahale.metrics.MetricRegistry@28904196
   [junit4]   2> 1492535 INFO  (TEST-TestReplicationHandler.doTestReplicateAfterCoreReload-seed#[80617765E3A24AA8]) [     ] o.a.s.m.SolrMetricManager Closing metric reporters for registry=solr.jetty, tag=null
   [junit4]   2> 1492535 INFO  (TEST-TestReplicationHandler.doTestReplicateAfterCoreReload-seed#[80617765E3A24AA8]) [     ] o.a.s.m.r.SolrJmxReporter Closing reporter [org.apache.solr.metrics.reporters.SolrJmxReporter@5c1ffe6e: rootName = null, domain = solr.jetty, service url = null, agent id = null] for registry solr.jetty / com.codahale.metrics.MetricRegistry@35572ec7
   [junit4]   2> 1492540 INFO  (TEST-TestReplicationHandler.doTestReplicateAfterCoreReload-seed#[80617765E3A24AA8]) [     ] o.e.j.s.AbstractConnector Stopped ServerConnector@6b2a4aa6{HTTP/1.1,[http/1.1, h2c]}{127.0.0.1:0}
   [junit4]   2> 1492540 INFO  (TEST-TestReplicationHandler.doTestReplicateAfterCoreReload-seed#[80617765E3A24AA8]) [     ] o.e.j.s.h.ContextHandler Stopped o.e.j.s.ServletContextHandler@bd1f5a2{/solr,null,UNAVAILABLE}
   [junit4]   2> 1492540 INFO  (TEST-TestReplicationHandler.doTestReplicateAfterCoreReload-seed#[80617765E3A24AA8]) [     ] o.e.j.s.session node0 Stopped scavenging
   [junit4]   2> 1492548 INFO  (TEST-TestReplicationHandler.doTestReplicateAfterCoreReload-seed#[80617765E3A24AA8]) [     ] o.a.s.c.CoreContainer Shutting down CoreContainer instance=1070216187
   [junit4]   2> 1492549 INFO  (coreCloseExecutor-2587-thread-1) [    x:collection1 ] o.a.s.c.SolrCore [collection1]  CLOSING SolrCore org.apache.solr.core.SolrCore@26f2adbf
   [junit4]   2> 1492549 INFO  (coreCloseExecutor-2587-thread-1) [    x:collection1 ] o.a.s.m.SolrMetricManager Closing metric reporters for registry=solr.core.collection1, tag=26f2adbf
   [junit4]   2> 1492549 INFO  (coreCloseExecutor-2587-thread-1) [    x:collection1 ] o.a.s.m.r.SolrJmxReporter Closing reporter [org.apache.solr.metrics.reporters.SolrJmxReporter@65cea6ba: rootName = null, domain = solr.core.collection1, service url = null, agent id = null] for registry solr.core.collection1 / com.codahale.metrics.MetricRegistry@1cbac576
   [junit4]   2> 1492554 INFO  (TEST-TestReplicationHandler.doTestReplicateAfterCoreReload-seed#[80617765E3A24AA8]) [     ] o.a.s.m.SolrMetricManager Closing metric reporters for registry=solr.node, tag=null
   [junit4]   2> 1492554 INFO  (TEST-TestReplicationHandler.doTestReplicateAfterCoreReload-seed#[80617765E3A24AA8]) [     ] o.a.s.m.r.SolrJmxReporter Closing reporter [org.apache.solr.metrics.reporters.SolrJmxReporter@2fbb494: rootName = null, domain = solr.node, service url = null, agent id = null] for registry solr.node / com.codahale.metrics.MetricRegistry@51f773c9
   [junit4]   2> 1492555 INFO  (TEST-TestReplicationHandler.doTestReplicateAfterCoreReload-seed#[80617765E3A24AA8]) [     ] o.a.s.m.SolrMetricManager Closing metric reporters for registry=solr.jvm, tag=null
   [junit4]   2> 1492555 INFO  (TEST-TestReplicationHandler.doTestReplicateAfterCoreReload-seed#[80617765E3A24AA8]) [     ] o.a.s.m.r.SolrJmxReporter Closing reporter [org.apache.solr.metrics.reporters.SolrJmxReporter@4e90dcff: rootName = null, domain = solr.jvm, service url = null, agent id = null] for registry solr.jvm / com.codahale.metrics.MetricRegistry@28904196
   [junit4]   2> 1492556 INFO  (TEST-TestReplicationHandler.doTestReplicateAfterCoreReload-seed#[80617765E3A24AA8]) [     ] o.a.s.m.SolrMetricManager Closing metric reporters for registry=solr.jetty, tag=null
   [junit4]   2> 1492556 INFO  (TEST-TestReplicationHandler.doTestReplicateAfterCoreReload-seed#[80617765E3A24AA8]) [     ] o.a.s.m.r.SolrJmxReporter Closing reporter [org.apache.solr.metrics.reporters.SolrJmxReporter@69aa6362: rootName = null, domain = solr.jetty, service url = null, agent id = null] for registry solr.jetty / com.codahale.metrics.MetricRegistry@35572ec7
   [junit4]   2> 1492557 INFO  (TEST-TestReplicationHandler.doTestReplicateAfterCoreReload-seed#[80617765E3A24AA8]) [     ] o.e.j.s.AbstractConnector Stopped ServerConnector@14a3c1fb{HTTP/1.1,[http/1.1, h2c]}{127.0.0.1:0}
   [junit4]   2> 1492557 INFO  (TEST-TestReplicationHandler.doTestReplicateAfterCoreReload-seed#[80617765E3A24AA8]) [     ] o.e.j.s.h.ContextHandler Stopped o.e.j.s.ServletContextHandler@28b68b6{/solr,null,UNAVAILABLE}
   [junit4]   2> 1492557 INFO  (TEST-TestReplicationHandler.doTestReplicateAfterCoreReload-seed#[80617765E3A24AA8]) [     ] o.e.j.s.session node0 Stopped scavenging
   [junit4]   2> 1492558 WARN  (TEST-TestReplicationHandler.doTestReplicateAfterCoreReload-seed#[80617765E3A24AA8]) [     ] o.e.j.s.AbstractConnector Ignoring deprecated socket close linger time
   [junit4]   2> 1492558 INFO  (TEST-TestReplicationHandler.doTestReplicateAfterCoreReload-seed#[80617765E3A24AA8]) [     ] o.a.s.c.s.e.JettySolrRunner Start Jetty (original configured port=0)
   [junit4]   2> 1492558 INFO  (TEST-TestReplicationHandler.doTestReplicateAfterCoreReload-seed#[80617765E3A24AA8]) [     ] o.a.s.c.s.e.JettySolrRunner Trying to start Jetty on port 0 try number 1 ...
   [junit4]   2> 1492559 INFO  (TEST-TestReplicationHandler.doTestReplicateAfterCoreReload-seed#[80617765E3A24AA8]) [     ] o.e.j.s.Server jetty-9.4.19.v20190610; built: 2019-06-10T16:30:51.723Z; git: afcf563148970e98786327af5e07c261fda175d3; jvm 1.8.0_191-b12
   [junit4]   2> 1492559 INFO  (TEST-TestReplicationHandler.doTestReplicateAfterCoreReload-seed#[80617765E3A24AA8]) [     ] o.e.j.s.session DefaultSessionIdManager workerName=node0
   [junit4]   2> 1492559 INFO  (TEST-TestReplicationHandler.doTestReplicateAfterCoreReload-seed#[80617765E3A24AA8]) [     ] o.e.j.s.session No SessionScavenger set, using defaults
   [junit4]   2> 1492559 INFO  (TEST-TestReplicationHandler.doTestReplicateAfterCoreReload-seed#[80617765E3A24AA8]) [     ] o.e.j.s.session node0 Scavenging every 660000ms
   [junit4]   2> 1492560 INFO  (TEST-TestReplicationHandler.doTestReplicateAfterCoreReload-seed#[80617765E3A24AA8]) [     ] o.e.j.s.h.ContextHandler Started o.e.j.s.ServletContextHandler@1b93c6bc{/solr,null,AVAILABLE}
   [junit4]   2> 1492560 INFO  (TEST-TestReplicationHandler.doTestReplicateAfterCoreReload-seed#[80617765E3A24AA8]) [     ] o.e.j.s.AbstractConnector Started ServerConnector@1ee7373d{HTTP/1.1,[http/1.1, h2c]}{127.0.0.1:34184}
   [junit4]   2> 1492560 INFO  (TEST-TestReplicationHandler.doTestReplicateAfterCoreReload-seed#[80617765E3A24AA8]) [     ] o.e.j.s.Server Started @1492636ms
   [junit4]   2> 1492560 INFO  (TEST-TestReplicationHandler.doTestReplicateAfterCoreReload-seed#[80617765E3A24AA8]) [     ] o.a.s.c.s.e.JettySolrRunner Jetty properties: {solr.data.dir=/home/jenkins/jenkins-slave/workspace/Lucene-Solr-Tests-8.x/solr/build/solr-core/test/J0/temp/solr.handler.TestReplicationHandler_80617765E3A24AA8-001/solr-instance-001/collection1/data, hostContext=/solr, hostPort=34184}
   [junit4]   2> 1492561 ERROR (TEST-TestReplicationHandler.doTestReplicateAfterCoreReload-seed#[80617765E3A24AA8]) [     ] o.a.s.u.StartupLoggingUtils Missing Java Option solr.log.dir. Logging may be missing or incomplete.
   [junit4]   2> 1492561 INFO  (TEST-TestReplicationHandler.doTestReplicateAfterCoreReload-seed#[80617765E3A24AA8]) [     ] o.a.s.s.SolrDispatchFilter Using logger factory org.apache.logging.slf4j.Log4jLoggerFactory
   [junit4]   2> 1492561 INFO  (TEST-TestReplicationHandler.doTestReplicateAfterCoreReload-seed#[80617765E3A24AA8]) [     ] o.a.s.s.SolrDispatchFilter  ___      _       Welcome to Apache Solr™ version 8.3.0
   [junit4]   2> 1492561 INFO  (TEST-TestReplicationHandler.doTestReplicateAfterCoreReload-seed#[80617765E3A24AA8]) [     ] o.a.s.s.SolrDispatchFilter / __| ___| |_ _   Starting in standalone mode on port null
   [junit4]   2> 1492561 INFO  (TEST-TestReplicationHandler.doTestReplicateAfterCoreReload-seed#[80617765E3A24AA8]) [     ] o.a.s.s.SolrDispatchFilter \__ \/ _ \ | '_|  Install dir: null
   [junit4]   2> 1492561 INFO  (TEST-TestReplicationHandler.doTestReplicateAfterCoreReload-seed#[80617765E3A24AA8]) [     ] o.a.s.s.SolrDispatchFilter |___/\___/_|_|    Start time: 2019-09-11T16:31:00.184Z
   [junit4]   2> 1492561 INFO  (TEST-TestReplicationHandler.doTestReplicateAfterCoreReload-seed#[80617765E3A24AA8]) [     ] o.a.s.c.SolrXmlConfig Loading container configuration from /home/jenkins/jenkins-slave/workspace/Lucene-Solr-Tests-8.x/solr/build/solr-core/test/J0/temp/solr.handler.TestReplicationHandler_80617765E3A24AA8-001/solr-instance-001/solr.xml
   [junit4]   2> 1492564 INFO  (TEST-TestReplicationHandler.doTestReplicateAfterCoreReload-seed#[80617765E3A24AA8]) [     ] o.a.s.c.SolrXmlConfig Configuration parameter autoReplicaFailoverWorkLoopDelay is ignored
   [junit4]   2> 1492564 INFO  (TEST-TestReplicationHandler.doTestReplicateAfterCoreReload-seed#[80617765E3A24AA8]) [     ] o.a.s.c.SolrXmlConfig Configuration parameter autoReplicaFailoverBadNodeExpiration is ignored
   [junit4]   2> 1492566 INFO  (TEST-TestReplicationHandler.doTestReplicateAfterCoreReload-seed#[80617765E3A24AA8]) [     ] o.a.s.c.SolrXmlConfig MBean server found: com.sun.jmx.mbeanserver.JmxMBeanServer@5745c229, but no JMX reporters were configured - adding default JMX reporter.
   [junit4]   2> 1492752 INFO  (TEST-TestReplicationHandler.doTestReplicateAfterCoreReload-seed#[80617765E3A24AA8]) [     ] o.a.s.h.c.HttpShardHandlerFactory Host whitelist initialized: WhitelistHostChecker [whitelistHosts=null, whitelistHostCheckingEnabled=true]
   [junit4]   2> 1492753 WARN  (TEST-TestReplicationHandler.doTestReplicateAfterCoreReload-seed#[80617765E3A24AA8]) [     ] o.e.j.u.s.S.config Trusting all certificates configured for Client@2781142e[provider=null,keyStore=null,trustStore=null]
   [junit4]   2> 1492753 WARN  (TEST-TestReplicationHandler.doTestReplicateAfterCoreReload-seed#[80617765E3A24AA8]) [     ] o.e.j.u.s.S.config No Client EndPointIdentificationAlgorithm configured for Client@2781142e[provider=null,keyStore=null,trustStore=null]
   [junit4]   2> 1492755 WARN  (TEST-TestReplicationHandler.doTestReplicateAfterCoreReload-seed#[80617765E3A24AA8]) [     ] o.e.j.u.s.S.config Trusting all certificates configured for Client@7f45b6b8[provider=null,keyStore=null,trustStore=null]
   [junit4]   2> 1492755 WARN  (TEST-TestReplicationHandler.doTestReplicateAfterCoreReload-seed#[80617765E3A24AA8]) [     ] o.e.j.u.s.S.config No Client EndPointIdentificationAlgorithm configured for Client@7f45b6b8[provider=null,keyStore=null,trustStore=null]
   [junit4]   2> 1492786 INFO  (TEST-TestReplicationHandler.doTestReplicateAfterCoreReload-seed#[80617765E3A24AA8]) [     ] o.a.s.c.TransientSolrCoreCacheDefault Allocating transient cache for 4 transient cores
   [junit4]   2> 1492786 INFO  (TEST-TestReplicationHandler.doTestReplicateAfterCoreReload-seed#[80617765E3A24AA8]) [     ] o.a.s.h.a.MetricsHistoryHandler No .system collection, keeping metrics history in memory.
   [junit4]   2> 1492802 INFO  (TEST-TestReplicationHandler.doTestReplicateAfterCoreReload-seed#[80617765E3A24AA8]) [     ] o.a.s.m.r.SolrJmxReporter JMX monitoring for 'solr.node' (registry 'solr.node') enabled at server: com.sun.jmx.mbeanserver.JmxMBeanServer@5745c229
   [junit4]   2> 1492831 INFO  (TEST-TestReplicationHandler.doTestReplicateAfterCoreReload-seed#[80617765E3A24AA8]) [     ] o.a.s.m.r.SolrJmxReporter JMX monitoring for 'solr.jvm' (registry 'solr.jvm') enabled at server: com.sun.jmx.mbeanserver.JmxMBeanServer@5745c229
   [junit4]   2> 1492831 INFO  (TEST-TestReplicationHandler.doTestReplicateAfterCoreReload-seed#[80617765E3A24AA8]) [     ] o.a.s.m.r.SolrJmxReporter JMX monitoring for 'solr.jetty' (registry 'solr.jetty') enabled at server: com.sun.jmx.mbeanserver.JmxMBeanServer@5745c229
   [junit4]   2> 1492833 INFO  (TEST-TestReplicationHandler.doTestReplicateAfterCoreReload-seed#[80617765E3A24AA8]) [     ] o.a.s.c.CorePropertiesLocator Found 1 core definitions underneath /home/jenkins/jenkins-slave/workspace/Lucene-Solr-Tests-8.x/solr/build/solr-core/test/J0/temp/solr.handler.TestReplicationHandler_80617765E3A24AA8-001/solr-instance-001/.
   [junit4]   2> 1492833 INFO  (TEST-TestReplicationHandler.doTestReplicateAfterCoreReload-seed#[80617765E3A24AA8]) [     ] o.a.s.c.CorePropertiesLocator Cores are: [collection1]
   [junit4]   2> 1492857 INFO  (coreLoadExecutor-2597-thread-1) [    x:collection1 ] o.a.s.c.SolrConfig Using Lucene MatchVersion: 8.3.0
   [junit4]   2> 1492934 INFO  (coreLoadExecutor-2597-thread-1) [    x:collection1 ] o.a.s.s.IndexSchema [collection1] Schema name=test
   [junit4]   2> 1492956 INFO  (coreLoadExecutor-2597-thread-1) [    x:collection1 ] o.a.s.s.IndexSchema Loaded schema test/1.2 with uniqueid field id
   [junit4]   2> 1492956 INFO  (coreLoadExecutor-2597-thread-1) [    x:collection1 ] o.a.s.c.CoreContainer Creating SolrCore 'collection1' using configuration from instancedir /home/jenkins/jenkins-slave/workspace/Lucene-Solr-Tests-8.x/solr/build/solr-core/test/J0/temp/solr.handler.TestReplicationHandler_80617765E3A24AA8-001/solr-instance-001/./collectio

[...truncated too long message...]

tings :: file = /home/jenkins/jenkins-slave/workspace/Lucene-Solr-Tests-8.x/lucene/top-level-ivy-settings.xml

resolve:

ivy-availability-check:
[loadresource] Do not set property disallowed.ivy.jars.list as its length is 0.

-ivy-fail-disallowed-ivy-version:

ivy-fail:

ivy-configure:
[ivy:configure] :: loading settings :: file = /home/jenkins/jenkins-slave/workspace/Lucene-Solr-Tests-8.x/lucene/top-level-ivy-settings.xml

resolve:

ivy-availability-check:
[loadresource] Do not set property disallowed.ivy.jars.list as its length is 0.

-ivy-fail-disallowed-ivy-version:

ivy-fail:

ivy-fail:

ivy-configure:
[ivy:configure] :: loading settings :: file = /home/jenkins/jenkins-slave/workspace/Lucene-Solr-Tests-8.x/lucene/top-level-ivy-settings.xml

resolve:

ivy-availability-check:
[loadresource] Do not set property disallowed.ivy.jars.list as its length is 0.

-ivy-fail-disallowed-ivy-version:

ivy-fail:

ivy-configure:
[ivy:configure] :: loading settings :: file = /home/jenkins/jenkins-slave/workspace/Lucene-Solr-Tests-8.x/lucene/top-level-ivy-settings.xml

resolve:

ivy-availability-check:
[loadresource] Do not set property disallowed.ivy.jars.list as its length is 0.

-ivy-fail-disallowed-ivy-version:

ivy-fail:

ivy-fail:

ivy-configure:
[ivy:configure] :: loading settings :: file = /home/jenkins/jenkins-slave/workspace/Lucene-Solr-Tests-8.x/lucene/top-level-ivy-settings.xml

resolve:

ivy-availability-check:
[loadresource] Do not set property disallowed.ivy.jars.list as its length is 0.

-ivy-fail-disallowed-ivy-version:

ivy-fail:

ivy-fail:

ivy-configure:
[ivy:configure] :: loading settings :: file = /home/jenkins/jenkins-slave/workspace/Lucene-Solr-Tests-8.x/lucene/top-level-ivy-settings.xml

resolve:

ivy-availability-check:
[loadresource] Do not set property disallowed.ivy.jars.list as its length is 0.

-ivy-fail-disallowed-ivy-version:

ivy-fail:

ivy-fail:

ivy-configure:
[ivy:configure] :: loading settings :: file = /home/jenkins/jenkins-slave/workspace/Lucene-Solr-Tests-8.x/lucene/top-level-ivy-settings.xml

resolve:

ivy-availability-check:
[loadresource] Do not set property disallowed.ivy.jars.list as its length is 0.

-ivy-fail-disallowed-ivy-version:

ivy-fail:

ivy-fail:

ivy-configure:
[ivy:configure] :: loading settings :: file = /home/jenkins/jenkins-slave/workspace/Lucene-Solr-Tests-8.x/lucene/top-level-ivy-settings.xml

resolve:

ivy-availability-check:
[loadresource] Do not set property disallowed.ivy.jars.list as its length is 0.

-ivy-fail-disallowed-ivy-version:

ivy-fail:

ivy-fail:

ivy-configure:
[ivy:configure] :: loading settings :: file = /home/jenkins/jenkins-slave/workspace/Lucene-Solr-Tests-8.x/lucene/top-level-ivy-settings.xml

resolve:

ivy-availability-check:
[loadresource] Do not set property disallowed.ivy.jars.list as its length is 0.

-ivy-fail-disallowed-ivy-version:

ivy-fail:

ivy-fail:

ivy-configure:
[ivy:configure] :: loading settings :: file = /home/jenkins/jenkins-slave/workspace/Lucene-Solr-Tests-8.x/lucene/top-level-ivy-settings.xml

resolve:

ivy-availability-check:
[loadresource] Do not set property disallowed.ivy.jars.list as its length is 0.

-ivy-fail-disallowed-ivy-version:

ivy-fail:

ivy-fail:

ivy-configure:
[ivy:configure] :: loading settings :: file = /home/jenkins/jenkins-slave/workspace/Lucene-Solr-Tests-8.x/lucene/top-level-ivy-settings.xml

resolve:

ivy-availability-check:
[loadresource] Do not set property disallowed.ivy.jars.list as its length is 0.

-ivy-fail-disallowed-ivy-version:

ivy-fail:

ivy-fail:

ivy-configure:
[ivy:configure] :: loading settings :: file = /home/jenkins/jenkins-slave/workspace/Lucene-Solr-Tests-8.x/lucene/top-level-ivy-settings.xml

resolve:

ivy-availability-check:
[loadresource] Do not set property disallowed.ivy.jars.list as its length is 0.

-ivy-fail-disallowed-ivy-version:

ivy-fail:

ivy-fail:

ivy-configure:
[ivy:configure] :: loading settings :: file = /home/jenkins/jenkins-slave/workspace/Lucene-Solr-Tests-8.x/lucene/top-level-ivy-settings.xml

resolve:

ivy-availability-check:
[loadresource] Do not set property disallowed.ivy.jars.list as its length is 0.

-ivy-fail-disallowed-ivy-version:

ivy-fail:

ivy-fail:

ivy-configure:
[ivy:configure] :: loading settings :: file = /home/jenkins/jenkins-slave/workspace/Lucene-Solr-Tests-8.x/lucene/top-level-ivy-settings.xml

resolve:

ivy-availability-check:
[loadresource] Do not set property disallowed.ivy.jars.list as its length is 0.

-ivy-fail-disallowed-ivy-version:

ivy-fail:

ivy-fail:

ivy-configure:
[ivy:configure] :: loading settings :: file = /home/jenkins/jenkins-slave/workspace/Lucene-Solr-Tests-8.x/lucene/top-level-ivy-settings.xml

resolve:

jar-checksums:
    [mkdir] Created dir: /home/jenkins/jenkins-slave/workspace/Lucene-Solr-Tests-8.x/solr/null425468487
     [copy] Copying 249 files to /home/jenkins/jenkins-slave/workspace/Lucene-Solr-Tests-8.x/solr/null425468487
   [delete] Deleting directory /home/jenkins/jenkins-slave/workspace/Lucene-Solr-Tests-8.x/solr/null425468487

check-working-copy:
[ivy:cachepath] :: resolving dependencies :: #;[hidden email]
[ivy:cachepath] confs: [default]
[ivy:cachepath] found org.eclipse.jgit#org.eclipse.jgit;5.3.0.201903130848-r in public
[ivy:cachepath] found com.jcraft#jsch;0.1.54 in public
[ivy:cachepath] found com.jcraft#jzlib;1.1.1 in public
[ivy:cachepath] found com.googlecode.javaewah#JavaEWAH;1.1.6 in public
[ivy:cachepath] found org.slf4j#slf4j-api;1.7.2 in public
[ivy:cachepath] found org.bouncycastle#bcpg-jdk15on;1.60 in public
[ivy:cachepath] found org.bouncycastle#bcprov-jdk15on;1.60 in public
[ivy:cachepath] found org.bouncycastle#bcpkix-jdk15on;1.60 in public
[ivy:cachepath] found org.slf4j#slf4j-nop;1.7.2 in public
[ivy:cachepath] :: resolution report :: resolve 34ms :: artifacts dl 2ms
        ---------------------------------------------------------------------
        |                  |            modules            ||   artifacts   |
        |       conf       | number| search|dwnlded|evicted|| number|dwnlded|
        ---------------------------------------------------------------------
        |      default     |   9   |   0   |   0   |   0   ||   9   |   0   |
        ---------------------------------------------------------------------
[wc-checker] Initializing working copy...
[wc-checker] Checking working copy status...

-jenkins-base:

BUILD SUCCESSFUL
Total time: 203 minutes 53 seconds
Archiving artifacts
java.lang.InterruptedException: no matches found within 10000
        at hudson.FilePath$ValidateAntFileMask.hasMatch(FilePath.java:2847)
        at hudson.FilePath$ValidateAntFileMask.invoke(FilePath.java:2726)
        at hudson.FilePath$ValidateAntFileMask.invoke(FilePath.java:2707)
        at hudson.FilePath$FileCallableWrapper.call(FilePath.java:3086)
Also:   hudson.remoting.Channel$CallSiteStackTrace: Remote call to lucene2
                at hudson.remoting.Channel.attachCallSiteStackTrace(Channel.java:1741)
                at hudson.remoting.UserRequest$ExceptionResponse.retrieve(UserRequest.java:357)
                at hudson.remoting.Channel.call(Channel.java:955)
                at hudson.FilePath.act(FilePath.java:1072)
                at hudson.FilePath.act(FilePath.java:1061)
                at hudson.FilePath.validateAntFileMask(FilePath.java:2705)
                at hudson.tasks.ArtifactArchiver.perform(ArtifactArchiver.java:243)
                at hudson.tasks.BuildStepCompatibilityLayer.perform(BuildStepCompatibilityLayer.java:81)
                at hudson.tasks.BuildStepMonitor$1.perform(BuildStepMonitor.java:20)
                at hudson.model.AbstractBuild$AbstractBuildExecution.perform(AbstractBuild.java:744)
                at hudson.model.AbstractBuild$AbstractBuildExecution.performAllBuildSteps(AbstractBuild.java:690)
                at hudson.model.Build$BuildExecution.post2(Build.java:186)
                at hudson.model.AbstractBuild$AbstractBuildExecution.post(AbstractBuild.java:635)
                at hudson.model.Run.execute(Run.java:1835)
                at hudson.model.FreeStyleBuild.run(FreeStyleBuild.java:43)
                at hudson.model.ResourceController.execute(ResourceController.java:97)
                at hudson.model.Executor.run(Executor.java:429)
Caused: hudson.FilePath$TunneledInterruptedException
        at hudson.FilePath$FileCallableWrapper.call(FilePath.java:3088)
        at hudson.remoting.UserRequest.perform(UserRequest.java:212)
        at hudson.remoting.UserRequest.perform(UserRequest.java:54)
        at hudson.remoting.Request$2.run(Request.java:369)
        at hudson.remoting.InterceptingExecutorService$1.call(InterceptingExecutorService.java:72)
        at java.util.concurrent.FutureTask.run(FutureTask.java:266)
        at java.util.concurrent.ThreadPoolExecutor.runWorker(ThreadPoolExecutor.java:1142)
        at java.util.concurrent.ThreadPoolExecutor$Worker.run(ThreadPoolExecutor.java:617)
        at java.lang.Thread.run(Thread.java:748)
Caused: java.lang.InterruptedException: java.lang.InterruptedException: no matches found within 10000
        at hudson.FilePath.act(FilePath.java:1074)
        at hudson.FilePath.act(FilePath.java:1061)
        at hudson.FilePath.validateAntFileMask(FilePath.java:2705)
        at hudson.tasks.ArtifactArchiver.perform(ArtifactArchiver.java:243)
        at hudson.tasks.BuildStepCompatibilityLayer.perform(BuildStepCompatibilityLayer.java:81)
        at hudson.tasks.BuildStepMonitor$1.perform(BuildStepMonitor.java:20)
        at hudson.model.AbstractBuild$AbstractBuildExecution.perform(AbstractBuild.java:744)
        at hudson.model.AbstractBuild$AbstractBuildExecution.performAllBuildSteps(AbstractBuild.java:690)
        at hudson.model.Build$BuildExecution.post2(Build.java:186)
        at hudson.model.AbstractBuild$AbstractBuildExecution.post(AbstractBuild.java:635)
        at hudson.model.Run.execute(Run.java:1835)
        at hudson.model.FreeStyleBuild.run(FreeStyleBuild.java:43)
        at hudson.model.ResourceController.execute(ResourceController.java:97)
        at hudson.model.Executor.run(Executor.java:429)
No artifacts found that match the file pattern "**/*.events,heapdumps/**,**/hs_err_pid*". Configuration error?
Recording test results
Build step 'Publish JUnit test result report' changed build result to UNSTABLE
Email was triggered for: Unstable (Test Failures)
Sending email for trigger: Unstable (Test Failures)


---------------------------------------------------------------------
To unsubscribe, e-mail: [hidden email]
For additional commands, e-mail: [hidden email]