[JENKINS] Lucene-Solr-Tests-master - Build # 3384 - Failure

classic Classic list List threaded Threaded
5 messages Options
Reply | Threaded
Open this post in threaded view
|

[JENKINS] Lucene-Solr-Tests-master - Build # 3384 - Failure

Apache Jenkins Server-2
Build: https://builds.apache.org/job/Lucene-Solr-Tests-master/3384/

All tests passed

Build Log:
[...truncated 64353 lines...]
-ecj-javadoc-lint-src:
    [mkdir] Created dir: /tmp/ecj1559259735
 [ecj-lint] Compiling 1279 source files to /tmp/ecj1559259735
 [ecj-lint] Processing annotations
 [ecj-lint] Annotations processed
 [ecj-lint] Processing annotations
 [ecj-lint] No elements to process
 [ecj-lint] invalid Class-Path header in manifest of jar file: /x1/jenkins/.ivy2/cache/org.restlet.jee/org.restlet/jars/org.restlet-2.3.0.jar
 [ecj-lint] invalid Class-Path header in manifest of jar file: /x1/jenkins/.ivy2/cache/org.restlet.jee/org.restlet.ext.servlet/jars/org.restlet.ext.servlet-2.3.0.jar
 [ecj-lint] ----------
 [ecj-lint] 1. WARNING in /x1/jenkins/jenkins-slave/workspace/Lucene-Solr-Tests-master/solr/core/src/java/org/apache/solr/client/solrj/embedded/EmbeddedSolrServer.java (at line 219)
 [ecj-lint] return (NamedList<Object>) new JavaBinCodec(resolver).unmarshal(in);
 [ecj-lint]                           ^^^^^^^^^^^^^^^^^^^^^^^^^^
 [ecj-lint] Resource leak: '<unassigned Closeable value>' is never closed
 [ecj-lint] ----------
 [ecj-lint] ----------
 [ecj-lint] 2. WARNING in /x1/jenkins/jenkins-slave/workspace/Lucene-Solr-Tests-master/solr/core/src/java/org/apache/solr/cloud/autoscaling/sim/SimCloudManager.java (at line 788)
 [ecj-lint] throw new UnsupportedOperationException("must add at least 1 node first");
 [ecj-lint] ^^^^^^^^^^^^^^^^^^^^^^^^^^^^^^^^^^^^^^^^^^^^^^^^^^^^^^^^^^^^^^^^^^^^^^^^^^
 [ecj-lint] Resource leak: 'queryRequest' is not closed at this location
 [ecj-lint] ----------
 [ecj-lint] 3. WARNING in /x1/jenkins/jenkins-slave/workspace/Lucene-Solr-Tests-master/solr/core/src/java/org/apache/solr/cloud/autoscaling/sim/SimCloudManager.java (at line 794)
 [ecj-lint] throw new UnsupportedOperationException("must add at least 1 node first");
 [ecj-lint] ^^^^^^^^^^^^^^^^^^^^^^^^^^^^^^^^^^^^^^^^^^^^^^^^^^^^^^^^^^^^^^^^^^^^^^^^^^
 [ecj-lint] Resource leak: 'queryRequest' is not closed at this location
 [ecj-lint] ----------
 [ecj-lint] ----------
 [ecj-lint] 4. ERROR in /x1/jenkins/jenkins-slave/workspace/Lucene-Solr-Tests-master/solr/core/src/java/org/apache/solr/core/SolrResourceLoader.java (at line 19)
 [ecj-lint] import javax.naming.Context;
 [ecj-lint]       ^^^^^^^^^^^^^^^^^^^^
 [ecj-lint] The type javax.naming.Context is not accessible
 [ecj-lint] ----------
 [ecj-lint] 5. ERROR in /x1/jenkins/jenkins-slave/workspace/Lucene-Solr-Tests-master/solr/core/src/java/org/apache/solr/core/SolrResourceLoader.java (at line 20)
 [ecj-lint] import javax.naming.InitialContext;
 [ecj-lint]       ^^^^^^^^^^^^^^^^^^^^^^^^^^^
 [ecj-lint] The type javax.naming.InitialContext is not accessible
 [ecj-lint] ----------
 [ecj-lint] 6. ERROR in /x1/jenkins/jenkins-slave/workspace/Lucene-Solr-Tests-master/solr/core/src/java/org/apache/solr/core/SolrResourceLoader.java (at line 21)
 [ecj-lint] import javax.naming.NamingException;
 [ecj-lint]       ^^^^^^^^^^^^^^^^^^^^^^^^^^^^
 [ecj-lint] The type javax.naming.NamingException is not accessible
 [ecj-lint] ----------
 [ecj-lint] 7. ERROR in /x1/jenkins/jenkins-slave/workspace/Lucene-Solr-Tests-master/solr/core/src/java/org/apache/solr/core/SolrResourceLoader.java (at line 22)
 [ecj-lint] import javax.naming.NoInitialContextException;
 [ecj-lint]       ^^^^^^^^^^^^^^^^^^^^^^^^^^^^^^^^^^^^^^
 [ecj-lint] The type javax.naming.NoInitialContextException is not accessible
 [ecj-lint] ----------
 [ecj-lint] 8. ERROR in /x1/jenkins/jenkins-slave/workspace/Lucene-Solr-Tests-master/solr/core/src/java/org/apache/solr/core/SolrResourceLoader.java (at line 776)
 [ecj-lint] Context c = new InitialContext();
 [ecj-lint] ^^^^^^^
 [ecj-lint] Context cannot be resolved to a type
 [ecj-lint] ----------
 [ecj-lint] 9. ERROR in /x1/jenkins/jenkins-slave/workspace/Lucene-Solr-Tests-master/solr/core/src/java/org/apache/solr/core/SolrResourceLoader.java (at line 776)
 [ecj-lint] Context c = new InitialContext();
 [ecj-lint]                ^^^^^^^^^^^^^^
 [ecj-lint] InitialContext cannot be resolved to a type
 [ecj-lint] ----------
 [ecj-lint] 10. ERROR in /x1/jenkins/jenkins-slave/workspace/Lucene-Solr-Tests-master/solr/core/src/java/org/apache/solr/core/SolrResourceLoader.java (at line 779)
 [ecj-lint] } catch (NoInitialContextException e) {
 [ecj-lint]         ^^^^^^^^^^^^^^^^^^^^^^^^^
 [ecj-lint] NoInitialContextException cannot be resolved to a type
 [ecj-lint] ----------
 [ecj-lint] 11. ERROR in /x1/jenkins/jenkins-slave/workspace/Lucene-Solr-Tests-master/solr/core/src/java/org/apache/solr/core/SolrResourceLoader.java (at line 781)
 [ecj-lint] } catch (NamingException e) {
 [ecj-lint]         ^^^^^^^^^^^^^^^
 [ecj-lint] NamingException cannot be resolved to a type
 [ecj-lint] ----------
 [ecj-lint] ----------
 [ecj-lint] 12. WARNING in /x1/jenkins/jenkins-slave/workspace/Lucene-Solr-Tests-master/solr/core/src/java/org/apache/solr/handler/SolrConfigHandler.java (at line 535)
 [ecj-lint] new PluginBag.RuntimeLib(req.getCore()).init(new PluginInfo(info.tag, op.getDataMap()));
 [ecj-lint] ^^^^^^^^^^^^^^^^^^^^^^^^^^^^^^^^^^^^^^^
 [ecj-lint] Resource leak: '<unassigned Closeable value>' is never closed
 [ecj-lint] ----------
 [ecj-lint] ----------
 [ecj-lint] 13. WARNING in /x1/jenkins/jenkins-slave/workspace/Lucene-Solr-Tests-master/solr/core/src/java/org/apache/solr/handler/admin/SegmentsInfoRequestHandler.java (at line 244)
 [ecj-lint] leafReader = ((FilterLeafReader)leafReader).getDelegate();
 [ecj-lint] ^^^^^^^^^^^^^^^^^^^^^^^^^^^^^^^^^^^^^^^^^^^^^^^^^^^^^^^^^
 [ecj-lint] Resource leak: 'leafReader' is not closed at this location
 [ecj-lint] ----------
 [ecj-lint] ----------
 [ecj-lint] 14. WARNING in /x1/jenkins/jenkins-slave/workspace/Lucene-Solr-Tests-master/solr/core/src/java/org/apache/solr/handler/component/HttpShardHandler.java (at line 148)
 [ecj-lint] return new JavaBinCodec(null, stringCache).setReadStringAsCharSeq(true);
 [ecj-lint]       ^^^^^^^^^^^^^^^^^^^^^^^^^^^^^^^^^^^
 [ecj-lint] Resource leak: '<unassigned Closeable value>' is never closed
 [ecj-lint] ----------
 [ecj-lint] ----------
 [ecj-lint] 15. WARNING in /x1/jenkins/jenkins-slave/workspace/Lucene-Solr-Tests-master/solr/core/src/java/org/apache/solr/handler/loader/JavabinLoader.java (at line 137)
 [ecj-lint] new JavaBinCodec() {
 [ecj-lint]       SolrParams params;
 [ecj-lint]       AddUpdateCommand addCmd = null;
 [ecj-lint]
 [ecj-lint]       @Override
 [ecj-lint]       public List<Object> readIterator(DataInputInputStream fis) throws IOException {
 [ecj-lint]         while (true) {
 [ecj-lint]           Object o = readVal(fis);
 [ecj-lint]           if (o == END_OBJ) break;
 [ecj-lint]           if (o instanceof NamedList) {
 [ecj-lint]             params = ((NamedList) o).toSolrParams();
 [ecj-lint]           } else {
 [ecj-lint]             try {
 [ecj-lint]               if (o instanceof byte[]) {
 [ecj-lint]                 if (params != null) req.setParams(params);
 [ecj-lint]                 byte[] buf = (byte[]) o;
 [ecj-lint]                 contentStreamLoader.load(req, rsp, new ContentStreamBase.ByteArrayStream(buf, null), processor);
 [ecj-lint]               } else {
 [ecj-lint]                 throw new RuntimeException("unsupported type ");
 [ecj-lint]               }
 [ecj-lint]             } catch (Exception e) {
 [ecj-lint]               throw new RuntimeException(e);
 [ecj-lint]             } finally {
 [ecj-lint]               params = null;
 [ecj-lint]               req.setParams(old);
 [ecj-lint]             }
 [ecj-lint]           }
 [ecj-lint]         }
 [ecj-lint]         return Collections.emptyList();
 [ecj-lint]       }
 [ecj-lint]
 [ecj-lint]     }.unmarshal(in);
 [ecj-lint] ^^^^^^^^^^^^^^^^^^^^^^^^^^^^^^^^^^^^^^^^^^^^^^^^^^^^^^^^^^^^^^^^^^^^^^^^^^^^^^^^^^^^^^^^^^^^^^^^^^^^^^^^^^^^^^^^^^^^^^^^^^^^^^^^^^^^^^^^^^^^^^^^^^^^^^^^^^^^^^^^^^^^^^^^^^^^^^^^^^^^^^^^^^^^^^^^^^^^^^^^^^^^^^^^^^^^^^^^^^^^^^^^^^^^^^^^^^^^^^^^^^^^^^^^^^^^^^^^^^^^^^^^^^^^^^^^^^^^^^^^^^^^^^^^^^^^^^^^^^^^^^^^^^^^^^^^^^^^^^^^^^^^^^^^^^^^^^^^^^^^^^^^^^^^^^^^^^^^^^^^^^^^^^^^^^^^^^^^^^^^^^^^^^^^^^^^^^^^^^^^^^^^^^^^^^^^^^^^^^^^^^^^^^^^^^^^^^^^^^^^^^^^^^^^^^^^^^^^^^^^^^^^^^^^^^^^^^^^^^^^^^^^^^^^^^^^^^^^^^^^^^^^^^^^^^^^^^^^^^^^^^^^^^^^^^^^^^^^^^^^^^^^^^^^^^^^^^^^^^^^^^^^^^^^^^^^^^^^^^^^^^^^^^^^^^^^^^^^^^^^^^^^^^^^^^^^^^^^^^^^^^^^^^^^^^^^^^^^^^^^^^^^^^^^^^^^^^^^^^^^^^^^^^^^^^^^^^^^^^^^^^^^^^^^^^^^^^^^^^^^^^^^^^^^^^^^^^^^^^^^^^^^^^^^^^^^^^^^^^^^^^^^^^^^^^^^^^^^^^^^^^^^^^^^^^^^^^^^^^^^^^^^^^^^^^^^^^^^^^^^^^^^^^^^^^^^^^^^^^^^^^^^^^^^^^^^^^^^^^^^^^^^^^^^^^^^^^^^^^^^^^^^^^^^^^^^^^^^^^^^^^^^^^^^^^^^^^^^^^^^^^^^^^^^^^^^^^^^^^^^^^^^^^^^^^^^^^^^^^^^^^^^^^^^^^^^^^^^^^^^^^^^^^^^^^^^^^^^^^^^^^^^^^^^^^^^^^^^^^^^^^^^^^^^^^^^^^^^^^^^^^^^^^
 [ecj-lint] Resource leak: '<unassigned Closeable value>' is never closed
 [ecj-lint] ----------
 [ecj-lint] ----------
 [ecj-lint] 16. INFO in /x1/jenkins/jenkins-slave/workspace/Lucene-Solr-Tests-master/solr/core/src/java/org/apache/solr/logging/log4j2/Log4j2Watcher.java (at line 187)
 [ecj-lint] if (logger == root || root.equals(logger) || isRootLogger(name) || "".equals(name)) {
 [ecj-lint]                                  ^^^^^^
 [ecj-lint] Unlikely argument type for equals(): Map.Entry<String,LoggerConfig> seems to be unrelated to Logger
 [ecj-lint] ----------
 [ecj-lint] ----------
 [ecj-lint] 17. WARNING in /x1/jenkins/jenkins-slave/workspace/Lucene-Solr-Tests-master/solr/core/src/java/org/apache/solr/update/SolrIndexSplitter.java (at line 258)
 [ecj-lint] HardlinkCopyDirectoryWrapper hardLinkedDir = new HardlinkCopyDirectoryWrapper(splitDir);
 [ecj-lint]                             ^^^^^^^^^^^^^
 [ecj-lint] Resource leak: 'hardLinkedDir' is never closed
 [ecj-lint] ----------
 [ecj-lint] ----------
 [ecj-lint] 18. WARNING in /x1/jenkins/jenkins-slave/workspace/Lucene-Solr-Tests-master/solr/core/src/java/org/apache/solr/util/FileUtils.java (at line 50)
 [ecj-lint] in = new FileInputStream(src).getChannel();
 [ecj-lint]     ^^^^^^^^^^^^^^^^^^^^^^^^
 [ecj-lint] Resource leak: '<unassigned Closeable value>' is never closed
 [ecj-lint] ----------
 [ecj-lint] 19. WARNING in /x1/jenkins/jenkins-slave/workspace/Lucene-Solr-Tests-master/solr/core/src/java/org/apache/solr/util/FileUtils.java (at line 51)
 [ecj-lint] out = new FileOutputStream(destination).getChannel();
 [ecj-lint]      ^^^^^^^^^^^^^^^^^^^^^^^^^^^^^^^^^
 [ecj-lint] Resource leak: '<unassigned Closeable value>' is never closed
 [ecj-lint] ----------
 [ecj-lint] ----------
 [ecj-lint] 20. WARNING in /x1/jenkins/jenkins-slave/workspace/Lucene-Solr-Tests-master/solr/core/src/java/org/apache/solr/util/SolrCLI.java (at line 1143)
 [ecj-lint] SnapshotCloudManager snapshotCloudManager = new SnapshotCloudManager(simCloudManager, config);
 [ecj-lint]                     ^^^^^^^^^^^^^^^^^^^^
 [ecj-lint] Resource leak: 'snapshotCloudManager' is never closed
 [ecj-lint] ----------
 [ecj-lint] ----------
 [ecj-lint] 21. WARNING in /x1/jenkins/jenkins-slave/workspace/Lucene-Solr-Tests-master/solr/core/src/java/org/apache/solr/util/TestInjection.java (at line 263)
 [ecj-lint] timers.remove(this);
 [ecj-lint]              ^^^^
 [ecj-lint] Unlikely argument type new TimerTask(){} for remove(Object) on a Collection<Timer>
 [ecj-lint] ----------
 [ecj-lint] 21 problems (8 errors, 12 warnings, 1 info)

BUILD FAILED
/x1/jenkins/jenkins-slave/workspace/Lucene-Solr-Tests-master/build.xml:634: The following error occurred while executing this line:
/x1/jenkins/jenkins-slave/workspace/Lucene-Solr-Tests-master/build.xml:101: The following error occurred while executing this line:
/x1/jenkins/jenkins-slave/workspace/Lucene-Solr-Tests-master/solr/build.xml:645: The following error occurred while executing this line:
/x1/jenkins/jenkins-slave/workspace/Lucene-Solr-Tests-master/lucene/common-build.xml:2009: The following error occurred while executing this line:
/x1/jenkins/jenkins-slave/workspace/Lucene-Solr-Tests-master/lucene/common-build.xml:2048: Compile failed; see the compiler error output for details.

Total time: 121 minutes 33 seconds
Build step 'Invoke Ant' marked build as failure
Archiving artifacts
Recording test results
Email was triggered for: Failure - Any
Sending email for trigger: Failure - Any


---------------------------------------------------------------------
To unsubscribe, e-mail: [hidden email]
For additional commands, e-mail: [hidden email]
Reply | Threaded
Open this post in threaded view
|

[JENKINS] Lucene-Solr-Tests-master - Build # 3385 - Still Failing

Apache Jenkins Server-2
Build: https://builds.apache.org/job/Lucene-Solr-Tests-master/3385/

All tests passed

Build Log:
[...truncated 65007 lines...]
-ecj-javadoc-lint-src:
    [mkdir] Created dir: /tmp/ecj671470942
 [ecj-lint] Compiling 69 source files to /tmp/ecj671470942
 [ecj-lint] invalid Class-Path header in manifest of jar file: /home/jenkins/.ivy2/cache/org.restlet.jee/org.restlet/jars/org.restlet-2.3.0.jar
 [ecj-lint] invalid Class-Path header in manifest of jar file: /home/jenkins/.ivy2/cache/org.restlet.jee/org.restlet.ext.servlet/jars/org.restlet.ext.servlet-2.3.0.jar
 [ecj-lint] ----------
 [ecj-lint] 1. ERROR in /home/jenkins/jenkins-slave/workspace/Lucene-Solr-Tests-master/solr/contrib/dataimporthandler/src/java/org/apache/solr/handler/dataimport/JdbcDataSource.java (at line 28)
 [ecj-lint] import javax.naming.InitialContext;
 [ecj-lint]       ^^^^^^^^^^^^^^^^^^^^^^^^^^^
 [ecj-lint] The type javax.naming.InitialContext is not accessible
 [ecj-lint] ----------
 [ecj-lint] 2. ERROR in /home/jenkins/jenkins-slave/workspace/Lucene-Solr-Tests-master/solr/contrib/dataimporthandler/src/java/org/apache/solr/handler/dataimport/JdbcDataSource.java (at line 29)
 [ecj-lint] import javax.naming.NamingException;
 [ecj-lint]       ^^^^^^^^^^^^^^^^^^^^^^^^^^^^
 [ecj-lint] The type javax.naming.NamingException is not accessible
 [ecj-lint] ----------
 [ecj-lint] 3. ERROR in /home/jenkins/jenkins-slave/workspace/Lucene-Solr-Tests-master/solr/contrib/dataimporthandler/src/java/org/apache/solr/handler/dataimport/JdbcDataSource.java (at line 182)
 [ecj-lint] c = getFromJndi(initProps, jndiName);
 [ecj-lint]    ^^^^^^^^^^^
 [ecj-lint] The method getFromJndi(Properties, String) from the type new Callable<Connection>(){} refers to the missing type NamingException
 [ecj-lint] ----------
 [ecj-lint] 4. ERROR in /home/jenkins/jenkins-slave/workspace/Lucene-Solr-Tests-master/solr/contrib/dataimporthandler/src/java/org/apache/solr/handler/dataimport/JdbcDataSource.java (at line 245)
 [ecj-lint] private Connection getFromJndi(final Properties initProps, final String jndiName) throws NamingException,
 [ecj-lint]                                                                                         ^^^^^^^^^^^^^^^
 [ecj-lint] NamingException cannot be resolved to a type
 [ecj-lint] ----------
 [ecj-lint] 5. ERROR in /home/jenkins/jenkins-slave/workspace/Lucene-Solr-Tests-master/solr/contrib/dataimporthandler/src/java/org/apache/solr/handler/dataimport/JdbcDataSource.java (at line 249)
 [ecj-lint] InitialContext ctx =  new InitialContext();
 [ecj-lint] ^^^^^^^^^^^^^^
 [ecj-lint] InitialContext cannot be resolved to a type
 [ecj-lint] ----------
 [ecj-lint] 6. ERROR in /home/jenkins/jenkins-slave/workspace/Lucene-Solr-Tests-master/solr/contrib/dataimporthandler/src/java/org/apache/solr/handler/dataimport/JdbcDataSource.java (at line 249)
 [ecj-lint] InitialContext ctx =  new InitialContext();
 [ecj-lint]                          ^^^^^^^^^^^^^^
 [ecj-lint] InitialContext cannot be resolved to a type
 [ecj-lint] ----------
 [ecj-lint] 6 problems (6 errors)

BUILD FAILED
/home/jenkins/jenkins-slave/workspace/Lucene-Solr-Tests-master/build.xml:634: The following error occurred while executing this line:
/home/jenkins/jenkins-slave/workspace/Lucene-Solr-Tests-master/build.xml:101: The following error occurred while executing this line:
/home/jenkins/jenkins-slave/workspace/Lucene-Solr-Tests-master/solr/build.xml:651: The following error occurred while executing this line:
/home/jenkins/jenkins-slave/workspace/Lucene-Solr-Tests-master/solr/common-build.xml:479: The following error occurred while executing this line:
/home/jenkins/jenkins-slave/workspace/Lucene-Solr-Tests-master/lucene/common-build.xml:2009: The following error occurred while executing this line:
/home/jenkins/jenkins-slave/workspace/Lucene-Solr-Tests-master/lucene/common-build.xml:2048: Compile failed; see the compiler error output for details.

Total time: 238 minutes 54 seconds
Build step 'Invoke Ant' marked build as failure
Archiving artifacts
Recording test results
Email was triggered for: Failure - Any
Sending email for trigger: Failure - Any


---------------------------------------------------------------------
To unsubscribe, e-mail: [hidden email]
For additional commands, e-mail: [hidden email]
Reply | Threaded
Open this post in threaded view
|

Re: [JENKINS] Lucene-Solr-Tests-master - Build # 3385 - Still Failing

Joel Bernstein
I saw these failures locally when running precommit, After running clean and clean-jars the precommit passed. Is there an issue with the jars on jenkins?





On Mon, Jun 17, 2019 at 3:35 PM Apache Jenkins Server <[hidden email]> wrote:
Build: https://builds.apache.org/job/Lucene-Solr-Tests-master/3385/

All tests passed

Build Log:
[...truncated 65007 lines...]
-ecj-javadoc-lint-src:
    [mkdir] Created dir: /tmp/ecj671470942
 [ecj-lint] Compiling 69 source files to /tmp/ecj671470942
 [ecj-lint] invalid Class-Path header in manifest of jar file: /home/jenkins/.ivy2/cache/org.restlet.jee/org.restlet/jars/org.restlet-2.3.0.jar
 [ecj-lint] invalid Class-Path header in manifest of jar file: /home/jenkins/.ivy2/cache/org.restlet.jee/org.restlet.ext.servlet/jars/org.restlet.ext.servlet-2.3.0.jar
 [ecj-lint] ----------
 [ecj-lint] 1. ERROR in /home/jenkins/jenkins-slave/workspace/Lucene-Solr-Tests-master/solr/contrib/dataimporthandler/src/java/org/apache/solr/handler/dataimport/JdbcDataSource.java (at line 28)
 [ecj-lint]     import javax.naming.InitialContext;
 [ecj-lint]            ^^^^^^^^^^^^^^^^^^^^^^^^^^^
 [ecj-lint] The type javax.naming.InitialContext is not accessible
 [ecj-lint] ----------
 [ecj-lint] 2. ERROR in /home/jenkins/jenkins-slave/workspace/Lucene-Solr-Tests-master/solr/contrib/dataimporthandler/src/java/org/apache/solr/handler/dataimport/JdbcDataSource.java (at line 29)
 [ecj-lint]     import javax.naming.NamingException;
 [ecj-lint]            ^^^^^^^^^^^^^^^^^^^^^^^^^^^^
 [ecj-lint] The type javax.naming.NamingException is not accessible
 [ecj-lint] ----------
 [ecj-lint] 3. ERROR in /home/jenkins/jenkins-slave/workspace/Lucene-Solr-Tests-master/solr/contrib/dataimporthandler/src/java/org/apache/solr/handler/dataimport/JdbcDataSource.java (at line 182)
 [ecj-lint]     c = getFromJndi(initProps, jndiName);
 [ecj-lint]         ^^^^^^^^^^^
 [ecj-lint] The method getFromJndi(Properties, String) from the type new Callable<Connection>(){} refers to the missing type NamingException
 [ecj-lint] ----------
 [ecj-lint] 4. ERROR in /home/jenkins/jenkins-slave/workspace/Lucene-Solr-Tests-master/solr/contrib/dataimporthandler/src/java/org/apache/solr/handler/dataimport/JdbcDataSource.java (at line 245)
 [ecj-lint]     private Connection getFromJndi(final Properties initProps, final String jndiName) throws NamingException,
 [ecj-lint]                                                                                              ^^^^^^^^^^^^^^^
 [ecj-lint] NamingException cannot be resolved to a type
 [ecj-lint] ----------
 [ecj-lint] 5. ERROR in /home/jenkins/jenkins-slave/workspace/Lucene-Solr-Tests-master/solr/contrib/dataimporthandler/src/java/org/apache/solr/handler/dataimport/JdbcDataSource.java (at line 249)
 [ecj-lint]     InitialContext ctx =  new InitialContext();
 [ecj-lint]     ^^^^^^^^^^^^^^
 [ecj-lint] InitialContext cannot be resolved to a type
 [ecj-lint] ----------
 [ecj-lint] 6. ERROR in /home/jenkins/jenkins-slave/workspace/Lucene-Solr-Tests-master/solr/contrib/dataimporthandler/src/java/org/apache/solr/handler/dataimport/JdbcDataSource.java (at line 249)
 [ecj-lint]     InitialContext ctx =  new InitialContext();
 [ecj-lint]                               ^^^^^^^^^^^^^^
 [ecj-lint] InitialContext cannot be resolved to a type
 [ecj-lint] ----------
 [ecj-lint] 6 problems (6 errors)

BUILD FAILED
/home/jenkins/jenkins-slave/workspace/Lucene-Solr-Tests-master/build.xml:634: The following error occurred while executing this line:
/home/jenkins/jenkins-slave/workspace/Lucene-Solr-Tests-master/build.xml:101: The following error occurred while executing this line:
/home/jenkins/jenkins-slave/workspace/Lucene-Solr-Tests-master/solr/build.xml:651: The following error occurred while executing this line:
/home/jenkins/jenkins-slave/workspace/Lucene-Solr-Tests-master/solr/common-build.xml:479: The following error occurred while executing this line:
/home/jenkins/jenkins-slave/workspace/Lucene-Solr-Tests-master/lucene/common-build.xml:2009: The following error occurred while executing this line:
/home/jenkins/jenkins-slave/workspace/Lucene-Solr-Tests-master/lucene/common-build.xml:2048: Compile failed; see the compiler error output for details.

Total time: 238 minutes 54 seconds
Build step 'Invoke Ant' marked build as failure
Archiving artifacts
Recording test results
Email was triggered for: Failure - Any
Sending email for trigger: Failure - Any

---------------------------------------------------------------------
To unsubscribe, e-mail: [hidden email]
For additional commands, e-mail: [hidden email]
Reply | Threaded
Open this post in threaded view
|

Re: [JENKINS] Lucene-Solr-Tests-master - Build # 3385 - Still Failing

Chris Hostetter-3

It is sporadic & seemingly unpredictible & has been happening for
various people on various machines / OSes since the upgrade to java11 on
master -- see thread "precommit failures" ...

http://mail-archives.apache.org/mod_mbox/lucene-dev/201906.mbox/%3Calpine.DEB.2.11.1906131520060.17915%40tray%3E



: Date: Mon, 17 Jun 2019 15:57:30 -0400
: From: Joel Bernstein <[hidden email]>
: Reply-To: [hidden email]
: To: lucene dev <[hidden email]>
: Subject: Re: [JENKINS] Lucene-Solr-Tests-master - Build # 3385 - Still Failing
:
: I saw these failures locally when running precommit, After running clean
: and clean-jars the precommit passed. Is there an issue with the jars on
: jenkins?
:
:
:
: Joel Bernstein
: http://joelsolr.blogspot.com/
:
:
: On Mon, Jun 17, 2019 at 3:35 PM Apache Jenkins Server <
: [hidden email]> wrote:
:
: > Build: https://builds.apache.org/job/Lucene-Solr-Tests-master/3385/
: >
: > All tests passed
: >
: > Build Log:
: > [...truncated 65007 lines...]
: > -ecj-javadoc-lint-src:
: >     [mkdir] Created dir: /tmp/ecj671470942
: >  [ecj-lint] Compiling 69 source files to /tmp/ecj671470942
: >  [ecj-lint] invalid Class-Path header in manifest of jar file:
: > /home/jenkins/.ivy2/cache/org.restlet.jee/org.restlet/jars/org.restlet-2.3.0.jar
: >  [ecj-lint] invalid Class-Path header in manifest of jar file:
: > /home/jenkins/.ivy2/cache/org.restlet.jee/org.restlet.ext.servlet/jars/org.restlet.ext.servlet-2.3.0.jar
: >  [ecj-lint] ----------
: >  [ecj-lint] 1. ERROR in
: > /home/jenkins/jenkins-slave/workspace/Lucene-Solr-Tests-master/solr/contrib/dataimporthandler/src/java/org/apache/solr/handler/dataimport/JdbcDataSource.java
: > (at line 28)
: >  [ecj-lint]     import javax.naming.InitialContext;
: >  [ecj-lint]            ^^^^^^^^^^^^^^^^^^^^^^^^^^^
: >  [ecj-lint] The type javax.naming.InitialContext is not accessible
: >  [ecj-lint] ----------
: >  [ecj-lint] 2. ERROR in
: > /home/jenkins/jenkins-slave/workspace/Lucene-Solr-Tests-master/solr/contrib/dataimporthandler/src/java/org/apache/solr/handler/dataimport/JdbcDataSource.java
: > (at line 29)
: >  [ecj-lint]     import javax.naming.NamingException;
: >  [ecj-lint]            ^^^^^^^^^^^^^^^^^^^^^^^^^^^^
: >  [ecj-lint] The type javax.naming.NamingException is not accessible
: >  [ecj-lint] ----------
: >  [ecj-lint] 3. ERROR in
: > /home/jenkins/jenkins-slave/workspace/Lucene-Solr-Tests-master/solr/contrib/dataimporthandler/src/java/org/apache/solr/handler/dataimport/JdbcDataSource.java
: > (at line 182)
: >  [ecj-lint]     c = getFromJndi(initProps, jndiName);
: >  [ecj-lint]         ^^^^^^^^^^^
: >  [ecj-lint] The method getFromJndi(Properties, String) from the type new
: > Callable<Connection>(){} refers to the missing type NamingException
: >  [ecj-lint] ----------
: >  [ecj-lint] 4. ERROR in
: > /home/jenkins/jenkins-slave/workspace/Lucene-Solr-Tests-master/solr/contrib/dataimporthandler/src/java/org/apache/solr/handler/dataimport/JdbcDataSource.java
: > (at line 245)
: >  [ecj-lint]     private Connection getFromJndi(final Properties initProps,
: > final String jndiName) throws NamingException,
: >  [ecj-lint]
: >                               ^^^^^^^^^^^^^^^
: >  [ecj-lint] NamingException cannot be resolved to a type
: >  [ecj-lint] ----------
: >  [ecj-lint] 5. ERROR in
: > /home/jenkins/jenkins-slave/workspace/Lucene-Solr-Tests-master/solr/contrib/dataimporthandler/src/java/org/apache/solr/handler/dataimport/JdbcDataSource.java
: > (at line 249)
: >  [ecj-lint]     InitialContext ctx =  new InitialContext();
: >  [ecj-lint]     ^^^^^^^^^^^^^^
: >  [ecj-lint] InitialContext cannot be resolved to a type
: >  [ecj-lint] ----------
: >  [ecj-lint] 6. ERROR in
: > /home/jenkins/jenkins-slave/workspace/Lucene-Solr-Tests-master/solr/contrib/dataimporthandler/src/java/org/apache/solr/handler/dataimport/JdbcDataSource.java
: > (at line 249)
: >  [ecj-lint]     InitialContext ctx =  new InitialContext();
: >  [ecj-lint]                               ^^^^^^^^^^^^^^
: >  [ecj-lint] InitialContext cannot be resolved to a type
: >  [ecj-lint] ----------
: >  [ecj-lint] 6 problems (6 errors)
: >
: > BUILD FAILED
: > /home/jenkins/jenkins-slave/workspace/Lucene-Solr-Tests-master/build.xml:634:
: > The following error occurred while executing this line:
: > /home/jenkins/jenkins-slave/workspace/Lucene-Solr-Tests-master/build.xml:101:
: > The following error occurred while executing this line:
: > /home/jenkins/jenkins-slave/workspace/Lucene-Solr-Tests-master/solr/build.xml:651:
: > The following error occurred while executing this line:
: > /home/jenkins/jenkins-slave/workspace/Lucene-Solr-Tests-master/solr/common-build.xml:479:
: > The following error occurred while executing this line:
: > /home/jenkins/jenkins-slave/workspace/Lucene-Solr-Tests-master/lucene/common-build.xml:2009:
: > The following error occurred while executing this line:
: > /home/jenkins/jenkins-slave/workspace/Lucene-Solr-Tests-master/lucene/common-build.xml:2048:
: > Compile failed; see the compiler error output for details.
: >
: > Total time: 238 minutes 54 seconds
: > Build step 'Invoke Ant' marked build as failure
: > Archiving artifacts
: > Recording test results
: > Email was triggered for: Failure - Any
: > Sending email for trigger: Failure - Any
: >
: > ---------------------------------------------------------------------
: > To unsubscribe, e-mail: [hidden email]
: > For additional commands, e-mail: [hidden email]
:

-Hoss
http://www.lucidworks.com/

---------------------------------------------------------------------
To unsubscribe, e-mail: [hidden email]
For additional commands, e-mail: [hidden email]

Reply | Threaded
Open this post in threaded view
|

Re: [JENKINS] Lucene-Solr-Tests-master - Build # 3385 - Still Failing

Joel Bernstein
Ok, thanks for the explanation.

On Mon, Jun 17, 2019 at 4:04 PM Chris Hostetter <[hidden email]> wrote:

It is sporadic & seemingly unpredictible & has been happening for
various people on various machines / OSes since the upgrade to java11 on
master -- see thread "precommit failures" ...

http://mail-archives.apache.org/mod_mbox/lucene-dev/201906.mbox/%3Calpine.DEB.2.11.1906131520060.17915%40tray%3E



: Date: Mon, 17 Jun 2019 15:57:30 -0400
: From: Joel Bernstein <[hidden email]>
: Reply-To: [hidden email]
: To: lucene dev <[hidden email]>
: Subject: Re: [JENKINS] Lucene-Solr-Tests-master - Build # 3385 - Still Failing
:
: I saw these failures locally when running precommit, After running clean
: and clean-jars the precommit passed. Is there an issue with the jars on
: jenkins?
:
:
:
: Joel Bernstein
: http://joelsolr.blogspot.com/
:
:
: On Mon, Jun 17, 2019 at 3:35 PM Apache Jenkins Server <
: [hidden email]> wrote:
:
: > Build: https://builds.apache.org/job/Lucene-Solr-Tests-master/3385/
: >
: > All tests passed
: >
: > Build Log:
: > [...truncated 65007 lines...]
: > -ecj-javadoc-lint-src:
: >     [mkdir] Created dir: /tmp/ecj671470942
: >  [ecj-lint] Compiling 69 source files to /tmp/ecj671470942
: >  [ecj-lint] invalid Class-Path header in manifest of jar file:
: > /home/jenkins/.ivy2/cache/org.restlet.jee/org.restlet/jars/org.restlet-2.3.0.jar
: >  [ecj-lint] invalid Class-Path header in manifest of jar file:
: > /home/jenkins/.ivy2/cache/org.restlet.jee/org.restlet.ext.servlet/jars/org.restlet.ext.servlet-2.3.0.jar
: >  [ecj-lint] ----------
: >  [ecj-lint] 1. ERROR in
: > /home/jenkins/jenkins-slave/workspace/Lucene-Solr-Tests-master/solr/contrib/dataimporthandler/src/java/org/apache/solr/handler/dataimport/JdbcDataSource.java
: > (at line 28)
: >  [ecj-lint]     import javax.naming.InitialContext;
: >  [ecj-lint]            ^^^^^^^^^^^^^^^^^^^^^^^^^^^
: >  [ecj-lint] The type javax.naming.InitialContext is not accessible
: >  [ecj-lint] ----------
: >  [ecj-lint] 2. ERROR in
: > /home/jenkins/jenkins-slave/workspace/Lucene-Solr-Tests-master/solr/contrib/dataimporthandler/src/java/org/apache/solr/handler/dataimport/JdbcDataSource.java
: > (at line 29)
: >  [ecj-lint]     import javax.naming.NamingException;
: >  [ecj-lint]            ^^^^^^^^^^^^^^^^^^^^^^^^^^^^
: >  [ecj-lint] The type javax.naming.NamingException is not accessible
: >  [ecj-lint] ----------
: >  [ecj-lint] 3. ERROR in
: > /home/jenkins/jenkins-slave/workspace/Lucene-Solr-Tests-master/solr/contrib/dataimporthandler/src/java/org/apache/solr/handler/dataimport/JdbcDataSource.java
: > (at line 182)
: >  [ecj-lint]     c = getFromJndi(initProps, jndiName);
: >  [ecj-lint]         ^^^^^^^^^^^
: >  [ecj-lint] The method getFromJndi(Properties, String) from the type new
: > Callable<Connection>(){} refers to the missing type NamingException
: >  [ecj-lint] ----------
: >  [ecj-lint] 4. ERROR in
: > /home/jenkins/jenkins-slave/workspace/Lucene-Solr-Tests-master/solr/contrib/dataimporthandler/src/java/org/apache/solr/handler/dataimport/JdbcDataSource.java
: > (at line 245)
: >  [ecj-lint]     private Connection getFromJndi(final Properties initProps,
: > final String jndiName) throws NamingException,
: >  [ecj-lint]
: >                               ^^^^^^^^^^^^^^^
: >  [ecj-lint] NamingException cannot be resolved to a type
: >  [ecj-lint] ----------
: >  [ecj-lint] 5. ERROR in
: > /home/jenkins/jenkins-slave/workspace/Lucene-Solr-Tests-master/solr/contrib/dataimporthandler/src/java/org/apache/solr/handler/dataimport/JdbcDataSource.java
: > (at line 249)
: >  [ecj-lint]     InitialContext ctx =  new InitialContext();
: >  [ecj-lint]     ^^^^^^^^^^^^^^
: >  [ecj-lint] InitialContext cannot be resolved to a type
: >  [ecj-lint] ----------
: >  [ecj-lint] 6. ERROR in
: > /home/jenkins/jenkins-slave/workspace/Lucene-Solr-Tests-master/solr/contrib/dataimporthandler/src/java/org/apache/solr/handler/dataimport/JdbcDataSource.java
: > (at line 249)
: >  [ecj-lint]     InitialContext ctx =  new InitialContext();
: >  [ecj-lint]                               ^^^^^^^^^^^^^^
: >  [ecj-lint] InitialContext cannot be resolved to a type
: >  [ecj-lint] ----------
: >  [ecj-lint] 6 problems (6 errors)
: >
: > BUILD FAILED
: > /home/jenkins/jenkins-slave/workspace/Lucene-Solr-Tests-master/build.xml:634:
: > The following error occurred while executing this line:
: > /home/jenkins/jenkins-slave/workspace/Lucene-Solr-Tests-master/build.xml:101:
: > The following error occurred while executing this line:
: > /home/jenkins/jenkins-slave/workspace/Lucene-Solr-Tests-master/solr/build.xml:651:
: > The following error occurred while executing this line:
: > /home/jenkins/jenkins-slave/workspace/Lucene-Solr-Tests-master/solr/common-build.xml:479:
: > The following error occurred while executing this line:
: > /home/jenkins/jenkins-slave/workspace/Lucene-Solr-Tests-master/lucene/common-build.xml:2009:
: > The following error occurred while executing this line:
: > /home/jenkins/jenkins-slave/workspace/Lucene-Solr-Tests-master/lucene/common-build.xml:2048:
: > Compile failed; see the compiler error output for details.
: >
: > Total time: 238 minutes 54 seconds
: > Build step 'Invoke Ant' marked build as failure
: > Archiving artifacts
: > Recording test results
: > Email was triggered for: Failure - Any
: > Sending email for trigger: Failure - Any
: >
: > ---------------------------------------------------------------------
: > To unsubscribe, e-mail: [hidden email]
: > For additional commands, e-mail: [hidden email]
:

-Hoss
http://www.lucidworks.com/

---------------------------------------------------------------------
To unsubscribe, e-mail: [hidden email]
For additional commands, e-mail: [hidden email]