[JENKINS] Lucene-Solr-Tests-master - Build # 3646 - Unstable

classic Classic list List threaded Threaded
4 messages Options
Reply | Threaded
Open this post in threaded view
|

[JENKINS] Lucene-Solr-Tests-master - Build # 3646 - Unstable

Apache Jenkins Server-2
Build: https://builds.apache.org/job/Lucene-Solr-Tests-master/3646/

1 tests failed.
FAILED:  org.apache.solr.search.facet.TestCloudJSONFacetJoinDomain.testRandom

Error Message:
Error from server at http://127.0.0.1:37373/solr/org.apache.solr.search.facet.TestCloudJSONFacetJoinDomain_collection: Expected mime type application/octet-stream but got text/html. <html> <head> <meta http-equiv="Content-Type" content="text/html;charset=utf-8"/> <title>Error 500 Server Error</title> </head> <body><h2>HTTP ERROR 500</h2> <p>Problem accessing /solr/org.apache.solr.search.facet.TestCloudJSONFacetJoinDomain_collection/select. Reason: <pre>    Server Error</pre></p><h3>Caused by:</h3><pre>java.lang.AssertionError  at java.base/java.util.HashMap$TreeNode.moveRootToFront(HashMap.java:1896)  at java.base/java.util.HashMap$TreeNode.putTreeVal(HashMap.java:2061)  at java.base/java.util.HashMap.putVal(HashMap.java:633)  at java.base/java.util.HashMap.put(HashMap.java:607)  at org.apache.solr.search.LRUCache.put(LRUCache.java:197)  at org.apache.solr.search.SolrCacheHolder.put(SolrCacheHolder.java:88)  at org.apache.solr.search.SolrIndexSearcher.getDocListC(SolrIndexSearcher.java:1449)  at org.apache.solr.search.SolrIndexSearcher.search(SolrIndexSearcher.java:568)  at org.apache.solr.handler.component.QueryComponent.doProcessUngroupedSearch(QueryComponent.java:1484)  at org.apache.solr.handler.component.QueryComponent.process(QueryComponent.java:398)  at org.apache.solr.handler.component.SearchHandler.handleRequestBody(SearchHandler.java:305)  at org.apache.solr.handler.RequestHandlerBase.handleRequest(RequestHandlerBase.java:200)  at org.apache.solr.core.SolrCore.execute(SolrCore.java:2598)  at org.apache.solr.servlet.HttpSolrCall.execute(HttpSolrCall.java:780)  at org.apache.solr.servlet.HttpSolrCall.call(HttpSolrCall.java:566)  at org.apache.solr.servlet.SolrDispatchFilter.doFilter(SolrDispatchFilter.java:424)  at org.apache.solr.servlet.SolrDispatchFilter.doFilter(SolrDispatchFilter.java:351)  at org.eclipse.jetty.servlet.ServletHandler$CachedChain.doFilter(ServletHandler.java:1610)  at org.apache.solr.client.solrj.embedded.JettySolrRunner$DebugFilter.doFilter(JettySolrRunner.java:167)  at org.eclipse.jetty.servlet.ServletHandler$CachedChain.doFilter(ServletHandler.java:1610)  at org.eclipse.jetty.servlet.ServletHandler.doHandle(ServletHandler.java:540)  at org.eclipse.jetty.server.handler.ScopedHandler.nextHandle(ScopedHandler.java:255)  at org.eclipse.jetty.server.session.SessionHandler.doHandle(SessionHandler.java:1711)  at org.eclipse.jetty.server.handler.ScopedHandler.nextHandle(ScopedHandler.java:255)  at org.eclipse.jetty.server.handler.ContextHandler.doHandle(ContextHandler.java:1347)  at org.eclipse.jetty.server.handler.ScopedHandler.nextScope(ScopedHandler.java:203)  at org.eclipse.jetty.servlet.ServletHandler.doScope(ServletHandler.java:480)  at org.eclipse.jetty.server.session.SessionHandler.doScope(SessionHandler.java:1678)  at org.eclipse.jetty.server.handler.ScopedHandler.nextScope(ScopedHandler.java:201)  at org.eclipse.jetty.server.handler.ContextHandler.doScope(ContextHandler.java:1249)  at org.eclipse.jetty.server.handler.ScopedHandler.handle(ScopedHandler.java:144)  at org.eclipse.jetty.server.handler.HandlerWrapper.handle(HandlerWrapper.java:132)  at org.eclipse.jetty.rewrite.handler.RewriteHandler.handle(RewriteHandler.java:335)  at org.eclipse.jetty.server.handler.gzip.GzipHandler.handle(GzipHandler.java:753)  at org.eclipse.jetty.server.handler.HandlerWrapper.handle(HandlerWrapper.java:132)  at org.eclipse.jetty.server.Server.handle(Server.java:505)  at org.eclipse.jetty.server.HttpChannel.handle(HttpChannel.java:370)  at org.eclipse.jetty.server.HttpConnection.onFillable(HttpConnection.java:267)  at org.eclipse.jetty.io.AbstractConnection$ReadCallback.succeeded(AbstractConnection.java:305)  at org.eclipse.jetty.io.FillInterest.fillable(FillInterest.java:103)  at org.eclipse.jetty.io.ChannelEndPoint$2.run(ChannelEndPoint.java:117)  at org.eclipse.jetty.util.thread.QueuedThreadPool.runJob(QueuedThreadPool.java:781)  at org.eclipse.jetty.util.thread.QueuedThreadPool$Runner.run(QueuedThreadPool.java:917)  at java.base/java.lang.Thread.run(Thread.java:834) </pre> <hr><a href="http://eclipse.org/jetty">Powered by Jetty:// 9.4.19.v20190610</a><hr/>  </body> </html>

Stack Trace:
org.apache.solr.client.solrj.impl.HttpSolrClient$RemoteSolrException: Error from server at http://127.0.0.1:37373/solr/org.apache.solr.search.facet.TestCloudJSONFacetJoinDomain_collection: Expected mime type application/octet-stream but got text/html. <html>
<head>
<meta http-equiv="Content-Type" content="text/html;charset=utf-8"/>
<title>Error 500 Server Error</title>
</head>
<body><h2>HTTP ERROR 500</h2>
<p>Problem accessing /solr/org.apache.solr.search.facet.TestCloudJSONFacetJoinDomain_collection/select. Reason:
<pre>    Server Error</pre></p><h3>Caused by:</h3><pre>java.lang.AssertionError
        at java.base/java.util.HashMap$TreeNode.moveRootToFront(HashMap.java:1896)
        at java.base/java.util.HashMap$TreeNode.putTreeVal(HashMap.java:2061)
        at java.base/java.util.HashMap.putVal(HashMap.java:633)
        at java.base/java.util.HashMap.put(HashMap.java:607)
        at org.apache.solr.search.LRUCache.put(LRUCache.java:197)
        at org.apache.solr.search.SolrCacheHolder.put(SolrCacheHolder.java:88)
        at org.apache.solr.search.SolrIndexSearcher.getDocListC(SolrIndexSearcher.java:1449)
        at org.apache.solr.search.SolrIndexSearcher.search(SolrIndexSearcher.java:568)
        at org.apache.solr.handler.component.QueryComponent.doProcessUngroupedSearch(QueryComponent.java:1484)
        at org.apache.solr.handler.component.QueryComponent.process(QueryComponent.java:398)
        at org.apache.solr.handler.component.SearchHandler.handleRequestBody(SearchHandler.java:305)
        at org.apache.solr.handler.RequestHandlerBase.handleRequest(RequestHandlerBase.java:200)
        at org.apache.solr.core.SolrCore.execute(SolrCore.java:2598)
        at org.apache.solr.servlet.HttpSolrCall.execute(HttpSolrCall.java:780)
        at org.apache.solr.servlet.HttpSolrCall.call(HttpSolrCall.java:566)
        at org.apache.solr.servlet.SolrDispatchFilter.doFilter(SolrDispatchFilter.java:424)
        at org.apache.solr.servlet.SolrDispatchFilter.doFilter(SolrDispatchFilter.java:351)
        at org.eclipse.jetty.servlet.ServletHandler$CachedChain.doFilter(ServletHandler.java:1610)
        at org.apache.solr.client.solrj.embedded.JettySolrRunner$DebugFilter.doFilter(JettySolrRunner.java:167)
        at org.eclipse.jetty.servlet.ServletHandler$CachedChain.doFilter(ServletHandler.java:1610)
        at org.eclipse.jetty.servlet.ServletHandler.doHandle(ServletHandler.java:540)
        at org.eclipse.jetty.server.handler.ScopedHandler.nextHandle(ScopedHandler.java:255)
        at org.eclipse.jetty.server.session.SessionHandler.doHandle(SessionHandler.java:1711)
        at org.eclipse.jetty.server.handler.ScopedHandler.nextHandle(ScopedHandler.java:255)
        at org.eclipse.jetty.server.handler.ContextHandler.doHandle(ContextHandler.java:1347)
        at org.eclipse.jetty.server.handler.ScopedHandler.nextScope(ScopedHandler.java:203)
        at org.eclipse.jetty.servlet.ServletHandler.doScope(ServletHandler.java:480)
        at org.eclipse.jetty.server.session.SessionHandler.doScope(SessionHandler.java:1678)
        at org.eclipse.jetty.server.handler.ScopedHandler.nextScope(ScopedHandler.java:201)
        at org.eclipse.jetty.server.handler.ContextHandler.doScope(ContextHandler.java:1249)
        at org.eclipse.jetty.server.handler.ScopedHandler.handle(ScopedHandler.java:144)
        at org.eclipse.jetty.server.handler.HandlerWrapper.handle(HandlerWrapper.java:132)
        at org.eclipse.jetty.rewrite.handler.RewriteHandler.handle(RewriteHandler.java:335)
        at org.eclipse.jetty.server.handler.gzip.GzipHandler.handle(GzipHandler.java:753)
        at org.eclipse.jetty.server.handler.HandlerWrapper.handle(HandlerWrapper.java:132)
        at org.eclipse.jetty.server.Server.handle(Server.java:505)
        at org.eclipse.jetty.server.HttpChannel.handle(HttpChannel.java:370)
        at org.eclipse.jetty.server.HttpConnection.onFillable(HttpConnection.java:267)
        at org.eclipse.jetty.io.AbstractConnection$ReadCallback.succeeded(AbstractConnection.java:305)
        at org.eclipse.jetty.io.FillInterest.fillable(FillInterest.java:103)
        at org.eclipse.jetty.io.ChannelEndPoint$2.run(ChannelEndPoint.java:117)
        at org.eclipse.jetty.util.thread.QueuedThreadPool.runJob(QueuedThreadPool.java:781)
        at org.eclipse.jetty.util.thread.QueuedThreadPool$Runner.run(QueuedThreadPool.java:917)
        at java.base/java.lang.Thread.run(Thread.java:834)
</pre>
<hr><a href="http://eclipse.org/jetty">Powered by Jetty:// 9.4.19.v20190610</a><hr/>

</body>
</html>

        at __randomizedtesting.SeedInfo.seed([822BFB357E2441F0:F067DE3ACF44F783]:0)
        at org.apache.solr.client.solrj.impl.HttpSolrClient.executeMethod(HttpSolrClient.java:620)
        at org.apache.solr.client.solrj.impl.HttpSolrClient.request(HttpSolrClient.java:262)
        at org.apache.solr.client.solrj.impl.HttpSolrClient.request(HttpSolrClient.java:245)
        at org.apache.solr.client.solrj.SolrRequest.process(SolrRequest.java:207)
        at org.apache.solr.client.solrj.SolrClient.query(SolrClient.java:987)
        at org.apache.solr.client.solrj.SolrClient.query(SolrClient.java:1002)
        at org.apache.solr.search.facet.TestCloudJSONFacetJoinDomain.assertFacetCountsAreCorrect(TestCloudJSONFacetJoinDomain.java:504)
        at org.apache.solr.search.facet.TestCloudJSONFacetJoinDomain.assertFacetCountsAreCorrect(TestCloudJSONFacetJoinDomain.java:512)
        at org.apache.solr.search.facet.TestCloudJSONFacetJoinDomain.assertFacetCountsAreCorrect(TestCloudJSONFacetJoinDomain.java:512)
        at org.apache.solr.search.facet.TestCloudJSONFacetJoinDomain.assertFacetCountsAreCorrect(TestCloudJSONFacetJoinDomain.java:462)
        at org.apache.solr.search.facet.TestCloudJSONFacetJoinDomain.testRandom(TestCloudJSONFacetJoinDomain.java:401)
        at java.base/jdk.internal.reflect.NativeMethodAccessorImpl.invoke0(Native Method)
        at java.base/jdk.internal.reflect.NativeMethodAccessorImpl.invoke(NativeMethodAccessorImpl.java:62)
        at java.base/jdk.internal.reflect.DelegatingMethodAccessorImpl.invoke(DelegatingMethodAccessorImpl.java:43)
        at java.base/java.lang.reflect.Method.invoke(Method.java:566)
        at com.carrotsearch.randomizedtesting.RandomizedRunner.invoke(RandomizedRunner.java:1750)
        at com.carrotsearch.randomizedtesting.RandomizedRunner$8.evaluate(RandomizedRunner.java:938)
        at com.carrotsearch.randomizedtesting.RandomizedRunner$9.evaluate(RandomizedRunner.java:974)
        at com.carrotsearch.randomizedtesting.RandomizedRunner$10.evaluate(RandomizedRunner.java:988)
        at com.carrotsearch.randomizedtesting.rules.SystemPropertiesRestoreRule$1.evaluate(SystemPropertiesRestoreRule.java:57)
        at org.apache.lucene.util.TestRuleSetupTeardownChained$1.evaluate(TestRuleSetupTeardownChained.java:49)
        at org.apache.lucene.util.AbstractBeforeAfterRule$1.evaluate(AbstractBeforeAfterRule.java:45)
        at org.apache.lucene.util.TestRuleThreadAndTestName$1.evaluate(TestRuleThreadAndTestName.java:48)
        at org.apache.lucene.util.TestRuleIgnoreAfterMaxFailures$1.evaluate(TestRuleIgnoreAfterMaxFailures.java:64)
        at org.apache.lucene.util.TestRuleMarkFailure$1.evaluate(TestRuleMarkFailure.java:47)
        at com.carrotsearch.randomizedtesting.rules.StatementAdapter.evaluate(StatementAdapter.java:36)
        at com.carrotsearch.randomizedtesting.ThreadLeakControl$StatementRunner.run(ThreadLeakControl.java:368)
        at com.carrotsearch.randomizedtesting.ThreadLeakControl.forkTimeoutingTask(ThreadLeakControl.java:817)
        at com.carrotsearch.randomizedtesting.ThreadLeakControl$3.evaluate(ThreadLeakControl.java:468)
        at com.carrotsearch.randomizedtesting.RandomizedRunner.runSingleTest(RandomizedRunner.java:947)
        at com.carrotsearch.randomizedtesting.RandomizedRunner$5.evaluate(RandomizedRunner.java:832)
        at com.carrotsearch.randomizedtesting.RandomizedRunner$6.evaluate(RandomizedRunner.java:883)
        at com.carrotsearch.randomizedtesting.RandomizedRunner$7.evaluate(RandomizedRunner.java:894)
        at com.carrotsearch.randomizedtesting.rules.StatementAdapter.evaluate(StatementAdapter.java:36)
        at com.carrotsearch.randomizedtesting.rules.SystemPropertiesRestoreRule$1.evaluate(SystemPropertiesRestoreRule.java:57)
        at org.apache.lucene.util.AbstractBeforeAfterRule$1.evaluate(AbstractBeforeAfterRule.java:45)
        at com.carrotsearch.randomizedtesting.rules.StatementAdapter.evaluate(StatementAdapter.java:36)
        at org.apache.lucene.util.TestRuleStoreClassName$1.evaluate(TestRuleStoreClassName.java:41)
        at com.carrotsearch.randomizedtesting.rules.NoShadowingOrOverridesOnMethodsRule$1.evaluate(NoShadowingOrOverridesOnMethodsRule.java:40)
        at com.carrotsearch.randomizedtesting.rules.NoShadowingOrOverridesOnMethodsRule$1.evaluate(NoShadowingOrOverridesOnMethodsRule.java:40)
        at com.carrotsearch.randomizedtesting.rules.StatementAdapter.evaluate(StatementAdapter.java:36)
        at com.carrotsearch.randomizedtesting.rules.StatementAdapter.evaluate(StatementAdapter.java:36)
        at org.apache.lucene.util.TestRuleAssertionsRequired$1.evaluate(TestRuleAssertionsRequired.java:53)
        at org.apache.lucene.util.TestRuleMarkFailure$1.evaluate(TestRuleMarkFailure.java:47)
        at org.apache.lucene.util.TestRuleIgnoreAfterMaxFailures$1.evaluate(TestRuleIgnoreAfterMaxFailures.java:64)
        at org.apache.lucene.util.TestRuleIgnoreTestSuites$1.evaluate(TestRuleIgnoreTestSuites.java:54)
        at com.carrotsearch.randomizedtesting.rules.StatementAdapter.evaluate(StatementAdapter.java:36)
        at com.carrotsearch.randomizedtesting.ThreadLeakControl$StatementRunner.run(ThreadLeakControl.java:368)
        at java.base/java.lang.Thread.run(Thread.java:834)




Build Log:
[...truncated 15285 lines...]
   [junit4] Suite: org.apache.solr.search.facet.TestCloudJSONFacetJoinDomain
   [junit4]   2> 1757661 INFO  (SUITE-TestCloudJSONFacetJoinDomain-seed#[822BFB357E2441F0]-worker) [     ] o.a.s.SolrTestCaseJ4 SecureRandom sanity checks: test.solr.allowed.securerandom=null & java.security.egd=file:/dev/./urandom
   [junit4]   2> 1757662 INFO  (SUITE-TestCloudJSONFacetJoinDomain-seed#[822BFB357E2441F0]-worker) [     ] o.a.s.SolrTestCaseJ4 Created dataDir: /home/jenkins/jenkins-slave/workspace/Lucene-Solr-Tests-master/solr/build/solr-core/test/J2/temp/solr.search.facet.TestCloudJSONFacetJoinDomain_822BFB357E2441F0-001/data-dir-277-001
   [junit4]   2> 1757662 INFO  (SUITE-TestCloudJSONFacetJoinDomain-seed#[822BFB357E2441F0]-worker) [     ] o.a.s.SolrTestCaseJ4 Using PointFields (NUMERIC_POINTS_SYSPROP=true) w/NUMERIC_DOCVALUES_SYSPROP=false
   [junit4]   2> 1757663 INFO  (SUITE-TestCloudJSONFacetJoinDomain-seed#[822BFB357E2441F0]-worker) [     ] o.a.s.SolrTestCaseJ4 Randomized ssl (false) and clientAuth (true) via: @org.apache.solr.util.RandomizeSSL(reason="", ssl=0.0/0.0, value=0.0/0.0, clientAuth=0.0/0.0)
   [junit4]   2> 1757663 INFO  (SUITE-TestCloudJSONFacetJoinDomain-seed#[822BFB357E2441F0]-worker) [     ] o.a.s.c.MiniSolrCloudCluster Starting cluster of 1 servers in /home/jenkins/jenkins-slave/workspace/Lucene-Solr-Tests-master/solr/build/solr-core/test/J2/temp/solr.search.facet.TestCloudJSONFacetJoinDomain_822BFB357E2441F0-001/tempDir-001
   [junit4]   2> 1757664 INFO  (SUITE-TestCloudJSONFacetJoinDomain-seed#[822BFB357E2441F0]-worker) [     ] o.a.s.c.ZkTestServer STARTING ZK TEST SERVER
   [junit4]   2> 1757674 INFO  (ZkTestServer Run Thread) [     ] o.a.s.c.ZkTestServer client port:0.0.0.0/0.0.0.0:0
   [junit4]   2> 1757675 INFO  (ZkTestServer Run Thread) [     ] o.a.s.c.ZkTestServer Starting server
   [junit4]   2> 1757772 INFO  (SUITE-TestCloudJSONFacetJoinDomain-seed#[822BFB357E2441F0]-worker) [     ] o.a.s.c.ZkTestServer start zk server on port:34399
   [junit4]   2> 1757772 INFO  (SUITE-TestCloudJSONFacetJoinDomain-seed#[822BFB357E2441F0]-worker) [     ] o.a.s.c.ZkTestServer waitForServerUp: 127.0.0.1:34399
   [junit4]   2> 1757772 INFO  (SUITE-TestCloudJSONFacetJoinDomain-seed#[822BFB357E2441F0]-worker) [     ] o.a.s.c.ZkTestServer parse host and port list: 127.0.0.1:34399
   [junit4]   2> 1757772 INFO  (SUITE-TestCloudJSONFacetJoinDomain-seed#[822BFB357E2441F0]-worker) [     ] o.a.s.c.ZkTestServer connecting to 127.0.0.1 34399
   [junit4]   2> 1757812 INFO  (SUITE-TestCloudJSONFacetJoinDomain-seed#[822BFB357E2441F0]-worker) [     ] o.a.s.c.c.ConnectionManager Waiting for client to connect to ZooKeeper
   [junit4]   2> 1757841 INFO  (zkConnectionManagerCallback-10739-thread-1) [     ] o.a.s.c.c.ConnectionManager zkClient has connected
   [junit4]   2> 1757841 INFO  (SUITE-TestCloudJSONFacetJoinDomain-seed#[822BFB357E2441F0]-worker) [     ] o.a.s.c.c.ConnectionManager Client is connected to ZooKeeper
   [junit4]   2> 1757853 INFO  (SUITE-TestCloudJSONFacetJoinDomain-seed#[822BFB357E2441F0]-worker) [     ] o.a.s.c.c.ConnectionManager Waiting for client to connect to ZooKeeper
   [junit4]   2> 1757857 INFO  (zkConnectionManagerCallback-10741-thread-1) [     ] o.a.s.c.c.ConnectionManager zkClient has connected
   [junit4]   2> 1757857 INFO  (SUITE-TestCloudJSONFacetJoinDomain-seed#[822BFB357E2441F0]-worker) [     ] o.a.s.c.c.ConnectionManager Client is connected to ZooKeeper
   [junit4]   2> 1757859 INFO  (SUITE-TestCloudJSONFacetJoinDomain-seed#[822BFB357E2441F0]-worker) [     ] o.a.s.c.c.ConnectionManager Waiting for client to connect to ZooKeeper
   [junit4]   2> 1757861 INFO  (zkConnectionManagerCallback-10743-thread-1) [     ] o.a.s.c.c.ConnectionManager zkClient has connected
   [junit4]   2> 1757861 INFO  (SUITE-TestCloudJSONFacetJoinDomain-seed#[822BFB357E2441F0]-worker) [     ] o.a.s.c.c.ConnectionManager Client is connected to ZooKeeper
   [junit4]   2> 1757967 WARN  (jetty-launcher-10744-thread-1) [     ] o.e.j.s.AbstractConnector Ignoring deprecated socket close linger time
   [junit4]   2> 1757971 INFO  (jetty-launcher-10744-thread-1) [     ] o.a.s.c.s.e.JettySolrRunner Start Jetty (original configured port=0)
   [junit4]   2> 1757971 INFO  (jetty-launcher-10744-thread-1) [     ] o.a.s.c.s.e.JettySolrRunner Trying to start Jetty on port 0 try number 1 ...
   [junit4]   2> 1757971 INFO  (jetty-launcher-10744-thread-1) [     ] o.e.j.s.Server jetty-9.4.19.v20190610; built: 2019-06-10T16:30:51.723Z; git: afcf563148970e98786327af5e07c261fda175d3; jvm 11.0.1+13-LTS
   [junit4]   2> 1757973 INFO  (jetty-launcher-10744-thread-1) [     ] o.e.j.s.session DefaultSessionIdManager workerName=node0
   [junit4]   2> 1757973 INFO  (jetty-launcher-10744-thread-1) [     ] o.e.j.s.session No SessionScavenger set, using defaults
   [junit4]   2> 1757973 INFO  (jetty-launcher-10744-thread-1) [     ] o.e.j.s.session node0 Scavenging every 600000ms
   [junit4]   2> 1757974 INFO  (jetty-launcher-10744-thread-1) [     ] o.e.j.s.h.ContextHandler Started o.e.j.s.ServletContextHandler@681a3ca7{/solr,null,AVAILABLE}
   [junit4]   2> 1757974 INFO  (jetty-launcher-10744-thread-1) [     ] o.e.j.s.AbstractConnector Started ServerConnector@7a173b92{HTTP/1.1,[http/1.1, h2c]}{127.0.0.1:٣٧٣٧٣}
   [junit4]   2> 1757974 INFO  (jetty-launcher-10744-thread-1) [     ] o.e.j.s.Server Started @١٧٥٨٠٤٨ms
   [junit4]   2> 1757974 INFO  (jetty-launcher-10744-thread-1) [     ] o.a.s.c.s.e.JettySolrRunner Jetty properties: {hostContext=/solr, hostPort=37373}
   [junit4]   2> 1757975 ERROR (jetty-launcher-10744-thread-1) [     ] o.a.s.u.StartupLoggingUtils Missing Java Option solr.log.dir. Logging may be missing or incomplete.
   [junit4]   2> 1757975 INFO  (jetty-launcher-10744-thread-1) [     ] o.a.s.s.SolrDispatchFilter Using logger factory org.apache.logging.slf4j.Log4jLoggerFactory
   [junit4]   2> 1757975 INFO  (jetty-launcher-10744-thread-1) [     ] o.a.s.s.SolrDispatchFilter  ___      _       Welcome to Apache Solr™ version 9.0.0
   [junit4]   2> 1757975 INFO  (jetty-launcher-10744-thread-1) [     ] o.a.s.s.SolrDispatchFilter / __| ___| |_ _   Starting in cloud mode on port null
   [junit4]   2> 1757975 INFO  (jetty-launcher-10744-thread-1) [     ] o.a.s.s.SolrDispatchFilter \__ \/ _ \ | '_|  Install dir: null
   [junit4]   2> 1757975 INFO  (jetty-launcher-10744-thread-1) [     ] o.a.s.s.SolrDispatchFilter |___/\___/_|_|    Start time: 2019-08-29T20:31:36.989332Z
   [junit4]   2> 1757977 INFO  (jetty-launcher-10744-thread-1) [     ] o.a.s.c.c.ConnectionManager Waiting for client to connect to ZooKeeper
   [junit4]   2> 1757978 INFO  (zkConnectionManagerCallback-10746-thread-1) [     ] o.a.s.c.c.ConnectionManager zkClient has connected
   [junit4]   2> 1757978 INFO  (jetty-launcher-10744-thread-1) [     ] o.a.s.c.c.ConnectionManager Client is connected to ZooKeeper
   [junit4]   2> 1757979 INFO  (jetty-launcher-10744-thread-1) [     ] o.a.s.s.SolrDispatchFilter solr.xml found in ZooKeeper. Loading...
   [junit4]   2> 1758522 INFO  (jetty-launcher-10744-thread-1) [     ] o.a.s.h.c.HttpShardHandlerFactory Host whitelist initialized: WhitelistHostChecker [whitelistHosts=null, whitelistHostCheckingEnabled=true]
   [junit4]   2> 1758523 WARN  (jetty-launcher-10744-thread-1) [     ] o.e.j.u.s.S.config Trusting all certificates configured for Client@52f19b33[provider=null,keyStore=null,trustStore=null]
   [junit4]   2> 1758523 WARN  (jetty-launcher-10744-thread-1) [     ] o.e.j.u.s.S.config No Client EndPointIdentificationAlgorithm configured for Client@52f19b33[provider=null,keyStore=null,trustStore=null]
   [junit4]   2> 1758526 WARN  (jetty-launcher-10744-thread-1) [     ] o.e.j.u.s.S.config Trusting all certificates configured for Client@1fe43a48[provider=null,keyStore=null,trustStore=null]
   [junit4]   2> 1758526 WARN  (jetty-launcher-10744-thread-1) [     ] o.e.j.u.s.S.config No Client EndPointIdentificationAlgorithm configured for Client@1fe43a48[provider=null,keyStore=null,trustStore=null]
   [junit4]   2> 1758527 INFO  (jetty-launcher-10744-thread-1) [     ] o.a.s.c.ZkContainer Zookeeper client=127.0.0.1:34399/solr
   [junit4]   2> 1758529 INFO  (jetty-launcher-10744-thread-1) [     ] o.a.s.c.c.ConnectionManager Waiting for client to connect to ZooKeeper
   [junit4]   2> 1758530 INFO  (zkConnectionManagerCallback-10753-thread-1) [     ] o.a.s.c.c.ConnectionManager zkClient has connected
   [junit4]   2> 1758530 INFO  (jetty-launcher-10744-thread-1) [     ] o.a.s.c.c.ConnectionManager Client is connected to ZooKeeper
   [junit4]   2> 1758644 INFO  (jetty-launcher-10744-thread-1) [n:127.0.0.1:37373_solr     ] o.a.s.c.c.ConnectionManager Waiting for client to connect to ZooKeeper
   [junit4]   2> 1758661 INFO  (zkConnectionManagerCallback-10755-thread-1) [     ] o.a.s.c.c.ConnectionManager zkClient has connected
   [junit4]   2> 1758662 INFO  (jetty-launcher-10744-thread-1) [n:127.0.0.1:37373_solr     ] o.a.s.c.c.ConnectionManager Client is connected to ZooKeeper
   [junit4]   2> 1758797 INFO  (jetty-launcher-10744-thread-1) [n:127.0.0.1:37373_solr     ] o.a.s.c.OverseerElectionContext I am going to be the leader 127.0.0.1:37373_solr
   [junit4]   2> 1758798 INFO  (jetty-launcher-10744-thread-1) [n:127.0.0.1:37373_solr     ] o.a.s.c.Overseer Overseer (id=72289086253563909-127.0.0.1:37373_solr-n_0000000000) starting
   [junit4]   2> 1758825 INFO  (jetty-launcher-10744-thread-1) [n:127.0.0.1:37373_solr     ] o.a.s.c.c.ConnectionManager Waiting for client to connect to ZooKeeper
   [junit4]   2> 1758834 INFO  (zkConnectionManagerCallback-10762-thread-1) [     ] o.a.s.c.c.ConnectionManager zkClient has connected
   [junit4]   2> 1758834 INFO  (jetty-launcher-10744-thread-1) [n:127.0.0.1:37373_solr     ] o.a.s.c.c.ConnectionManager Client is connected to ZooKeeper
   [junit4]   2> 1758838 INFO  (jetty-launcher-10744-thread-1) [n:127.0.0.1:37373_solr     ] o.a.s.c.s.i.ZkClientClusterStateProvider Cluster at 127.0.0.1:34399/solr ready
   [junit4]   2> 1758849 INFO  (OverseerStateUpdate-72289086253563909-127.0.0.1:37373_solr-n_0000000000) [n:127.0.0.1:37373_solr     ] o.a.s.c.Overseer Starting to work on the main queue : 127.0.0.1:37373_solr
   [junit4]   2> 1758872 INFO  (jetty-launcher-10744-thread-1) [n:127.0.0.1:37373_solr     ] o.a.s.c.ZkController Register node as live in ZooKeeper:/live_nodes/127.0.0.1:37373_solr
   [junit4]   2> 1758875 INFO  (jetty-launcher-10744-thread-1) [n:127.0.0.1:37373_solr     ] o.a.s.c.PackageManager clusterprops.json changed , version -1
   [junit4]   2> 1758884 INFO  (zkCallback-10761-thread-1) [     ] o.a.s.c.c.ZkStateReader Updated live nodes from ZooKeeper... (0) -> (1)
   [junit4]   2> 1758890 INFO  (zkCallback-10754-thread-1) [     ] o.a.s.c.c.ZkStateReader Updated live nodes from ZooKeeper... (0) -> (1)
   [junit4]   2> 1758930 INFO  (jetty-launcher-10744-thread-1) [n:127.0.0.1:37373_solr     ] o.a.s.h.a.MetricsHistoryHandler No .system collection, keeping metrics history in memory.
   [junit4]   2> 1758983 INFO  (jetty-launcher-10744-thread-1) [n:127.0.0.1:37373_solr     ] o.a.s.m.r.SolrJmxReporter JMX monitoring for 'solr_37373.solr.node' (registry 'solr.node') enabled at server: com.sun.jmx.mbeanserver.JmxMBeanServer@33aeca63
   [junit4]   2> 1759014 INFO  (jetty-launcher-10744-thread-1) [n:127.0.0.1:37373_solr     ] o.a.s.m.r.SolrJmxReporter JMX monitoring for 'solr_37373.solr.jvm' (registry 'solr.jvm') enabled at server: com.sun.jmx.mbeanserver.JmxMBeanServer@33aeca63
   [junit4]   2> 1759014 INFO  (jetty-launcher-10744-thread-1) [n:127.0.0.1:37373_solr     ] o.a.s.m.r.SolrJmxReporter JMX monitoring for 'solr_37373.solr.jetty' (registry 'solr.jetty') enabled at server: com.sun.jmx.mbeanserver.JmxMBeanServer@33aeca63
   [junit4]   2> 1759016 INFO  (jetty-launcher-10744-thread-1) [n:127.0.0.1:37373_solr     ] o.a.s.c.CorePropertiesLocator Found 0 core definitions underneath /home/jenkins/jenkins-slave/workspace/Lucene-Solr-Tests-master/solr/build/solr-core/test/J2/temp/solr.search.facet.TestCloudJSONFacetJoinDomain_822BFB357E2441F0-001/tempDir-001/node1/.
   [junit4]   2> 1759125 INFO  (SUITE-TestCloudJSONFacetJoinDomain-seed#[822BFB357E2441F0]-worker) [     ] o.a.s.c.MiniSolrCloudCluster waitForAllNodes: numServers=1
   [junit4]   2> 1759146 INFO  (SUITE-TestCloudJSONFacetJoinDomain-seed#[822BFB357E2441F0]-worker) [     ] o.a.s.c.c.ConnectionManager Waiting for client to connect to ZooKeeper
   [junit4]   2> 1759173 INFO  (zkConnectionManagerCallback-10768-thread-1) [     ] o.a.s.c.c.ConnectionManager zkClient has connected
   [junit4]   2> 1759173 INFO  (SUITE-TestCloudJSONFacetJoinDomain-seed#[822BFB357E2441F0]-worker) [     ] o.a.s.c.c.ConnectionManager Client is connected to ZooKeeper
   [junit4]   2> 1759176 INFO  (SUITE-TestCloudJSONFacetJoinDomain-seed#[822BFB357E2441F0]-worker) [     ] o.a.s.c.c.ZkStateReader Updated live nodes from ZooKeeper... (0) -> (1)
   [junit4]   2> 1759178 INFO  (SUITE-TestCloudJSONFacetJoinDomain-seed#[822BFB357E2441F0]-worker) [     ] o.a.s.c.s.i.ZkClientClusterStateProvider Cluster at 127.0.0.1:34399/solr ready
   [junit4]   2> 1759754 INFO  (qtp1959840632-24176) [n:127.0.0.1:37373_solr     ] o.a.s.h.a.CollectionsHandler Invoked Collection Action :create with params property.schema=schema_latest.xml&property.config=solrconfig-tlog.xml&collection.configName=org.apache.solr.search.facet.TestCloudJSONFacetJoinDomain_config-set&name=org.apache.solr.search.facet.TestCloudJSONFacetJoinDomain_collection&nrtReplicas=1&action=CREATE&numShards=1&wt=javabin&version=2 and sendToOCPQueue=true
   [junit4]   2> 1759766 INFO  (OverseerThreadFactory-7173-thread-1-processing-n:127.0.0.1:37373_solr) [n:127.0.0.1:37373_solr     ] o.a.s.c.a.c.CreateCollectionCmd Create collection org.apache.solr.search.facet.TestCloudJSONFacetJoinDomain_collection
   [junit4]   2> 1759878 INFO  (OverseerStateUpdate-72289086253563909-127.0.0.1:37373_solr-n_0000000000) [n:127.0.0.1:37373_solr     ] o.a.s.c.o.SliceMutator createReplica() {
   [junit4]   2>   "operation":"ADDREPLICA",
   [junit4]   2>   "collection":"org.apache.solr.search.facet.TestCloudJSONFacetJoinDomain_collection",
   [junit4]   2>   "shard":"shard1",
   [junit4]   2>   "core":"org.apache.solr.search.facet.TestCloudJSONFacetJoinDomain_collection_shard1_replica_n1",
   [junit4]   2>   "state":"down",
   [junit4]   2>   "base_url":"http://127.0.0.1:37373/solr",
   [junit4]   2>   "type":"NRT",
   [junit4]   2>   "waitForFinalState":"false"}
   [junit4]   2> 1760087 INFO  (qtp1959840632-24178) [n:127.0.0.1:37373_solr    x:org.apache.solr.search.facet.TestCloudJSONFacetJoinDomain_collection_shard1_replica_n1 ] o.a.s.h.a.CoreAdminOperation core create command qt=/admin/cores&collection.configName=org.apache.solr.search.facet.TestCloudJSONFacetJoinDomain_config-set&newCollection=true&collection=org.apache.solr.search.facet.TestCloudJSONFacetJoinDomain_collection&version=2&replicaType=NRT&property.schema=schema_latest.xml&property.config=solrconfig-tlog.xml&coreNodeName=core_node2&name=org.apache.solr.search.facet.TestCloudJSONFacetJoinDomain_collection_shard1_replica_n1&action=CREATE&numShards=1&shard=shard1&wt=javabin
   [junit4]   2> 1760087 INFO  (qtp1959840632-24178) [n:127.0.0.1:37373_solr    x:org.apache.solr.search.facet.TestCloudJSONFacetJoinDomain_collection_shard1_replica_n1 ] o.a.s.c.TransientSolrCoreCacheDefault Allocating transient cache for 2147483647 transient cores
   [junit4]   2> 1761116 INFO  (qtp1959840632-24178) [n:127.0.0.1:37373_solr c:org.apache.solr.search.facet.TestCloudJSONFacetJoinDomain_collection s:shard1 r:core_node2 x:org.apache.solr.search.facet.TestCloudJSONFacetJoinDomain_collection_shard1_replica_n1 ] o.a.s.c.SolrConfig Using Lucene MatchVersion: 9.0.0
   [junit4]   2> 1761136 INFO  (qtp1959840632-24178) [n:127.0.0.1:37373_solr c:org.apache.solr.search.facet.TestCloudJSONFacetJoinDomain_collection s:shard1 r:core_node2 x:org.apache.solr.search.facet.TestCloudJSONFacetJoinDomain_collection_shard1_replica_n1 ] o.a.s.s.IndexSchema [org.apache.solr.search.facet.TestCloudJSONFacetJoinDomain_collection_shard1_replica_n1] Schema name=example
   [junit4]   2> 1761210 INFO  (qtp1959840632-24178) [n:127.0.0.1:37373_solr c:org.apache.solr.search.facet.TestCloudJSONFacetJoinDomain_collection s:shard1 r:core_node2 x:org.apache.solr.search.facet.TestCloudJSONFacetJoinDomain_collection_shard1_replica_n1 ] o.a.s.s.IndexSchema Loaded schema example/1.6 with uniqueid field id
   [junit4]   2> 1761233 INFO  (qtp1959840632-24178) [n:127.0.0.1:37373_solr c:org.apache.solr.search.facet.TestCloudJSONFacetJoinDomain_collection s:shard1 r:core_node2 x:org.apache.solr.search.facet.TestCloudJSONFacetJoinDomain_collection_shard1_replica_n1 ] o.a.s.c.CoreContainer Creating SolrCore 'org.apache.solr.search.facet.TestCloudJSONFacetJoinDomain_collection_shard1_replica_n1' using configuration from collection org.apache.solr.search.facet.TestCloudJSONFacetJoinDomain_collection, trusted=true
   [junit4]   2> 1761233 INFO  (qtp1959840632-24178) [n:127.0.0.1:37373_solr c:org.apache.solr.search.facet.TestCloudJSONFacetJoinDomain_collection s:shard1 r:core_node2 x:org.apache.solr.search.facet.TestCloudJSONFacetJoinDomain_collection_shard1_replica_n1 ] o.a.s.m.r.SolrJmxReporter JMX monitoring for 'solr_37373.solr.core.org.apache.solr.search.facet.TestCloudJSONFacetJoinDomain_collection.shard1.replica_n1' (registry 'solr.core.org.apache.solr.search.facet.TestCloudJSONFacetJoinDomain_collection.shard1.replica_n1') enabled at server: com.sun.jmx.mbeanserver.JmxMBeanServer@33aeca63
   [junit4]   2> 1761234 INFO  (qtp1959840632-24178) [n:127.0.0.1:37373_solr c:org.apache.solr.search.facet.TestCloudJSONFacetJoinDomain_collection s:shard1 r:core_node2 x:org.apache.solr.search.facet.TestCloudJSONFacetJoinDomain_collection_shard1_replica_n1 ] o.a.s.c.SolrCore [[org.apache.solr.search.facet.TestCloudJSONFacetJoinDomain_collection_shard1_replica_n1] ] Opening new SolrCore at [/home/jenkins/jenkins-slave/workspace/Lucene-Solr-Tests-master/solr/build/solr-core/test/J2/temp/solr.search.facet.TestCloudJSONFacetJoinDomain_822BFB357E2441F0-001/tempDir-001/node1/org.apache.solr.search.facet.TestCloudJSONFacetJoinDomain_collection_shard1_replica_n1], dataDir=[/home/jenkins/jenkins-slave/workspace/Lucene-Solr-Tests-master/solr/build/solr-core/test/J2/temp/solr.search.facet.TestCloudJSONFacetJoinDomain_822BFB357E2441F0-001/tempDir-001/node1/./org.apache.solr.search.facet.TestCloudJSONFacetJoinDomain_collection_shard1_replica_n1/data/]
   [junit4]   2> 1761238 INFO  (qtp1959840632-24178) [n:127.0.0.1:37373_solr c:org.apache.solr.search.facet.TestCloudJSONFacetJoinDomain_collection s:shard1 r:core_node2 x:org.apache.solr.search.facet.TestCloudJSONFacetJoinDomain_collection_shard1_replica_n1 ] o.a.s.u.RandomMergePolicy RandomMergePolicy wrapping class org.apache.lucene.index.LogDocMergePolicy: [LogDocMergePolicy: minMergeSize=1000, mergeFactor=11, maxMergeSize=9223372036854775807, maxMergeSizeForForcedMerge=9223372036854775807, calibrateSizeByDeletes=false, maxMergeDocs=2147483647, maxCFSSegmentSizeMB=8.796093022207999E12, noCFSRatio=0.34887190702984205]
   [junit4]   2> 1761241 WARN  (qtp1959840632-24178) [n:127.0.0.1:37373_solr c:org.apache.solr.search.facet.TestCloudJSONFacetJoinDomain_collection s:shard1 r:core_node2 x:org.apache.solr.search.facet.TestCloudJSONFacetJoinDomain_collection_shard1_replica_n1 ] o.a.s.c.RequestHandlers INVALID paramSet a in requestHandler {type = requestHandler,name = /dump,class = DumpRequestHandler,attributes = {initParams=a, name=/dump, class=DumpRequestHandler},args = {defaults={a=A,b=B}}}
   [junit4]   2> 1761342 INFO  (qtp1959840632-24178) [n:127.0.0.1:37373_solr c:org.apache.solr.search.facet.TestCloudJSONFacetJoinDomain_collection s:shard1 r:core_node2 x:org.apache.solr.search.facet.TestCloudJSONFacetJoinDomain_collection_shard1_replica_n1 ] o.a.s.u.UpdateHandler Using UpdateLog implementation: org.apache.solr.update.UpdateLog
   [junit4]   2> 1761342 INFO  (qtp1959840632-24178) [n:127.0.0.1:37373_solr c:org.apache.solr.search.facet.TestCloudJSONFacetJoinDomain_collection s:shard1 r:core_node2 x:org.apache.solr.search.facet.TestCloudJSONFacetJoinDomain_collection_shard1_replica_n1 ] o.a.s.u.UpdateLog Initializing UpdateLog: dataDir= defaultSyncLevel=FLUSH numRecordsToKeep=100 maxNumLogsToKeep=10 numVersionBuckets=65536
   [junit4]   2> 1761344 INFO  (qtp1959840632-24178) [n:127.0.0.1:37373_solr c:org.apache.solr.search.facet.TestCloudJSONFacetJoinDomain_collection s:shard1 r:core_node2 x:org.apache.solr.search.facet.TestCloudJSONFacetJoinDomain_collection_shard1_replica_n1 ] o.a.s.u.CommitTracker Hard AutoCommit: disabled
   [junit4]   2> 1761344 INFO  (qtp1959840632-24178) [n:127.0.0.1:37373_solr c:org.apache.solr.search.facet.TestCloudJSONFacetJoinDomain_collection s:shard1 r:core_node2 x:org.apache.solr.search.facet.TestCloudJSONFacetJoinDomain_collection_shard1_replica_n1 ] o.a.s.u.CommitTracker Soft AutoCommit: disabled
   [junit4]   2> 1761346 INFO  (qtp1959840632-24178) [n:127.0.0.1:37373_solr c:org.apache.solr.search.facet.TestCloudJSONFacetJoinDomain_collection s:shard1 r:core_node2 x:org.apache.solr.search.facet.TestCloudJSONFacetJoinDomain_collection_shard1_replica_n1 ] o.a.s.u.RandomMergePolicy RandomMergePolicy wrapping class org.apache.lucene.index.LogByteSizeMergePolicy: [LogByteSizeMergePolicy: minMergeSize=1677721, mergeFactor=30, maxMergeSize=2147483648, maxMergeSizeForForcedMerge=9223372036854775807, calibrateSizeByDeletes=false, maxMergeDocs=2147483647, maxCFSSegmentSizeMB=8.796093022207999E12, noCFSRatio=0.7391295534431545]
   [junit4]   2> 1761347 INFO  (qtp1959840632-24178) [n:127.0.0.1:37373_solr c:org.apache.solr.search.facet.TestCloudJSONFacetJoinDomain_collection s:shard1 r:core_node2 x:org.apache.solr.search.facet.TestCloudJSONFacetJoinDomain_collection_shard1_replica_n1 ] o.a.s.s.SolrIndexSearcher Opening [Searcher@5c417402[org.apache.solr.search.facet.TestCloudJSONFacetJoinDomain_collection_shard1_replica_n1] main]
   [junit4]   2> 1761350 INFO  (qtp1959840632-24178) [n:127.0.0.1:37373_solr c:org.apache.solr.search.facet.TestCloudJSONFacetJoinDomain_collection s:shard1 r:core_node2 x:org.apache.solr.search.facet.TestCloudJSONFacetJoinDomain_collection_shard1_replica_n1 ] o.a.s.r.ManagedResourceStorage Configured ZooKeeperStorageIO with znodeBase: /configs/org.apache.solr.search.facet.TestCloudJSONFacetJoinDomain_config-set
   [junit4]   2> 1761351 INFO  (qtp1959840632-24178) [n:127.0.0.1:37373_solr c:org.apache.solr.search.facet.TestCloudJSONFacetJoinDomain_collection s:shard1 r:core_node2 x:org.apache.solr.search.facet.TestCloudJSONFacetJoinDomain_collection_shard1_replica_n1 ] o.a.s.r.ManagedResourceStorage Loaded null at path _rest_managed.json using ZooKeeperStorageIO:path=/configs/org.apache.solr.search.facet.TestCloudJSONFacetJoinDomain_config-set
   [junit4]   2> 1761352 INFO  (qtp1959840632-24178) [n:127.0.0.1:37373_solr c:org.apache.solr.search.facet.TestCloudJSONFacetJoinDomain_collection s:shard1 r:core_node2 x:org.apache.solr.search.facet.TestCloudJSONFacetJoinDomain_collection_shard1_replica_n1 ] o.a.s.h.ReplicationHandler Commits will be reserved for 10000ms.
   [junit4]   2> 1761352 INFO  (qtp1959840632-24178) [n:127.0.0.1:37373_solr c:org.apache.solr.search.facet.TestCloudJSONFacetJoinDomain_collection s:shard1 r:core_node2 x:org.apache.solr.search.facet.TestCloudJSONFacetJoinDomain_collection_shard1_replica_n1 ] o.a.s.u.UpdateLog Could not find max version in index or recent updates, using new clock 1643234669746978816
   [junit4]   2> 1761360 INFO  (searcherExecutor-7178-thread-1-processing-n:127.0.0.1:37373_solr x:org.apache.solr.search.facet.TestCloudJSONFacetJoinDomain_collection_shard1_replica_n1 c:org.apache.solr.search.facet.TestCloudJSONFacetJoinDomain_collection s:shard1 r:core_node2) [n:127.0.0.1:37373_solr c:org.apache.solr.search.facet.TestCloudJSONFacetJoinDomain_collection s:shard1 r:core_node2 x:org.apache.solr.search.facet.TestCloudJSONFacetJoinDomain_collection_shard1_replica_n1 ] o.a.s.c.SolrCore [org.apache.solr.search.facet.TestCloudJSONFacetJoinDomain_collection_shard1_replica_n1] Registered new searcher Searcher@5c417402[org.apache.solr.search.facet.TestCloudJSONFacetJoinDomain_collection_shard1_replica_n1] main{ExitableDirectoryReader(UninvertingDirectoryReader())}
   [junit4]   2> 1761365 INFO  (qtp1959840632-24178) [n:127.0.0.1:37373_solr c:org.apache.solr.search.facet.TestCloudJSONFacetJoinDomain_collection s:shard1 r:core_node2 x:org.apache.solr.search.facet.TestCloudJSONFacetJoinDomain_collection_shard1_replica_n1 ] o.a.s.c.ZkShardTerms Successful update of terms at /collections/org.apache.solr.search.facet.TestCloudJSONFacetJoinDomain_collection/terms/shard1 to Terms{values={core_node2=0}, version=0}
   [junit4]   2> 1761366 INFO  (qtp1959840632-24178) [n:127.0.0.1:37373_solr c:org.apache.solr.search.facet.TestCloudJSONFacetJoinDomain_collection s:shard1 r:core_node2 x:org.apache.solr.search.facet.TestCloudJSONFacetJoinDomain_collection_shard1_replica_n1 ] o.a.s.c.ShardLeaderElectionContextBase make sure parent is created /collections/org.apache.solr.search.facet.TestCloudJSONFacetJoinDomain_collection/leaders/shard1
   [junit4]   2> 1761371 INFO  (qtp1959840632-24178) [n:127.0.0.1:37373_solr c:org.apache.solr.search.facet.TestCloudJSONFacetJoinDomain_collection s:shard1 r:core_node2 x:org.apache.solr.search.facet.TestCloudJSONFacetJoinDomain_collection_shard1_replica_n1 ] o.a.s.c.ShardLeaderElectionContext Enough replicas found to continue.
   [junit4]   2> 1761371 INFO  (qtp1959840632-24178) [n:127.0.0.1:37373_solr c:org.apache.solr.search.facet.TestCloudJSONFacetJoinDomain_collection s:shard1 r:core_node2 x:org.apache.solr.search.facet.TestCloudJSONFacetJoinDomain_collection_shard1_replica_n1 ] o.a.s.c.ShardLeaderElectionContext I may be the new leader - try and sync
   [junit4]   2> 1761371 INFO  (qtp1959840632-24178) [n:127.0.0.1:37373_solr c:org.apache.solr.search.facet.TestCloudJSONFacetJoinDomain_collection s:shard1 r:core_node2 x:org.apache.solr.search.facet.TestCloudJSONFacetJoinDomain_collection_shard1_replica_n1 ] o.a.s.c.SyncStrategy Sync replicas to http://127.0.0.1:37373/solr/org.apache.solr.search.facet.TestCloudJSONFacetJoinDomain_collection_shard1_replica_n1/
   [junit4]   2> 1761371 INFO  (qtp1959840632-24178) [n:127.0.0.1:37373_solr c:org.apache.solr.search.facet.TestCloudJSONFacetJoinDomain_collection s:shard1 r:core_node2 x:org.apache.solr.search.facet.TestCloudJSONFacetJoinDomain_collection_shard1_replica_n1 ] o.a.s.c.SyncStrategy Sync Success - now sync replicas to me
   [junit4]   2> 1761372 INFO  (qtp1959840632-24178) [n:127.0.0.1:37373_solr c:org.apache.solr.search.facet.TestCloudJSONFacetJoinDomain_collection s:shard1 r:core_node2 x:org.apache.solr.search.facet.TestCloudJSONFacetJoinDomain_collection_shard1_replica_n1 ] o.a.s.c.SyncStrategy http://127.0.0.1:37373/solr/org.apache.solr.search.facet.TestCloudJSONFacetJoinDomain_collection_shard1_replica_n1/ has no replicas
   [junit4]   2> 1761372 INFO  (qtp1959840632-24178) [n:127.0.0.1:37373_solr c:org.apache.solr.search.facet.TestCloudJSONFacetJoinDomain_collection s:shard1 r:core_node2 x:org.apache.solr.search.facet.TestCloudJSONFacetJoinDomain_collection_shard1_replica_n1 ] o.a.s.c.ShardLeaderElectionContextBase Creating leader registration node /collections/org.apache.solr.search.facet.TestCloudJSONFacetJoinDomain_collection/leaders/shard1/leader after winning as /collections/org.apache.solr.search.facet.TestCloudJSONFacetJoinDomain_collection/leader_elect/shard1/election/72289086253563909-core_node2-n_0000000000
   [junit4]   2> 1761375 INFO  (qtp1959840632-24178) [n:127.0.0.1:37373_solr c:org.apache.solr.search.facet.TestCloudJSONFacetJoinDomain_collection s:shard1 r:core_node2 x:org.apache.solr.search.facet.TestCloudJSONFacetJoinDomain_collection_shard1_replica_n1 ] o.a.s.c.ShardLeaderElectionContext I am the new leader: http://127.0.0.1:37373/solr/org.apache.solr.search.facet.TestCloudJSONFacetJoinDomain_collection_shard1_replica_n1/ shard1
   [junit4]   2> 1761481 INFO  (zkCallback-10754-thread-1) [     ] o.a.s.c.c.ZkStateReader A cluster state change: [WatchedEvent state:SyncConnected type:NodeDataChanged path:/collections/org.apache.solr.search.facet.TestCloudJSONFacetJoinDomain_collection/state.json] for collection [org.apache.solr.search.facet.TestCloudJSONFacetJoinDomain_collection] has occurred - updating... (live nodes size: [1])
   [junit4]   2> 1761482 INFO  (qtp1959840632-24178) [n:127.0.0.1:37373_solr c:org.apache.solr.search.facet.TestCloudJSONFacetJoinDomain_collection s:shard1 r:core_node2 x:org.apache.solr.search.facet.TestCloudJSONFacetJoinDomain_collection_shard1_replica_n1 ] o.a.s.c.ZkController I am the leader, no recovery necessary
   [junit4]   2> 1761484 INFO  (zkCallback-10754-thread-2) [     ] o.a.s.c.c.ZkStateReader A cluster state change: [WatchedEvent state:SyncConnected type:NodeDataChanged path:/collections/org.apache.solr.search.facet.TestCloudJSONFacetJoinDomain_collection/state.json] for collection [org.apache.solr.search.facet.TestCloudJSONFacetJoinDomain_collection] has occurred - updating... (live nodes size: [1])
   [junit4]   2> 1761486 INFO  (qtp1959840632-24178) [n:127.0.0.1:37373_solr c:org.apache.solr.search.facet.TestCloudJSONFacetJoinDomain_collection s:shard1 r:core_node2 x:org.apache.solr.search.facet.TestCloudJSONFacetJoinDomain_collection_shard1_replica_n1 ] o.a.s.s.HttpSolrCall [admin] webapp=null path=/admin/cores params={qt=/admin/cores&collection.configName=org.apache.solr.search.facet.TestCloudJSONFacetJoinDomain_config-set&newCollection=true&collection=org.apache.solr.search.facet.TestCloudJSONFacetJoinDomain_collection&version=2&replicaType=NRT&property.schema=schema_latest.xml&property.config=solrconfig-tlog.xml&coreNodeName=core_node2&name=org.apache.solr.search.facet.TestCloudJSONFacetJoinDomain_collection_shard1_replica_n1&action=CREATE&numShards=1&shard=shard1&wt=javabin} status=0 QTime=1399
   [junit4]   2> 1761491 INFO  (qtp1959840632-24176) [n:127.0.0.1:37373_solr     ] o.a.s.h.a.CollectionsHandler Wait for new collection to be active for at most 45 seconds. Check all shard replicas
   [junit4]   2> 1761589 INFO  (zkCallback-10754-thread-1) [     ] o.a.s.c.c.ZkStateReader A cluster state change: [WatchedEvent state:SyncConnected type:NodeDataChanged path:/collections/org.apache.solr.search.facet.TestCloudJSONFacetJoinDomain_collection/state.json] for collection [org.apache.solr.search.facet.TestCloudJSONFacetJoinDomain_collection] has occurred - updating... (live nodes size: [1])
   [junit4]   2> 1761590 INFO  (zkCallback-10754-thread-2) [     ] o.a.s.c.c.ZkStateReader A cluster state change: [WatchedEvent state:SyncConnected type:NodeDataChanged path:/collections/org.apache.solr.search.facet.TestCloudJSONFacetJoinDomain_collection/state.json] for collection [org.apache.solr.search.facet.TestCloudJSONFacetJoinDomain_collection] has occurred - updating... (live nodes size: [1])
   [junit4]   2> 1761591 INFO  (qtp1959840632-24176) [n:127.0.0.1:37373_solr     ] o.a.s.s.HttpSolrCall [admin] webapp=null path=/admin/collections params={property.schema=schema_latest.xml&property.config=solrconfig-tlog.xml&collection.configName=org.apache.solr.search.facet.TestCloudJSONFacetJoinDomain_config-set&name=org.apache.solr.search.facet.TestCloudJSONFacetJoinDomain_collection&nrtReplicas=1&action=CREATE&numShards=1&wt=javabin&version=2} status=0 QTime=1837
   [junit4]   2> 1761592 INFO  (SUITE-TestCloudJSONFacetJoinDomain-seed#[822BFB357E2441F0]-worker) [     ] o.a.s.c.AbstractDistribZkTestBase Wait for recoveries to finish - collection: org.apache.solr.search.facet.TestCloudJSONFacetJoinDomain_collection failOnTimeout:true timeout (sec):330
   [junit4]   2> 1761601 INFO  (zkCallback-10754-thread-3) [     ] o.a.s.c.c.ZkStateReader A cluster state change: [WatchedEvent state:SyncConnected type:NodeDataChanged path:/collections/org.apache.solr.search.facet.TestCloudJSONFacetJoinDomain_collection/state.json] for collection [org.apache.solr.search.facet.TestCloudJSONFacetJoinDomain_collection] has occurred - updating... (live nodes size: [1])
   [junit4]   1> replica:core_node2 rstate:active live:true
   [junit4]   1> no one is recoverying
   [junit4]   1> replica:core_node2 rstate:active live:true
   [junit4]   1> no one is recoverying
   [junit4]   1> replica:core_node2 rstate:active live:true
   [junit4]   1> no one is recoverying
   [junit4]   2> 1761603 INFO  (SUITE-TestCloudJSONFacetJoinDomain-seed#[822BFB357E2441F0]-worker) [     ] o.a.s.c.AbstractDistribZkTestBase Recoveries finished - collection: org.apache.solr.search.facet.TestCloudJSONFacetJoinDomain_collection
   [junit4]   2> 1761619 INFO  (qtp1959840632-24179) [n:127.0.0.1:37373_solr c:org.apache.solr.search.facet.TestCloudJSONFacetJoinDomain_collection s:shard1 r:core_node2 x:org.apache.solr.search.facet.TestCloudJSONFacetJoinDomain_collection_shard1_replica_n1 ] o.a.s.c.ZkShardTerms Successful update of terms at /collections/org.apache.solr.search.facet.TestCloudJSONFacetJoinDomain_collection/terms/shard1 to Terms{values={core_node2=1}, version=1}
   [junit4]   2> 1761619 INFO  (qtp1959840632-24179) [n:127.0.0.1:37373_solr c:org.apache.solr.search.facet.TestCloudJSONFacetJoinDomain_collection s:shard1 r:core_node2 x:org.apache.solr.search.facet.TestCloudJSONFacetJoinDomain_collection_shard1_replica_n1 ] o.a.s.u.p.LogUpdateProcessorFactory [org.apache.solr.search.facet.TestCloudJSONFacetJoinDomain_collection_shard1_replica_n1]  webapp=/solr path=/update params={wt=javabin&version=2}{add=[0 (1643234670023802880)]} 0 5
   [junit4]   2> 1761635 INFO  (qtp1959840632-24175) [n:127.0.0.1:37373_solr c:org.apache.solr.search.facet.TestCloudJSONFacetJoinDomain_collection s:shard1 r:core_node2 x:org.apache.solr.search.facet.TestCloudJSONFacetJoinDomain_collection_shard1_replica_n1 ] o.a.s.u.p.LogUpdateProcessorFactory [org.apache.solr.search.facet.TestCloudJSONFacetJoinDomain_collection_shard1_replica_n1]  webapp=/solr path=/update params={wt=javabin&version=2}{add=[1 (1643234670042677248)]} 0 1
   [junit4]   2> 1761651 INFO  (qtp1959840632-24177) [n:127.0.0.1:37373_solr c:org.apache.solr.search.facet.TestCloudJSONFacetJoinDomain_collection s:shard1 r:core_node2 x:org.apache.solr.search.facet.TestCloudJSONFacetJoinDomain_collection_shard1_replica_n1 ] o.a.s.u.p.LogUpdateProcessorFactory [org.apache.solr.search.facet.TestCloudJSONFacetJoinDomain_collection_shard1_replica_n1]  webapp=/solr path=/update params={wt=javabin&version=2}{add=[2 (1643234670059454464)]} 0 0
   [junit4]   2> 1761653 INFO  (qtp1959840632-24178) [n:127.0.0.1:37373_solr c:org.apache.solr.search.facet.TestCloudJSONFacetJoinDomain_collection s:shard1 r:core_node2 x:org.apache.solr.search.facet.TestCloudJSONFacetJoinDomain_collection_shard1_replica_n1 ] o.a.s.u.p.LogUpdateProcessorFactory [org.apache.solr.search.facet.TestCloudJSONFacetJoinDomain_collection_shard1_replica_n1]  webapp=/solr path=/update params={wt=javabin&version=2}{add=[3 (1643234670062600192)]} 0 0
   [junit4]   2> 1761658 INFO  (qtp1959840632-24176) [n:127.0.0.1:37373_solr c:org.apache.solr.search.facet.TestCloudJSONFacetJoinDomain_collection s:shard1 r:core_node2 x:org.apache.solr.search.facet.TestCloudJSONFacetJoinDomain_collection_shard1_replica_n1 ] o.a.s.u.p.LogUpdateProcessorFactory [org.apache.solr.search.facet.TestCloudJSONFacetJoinDomain_collection_shard1_replica_n1]  webapp=/solr path=/update params={wt=javabin&version=2}{add=[4 (1643234670067843072)]} 0 0
   [junit4]   2> 1761660 INFO  (qtp1959840632-24179) [n:127.0.0.1:37373_solr c:org.apache.solr.search.facet.TestCloudJSONFacetJoinDomain_collection s:shard1 r:core_node2 x:org.apache.solr.search.facet.TestCloudJSONFacetJoinDomain_collection_shard1_replica_n1 ] o.a.s.u.p.LogUpdateProcessorFactory [org.apache.solr.search.facet.TestCloudJSONFacetJoinDomain_collection_shard1_replica_n1]  webapp=/solr path=/update params={wt=javabin&version=2}{add=[5 (1643234670068891648)]} 0 0
   [junit4]   2> 1761662 INFO  (qtp1959840632-24175) [n:127.0.0.1:37373_solr c:org.apache.solr.search.facet.TestCloudJSONFacetJoinDomain_collection s:shard1 r:core_node2 x:org.apache.solr.search.facet.TestCloudJSONFacetJoinDomain_collection_shard1_replica_n1 ] o.a.s.u.p.LogUpdateProcessorFactory [org.apache.solr.search.facet.TestCloudJSONFacetJoinDomain_collection_shard1_replica_n1]  webapp=/solr path=/update params={wt=javabin&version=2}{add=[6 (1643234670072037376)]} 0 0
   [junit4]   2> 1761669 INFO  (qtp1959840632-24177) [n:127.0.0.1:37373_solr c:org.apache.solr.search.facet.TestCloudJSONFacetJoinDomain_collection s:shard1 r:core_node2 x:org.apache.solr.search.facet.TestCloudJSONFacetJoinDomain_collection_shard1_replica_n1 ] o.a.s.u.p.LogUpdateProcessorFactory [org.apache.solr.search.facet.TestCloudJSONFacetJoinDomain_collection_shard1_replica_n1]  webapp=/solr path=/update params={wt=javabin&version=2}{add=[7 (1643234670079377408)]} 0 0
   [junit4]   2> 1761672 INFO  (qtp1959840632-24178) [n:127.0.0.1:37373_solr c:org.apache.solr.search.facet.TestCloudJSONFacetJoinDomain_collection s:shard1 r:core_node2 x:org.apache.solr.search.facet.TestCloudJSONFacetJoinDomain_collection_shard1_replica_n1 ] o.a.s.u.p.LogUpdateProcessorFactory [org.apache.solr.search.facet.TestCloudJSONFacetJoinDomain_collection_shard1_replica_n1]  webapp=/solr path=/update params={wt=javabin&version=2}{add=[8 (1643234670082523136)]} 0 0
   [junit4]   2> 1761674 INFO  (qtp1959840632-24176) [n:127.0.0.1:37373_solr c:org.apache.solr.search.facet.TestCloudJSONFacetJoinDomain_collection s:shard1 r:core_node2 x:org.apache.solr.search.facet.TestCloudJSONFacetJoinDomain_collection_shard1_replica_n1 ] o.a.s.u.p.LogUpdateProcessorFactory [org.apache.solr.search.facet.TestCloudJSONFacetJoinDomain_collection_shard1_replica_n1]  webapp=/solr path=/update params={wt=javabin&version=2}{add=[9 (1643234670083571712)]} 0 0
   [junit4]   2> 1761675 INFO  (qtp1959840632-24179) [n:127.0.0.1:37373_solr c:org.apache.solr.search.facet.TestCloudJSONFacetJoinDomain_collection s:shard1 r:core_node2 x:org.apache.solr.search.facet.TestCloudJSONFacetJoinDomain_collection_shard1_replica_n1 ] o.a.s.u.p.LogUpdateProcessorFactory [org.apache.solr.search.facet.TestCloudJSONFacetJoinDomain_collection_shard1_replica_n1]  webapp=/solr path=/update params={wt=javabin&version=2}{add=[10 (1643234670085668864)]} 0 0
   [junit4]   2> 1761676 INFO  (qtp1959840632-24175) [n:127.0.0.1:37373_solr c:org.apache.solr.search.facet.TestCloudJSONFacetJoinDomain_collection s:shard1 r:core_node2 x:org.apache.solr.search.facet.TestCloudJSONFacetJoinDomain_collection_shard1_replica_n1 ] o.a.s.u.p.LogUpdateProcessorFactory [org.apache.solr.search.facet.TestCloudJSONFacetJoinDomain_collection_shard1_replica_n1]  webapp=/solr path=/update params={wt=javabin&version=2}{add=[11 (1643234670086717440)]} 0 0
   [junit4]   2> 1761678 INFO  (qtp1959840632-24177) [n:127.0.0.1:37373_solr c:org.apache.solr.search.facet.TestCloudJSONFacetJoinDomain_collection s:shard1 r:core_node2 x:org.apache.solr.search.facet.TestCloudJSONFacetJoinDomain_collection_shard1_replica_n1 ] o.a.s.u.p.LogUpdateProcessorFactory [org.apache.solr.search.facet.TestCloudJSONFacetJoinDomain_collection_shard1_replica_n1]  webapp=/solr path=/update params={wt=javabin&version=2}{add=[12 (1643234670088814592)]} 0 0
   [junit4]   2> 1761679 INFO  (qtp1959840632-24178) [n:127.0.0.1:37373_solr c:org.apache.solr.search.facet.TestCloudJSONFacetJoinDomain_collection s:shard1 r:core_node2 x:org.apache.solr.search.facet.TestCloudJSONFacetJoinDomain_collection_shard1_replica_n1 ] o.a.s.u.p.LogUpdateProcessorFactory [org.apache.solr.search.facet.TestCloudJSONFacetJoinDomain_collection_shard1_replica_n1]  webapp=/solr path=/update params={wt=javabin&version=2}{add=[13 (1643234670089863168)]} 0 0
   [junit4]   2> 1761681 INFO  (qtp1959840632-24176) [n:127.0.0.1:37373_solr c:org.apache.solr.search.facet.TestCloudJSONFacetJoinDomain_collection s:shard1 r:core_node2 x:org.apache.solr.search.facet.TestCloudJSONFacetJoinDomain_collection_shard1_replica_n1 ] o.a.s.u.p.LogUpdateProcessorFactory [org.apache.solr.search.facet.TestCloudJSONFacetJoinDomain_collection_shard1_replica_n1]  webapp=/solr path=/update params={wt=javabin&version=2}{add=[14 (1643234670090911744)]} 0 0
   [junit4]   2> 1761682 INFO  (qtp1959840632-24179) [n:127.0.0.1:37373_solr c:org.apache.solr.search.facet.TestCloudJSONFacetJoinDomain_collection s:shard1 r:core_node2 x:org.apache.solr.search.facet.TestCloudJSONFacetJoinDomain_collection_shard1_replica_n1 ] o.a.s.u.p.LogUpdateProcessorFactory [org.apache.solr.search.facet.TestCloudJSONFacetJoinDomain_collection_shard1_replica_n1]  webapp=/solr path=/update params={wt=javabin&version=2}{add=[15 (1643234670093008896)]} 0 0
   [junit4]   2> 1761683 INFO  (qtp1959840632-24175) [n:127.0.0.1:37373_solr c:org.apache.solr.search.facet.TestCloudJSONFacetJoinDomain_collection s:shard1 r:core_node2 x:org.apache.solr.search.facet.TestCloudJSONFacetJoinDomain_collection_shard1_replica_n1 ] o.a.s.u.p.LogUpdateProcessorFactory [org.apache.solr.search.facet.TestCloudJSONFacetJoinDomain_collection_shard1_replica_n1]  webapp=/solr path=/update params={wt=javabin&version=2}{add=[16 (1643234670094057472)]} 0 0
   [junit4]   2> 1761686 INFO  (qtp1959840632-24177) [n:127.0.0.1:37373_solr c:org.apache.solr.search.facet.TestCloudJSONFacetJoinDomain_collection s:shard1 r:core_node2 x:org.apache.solr.search.facet.TestCloudJSONFacetJoinDomain_collection_shard1_replica_n1 ] o.a.s.u.p.LogUpdateProcessorFactory [org.apache.solr.search.facet.TestCloudJSONFacetJoinDomain_collection_shard1_replica_n1]  webapp=/solr path=/update params={wt=javabin&version=2}{add=[17 (1643234670097203200)]} 0 0
   [junit4]   2> 1761687 INFO  (qtp1959840632-24178) [n:127.0.0.1:37373_solr c:org.apache.solr.search.facet.TestCloudJSONFacetJoinDomain_collection s:shard1 r:core_node2 x:org.apache.solr.search.facet.TestCloudJSONFacetJoinDomain_collection_shard1_replica_n1 ] o.a.s.u.p.LogUpdateProcessorFactory [org.apache.solr.search.facet.TestCloudJSONFacetJoinDomain_collection_shard1_replica_n1]  webapp=/solr path=/update params={wt=javabin&version=2}{add=[18 (1643234670098251776)]} 0 0
   [junit4]   2> 1761688 INFO  (qtp1959840632-24176) [n:127.0.0.1:37373_solr c:org.apache.solr.search.facet.TestCloudJSONFacetJoinDomain_collection s:shard1 r:core_node2 x:org.apache.solr.search.facet.TestCloudJSONFacetJoinDomain_collection_shard1_replica_n1 ] o.a.s.u.p.LogUpdateProcessorFactory [org.apache.solr.search.facet.TestCloudJSONFacetJoinDomain_collection_shard1_replica_n1]  webapp=/solr path=/update params={wt=javabin&version=2}{add=[19 (1643234670099300352)]} 0 0
   [junit4]   2> 1761689 INFO  (qtp1959840632-24179) [n:127.0.0.1:37373_solr c:org.apache.solr.search.facet.TestCloudJSONFacetJoinDomain_collection s:shard1 r:core_node2 x:org.apache.solr.search.facet.TestCloudJSONFacetJoinDomain_collection_shard1_replica_n1 ] o.a.s.u.p.LogUpdateProcessorFactory [org.apache.solr.search.facet.TestCloudJSONFacetJoinDomain_collection_shard1_replica_n1]  webapp=/solr path=/update params={wt=javabin&version=2}{add=[20 (1643234670100348928)]} 0 0
   [junit4]   2> 1761690 INFO  (qtp1959840632-24175) [n:127.0.0.1:37373_solr c:org.apache.solr.search.facet.TestCloudJSONFacetJoinDomain_collection s:shard1 r:core_node2 x:org.apache.solr.search.facet.TestCloudJSONFacetJoinDomain_collection_shard1_replica_n1 ] o.a.s.u.p.LogUpdateProcessorFactory [org.apache.solr.search.facet.TestCloudJSONFacetJoinDomain_collection_shard1_replica_n1]  webapp=/solr path=/update params={wt=javabin&version=2}{add=[21 (1643234670101397504)]} 0 0
   [junit4]   2> 1761692 INFO  (qtp1959840632-24177) [n:127.0.0.1:37373_solr c:org.apache.solr.search.facet.TestCloudJSONFacetJoinDomain_collection s:shard1 r:core_node2 x:org.apache.solr.search.facet.TestCloudJSONFacetJoinDomain_collection_shard1_replica_n1 ] o.a.s.u.p.LogUpdateProcessorFactory [org.apache.solr.search.facet.TestCloudJSONFacetJoinDomain_collection_shard1_replica_n1]  webapp=/solr path=/update params={wt=javabin&version=2}{add=[22 (1643234670102446080)]} 0 0
   [junit4]   2> 1761693 INFO  (qtp1959840632-24178) [n:127.0.0.1:37373_solr c:org.apache.solr.search.facet.TestCloudJSONFacetJoinDomain_collection s:shard1 r:core_node2 x:org.apache.solr.search.facet.TestCloudJSONFacetJoinDomain_collection_shard1_replica_n1 ] o.a.s.u.p.LogUpdateProcessorFactory [org.apache.solr.search.facet.TestCloudJSONFacetJoinDomain_collection_shard1_replica_n1]  webapp=/solr path=/update params={wt=javabin&version=2}{add=[23 (1643234670103494656)]} 0 0
   [junit4]   2> 1761694 INFO  (qtp1959840632-24176) [n:127.0.0.1:37373_solr c:org.apache.solr.search.facet.TestCloudJSONFacetJoinDomain_collection s:shard1 r:core_node2 x:org.apache.solr.search.facet.TestCloudJSONFacetJoinDomain_collection_shard1_replica_n1 ] o.a.s.u.p.LogUpdateProcessorFactory [org.apache.solr.search.facet.TestCloudJSONFacetJoinDomain_collection_shard1_replica_n1]  webapp=/solr path=/update params={wt=javabin&version=2}{add=[24 (1643234670105591808)]} 0 0
   [junit4]   2> 1761695 INFO  (qtp1959840632-24179) [n:127.0.0.1:37373_solr c:org.apache.solr.search.facet.TestCloudJSONFacetJoinDomain_collection s:shard1 r:core_node2 x:org.apache.solr.search.facet.TestCloudJSONFacetJoinDomain_collection_shard1_replica_n1 ] o.a.s.u.p.LogUpdateProcessorFactory [org.apache.solr.search.facet.TestCloudJSONFacetJoinDomain_collection_shard1_replica_n1]  webapp=/solr path=/update params={wt=javabin&version=2}{add=[25 (1643234670106640384)]} 0 0
   [junit4]   2> 1761696 INFO  (qtp1959840632-24175) [n:127.0.0.1:37373_solr c:org.apache.solr.search.facet.TestCloudJSONFacetJoinDomain_collection s:shard1 r:core_node2 x:org.apache.solr.search.facet.TestCloudJSONFacetJoinDomain_collection_shard1_replica_n1 ] o.a.s.u.p.LogUpdateProcessorFactory [org.apache.solr.search.facet.TestCloudJSONFacetJoinDomain_collection_shard1_replica_n1]  webapp=/solr path=/update params={wt=javabin&version=2}{add=[26 (1643234670107688960)]} 0 0
   [junit4]   2> 1761697 INFO  (qtp1959840632-24177) [n:127.0.0.1:37373_solr c:org.apache.solr.search.facet.TestCloudJSONFacetJoinDomain_collection s:shard1 r:core_node2 x:org.apache.solr.search.facet.TestCloudJSONFacetJoinDomain_collection_shard1_replica_n1 ] o.a.s.u.p.LogUpdateProcessorFactory [org.apache.solr.search.facet.TestCloudJSONFacetJoinDomain_collection_shard1_replica_n1]  webapp=/solr path=/update params={wt=javabin&version=2}{add=[27 (1643234670108737536)]} 0 0
   [junit4]   2> 1761698 INFO  (qtp1959840632-24178) [n:127.0.0.1:37373_solr c:org.apache.solr.search.facet.TestCloudJSONFacetJoinDomain_collection s:shard1 r:core_node2 x:org.apache.solr.search.facet.TestCloudJSONFacetJoinDomain_collection_shard1_replica_n1 ] o.a.s.u.p.LogUpdateProcessorFactory [org.apache.solr.search.facet.TestCloudJSONFacetJoinDomain_collection_shard1_replica_n1]  webapp=/solr path=/update params={wt=javabin&version=2}{add=[28 (1643234670109786112)]} 0 0
   [junit4]   2> 1761699 INFO  (qtp1959840632-24176) [n:127.0.0.1:37373_solr c:org.apache.solr.search.facet.TestCloudJSONFacetJoinDomain_collection s:shard1 r:core_node2 x:org.apache.solr.search.facet.TestCloudJSONFacetJoinDomain_collection_shard1_replica_n1 ] o.a.s.u.p.LogUpdateProcessorFactory [org.apache.solr.search.facet.TestCloudJSONFacetJoinDomain_collection_shard1_replica_n1]  webapp=/solr path=/update params={wt=javabin&version=2}{add=[29 (1643234670110834688)]} 0 0
   [junit4]   2> 1761700 INFO  (qtp1959840632-24179) [n:127.0.0.1:37373_solr c:org.apache.solr.search.facet.TestCloudJSONFacetJoinDomain_collection s:shard1 r:core_node2 x:org.apache.solr.search.facet.TestCloudJSONFacetJoinDomain_collection_shard1_replica_n1 ] o.a.s.u.p.LogUpdateProcessorFactory [org.apache.solr.search.facet.TestCloudJSONFacetJoinDomain_collection_shard1_replica_n1]  webapp=/solr path=/update params={wt=javabin&version=2}{add=[30 (1643234670111883264)]} 0 0
   [junit4]   2> 1761701 INFO  (qtp1959840632-24175) [n:127.0.0.1:37373_solr c:org.apache.solr.search.facet.TestCloudJSONFacetJoinDomain_collection s:shard1 r:core_node2 x:org.apache.solr.search.facet.TestCloudJSONFacetJoinDomain_collection_shard1_replica_n1 ] o.a.s.u.p.LogUpdateProcessorFactory [org.apache.solr.search.facet.TestCloudJSONFacetJoinDomain_collection_shard1_replica_n1]  webapp=/solr path=/update params={wt=javabin&version=2}{add=[31 (1643234670112931840)]} 0 0
   [junit4]   2> 1761703 INFO  (qtp1959840632-24177) [n:127.0.0.1:37373_solr c:org.apache.solr.search.facet.TestCloudJSONFacetJoinDomain_collection s:shard1 r:core_node2 x:org.apache.solr.search.facet.TestCloudJSONFacetJoinDomain_collection_shard1_replica_n1 ] o.a.s.u.p.LogUpdateProcessorFactory [org.apache.solr.search.facet.TestCloudJSONFacetJoinDomain_collection_shard1_replica_n1]  webapp=/solr path=/update params={wt=javabin&version=2}{add=[32 (1643234670113980416)]} 0 0
   [junit4]   2> 1761704 INFO  (qtp1959840632-24178) [n:127.0.0.1:37373_solr c:org.apache.solr.search.facet.TestCloudJSONFacetJoinDomain_collection s:shard1 r:core_node2 x:org.apache.solr.search.facet.TestCloudJSONFacetJoinDomain_collection_shard1_replica_n1 ] o.a.s.u.p.LogUpdateProcessorFactory [org.apache.solr.search.facet.TestCloudJSONFacetJoinDomain_collection_shard1_replica_n1]  webapp=/solr path=/update params={wt=javabin&version=2}{add=[33 (1643234670115028992)]} 0 0
   [junit4]   2> 1761705 INFO  (qtp1959840632-24176) [n:127.0.0.1:37373_solr c:org.apache.solr.search.facet.TestCloudJSONFacetJoinDomain_collection s:shard1 r:core_node2 x:org.apache.solr.search.facet.TestCloudJSONFacetJoinDomain_collection_shard1_replica_n1 ] o.a.s.u.p.LogUpdateProcessorFactory [org.apache.solr.search.facet.TestCloudJSONFacetJoinDomain_collection_shard1_replica_n1]  webapp=/solr path=/update params={wt=javabin&version=2}{add=[34 (1643234670117126144)]} 0 0
   [junit4]   2> 1761706 INFO  (qtp1959840632-24179) [n:127.0.0.1:37373_solr c:org.apache.solr.search.facet.TestCloudJSONFacetJoinDomain_collection s:shard1 r:core_node2 x:org.apache.solr.search.facet.TestCloudJSONFacetJoinDomain_collection_shard1_replica_n1 ] o.a.s.u.p.LogUpdateProcessorFactory [org.apache.solr.search.facet.TestCloudJSONFacetJoinDomain_collection_shard1_replica_n1]  webapp=/solr path=/update params={wt=javabin&version=2}{add=[35 (1643234670118174720)]} 0 0
   [junit4]   2> 1761707 INFO  (qtp1959840632-24175) [n:127.0.0.1:37373_solr c:org.apache.solr.search.facet.TestCloudJSONFacetJoinDomain_collection s:shard1 r:core_node2 x:org.apache.solr.search.facet.TestCloudJSONFacetJoinDomain_collection_shard1_replica_n1 ] o.a.s.u.p.LogUpdateProcessorFactory [org.apache.solr.search.facet.TestCloudJSONFacetJoinDomain_collection_shard1_replica_n1]  webapp=/solr path=/update params={wt=javabin&version=2}{add=[36 (1643234670119223296)]} 0 0
   [junit4]   2> 1761708 INFO  (qtp1959840632-24177) [n:127.0.0.1:37373_solr c:org.apache.solr.search.facet.TestCloudJSONFacetJoinDomain_collection s:shard1 r:core_node2 x:org.apache.solr.search.facet.TestCloudJSONFacetJoinDomain_collection_shard1_replica_n1 ] o.a.s.u.p.LogUpdateProcessorFactory [org.apache.solr.search.facet.TestCloudJSONFacetJoinDomain_collection_shard1_replica_n1]  webapp=/solr path=/update params={wt=javabin&version=2}{add=[37 (1643234670120271872)]} 0 0
   [junit4]   2> 1761709 INFO  (qtp1959840632-24178) [n:127.0.0.1:37373_solr c:org.apache.solr.search.facet.TestCloudJSONFacetJoinDomain_collection s:shard1 r:core_node2 x:org.apache.solr.search.facet.TestCloudJSONFacetJoinDomain_collection_shard1_replica_n1 ] o.a.s.u.p.LogUpdateProcessorFactory [org.apache.solr.search.facet.TestCloudJSONFacetJoinDomain_collection_shard1_replica_n1]  webapp=/solr path=/update params={wt=javabin&version=2}{add=[38 (1643234670121320448)]} 0 0
   [junit4]   2> 1761710 INFO  (qtp1959840632-24176) [n:127.0.0.1:37373_solr c:org.apache.solr.search.facet.TestCloudJSONFacetJoinDomain_collection s:shard1 r:core_node2 x:org.apache.solr.search.facet.TestCloudJSONFacetJoinDomain_collection_shard1_replica_n1 ] o.a.s.u.p.LogUpdateProcessorFactory [org.apache.solr.search.facet.TestCloudJSONFacetJoinDomain_collection_shard1_replica_n1]  webapp=/solr path=/update params={wt=javabin&version=2}{add=[39 (1643234670122369024)]} 0 0
   [junit4]   2> 1761711 INFO  (qtp1959840632-24179) [n:127.0.0.1:37373_solr c:org.apache.solr.search.facet.TestCloudJSONFacetJoinDomain_collection s:shard1 r:core_node2 x:org.apache.solr.search.facet.TestCloudJSONFacetJoinDomain_collection_shard1_replica_n1 ] o.a.s.u.p.LogUpdateProcessorFactory [org.apache.solr.search.facet.TestCloudJSONFacetJoinDomain_collection_shard1_replica_n1]  webapp=/solr path=/update params={wt=javabin&version=2}{add=[40 (1643234670123417600)]} 0 0
   [junit4]   2> 1761713 INFO  (qtp1959840632-24175) [n:127.0.0.1:37373_solr c:org.apache.solr.search.facet.TestCloudJSONFacetJoinDomain_collection s:shard1 r:core_node2 x:org.apache.solr.search.facet.TestCloudJSONFacetJoinDomain_collection_shard1_replica_n1 ] o.a.s.u.p.LogUpdateProcessorFactory [org.apache.solr.search.facet.TestCloudJSONFacetJoinDomain_collection_shard1_replica_n1]  webapp=/solr path=/update params={wt=javabin&version=2}{add=[41 (1643234670124466176)]} 0 0
   [junit4]   2> 1761718 INFO  (qtp1959840632-24177) [n:127.0.0.1:37373_solr c:org.apache.solr.search.facet.TestCloudJSONFacetJoinDomain_collection s:shard1 r:core_node2 x:org.apache.solr.search.facet.TestCloudJSONFacetJoinDomain_collection_shard1_replica_n1 ] o.a.s.u.p.LogUpdateProcessorFactory [org.apache.solr.search.facet.TestCloudJSONFacetJoinDomain_collection_shard1_replica_n1]  webapp=/solr path=/update params={wt=javabin&version=2}{add=[42 (1643234670130757632)]} 0 0
   [junit4]   2> 1761719 INFO  (qtp1959840632-24178) [n:127.0.0.1:37373_solr c:org.apache.solr.search.facet.TestCloudJSONFacetJoinDomain_collection s:shard1 r:core_node2 x:org.apache.solr.search.facet.TestCloudJSONFacetJoinDomain_collection_shard1_replica_n1 ] o.a.s.u.p.LogUpdateProcessorFactory [org.apache.solr.search.facet.TestCloudJSONFacetJoinDomain_collection_shard1_replica_n1]  webapp=/solr path=/update params={wt=javabin&version=2}{add=[43 (1643234670131806208)]} 0 0
   [junit4]   2> 1761720 INFO  (qtp1959840632-24176) [n:127.0.0.1:37373_solr c:org.apache.solr.search.facet.TestCloudJSONFacetJoinDomain_collection s:shard1 r:core_node2 x:org.apache.solr.search.facet.TestCloudJSONFacetJoinDomain_collection_shard1_replica_n1 ] o.a.s.u.p.LogUpdateProcessorFactory [org.apache.solr.search.facet.TestCloudJSONFacetJoinDomain_collection_shard1_replica_n1]  webapp=/solr path=/update params={wt=javabin&version=2}{add=[44 (1643234670132854784)]} 0 0
   [junit4]   2> 1761721 INFO  (qtp1959840632-24179) [n:127.0.0.1:37373_solr c:org.apache.solr.search.facet.TestCloudJSONFacetJoinDomain_collection s:shard1 r:core_node2 x:org.apache.solr.search.facet.TestCloudJSONFacetJoinDomain_collection_shard1_replica_n1 ] o.a.s.u.p.LogUpdateProcessorFactory [org.apache.solr.search.facet.TestCloudJSONFacetJoinDomain_collection_shard1_replica_n1]  webapp=/solr path=/update params={wt=javabin&version=2}{add=[45 (1643234670133903360)]} 0 0
   [junit4]   2> 1761723 INFO  (qtp1959840632-24175) [n:127.0.0.1:37373_solr c:org.apache.solr.search.facet.TestCloudJSONFacetJoinDomain_collection s:shard1 r:core_node2 x:org.apache.solr.search.facet.TestCloudJSONFacetJoinDomain_collection_shard1_replica_n1 ] o.a.s.u.p.LogUpdateProcessorFactory [org.apache.solr.search.facet.TestCloudJSONFacetJoinDomain_collection_shard1_replica_n1]  webapp=/solr path=/update params={wt=javabin&version=2}{add=[46 (1643234670134951936)]} 0 0
   [junit4]   2> 1761724 INFO  (qtp1959840632-24177) [n:127.0.0.1:37373_solr c:org.apache.solr.search.facet.TestCloudJSONFacetJoinDomain_collection s:shard1 r:core_node2 x:org.apache.solr.search.facet.TestCloudJSONFacetJoinDomain_collection_shard1_replica_n1 ] o.a.s.u.p.LogUpdateProcessorFactory [org.apache.solr.search.facet.TestCloudJSONFacetJoinDomain_collection_shard1_replica_n1]  webapp=/solr path=/update params={wt=javabin&version=2}{add=[47 (1643234670137049088)]} 0 0
   [junit4]   2> 1761725 INFO  (qtp1959840632-24178) [n:127.0.0.1:37373_solr c:org.apache.solr.search.facet.TestCloudJSONFacetJoinDomain_collection s:shard1 r:core_node2 x:org.apache.solr.search.facet.TestCloudJSONFacetJoinDomain_collection_shard1_replica_n1 ] o.a.s.u.p.LogUpdateProcessorFactory [org.apache.solr.search.facet.TestCloudJSONFacetJoinDomain_collection_shard1_replica_n1]  webapp=/solr path=/update params={wt=javabin&version=2}{add=[48 (1643234670138097664)]} 0 0
   [junit4]   2> 1761726 INFO  (qtp1959840632-24176) [n:127.0.0.1:37373_solr c:org.apache.solr.search.facet.TestCloudJSONFacetJoinDomain_collection s:shard1 r:core_node2 x:org.apache.solr.search.facet.TestCloudJSONFacetJoinDomain_collection_shard1_replica_n1 ] o.a.s.u.p.LogUpdateProcessorFactory [org.apache.solr.search.facet.TestCloudJSONFacetJoinDomain_collection_shard1_replica_n1]  webapp=/solr path=/update params={wt=javabin&version=2}{add=[49 (1643234670139146240)]} 0 0
   [junit4]   2> 1761727 INFO  (qtp1959840632-24179) [n:127.0.0.1:37373_solr c:org.apache.solr.search.facet.TestCloudJSONFacetJoinDomain_collection s:shard1 r:core_node2 x:org.apache.solr.search.facet.TestCloudJSONFacetJoinDomain_collection_shard1_replica_n1 ] o.a.s.u.p.LogUpdateProcessorFactory [org.apache.solr.search.facet.TestCloudJSONFacetJoinDomain_collection_shard1_replica_n1]  webapp=/solr path=/update params={wt=javabin&version=2}{add=[50 (1643234670140194816)]} 0 0
   [junit4]   2> 1761728 INFO  (qtp1959840632-24175) [n:127.0.0.1:37373_solr c:org.apache.solr.search.facet.TestCloudJSONFacetJoinDomain_collection s:shard1 r:core_node2 x:org.apache.solr.search.facet.TestCloudJSONFacetJoinDomain_collection_shard1_replica_n1 ] o.a.s.u.p.LogUpdateProcessorFactory [org.apache.solr.search.facet.TestCloudJSONFacetJoinDomain_collection_shard1_replica_n1]  webapp=/solr path=/update params={wt=javabin&version=2}{add=[51 (1643234670141243392)]} 0 0
   [junit4]   2> 1761730 INFO  (qtp1959840632-24177) [n:127.0.0.1:37373_solr c:org.apache.solr.search.facet.TestCloudJSONFacetJoinDomain_collection s:shard1 r:core_node2 x:org.apache.solr.search.facet.TestCloudJSONFacetJoinDomain_collection_shard1_replica_n1 ] o.a.s.u.p.LogUpdateProcessorFactory [org.apache.solr.search.facet.TestCloudJSONFacetJoinDomain_collection_shard1_replica_n1]  webapp=/solr path=/update params={wt=javabin&version=2}{add=[52 (1643234670142291968)]} 0 0
   [junit4]   2> 1761731 INFO  (qtp1959840632-24178) [n:127.0.0.1:37373_solr c:org.apache.solr.search.facet.TestCloudJSONFacetJoinDomain_collection s:shard1 r:core_node2 x:org.apache.solr.search.facet.TestCloudJSONFacetJoinDomain_collection_shard1_replica_n1 ] o.a.s.u.p.LogUpdateProcessorFactory [org.apache.solr.search.facet.TestCloudJSONFacetJoinDomain_collection_shard1_replica_n1]  webapp=/solr path=/update params={wt=javabin&version=2}{add=[53 (1643234670144389120)]} 0 0
   [junit4]   2> 1761732 INFO  (qtp1959840632-24176) [n:127.0.0.1:37373_solr c:org.apache.solr.search.facet.TestCloudJSONFacetJoinDomain_collection s:shard1 r:core_node2 x:org.apache.solr.search.facet.TestCloudJSONFacetJoinDomain_collection_shard1_replica_n1 ] o.a.s.u.p.LogUpdateProcessorFactory [org.apache.solr.search.facet.TestCloudJSONFacetJoinDomain_collection_shard1_replica_n1]  webapp=/solr path=/update params={wt=javabin&version=2}{add=[54 (1643234670145437696)]} 0 0
   [junit4]   2> 1761733 INFO  (qtp1959840632-24179) [n:127.0.0.1:37373_solr c:org.apache.solr.search.facet.TestCloudJSONFacetJoinDomain_collection s:shard1 r:core_node2 x:org.apache.solr.search.facet.TestCloudJSONFacetJoinDomain_collection_shard1_replica_n1 ] o.a.s.u.p.LogUpdateProcessorFactory [org.apache.solr.search.facet.TestCloudJSONFacetJoinDomain_collection_shard1_replica_n1]  webapp=/solr path=/update params={wt=javabin&version=2}{add=[55 (1643234670146486272)]} 0 0
   [junit4]   2> 1761734 INFO  (qtp1959840632-24175) [n:127.0.0.1:37373_solr c:org.apache.solr.search.facet.TestCloudJSONFacetJoinDomain_collection s:shard1 r:core_node2 x:org.apache.solr.search.facet.TestCloudJSONFacetJoinDomain_collection_shard1_replica_n1 ] o.a.s.u.p.LogUpdateProcessorFactory [org.apache.solr.search.facet.TestCloudJSONFacetJoinDomain_collection_shard1_replica_n1]  webapp=/solr path=/update params={wt=javabin&version=2}{add=[56 (1643234670147534848)]} 0 0
   [junit4]   2> 1761735 INFO  (qtp1959840632-24177) [n:127.0.0.1:37373_solr c:org.apache.solr.search.facet.TestCloudJSONFacetJoinDomain_collection s:shard1 r:core_node2 x:org.apache.solr.search.facet.TestCloudJSONFacetJoinDomain_collection_shard1_replica_n1 ] o.a.s.u.p.LogUpdateProcessorFactory [org.apache.solr.search.facet.TestCloudJSONFacetJoinDomain_collection_shard1_replica_n1]  webapp=/solr path=/update params={wt=javabin&version=2}{add=[57 (1643234670148583424)]} 0 0
   [junit4]   2> 1761736 INFO  (qtp1959840632-24178) [n:127.0.0.1:37373_solr c:org.apache.solr.search.facet.TestCloudJSONFacetJoinDomain_collection s:shard1 r:core_node2 x:org.apache.solr.search.facet.TestCloudJSONFacetJoinDomain_collection_shard1_replica_n1 ] o.a.s.u.p.LogUpdateProcessorFactory [org.apache.solr.search.facet.TestCloudJSONFacetJoinDomain_collection_shard1_replica_n1]  webapp=/solr path=/update params={wt=javabin&version=2}{add=[58 (1643234670149632000)]} 0 0
   [junit4]   2> 1761737 INFO  (qtp1959840632-24176) [n:127.0.0.1:37373_solr c:org.apache.solr.search.facet.TestCloudJSONFacetJoinDomain_collection s:shard1 r:core_node2 x:org.apache.solr.search.facet.TestCloudJSONFacetJoinDomain_collection_shard1_replica_n1 ] o.a.s.u.p.LogUpdateProcessorFactory [org.apache.solr.search.facet.TestCloudJSONFacetJoinDomain_collection_shard1_replica_n1]  webapp=/solr path=/update params={wt=javabin&version=2}{add=[59 (1643234670150680576)]} 0 0
   [junit4]   2> 1761738 INFO  (qtp1959840632-24179) [n:127.0.0.1:37373_solr c:org.apache.solr.search.facet.TestCloudJSONFacetJoinDomain_collection s:shard1 r:core_node2 x:org.apache.solr.search.facet.TestCloudJSONFacetJoinDomain_collection_shard1_replica_n1 ] o.a.s.u.p.LogUpdateProcessorFactory [org.apache.solr.search.facet.TestCloudJSONFacetJoinDomain_collection_shard1_replica_n1]  webapp=/solr path=/update params={wt=javabin&version=2}{add=[60 (1643234670151729152)]} 0 0
   [junit4]   2> 1761740 INFO  (qtp1959840632-24175) [n:127.0.0.1:37373_solr c:org.apache.solr.search.facet.TestCloudJSONFacetJoinDomain_collection s:shard1 r:core_node2 x:org.apache.solr.search.facet.TestCloudJSONFacetJoinDomain_collection_shard1_replica_n1 ] o.a.s.u.p.LogUpdateProcessorFactory [org.apache.solr.search.facet.TestCloudJSONFacetJoinDomain_collection_shard1_replica_n1]  webapp=/solr path=/update params={wt=javabin&version=2}{add=[61 (1643234670152777728)]} 0 0
   [junit4]   2> 1761741 INFO  (qtp1959840632-24177) [n:127.0.0.1:37373_solr c:org.apache.solr.search.facet.TestCloudJSONFacetJoinDomain_collection s:shard1 r:core_node2 x:org.apache.solr.search.facet.TestCloudJSONFacetJoinDomain_collection_shard1_replica_n1 ] o.a.s.u.p.LogUpdateProcessorFactory [org.apache.solr.search.facet.TestCloudJSONFacetJoinDomain_collection_shard1_replica_n1]  webapp=/solr path=/update params={wt=javabin&version=2}{add=[62 (1643234670153826304)]} 0 0
   [junit4]   2> 1761742 INFO  (qtp1959840632-24178) [n:127.0.0.1:37373_solr c:org.apache.solr.search.facet.TestCloudJSONFacetJoinDomain_collection s:shard1 r:core_node2 x:org.apache.solr.search.facet.TestCloudJSONFacetJoinDomain_collection_shard1_replica_n1 ] o.a.s.u.p.LogUpdateProcessorFactory [org.apache.solr.search.facet.TestCloudJSONFacetJoinDomain_collection_shard1_replica_n1]  webapp=/solr path=/update params={wt=javabin&version=2}{add=[63 (1643234670154874880)]} 0 0
   [junit4]   2> 1761743 INFO  (qtp1959840632-24176) [n:127.0.0.1:37373_solr c:org.apache.solr.search.facet.TestCloudJSONFacetJoinDomain_collection s:shard1 r:core_node2 x:org.apache.solr.search.facet.TestCloudJSONFacetJoinDomain_collection_shard1_replica_n1 ] o.a.s.u.p.LogUpdateProcessorFactory [org.apache.solr.search.facet.TestCloudJSONFacetJoinDomain_collection_shard1_replica_n1]  webapp=/solr path=/update params={wt=javabin&version=2}{add=[64 (1643234670156972032)]} 0 0
   [junit4]   2> 1761744 INFO  (qtp1959840632-24179) [n:127.0.0.1:37373_solr c:org.apache.solr.search.facet.TestCloudJSONFacetJoinDomain_collection s:shard1 r:core_node2 x:org.apache.solr.search.facet.TestCloudJSONFacetJoinDomain_collection_shard1_replica_n1 ] o.a.s.u.p.LogUpdateProcessorFactory [org.apache.solr.search.facet.TestCloudJSONFacetJoinDomain_collection_shard1_replica_n1]  webapp=/solr path=/update params={wt=javabin&version=2}{add=[65 (1643234670158020608)]} 0 0
   [junit4]   2> 1761745 INFO  (qtp1959840632-24175) [n:127.0.0.1:37373_solr c:org.apache.solr.search.facet.TestCloudJSONFacetJoinDomain_collection s:shard1 r:core_node2 x:org.apache.solr.search.facet.TestCloudJSONFacetJoinDomain_collection_shard1_replica_n1 ] o.a.s.u.p.LogUpdateProcessorFactory [org.apache.solr.search.facet.TestCloudJSONFacetJoinDomain_collection_shard1_replica_n1]  webapp=/solr path=/update params={wt=javabin&version=2}{add=[66 (1643234670159069184)]} 0 0
   [junit4]   2> 1761746 INFO  (qtp1959840632-24177) [n:127.0.0.1:37373_solr c:org.apache.solr.search.facet.TestCloudJSONFacetJoinDomain_collection s:shard1 r:core_node2 x:org.apache.solr.search.facet.TestCloudJSONFacetJoinDomain_collection_shard1_replica_n1 ] o.a.s.u.p.LogUpdateProcessorFactory [org.apache.solr.search.facet.TestCloudJSONFacetJoinDomain_collection_shard1_replica_n1]  webapp=/solr path=/update params={wt=javabin&version=2}{add=[67 (1643234670160117760)]} 0 0
   [junit4]   2> 1761751 INFO  (qtp1959840632-24178) [n:127.0.0.1:37373_solr c:org.apache.solr.search.facet.TestCloudJSONFacetJoinDomain_collection s:shard1 r:core_node2 x:org.apache.solr.search.facet.TestCloudJSONFacetJoinDomain_collection_shard1_replica_n1 ] o.a.s.u.p.LogUpdateProcessorFactory [org.apache.solr.search.facet.TestCloudJSONFacetJoinDomain_collection_shard1_replica_n1]  webapp=/solr path=/update params={wt=javabin&version=2}{add=[68 (1643234670164312064)]} 0 0
   [junit4]   2> 1761752 INFO  (qtp1959840632-24176) [n:127.0.0.1:37373_solr c:org.apache.solr.search.facet.TestCloudJSONFacetJoinDomain_collection s:shard1 r:core_node2 x:org.apache.solr.search.facet.TestCloudJSONFacetJoinDomain_collection_shard1_replica_n1 ] o.a.s.u.p.LogUpdateProcessorFactory [org.apache.solr.search.facet.TestCloudJSONFacetJoinDomain_collection_shard1_replica_n1]  webapp=/solr path=/update params={wt=javabin&version=2}{add=[69 (1643234670166409216)]} 0 0
   [junit4]   2> 1761753 INFO  (qtp1959840632-24179) [n:127.0.0.1:37373_solr c:org.apache.solr.search.facet.TestCloudJSONFacetJoinDomain_collection s:shard1 r:core_node2 x:org.apache.solr.search.facet.TestCloudJSONFacetJoinDomain_collection_shard1_replica_n1 ] o.a.s.u.p.LogUpdateProcessorFactory [org.apache.solr.search.facet.TestCloudJSONFacetJoinDomain_collection_shard1_replica_n1]  webapp=/solr path=/update params={wt=javabin&version=2}{add=[70 (1643234670167457792)]} 0 0
   [junit4]   2> 1761755 INFO  (qtp1959840632-24175) [n:127.0.0.1:37373_solr c:org.apache.solr.search.facet.TestCloudJSONFacetJoinDomain_collection s:shard1 r:core_node2 x:org.apache.solr.search.facet.TestCloudJSONFacetJoinDomain_collection_shard1_replica_n1 ] o.a.s.u.p.LogUpdateProcessorFactory [org.apache.solr.search.facet.TestCloudJSONFacetJoinDomain_collection_shard1_replica_n1]  webapp=/solr path=/update params={wt=javabin&version=2}{add=[71 (1643234670168506368)]} 0 0
   [junit4]   2> 1761756 INFO  (qtp1959840632-24177) [n:127.0.0.1:37373_solr c:org.apache.solr.search.facet.TestCloudJSONFacetJoinDomain_collection s:shard1 r:core_node2 x:org.apache.solr.search.facet.TestCloudJSONFacetJoinDomain_collection_shard1_replica_n1 ] o.a.s.u.p.LogUpdateProcessorFactory [org.apache.solr.search.facet.TestCloudJSONFacetJoinDomain_collection_shard1_replica_n1]  webapp=/solr path=/update params={wt=javabin&version=2}{add=[72 (1643234670169554944)]} 0 0
   [junit4]   2> 1761757 INFO  (qtp1959840632-24178) [n:127.0.0.1:37373_solr c:org.apache.solr.search.facet.TestCloudJSONFacetJoinDomain_collection s:shard1 r:core_node2 x:org.apache.solr.search.facet.TestCloudJSONFacetJoinDomain_collection_shard1_replica_n1 ] o.a.s.u.p.LogUpdateProcessorFactory [org.apache.solr.search.facet.TestCloudJSONFacetJoinDomain_collection_shard1_replica_n1]  webapp=/solr path=/update params={wt=javabin&version=2}{add=[73 (1643234670170603520)]} 0 0
   [junit4]   2> 1761758 INFO  (qtp1959840632-24176) [n:127.0.0.1:37373_solr c:org.apache.solr.search.facet.TestCloudJSONFacetJoinDomain_collection s:shard1 r:core_node2 x:org.apache.solr.search.facet.TestCloudJSONFacetJoinDomain_collection_shard1_replica_n1 ] o.a.s.u.DirectUpdateHandler2 start commit{_version_=1643234670172700672,optimize=false,openSearcher=true,waitSearcher=true,expungeDeletes=false,softCommit=false,prepareCommit=false}
   [junit4]   2> 1761758 INFO  (qtp1959840632-24176) [n:127.0.0.1:37373_solr c:org.apache.solr.search.facet.TestCloudJSONFacetJoinDomain_collection s:shard1 r:core_node2 x:org.apache.solr.search.facet.TestCloudJSONFacetJoinDomain_collection_shard1_replica_n1 ] o.a.s.u.SolrIndexWriter Calling setCommitData with IW:org.apache.solr.update.SolrIndexWriter@50dae0e2 commitCommandVersion:1643234670172700672
   [junit4]   2> 1761768 INFO  (OverseerCollectionConfigSetProcessor-72289086253563909-127.0.0.1:37373_solr-n_0000000000) [n:127.0.0.1:37373_solr     ] o.a.s.c.OverseerTaskQueue Response ZK path: /overseer/collection-queue-work/qnr-0000000000 doesn't exist.  Requestor may have disconnected from ZooKeeper
   [junit4]   2> 1761849 INFO  (qtp1959840632-24176) [n:127.0.0.1:37373_solr c:org.apache.solr.search.facet.TestCloudJSONFacetJoinDomain_collection s:shard1 r:core_node2 x:org.apache.solr.search.facet.TestCloudJSONFacetJoinDomain_collection_shard1_replica_n1 ] o.a.s.s.SolrIndexSearcher Opening [Searcher@7c8390df[org.apache.solr.search.facet.TestCloudJSONFacetJoinDomain_collection_shard1_replica_n1] main]
   [junit4]   2> 1761850 INFO  (qtp1959840632-24176) [n:127.0.0.1:37373_solr c:org.apache.solr.search.facet.TestCloudJSONFacetJoinDomain_collection s:shard1 r:core_node2 x:org.apache.solr.search.facet.TestCloudJSONFacetJoinDomain_collection_shard1_replica_n1 ] o.a.s.u.DirectUpdateHandler2 end_commit_flush
   [junit4]   2> 1761858 INFO  (searcherExecutor-7178-thread-1-processing-n:127.0.0.1:37373_solr x:org.apache.solr.search.facet.TestCloudJSONFacetJoinDomain_collection_shard1_replica_n1 c:org.apache.solr.search.facet.TestCloudJSONFacetJoinDomain_collection s:shard1 r:core_node2) [n:127.0.0.1:37373_solr c:org.apache.solr.search.facet.TestCloudJSONFacetJoinDomain_collection s:shard1 r:core_node2 x:org.apache.solr.search.facet.TestCloudJSONFacetJoinDomain_collection_shard1_replica_n1 ] o.a.s.c.SolrCore [org.apache.solr.search.facet.TestCloudJSONFacetJoinDomain_collection_shard1_replica_n1] Registered new searcher Searcher@7c8390df[org.apache.solr.search.facet.TestCloudJSONFacetJoinDomain_collection_shard1_replica_n1] main{ExitableDirectoryReader(UninvertingDirectoryReader(Uninverting(_0(9.0.0):c74:[diagnostics={timestamp=1567110700858, java.version=11.0.1, java.vm.version=11.0.1+13-LTS, lucene.version=9.0.0, source=flush, os.arch=amd64, java.runtime.version=11.0.1+13-LTS, os.version=4.15.0-54-generic, os=Linux, java.vendor=Oracle Corporation}]:[attributes={Lucene50StoredFieldsFormat.mode=BEST_COMPRESSION}])))}
   [junit4]   2> 1761858 INFO  (qtp1959840632-24176) [n:127.0.0.1:37373_solr c:org.apache.solr.search.facet.TestCloudJSONFacetJoinDomain_collection s:shard1 r:core_node2 x:org.apache.solr.search.facet.TestCloudJSONFacetJoinDomain_collection_shard1_replica_n1 ] o.a.s.u.p.LogUpdateProcessorFactory [org.apache.solr.search.facet.TestCloudJSONFacetJoinDomain_collection_shard1_replica_n1]  webapp=/solr path=/update params={_stateVer_=org.apache.solr.search.facet.TestCloudJSONFacetJoinDomain_collection:4&waitSearcher=true&commit=true&softCommit=false&wt=javabin&version=2}{commit=} 0 100
   [junit4]   2> 1761862 INFO  (qtp1959840632-24179) [n:127.0.0.1:37373_solr c:org.apache.solr.search.facet.TestCloudJSONFacetJoinDomain_collection s:shard1 r:core_node2 x:org.apache.solr.search.facet.TestCloudJSONFacetJoinDomain_collection_shard1_replica_n1 ] o.a.s.u.p.LogUpdateProcessorFactory [org.apache.solr.search.facet.TestCloudJSONFacetJoinDomain_collection_shard1_replica_n1]  webapp=/solr path=/update params={wt=javabin&version=2}{add=[74 (1643234670279655424)]} 0 2
   [junit4]   2> 1761864 INFO  (qtp1959840632-24175) [n:127.0.0.1:37373_solr c:org.apache.solr.search.facet.TestCloudJSONFacetJoinDomain_collection s:shard1 r:core_node2 x:org.apache.solr.search.facet.TestCloudJSONFacetJoinDomain_collection_shard1_replica_n1 ] o.a.s.u.p.LogUpdateProcessorFactory [org.apache.solr.search.facet.TestCloudJSONFacetJoinDomain_collection_shard1_replica_n1]  webapp=/solr path=/update params={wt=javabin&version=2}{add=[75 (1643234670283849728)]} 0 0
   [junit4]   2> 1761870 INFO  (qtp1959840632-24177) [n:127.0.0.1:37373_solr c:org.apache.solr.search.facet.TestCloudJSONFacetJoinDomain_collection s:shard1 r:core_node2 x:org.apache.solr.search.facet.TestCloudJSONFacetJoinDomain_collection_shard1_replica_n1 ] o.a.s.u.p.LogUpdateProcessorFactory [org.apache.solr.search.facet.TestCloudJSONFacetJoinDomain_collection_shard1_replica_n1]  webapp=/solr path=/update params={wt=javabin&version=2}{add=[76 (1643234670290141184)]} 0 0
   [junit4]   2> 1761874 INFO  (qtp1959840632-24178) [n:127.0.0.1:37373_solr c:org.apache.solr.search.facet.TestCloudJSONFacetJoinDomain_collection s:shard1 r:core_node2 x:org.apache.solr.search.facet.TestCloudJSONFacetJoinDomain_collection_shard1_replica_n1 ] o.a.s.u.p.LogUpdateProcessorFactory [org.apache.solr.search.facet.TestCloudJSONFacetJoinDomain_collection_shard1_replica_n1]  webapp=/solr path=/update params={wt=javabin&version=2}{add=[77 (1643234670294335488)]} 0 0
   [junit4]   2> 1761876 INFO  (qtp1959840632-24176) [n:127.0.0.1:37373_solr c:org.apache.solr.search.facet.TestCloudJSONFacetJoinDomain_collection s:shard1 r:core_node2 x:org.apache.solr.search.facet.TestCloudJSONFacetJoinDomain_collection_shard1_replica_n1 ] o.a.s.u.p.LogUpdateProcessorFactory [org.apache.solr.search.facet.TestCloudJSONFacetJoinDomain_collection_shard1_replica_n1]  webapp=/solr path=/update params={wt=javabin&version=2}{add=[78 (1643234670296432640)]} 0 0
   [junit4]   2> 1761877 INFO  (qtp1959840632-24179) [n:127.0.0.1:37373_solr c:org.apache.solr.search.facet.TestCloudJSONFacetJoinDomain_collection s:shard1 r:core_node2 x:org.apache.solr.search.facet.TestCloudJSONFacetJoinDomain_collection_shard1_replica_n1 ] o.a.s.u.p.LogUpdateProcessorFactory [org.apache.solr.search.facet.TestCloudJSONFacetJoinDomain_collection_shard1_replica_n1]  webapp=/solr path=/update params={wt=javabin&version=2}{add=[79 (1643234670297481216)]} 0 0
   [junit4]   2> 1761879 INFO  (qtp1959840632-24175) [n:127.0.0.1:37373_solr c:org.apache.solr.search.facet.TestCloudJSONFacetJoinDomain_collection s:shard1 r:core_node2 x:org.apache.solr.search.facet.TestCloudJSONFacetJoinDomain_collection_shard1_replica_n1 ] o.a.s.u.p.LogUpdateProcessorFactory [org.apache.solr.search.facet.TestCloudJSONFacetJoinDomain_collection_shard1_replica_n1]  webapp=/solr path=/update params={wt=javabin&version=2}{add=[80 (1643234670298529792)]} 0 0
   [junit4]   2> 1761880 INFO  (qtp1959840632-24177) [n:127.0.0.1:37373_solr c:org.apache.solr.search.facet.TestCloudJSONFacetJoinDomain_collection s:shard1 r:core_node2 x:org.apache.solr.search.facet.TestCloudJSONFacetJoinDomain_collection_shard1_replica_n1 ] o.a.s.u.p.LogUpdateProcessorFactory [org.apache.solr.search.facet.TestCloudJSONFacetJoinDomain_collection_shard1_replica_n1]  webapp=/solr path=/update params={wt=javabin&version=2}{add=[81 (1643234670299578368)]} 0 0
   [junit4]   2> 1761881 INFO  (qtp1959840632-24178) [n:127.0.0.1:37373_solr c:org.apache.solr.search.facet.TestCloudJSONFacetJoinDomain_collection s:shard1 r:core_node2 x:org.apache.solr.search.facet.TestCloudJSONFacetJoinDomain_collection_shard1_replica_n1 ] o.a.s.u.p.LogUpdateProcessorFactory [org.apache.solr.search.

[...truncated too long message...]

e/workspace/Lucene-Solr-Tests-master/lucene/top-level-ivy-settings.xml

resolve:

ivy-availability-check:
[loadresource] Do not set property disallowed.ivy.jars.list as its length is 0.

-ivy-fail-disallowed-ivy-version:

ivy-fail:

ivy-configure:
[ivy:configure] :: loading settings :: file = /home/jenkins/jenkins-slave/workspace/Lucene-Solr-Tests-master/lucene/top-level-ivy-settings.xml

resolve:

ivy-availability-check:
[loadresource] Do not set property disallowed.ivy.jars.list as its length is 0.

-ivy-fail-disallowed-ivy-version:

ivy-fail:

ivy-fail:

ivy-configure:
[ivy:configure] :: loading settings :: file = /home/jenkins/jenkins-slave/workspace/Lucene-Solr-Tests-master/lucene/top-level-ivy-settings.xml

resolve:

ivy-availability-check:
[loadresource] Do not set property disallowed.ivy.jars.list as its length is 0.

-ivy-fail-disallowed-ivy-version:

ivy-fail:

ivy-configure:
[ivy:configure] :: loading settings :: file = /home/jenkins/jenkins-slave/workspace/Lucene-Solr-Tests-master/lucene/top-level-ivy-settings.xml

resolve:

ivy-availability-check:
[loadresource] Do not set property disallowed.ivy.jars.list as its length is 0.

-ivy-fail-disallowed-ivy-version:

ivy-fail:

ivy-fail:

ivy-configure:
[ivy:configure] :: loading settings :: file = /home/jenkins/jenkins-slave/workspace/Lucene-Solr-Tests-master/lucene/top-level-ivy-settings.xml

resolve:

ivy-availability-check:
[loadresource] Do not set property disallowed.ivy.jars.list as its length is 0.

-ivy-fail-disallowed-ivy-version:

ivy-fail:

ivy-fail:

ivy-configure:
[ivy:configure] :: loading settings :: file = /home/jenkins/jenkins-slave/workspace/Lucene-Solr-Tests-master/lucene/top-level-ivy-settings.xml

resolve:

ivy-availability-check:
[loadresource] Do not set property disallowed.ivy.jars.list as its length is 0.

-ivy-fail-disallowed-ivy-version:

ivy-fail:

ivy-fail:

ivy-configure:
[ivy:configure] :: loading settings :: file = /home/jenkins/jenkins-slave/workspace/Lucene-Solr-Tests-master/lucene/top-level-ivy-settings.xml

resolve:

ivy-availability-check:
[loadresource] Do not set property disallowed.ivy.jars.list as its length is 0.

-ivy-fail-disallowed-ivy-version:

ivy-fail:

ivy-fail:

ivy-configure:
[ivy:configure] :: loading settings :: file = /home/jenkins/jenkins-slave/workspace/Lucene-Solr-Tests-master/lucene/top-level-ivy-settings.xml

resolve:

ivy-availability-check:
[loadresource] Do not set property disallowed.ivy.jars.list as its length is 0.

-ivy-fail-disallowed-ivy-version:

ivy-fail:

ivy-fail:

ivy-configure:
[ivy:configure] :: loading settings :: file = /home/jenkins/jenkins-slave/workspace/Lucene-Solr-Tests-master/lucene/top-level-ivy-settings.xml

resolve:

ivy-availability-check:
[loadresource] Do not set property disallowed.ivy.jars.list as its length is 0.

-ivy-fail-disallowed-ivy-version:

ivy-fail:

ivy-fail:

ivy-configure:
[ivy:configure] :: loading settings :: file = /home/jenkins/jenkins-slave/workspace/Lucene-Solr-Tests-master/lucene/top-level-ivy-settings.xml

resolve:

ivy-availability-check:
[loadresource] Do not set property disallowed.ivy.jars.list as its length is 0.

-ivy-fail-disallowed-ivy-version:

ivy-fail:

ivy-fail:

ivy-configure:
[ivy:configure] :: loading settings :: file = /home/jenkins/jenkins-slave/workspace/Lucene-Solr-Tests-master/lucene/top-level-ivy-settings.xml

resolve:

ivy-availability-check:
[loadresource] Do not set property disallowed.ivy.jars.list as its length is 0.

-ivy-fail-disallowed-ivy-version:

ivy-fail:

ivy-fail:

ivy-configure:
[ivy:configure] :: loading settings :: file = /home/jenkins/jenkins-slave/workspace/Lucene-Solr-Tests-master/lucene/top-level-ivy-settings.xml

resolve:

ivy-availability-check:
[loadresource] Do not set property disallowed.ivy.jars.list as its length is 0.

-ivy-fail-disallowed-ivy-version:

ivy-fail:

ivy-fail:

ivy-configure:
[ivy:configure] :: loading settings :: file = /home/jenkins/jenkins-slave/workspace/Lucene-Solr-Tests-master/lucene/top-level-ivy-settings.xml

resolve:

ivy-availability-check:
[loadresource] Do not set property disallowed.ivy.jars.list as its length is 0.

-ivy-fail-disallowed-ivy-version:

ivy-fail:

ivy-fail:

ivy-configure:
[ivy:configure] :: loading settings :: file = /home/jenkins/jenkins-slave/workspace/Lucene-Solr-Tests-master/lucene/top-level-ivy-settings.xml

resolve:

ivy-availability-check:
[loadresource] Do not set property disallowed.ivy.jars.list as its length is 0.

-ivy-fail-disallowed-ivy-version:

ivy-fail:

ivy-fail:

ivy-configure:
[ivy:configure] :: loading settings :: file = /home/jenkins/jenkins-slave/workspace/Lucene-Solr-Tests-master/lucene/top-level-ivy-settings.xml

resolve:

jar-checksums:
    [mkdir] Created dir: /home/jenkins/jenkins-slave/workspace/Lucene-Solr-Tests-master/solr/null522332938
     [copy] Copying 249 files to /home/jenkins/jenkins-slave/workspace/Lucene-Solr-Tests-master/solr/null522332938
   [delete] Deleting directory /home/jenkins/jenkins-slave/workspace/Lucene-Solr-Tests-master/solr/null522332938

check-working-copy:
[ivy:cachepath] :: resolving dependencies :: #;working@lucene1-us-west
[ivy:cachepath] confs: [default]
[ivy:cachepath] found org.eclipse.jgit#org.eclipse.jgit;5.3.0.201903130848-r in public
[ivy:cachepath] found com.jcraft#jsch;0.1.54 in public
[ivy:cachepath] found com.jcraft#jzlib;1.1.1 in public
[ivy:cachepath] found com.googlecode.javaewah#JavaEWAH;1.1.6 in public
[ivy:cachepath] found org.slf4j#slf4j-api;1.7.2 in public
[ivy:cachepath] found org.bouncycastle#bcpg-jdk15on;1.60 in public
[ivy:cachepath] found org.bouncycastle#bcprov-jdk15on;1.60 in public
[ivy:cachepath] found org.bouncycastle#bcpkix-jdk15on;1.60 in public
[ivy:cachepath] found org.slf4j#slf4j-nop;1.7.2 in public
[ivy:cachepath] :: resolution report :: resolve 51ms :: artifacts dl 6ms
        ---------------------------------------------------------------------
        |                  |            modules            ||   artifacts   |
        |       conf       | number| search|dwnlded|evicted|| number|dwnlded|
        ---------------------------------------------------------------------
        |      default     |   9   |   0   |   0   |   0   ||   9   |   0   |
        ---------------------------------------------------------------------
[wc-checker] Initializing working copy...
[wc-checker] Checking working copy status...

-jenkins-base:

BUILD SUCCESSFUL
Total time: 107 minutes 21 seconds
Archiving artifacts
java.lang.InterruptedException: no matches found within 10000
        at hudson.FilePath$ValidateAntFileMask.hasMatch(FilePath.java:2847)
        at hudson.FilePath$ValidateAntFileMask.invoke(FilePath.java:2726)
        at hudson.FilePath$ValidateAntFileMask.invoke(FilePath.java:2707)
        at hudson.FilePath$FileCallableWrapper.call(FilePath.java:3086)
Also:   hudson.remoting.Channel$CallSiteStackTrace: Remote call to lucene
                at hudson.remoting.Channel.attachCallSiteStackTrace(Channel.java:1741)
                at hudson.remoting.UserRequest$ExceptionResponse.retrieve(UserRequest.java:357)
                at hudson.remoting.Channel.call(Channel.java:955)
                at hudson.FilePath.act(FilePath.java:1072)
                at hudson.FilePath.act(FilePath.java:1061)
                at hudson.FilePath.validateAntFileMask(FilePath.java:2705)
                at hudson.tasks.ArtifactArchiver.perform(ArtifactArchiver.java:243)
                at hudson.tasks.BuildStepCompatibilityLayer.perform(BuildStepCompatibilityLayer.java:81)
                at hudson.tasks.BuildStepMonitor$1.perform(BuildStepMonitor.java:20)
                at hudson.model.AbstractBuild$AbstractBuildExecution.perform(AbstractBuild.java:744)
                at hudson.model.AbstractBuild$AbstractBuildExecution.performAllBuildSteps(AbstractBuild.java:690)
                at hudson.model.Build$BuildExecution.post2(Build.java:186)
                at hudson.model.AbstractBuild$AbstractBuildExecution.post(AbstractBuild.java:635)
                at hudson.model.Run.execute(Run.java:1835)
                at hudson.model.FreeStyleBuild.run(FreeStyleBuild.java:43)
                at hudson.model.ResourceController.execute(ResourceController.java:97)
                at hudson.model.Executor.run(Executor.java:429)
Caused: hudson.FilePath$TunneledInterruptedException
        at hudson.FilePath$FileCallableWrapper.call(FilePath.java:3088)
        at hudson.remoting.UserRequest.perform(UserRequest.java:212)
        at hudson.remoting.UserRequest.perform(UserRequest.java:54)
        at hudson.remoting.Request$2.run(Request.java:369)
        at hudson.remoting.InterceptingExecutorService$1.call(InterceptingExecutorService.java:72)
        at java.util.concurrent.FutureTask.run(FutureTask.java:266)
        at java.util.concurrent.ThreadPoolExecutor.runWorker(ThreadPoolExecutor.java:1142)
        at java.util.concurrent.ThreadPoolExecutor$Worker.run(ThreadPoolExecutor.java:617)
        at java.lang.Thread.run(Thread.java:744)
Caused: java.lang.InterruptedException: java.lang.InterruptedException: no matches found within 10000
        at hudson.FilePath.act(FilePath.java:1074)
        at hudson.FilePath.act(FilePath.java:1061)
        at hudson.FilePath.validateAntFileMask(FilePath.java:2705)
        at hudson.tasks.ArtifactArchiver.perform(ArtifactArchiver.java:243)
        at hudson.tasks.BuildStepCompatibilityLayer.perform(BuildStepCompatibilityLayer.java:81)
        at hudson.tasks.BuildStepMonitor$1.perform(BuildStepMonitor.java:20)
        at hudson.model.AbstractBuild$AbstractBuildExecution.perform(AbstractBuild.java:744)
        at hudson.model.AbstractBuild$AbstractBuildExecution.performAllBuildSteps(AbstractBuild.java:690)
        at hudson.model.Build$BuildExecution.post2(Build.java:186)
        at hudson.model.AbstractBuild$AbstractBuildExecution.post(AbstractBuild.java:635)
        at hudson.model.Run.execute(Run.java:1835)
        at hudson.model.FreeStyleBuild.run(FreeStyleBuild.java:43)
        at hudson.model.ResourceController.execute(ResourceController.java:97)
        at hudson.model.Executor.run(Executor.java:429)
No artifacts found that match the file pattern "**/*.events,heapdumps/**,**/hs_err_pid*". Configuration error?
Recording test results
Build step 'Publish JUnit test result report' changed build result to UNSTABLE
Email was triggered for: Unstable (Test Failures)
Sending email for trigger: Unstable (Test Failures)


---------------------------------------------------------------------
To unsubscribe, e-mail: [hidden email]
For additional commands, e-mail: [hidden email]
Reply | Threaded
Open this post in threaded view
|

[JENKINS] Lucene-Solr-Tests-master - Build # 3647 - Failure

Apache Jenkins Server-2
Build: https://builds.apache.org/job/Lucene-Solr-Tests-master/3647/

All tests passed

Build Log:
[...truncated 63887 lines...]
-ecj-javadoc-lint-src:
    [mkdir] Created dir: /tmp/ecj24631864
 [ecj-lint] Compiling 1289 source files to /tmp/ecj24631864
 [ecj-lint] Processing annotations
 [ecj-lint] Annotations processed
 [ecj-lint] Processing annotations
 [ecj-lint] No elements to process
 [ecj-lint] invalid Class-Path header in manifest of jar file: /home/jenkins/.ivy2/cache/org.restlet.jee/org.restlet/jars/org.restlet-2.3.0.jar
 [ecj-lint] invalid Class-Path header in manifest of jar file: /home/jenkins/.ivy2/cache/org.restlet.jee/org.restlet.ext.servlet/jars/org.restlet.ext.servlet-2.3.0.jar
 [ecj-lint] ----------
 [ecj-lint] 1. WARNING in /home/jenkins/jenkins-slave/workspace/Lucene-Solr-Tests-master/solr/core/src/java/org/apache/solr/client/solrj/embedded/EmbeddedSolrServer.java (at line 219)
 [ecj-lint] return (NamedList<Object>) new JavaBinCodec(resolver).unmarshal(in);
 [ecj-lint]                           ^^^^^^^^^^^^^^^^^^^^^^^^^^
 [ecj-lint] Resource leak: '<unassigned Closeable value>' is never closed
 [ecj-lint] ----------
 [ecj-lint] ----------
 [ecj-lint] 2. WARNING in /home/jenkins/jenkins-slave/workspace/Lucene-Solr-Tests-master/solr/core/src/java/org/apache/solr/cloud/RecoveryStrategy.java (at line 232)
 [ecj-lint] ReplicationHandler replicationHandler = (ReplicationHandler) handler;
 [ecj-lint]                   ^^^^^^^^^^^^^^^^^^
 [ecj-lint] Resource leak: 'replicationHandler' is never closed
 [ecj-lint] ----------
 [ecj-lint] 3. WARNING in /home/jenkins/jenkins-slave/workspace/Lucene-Solr-Tests-master/solr/core/src/java/org/apache/solr/cloud/RecoveryStrategy.java (at line 628)
 [ecj-lint] PeerSyncWithLeader peerSyncWithLeader = new PeerSyncWithLeader(core,
 [ecj-lint]                   ^^^^^^^^^^^^^^^^^^
 [ecj-lint] Resource leak: 'peerSyncWithLeader' is never closed
 [ecj-lint] ----------
 [ecj-lint] ----------
 [ecj-lint] 4. WARNING in /home/jenkins/jenkins-slave/workspace/Lucene-Solr-Tests-master/solr/core/src/java/org/apache/solr/cloud/SyncStrategy.java (at line 186)
 [ecj-lint] PeerSync peerSync = new PeerSync(core, syncWith, core.getUpdateHandler().getUpdateLog().getNumRecordsToKeep(), true, peerSyncOnlyWithActive, false);
 [ecj-lint]         ^^^^^^^^
 [ecj-lint] Resource leak: 'peerSync' is never closed
 [ecj-lint] ----------
 [ecj-lint] ----------
 [ecj-lint] 5. WARNING in /home/jenkins/jenkins-slave/workspace/Lucene-Solr-Tests-master/solr/core/src/java/org/apache/solr/cloud/autoscaling/sim/SimCloudManager.java (at line 788)
 [ecj-lint] throw new UnsupportedOperationException("must add at least 1 node first");
 [ecj-lint] ^^^^^^^^^^^^^^^^^^^^^^^^^^^^^^^^^^^^^^^^^^^^^^^^^^^^^^^^^^^^^^^^^^^^^^^^^^
 [ecj-lint] Resource leak: 'queryRequest' is not closed at this location
 [ecj-lint] ----------
 [ecj-lint] 6. WARNING in /home/jenkins/jenkins-slave/workspace/Lucene-Solr-Tests-master/solr/core/src/java/org/apache/solr/cloud/autoscaling/sim/SimCloudManager.java (at line 794)
 [ecj-lint] throw new UnsupportedOperationException("must add at least 1 node first");
 [ecj-lint] ^^^^^^^^^^^^^^^^^^^^^^^^^^^^^^^^^^^^^^^^^^^^^^^^^^^^^^^^^^^^^^^^^^^^^^^^^^
 [ecj-lint] Resource leak: 'queryRequest' is not closed at this location
 [ecj-lint] ----------
 [ecj-lint] ----------
 [ecj-lint] 7. WARNING in /home/jenkins/jenkins-slave/workspace/Lucene-Solr-Tests-master/solr/core/src/java/org/apache/solr/core/CoreContainer.java (at line 726)
 [ecj-lint] SolrFieldCacheBean fieldCacheBean = new SolrFieldCacheBean();
 [ecj-lint]                   ^^^^^^^^^^^^^^
 [ecj-lint] Resource leak: 'fieldCacheBean' is never closed
 [ecj-lint] ----------
 [ecj-lint] ----------
 [ecj-lint] 8. ERROR in /home/jenkins/jenkins-slave/workspace/Lucene-Solr-Tests-master/solr/core/src/java/org/apache/solr/core/SolrResourceLoader.java (at line 19)
 [ecj-lint] import javax.naming.Context;
 [ecj-lint]       ^^^^^^^^^^^^^^^^^^^^
 [ecj-lint] The type javax.naming.Context is not accessible
 [ecj-lint] ----------
 [ecj-lint] 9. ERROR in /home/jenkins/jenkins-slave/workspace/Lucene-Solr-Tests-master/solr/core/src/java/org/apache/solr/core/SolrResourceLoader.java (at line 20)
 [ecj-lint] import javax.naming.InitialContext;
 [ecj-lint]       ^^^^^^^^^^^^^^^^^^^^^^^^^^^
 [ecj-lint] The type javax.naming.InitialContext is not accessible
 [ecj-lint] ----------
 [ecj-lint] 10. ERROR in /home/jenkins/jenkins-slave/workspace/Lucene-Solr-Tests-master/solr/core/src/java/org/apache/solr/core/SolrResourceLoader.java (at line 21)
 [ecj-lint] import javax.naming.NamingException;
 [ecj-lint]       ^^^^^^^^^^^^^^^^^^^^^^^^^^^^
 [ecj-lint] The type javax.naming.NamingException is not accessible
 [ecj-lint] ----------
 [ecj-lint] 11. ERROR in /home/jenkins/jenkins-slave/workspace/Lucene-Solr-Tests-master/solr/core/src/java/org/apache/solr/core/SolrResourceLoader.java (at line 22)
 [ecj-lint] import javax.naming.NoInitialContextException;
 [ecj-lint]       ^^^^^^^^^^^^^^^^^^^^^^^^^^^^^^^^^^^^^^
 [ecj-lint] The type javax.naming.NoInitialContextException is not accessible
 [ecj-lint] ----------
 [ecj-lint] 12. ERROR in /home/jenkins/jenkins-slave/workspace/Lucene-Solr-Tests-master/solr/core/src/java/org/apache/solr/core/SolrResourceLoader.java (at line 776)
 [ecj-lint] Context c = new InitialContext();
 [ecj-lint] ^^^^^^^
 [ecj-lint] Context cannot be resolved to a type
 [ecj-lint] ----------
 [ecj-lint] 13. ERROR in /home/jenkins/jenkins-slave/workspace/Lucene-Solr-Tests-master/solr/core/src/java/org/apache/solr/core/SolrResourceLoader.java (at line 776)
 [ecj-lint] Context c = new InitialContext();
 [ecj-lint]                ^^^^^^^^^^^^^^
 [ecj-lint] InitialContext cannot be resolved to a type
 [ecj-lint] ----------
 [ecj-lint] 14. ERROR in /home/jenkins/jenkins-slave/workspace/Lucene-Solr-Tests-master/solr/core/src/java/org/apache/solr/core/SolrResourceLoader.java (at line 779)
 [ecj-lint] } catch (NoInitialContextException e) {
 [ecj-lint]         ^^^^^^^^^^^^^^^^^^^^^^^^^
 [ecj-lint] NoInitialContextException cannot be resolved to a type
 [ecj-lint] ----------
 [ecj-lint] 15. ERROR in /home/jenkins/jenkins-slave/workspace/Lucene-Solr-Tests-master/solr/core/src/java/org/apache/solr/core/SolrResourceLoader.java (at line 781)
 [ecj-lint] } catch (NamingException e) {
 [ecj-lint]         ^^^^^^^^^^^^^^^
 [ecj-lint] NamingException cannot be resolved to a type
 [ecj-lint] ----------
 [ecj-lint] ----------
 [ecj-lint] 16. WARNING in /home/jenkins/jenkins-slave/workspace/Lucene-Solr-Tests-master/solr/core/src/java/org/apache/solr/handler/CdcrRequestHandler.java (at line 741)
 [ecj-lint] ReplicationHandler replicationHandler = (ReplicationHandler) handler;
 [ecj-lint]                   ^^^^^^^^^^^^^^^^^^
 [ecj-lint] Resource leak: 'replicationHandler' is never closed
 [ecj-lint] ----------
 [ecj-lint] 17. WARNING in /home/jenkins/jenkins-slave/workspace/Lucene-Solr-Tests-master/solr/core/src/java/org/apache/solr/handler/CdcrRequestHandler.java (at line 760)
 [ecj-lint] ReplicationHandler replicationHandler = (ReplicationHandler) handler;
 [ecj-lint]                   ^^^^^^^^^^^^^^^^^^
 [ecj-lint] Resource leak: 'replicationHandler' is never closed
 [ecj-lint] ----------
 [ecj-lint] ----------
 [ecj-lint] 18. WARNING in /home/jenkins/jenkins-slave/workspace/Lucene-Solr-Tests-master/solr/core/src/java/org/apache/solr/handler/SolrConfigHandler.java (at line 819)
 [ecj-lint] new RuntimeLib(req.getCore().getCoreContainer()).init(new PluginInfo(info.tag, op.getDataMap()));
 [ecj-lint] ^^^^^^^^^^^^^^^^^^^^^^^^^^^^^^^^^^^^^^^^^^^^^^^^
 [ecj-lint] Resource leak: '<unassigned Closeable value>' is never closed
 [ecj-lint] ----------
 [ecj-lint] ----------
 [ecj-lint] 19. WARNING in /home/jenkins/jenkins-slave/workspace/Lucene-Solr-Tests-master/solr/core/src/java/org/apache/solr/handler/admin/CollectionHandlerApi.java (at line 207)
 [ecj-lint] RuntimeLib lib = new RuntimeLib(handler.handler.coreContainer);
 [ecj-lint]           ^^^
 [ecj-lint] Resource leak: 'lib' is never closed
 [ecj-lint] ----------
 [ecj-lint] ----------
 [ecj-lint] 20. WARNING in /home/jenkins/jenkins-slave/workspace/Lucene-Solr-Tests-master/solr/core/src/java/org/apache/solr/handler/admin/SegmentsInfoRequestHandler.java (at line 244)
 [ecj-lint] leafReader = ((FilterLeafReader)leafReader).getDelegate();
 [ecj-lint] ^^^^^^^^^^^^^^^^^^^^^^^^^^^^^^^^^^^^^^^^^^^^^^^^^^^^^^^^^
 [ecj-lint] Resource leak: 'leafReader' is not closed at this location
 [ecj-lint] ----------
 [ecj-lint] ----------
 [ecj-lint] 21. WARNING in /home/jenkins/jenkins-slave/workspace/Lucene-Solr-Tests-master/solr/core/src/java/org/apache/solr/handler/component/HttpShardHandler.java (at line 148)
 [ecj-lint] return new JavaBinCodec(null, stringCache).setReadStringAsCharSeq(true);
 [ecj-lint]       ^^^^^^^^^^^^^^^^^^^^^^^^^^^^^^^^^^^
 [ecj-lint] Resource leak: '<unassigned Closeable value>' is never closed
 [ecj-lint] ----------
 [ecj-lint] ----------
 [ecj-lint] 22. WARNING in /home/jenkins/jenkins-slave/workspace/Lucene-Solr-Tests-master/solr/core/src/java/org/apache/solr/handler/component/HttpShardHandlerFactory.java (at line 637)
 [ecj-lint] ZkController zkController = core == null ? null : core.getCoreContainer().getZkController();
 [ecj-lint]             ^^^^^^^^^^^^
 [ecj-lint] Resource leak: 'zkController' is never closed
 [ecj-lint] ----------
 [ecj-lint] ----------
 [ecj-lint] 23. WARNING in /home/jenkins/jenkins-slave/workspace/Lucene-Solr-Tests-master/solr/core/src/java/org/apache/solr/handler/component/RealTimeGetComponent.java (at line 1118)
 [ecj-lint] PeerSyncWithLeader peerSync = new PeerSyncWithLeader(rb.req.getCore(), syncWithLeader, nVersions);
 [ecj-lint]                   ^^^^^^^^
 [ecj-lint] Resource leak: 'peerSync' is never closed
 [ecj-lint] ----------
 [ecj-lint] 24. WARNING in /home/jenkins/jenkins-slave/workspace/Lucene-Solr-Tests-master/solr/core/src/java/org/apache/solr/handler/component/RealTimeGetComponent.java (at line 1140)
 [ecj-lint] PeerSync peerSync = new PeerSync(rb.req.getCore(), replicas, nVersions, cantReachIsSuccess);
 [ecj-lint]         ^^^^^^^^
 [ecj-lint] Resource leak: 'peerSync' is never closed
 [ecj-lint] ----------
 [ecj-lint] ----------
 [ecj-lint] 25. WARNING in /home/jenkins/jenkins-slave/workspace/Lucene-Solr-Tests-master/solr/core/src/java/org/apache/solr/handler/loader/JavabinLoader.java (at line 137)
 [ecj-lint] new JavaBinCodec() {
 [ecj-lint]       SolrParams params;
 [ecj-lint]       AddUpdateCommand addCmd = null;
 [ecj-lint]
 [ecj-lint]       @Override
 [ecj-lint]       public List<Object> readIterator(DataInputInputStream fis) throws IOException {
 [ecj-lint]         while (true) {
 [ecj-lint]           Object o = readVal(fis);
 [ecj-lint]           if (o == END_OBJ) break;
 [ecj-lint]           if (o instanceof NamedList) {
 [ecj-lint]             params = ((NamedList) o).toSolrParams();
 [ecj-lint]           } else {
 [ecj-lint]             try {
 [ecj-lint]               if (o instanceof byte[]) {
 [ecj-lint]                 if (params != null) req.setParams(params);
 [ecj-lint]                 byte[] buf = (byte[]) o;
 [ecj-lint]                 contentStreamLoader.load(req, rsp, new ContentStreamBase.ByteArrayStream(buf, null), processor);
 [ecj-lint]               } else {
 [ecj-lint]                 throw new RuntimeException("unsupported type ");
 [ecj-lint]               }
 [ecj-lint]             } catch (Exception e) {
 [ecj-lint]               throw new RuntimeException(e);
 [ecj-lint]             } finally {
 [ecj-lint]               params = null;
 [ecj-lint]               req.setParams(old);
 [ecj-lint]             }
 [ecj-lint]           }
 [ecj-lint]         }
 [ecj-lint]         return Collections.emptyList();
 [ecj-lint]       }
 [ecj-lint]
 [ecj-lint]     }.unmarshal(in);
 [ecj-lint] ^^^^^^^^^^^^^^^^^^^^^^^^^^^^^^^^^^^^^^^^^^^^^^^^^^^^^^^^^^^^^^^^^^^^^^^^^^^^^^^^^^^^^^^^^^^^^^^^^^^^^^^^^^^^^^^^^^^^^^^^^^^^^^^^^^^^^^^^^^^^^^^^^^^^^^^^^^^^^^^^^^^^^^^^^^^^^^^^^^^^^^^^^^^^^^^^^^^^^^^^^^^^^^^^^^^^^^^^^^^^^^^^^^^^^^^^^^^^^^^^^^^^^^^^^^^^^^^^^^^^^^^^^^^^^^^^^^^^^^^^^^^^^^^^^^^^^^^^^^^^^^^^^^^^^^^^^^^^^^^^^^^^^^^^^^^^^^^^^^^^^^^^^^^^^^^^^^^^^^^^^^^^^^^^^^^^^^^^^^^^^^^^^^^^^^^^^^^^^^^^^^^^^^^^^^^^^^^^^^^^^^^^^^^^^^^^^^^^^^^^^^^^^^^^^^^^^^^^^^^^^^^^^^^^^^^^^^^^^^^^^^^^^^^^^^^^^^^^^^^^^^^^^^^^^^^^^^^^^^^^^^^^^^^^^^^^^^^^^^^^^^^^^^^^^^^^^^^^^^^^^^^^^^^^^^^^^^^^^^^^^^^^^^^^^^^^^^^^^^^^^^^^^^^^^^^^^^^^^^^^^^^^^^^^^^^^^^^^^^^^^^^^^^^^^^^^^^^^^^^^^^^^^^^^^^^^^^^^^^^^^^^^^^^^^^^^^^^^^^^^^^^^^^^^^^^^^^^^^^^^^^^^^^^^^^^^^^^^^^^^^^^^^^^^^^^^^^^^^^^^^^^^^^^^^^^^^^^^^^^^^^^^^^^^^^^^^^^^^^^^^^^^^^^^^^^^^^^^^^^^^^^^^^^^^^^^^^^^^^^^^^^^^^^^^^^^^^^^^^^^^^^^^^^^^^^^^^^^^^^^^^^^^^^^^^^^^^^^^^^^^^^^^^^^^^^^^^^^^^^^^^^^^^^^^^^^^^^^^^^^^^^^^^^^^^^^^^^^^^^^^^^^^^^^^^^^^^^^^^^^^^^^^^^^^^^^^^^^^^^^^^^^^^^^^^^^^^^^^^^^^^^^^^
 [ecj-lint] Resource leak: '<unassigned Closeable value>' is never closed
 [ecj-lint] ----------
 [ecj-lint] ----------
 [ecj-lint] 26. INFO in /home/jenkins/jenkins-slave/workspace/Lucene-Solr-Tests-master/solr/core/src/java/org/apache/solr/logging/log4j2/Log4j2Watcher.java (at line 187)
 [ecj-lint] if (logger == root || root.equals(logger) || isRootLogger(name) || "".equals(name)) {
 [ecj-lint]                                  ^^^^^^
 [ecj-lint] Unlikely argument type for equals(): Map.Entry<String,LoggerConfig> seems to be unrelated to Logger
 [ecj-lint] ----------
 [ecj-lint] ----------
 [ecj-lint] 27. WARNING in /home/jenkins/jenkins-slave/workspace/Lucene-Solr-Tests-master/solr/core/src/java/org/apache/solr/search/CacheConfig.java (at line 147)
 [ecj-lint] MemClassLoader memClassLoader = (MemClassLoader) loader;
 [ecj-lint]               ^^^^^^^^^^^^^^
 [ecj-lint] Resource leak: 'memClassLoader' is never closed
 [ecj-lint] ----------
 [ecj-lint] ----------
 [ecj-lint] 28. WARNING in /home/jenkins/jenkins-slave/workspace/Lucene-Solr-Tests-master/solr/core/src/java/org/apache/solr/update/SolrIndexSplitter.java (at line 258)
 [ecj-lint] HardlinkCopyDirectoryWrapper hardLinkedDir = new HardlinkCopyDirectoryWrapper(splitDir);
 [ecj-lint]                             ^^^^^^^^^^^^^
 [ecj-lint] Resource leak: 'hardLinkedDir' is never closed
 [ecj-lint] ----------
 [ecj-lint] ----------
 [ecj-lint] 29. WARNING in /home/jenkins/jenkins-slave/workspace/Lucene-Solr-Tests-master/solr/core/src/java/org/apache/solr/util/FileUtils.java (at line 52)
 [ecj-lint] try (FileChannel in = new FileInputStream(src).getChannel();
 [ecj-lint]                      ^^^^^^^^^^^^^^^^^^^^^^^^
 [ecj-lint] Resource leak: '<unassigned Closeable value>' is never closed
 [ecj-lint] ----------
 [ecj-lint] 30. WARNING in /home/jenkins/jenkins-slave/workspace/Lucene-Solr-Tests-master/solr/core/src/java/org/apache/solr/util/FileUtils.java (at line 53)
 [ecj-lint] FileChannel out = new FileOutputStream(destination).getChannel()) {
 [ecj-lint]                  ^^^^^^^^^^^^^^^^^^^^^^^^^^^^^^^^^
 [ecj-lint] Resource leak: '<unassigned Closeable value>' is never closed
 [ecj-lint] ----------
 [ecj-lint] ----------
 [ecj-lint] 31. WARNING in /home/jenkins/jenkins-slave/workspace/Lucene-Solr-Tests-master/solr/core/src/java/org/apache/solr/util/SolrCLI.java (at line 1146)
 [ecj-lint] SnapshotCloudManager snapshotCloudManager = new SnapshotCloudManager(simCloudManager, config);
 [ecj-lint]                     ^^^^^^^^^^^^^^^^^^^^
 [ecj-lint] Resource leak: 'snapshotCloudManager' is never closed
 [ecj-lint] ----------
 [ecj-lint] ----------
 [ecj-lint] 32. WARNING in /home/jenkins/jenkins-slave/workspace/Lucene-Solr-Tests-master/solr/core/src/java/org/apache/solr/util/TestInjection.java (at line 263)
 [ecj-lint] timers.remove(this);
 [ecj-lint]              ^^^^
 [ecj-lint] Unlikely argument type new TimerTask(){} for remove(Object) on a Collection<Timer>
 [ecj-lint] ----------
 [ecj-lint] 32 problems (8 errors, 23 warnings, 1 info)

BUILD FAILED
/home/jenkins/jenkins-slave/workspace/Lucene-Solr-Tests-master/build.xml:634: The following error occurred while executing this line:
/home/jenkins/jenkins-slave/workspace/Lucene-Solr-Tests-master/build.xml:101: The following error occurred while executing this line:
/home/jenkins/jenkins-slave/workspace/Lucene-Solr-Tests-master/solr/build.xml:645: The following error occurred while executing this line:
/home/jenkins/jenkins-slave/workspace/Lucene-Solr-Tests-master/lucene/common-build.xml:2009: The following error occurred while executing this line:
/home/jenkins/jenkins-slave/workspace/Lucene-Solr-Tests-master/lucene/common-build.xml:2048: Compile failed; see the compiler error output for details.

Total time: 102 minutes 40 seconds
Build step 'Invoke Ant' marked build as failure
Archiving artifacts
Recording test results
Email was triggered for: Failure - Any
Sending email for trigger: Failure - Any


---------------------------------------------------------------------
To unsubscribe, e-mail: [hidden email]
For additional commands, e-mail: [hidden email]
Reply | Threaded
Open this post in threaded view
|

[JENKINS] Lucene-Solr-Tests-master - Build # 3648 - Still unstable

Apache Jenkins Server-2
Build: https://builds.apache.org/job/Lucene-Solr-Tests-master/3648/

1 tests failed.
FAILED:  org.apache.solr.schema.TestCloudSchemaless.test

Error Message:
Error from server at http://127.0.0.1:36841/d/collection1: 3 Async exceptions during distributed update:  java.util.concurrent.TimeoutException: idle_timeout java.util.concurrent.TimeoutException: idle_timeout java.util.concurrent.TimeoutException: idle_timeout

Stack Trace:
org.apache.solr.client.solrj.impl.HttpSolrClient$RemoteSolrException: Error from server at http://127.0.0.1:36841/d/collection1: 3 Async exceptions during distributed update:
java.util.concurrent.TimeoutException: idle_timeout
java.util.concurrent.TimeoutException: idle_timeout
java.util.concurrent.TimeoutException: idle_timeout
        at __randomizedtesting.SeedInfo.seed([F4BBC4C798DC9271:7CEFFB1D3620FF89]:0)
        at org.apache.solr.client.solrj.impl.HttpSolrClient.executeMethod(HttpSolrClient.java:656)
        at org.apache.solr.client.solrj.impl.HttpSolrClient.request(HttpSolrClient.java:262)
        at org.apache.solr.client.solrj.impl.HttpSolrClient.request(HttpSolrClient.java:245)
        at org.apache.solr.client.solrj.SolrRequest.process(SolrRequest.java:207)
        at org.apache.solr.client.solrj.SolrClient.add(SolrClient.java:106)
        at org.apache.solr.client.solrj.SolrClient.add(SolrClient.java:71)
        at org.apache.solr.client.solrj.SolrClient.add(SolrClient.java:85)
        at org.apache.solr.schema.TestCloudSchemaless.test(TestCloudSchemaless.java:115)
        at java.base/jdk.internal.reflect.NativeMethodAccessorImpl.invoke0(Native Method)
        at java.base/jdk.internal.reflect.NativeMethodAccessorImpl.invoke(NativeMethodAccessorImpl.java:62)
        at java.base/jdk.internal.reflect.DelegatingMethodAccessorImpl.invoke(DelegatingMethodAccessorImpl.java:43)
        at java.base/java.lang.reflect.Method.invoke(Method.java:566)
        at com.carrotsearch.randomizedtesting.RandomizedRunner.invoke(RandomizedRunner.java:1750)
        at com.carrotsearch.randomizedtesting.RandomizedRunner$8.evaluate(RandomizedRunner.java:938)
        at com.carrotsearch.randomizedtesting.RandomizedRunner$9.evaluate(RandomizedRunner.java:974)
        at com.carrotsearch.randomizedtesting.RandomizedRunner$10.evaluate(RandomizedRunner.java:988)
        at org.apache.solr.BaseDistributedSearchTestCase$ShardsRepeatRule$ShardsFixedStatement.callStatement(BaseDistributedSearchTestCase.java:1082)
        at org.apache.solr.BaseDistributedSearchTestCase$ShardsRepeatRule$ShardsStatement.evaluate(BaseDistributedSearchTestCase.java:1054)
        at com.carrotsearch.randomizedtesting.rules.SystemPropertiesRestoreRule$1.evaluate(SystemPropertiesRestoreRule.java:57)
        at org.apache.lucene.util.TestRuleSetupTeardownChained$1.evaluate(TestRuleSetupTeardownChained.java:49)
        at org.apache.lucene.util.AbstractBeforeAfterRule$1.evaluate(AbstractBeforeAfterRule.java:45)
        at org.apache.lucene.util.TestRuleThreadAndTestName$1.evaluate(TestRuleThreadAndTestName.java:48)
        at org.apache.lucene.util.TestRuleIgnoreAfterMaxFailures$1.evaluate(TestRuleIgnoreAfterMaxFailures.java:64)
        at org.apache.lucene.util.TestRuleMarkFailure$1.evaluate(TestRuleMarkFailure.java:47)
        at com.carrotsearch.randomizedtesting.rules.StatementAdapter.evaluate(StatementAdapter.java:36)
        at com.carrotsearch.randomizedtesting.ThreadLeakControl$StatementRunner.run(ThreadLeakControl.java:368)
        at com.carrotsearch.randomizedtesting.ThreadLeakControl.forkTimeoutingTask(ThreadLeakControl.java:817)
        at com.carrotsearch.randomizedtesting.ThreadLeakControl$3.evaluate(ThreadLeakControl.java:468)
        at com.carrotsearch.randomizedtesting.RandomizedRunner.runSingleTest(RandomizedRunner.java:947)
        at com.carrotsearch.randomizedtesting.RandomizedRunner$5.evaluate(RandomizedRunner.java:832)
        at com.carrotsearch.randomizedtesting.RandomizedRunner$6.evaluate(RandomizedRunner.java:883)
        at com.carrotsearch.randomizedtesting.RandomizedRunner$7.evaluate(RandomizedRunner.java:894)
        at com.carrotsearch.randomizedtesting.rules.StatementAdapter.evaluate(StatementAdapter.java:36)
        at com.carrotsearch.randomizedtesting.rules.SystemPropertiesRestoreRule$1.evaluate(SystemPropertiesRestoreRule.java:57)
        at org.apache.lucene.util.AbstractBeforeAfterRule$1.evaluate(AbstractBeforeAfterRule.java:45)
        at com.carrotsearch.randomizedtesting.rules.StatementAdapter.evaluate(StatementAdapter.java:36)
        at org.apache.lucene.util.TestRuleStoreClassName$1.evaluate(TestRuleStoreClassName.java:41)
        at com.carrotsearch.randomizedtesting.rules.NoShadowingOrOverridesOnMethodsRule$1.evaluate(NoShadowingOrOverridesOnMethodsRule.java:40)
        at com.carrotsearch.randomizedtesting.rules.NoShadowingOrOverridesOnMethodsRule$1.evaluate(NoShadowingOrOverridesOnMethodsRule.java:40)
        at com.carrotsearch.randomizedtesting.rules.StatementAdapter.evaluate(StatementAdapter.java:36)
        at com.carrotsearch.randomizedtesting.rules.StatementAdapter.evaluate(StatementAdapter.java:36)
        at org.apache.lucene.util.TestRuleAssertionsRequired$1.evaluate(TestRuleAssertionsRequired.java:53)
        at org.apache.lucene.util.TestRuleMarkFailure$1.evaluate(TestRuleMarkFailure.java:47)
        at org.apache.lucene.util.TestRuleIgnoreAfterMaxFailures$1.evaluate(TestRuleIgnoreAfterMaxFailures.java:64)
        at org.apache.lucene.util.TestRuleIgnoreTestSuites$1.evaluate(TestRuleIgnoreTestSuites.java:54)
        at com.carrotsearch.randomizedtesting.rules.StatementAdapter.evaluate(StatementAdapter.java:36)
        at com.carrotsearch.randomizedtesting.ThreadLeakControl$StatementRunner.run(ThreadLeakControl.java:368)
        at java.base/java.lang.Thread.run(Thread.java:834)




Build Log:
[...truncated 15270 lines...]
   [junit4] Suite: org.apache.solr.schema.TestCloudSchemaless
   [junit4]   2> 2234750 INFO  (SUITE-TestCloudSchemaless-seed#[F4BBC4C798DC9271]-worker) [     ] o.a.s.SolrTestCaseJ4 Created dataDir: /home/jenkins/jenkins-slave/workspace/Lucene-Solr-Tests-master/solr/build/solr-core/test/J1/temp/solr.schema.TestCloudSchemaless_F4BBC4C798DC9271-001/data-dir-191-001
   [junit4]   2> 2234750 WARN  (SUITE-TestCloudSchemaless-seed#[F4BBC4C798DC9271]-worker) [     ] o.a.s.SolrTestCaseJ4 startTrackingSearchers: numOpens=12 numCloses=12
   [junit4]   2> 2234751 INFO  (SUITE-TestCloudSchemaless-seed#[F4BBC4C798DC9271]-worker) [     ] o.a.s.SolrTestCaseJ4 Using PointFields (NUMERIC_POINTS_SYSPROP=true) w/NUMERIC_DOCVALUES_SYSPROP=true
   [junit4]   2> 2234764 INFO  (SUITE-TestCloudSchemaless-seed#[F4BBC4C798DC9271]-worker) [     ] o.a.s.SolrTestCaseJ4 Randomized ssl (false) and clientAuth (false) via: @org.apache.solr.SolrTestCaseJ4$SuppressSSL(bugUrl="https://issues.apache.org/jira/browse/SOLR-5776")
   [junit4]   2> 2234764 INFO  (SUITE-TestCloudSchemaless-seed#[F4BBC4C798DC9271]-worker) [     ] o.a.s.SolrTestCaseJ4 SecureRandom sanity checks: test.solr.allowed.securerandom=null & java.security.egd=file:/dev/./urandom
   [junit4]   2> 2234764 INFO  (SUITE-TestCloudSchemaless-seed#[F4BBC4C798DC9271]-worker) [     ] o.a.s.BaseDistributedSearchTestCase Setting hostContext system property: /d/
   [junit4]   2> 2234766 INFO  (TEST-TestCloudSchemaless.test-seed#[F4BBC4C798DC9271]) [     ] o.a.s.c.ZkTestServer STARTING ZK TEST SERVER
   [junit4]   2> 2234775 INFO  (ZkTestServer Run Thread) [     ] o.a.s.c.ZkTestServer client port:0.0.0.0/0.0.0.0:0
   [junit4]   2> 2234775 INFO  (ZkTestServer Run Thread) [     ] o.a.s.c.ZkTestServer Starting server
   [junit4]   2> 2234776 INFO  (TEST-TestCloudSchemaless.test-seed#[F4BBC4C798DC9271]) [     ] o.a.s.c.ZkTestServer start zk server on port:44625
   [junit4]   2> 2234776 INFO  (TEST-TestCloudSchemaless.test-seed#[F4BBC4C798DC9271]) [     ] o.a.s.c.ZkTestServer waitForServerUp: 127.0.0.1:44625
   [junit4]   2> 2234776 INFO  (TEST-TestCloudSchemaless.test-seed#[F4BBC4C798DC9271]) [     ] o.a.s.c.ZkTestServer parse host and port list: 127.0.0.1:44625
   [junit4]   2> 2234776 INFO  (TEST-TestCloudSchemaless.test-seed#[F4BBC4C798DC9271]) [     ] o.a.s.c.ZkTestServer connecting to 127.0.0.1 44625
   [junit4]   2> 2234810 INFO  (TEST-TestCloudSchemaless.test-seed#[F4BBC4C798DC9271]) [     ] o.a.s.c.c.ConnectionManager Waiting for client to connect to ZooKeeper
   [junit4]   2> 2234843 INFO  (zkConnectionManagerCallback-8866-thread-1) [     ] o.a.s.c.c.ConnectionManager zkClient has connected
   [junit4]   2> 2234843 INFO  (TEST-TestCloudSchemaless.test-seed#[F4BBC4C798DC9271]) [     ] o.a.s.c.c.ConnectionManager Client is connected to ZooKeeper
   [junit4]   2> 2234853 INFO  (TEST-TestCloudSchemaless.test-seed#[F4BBC4C798DC9271]) [     ] o.a.s.c.c.ConnectionManager Waiting for client to connect to ZooKeeper
   [junit4]   2> 2234921 INFO  (zkConnectionManagerCallback-8868-thread-1) [     ] o.a.s.c.c.ConnectionManager zkClient has connected
   [junit4]   2> 2234921 INFO  (TEST-TestCloudSchemaless.test-seed#[F4BBC4C798DC9271]) [     ] o.a.s.c.c.ConnectionManager Client is connected to ZooKeeper
   [junit4]   2> 2234939 INFO  (TEST-TestCloudSchemaless.test-seed#[F4BBC4C798DC9271]) [     ] o.a.s.c.ZkTestServer put /home/jenkins/jenkins-slave/workspace/Lucene-Solr-Tests-master/solr/core/src/test-files/solr/collection1/conf/solrconfig-schemaless.xml to /configs/conf1/solrconfig.xml
   [junit4]   2> 2234959 INFO  (TEST-TestCloudSchemaless.test-seed#[F4BBC4C798DC9271]) [     ] o.a.s.c.ZkTestServer put /home/jenkins/jenkins-slave/workspace/Lucene-Solr-Tests-master/solr/core/src/test-files/solr/collection1/conf/schema-add-schema-fields-update-processor.xml to /configs/conf1/schema.xml
   [junit4]   2> 2234960 INFO  (TEST-TestCloudSchemaless.test-seed#[F4BBC4C798DC9271]) [     ] o.a.s.c.ZkTestServer put /home/jenkins/jenkins-slave/workspace/Lucene-Solr-Tests-master/solr/core/src/test-files/solr/collection1/conf/solrconfig.snippet.randomindexconfig.xml to /configs/conf1/solrconfig.snippet.randomindexconfig.xml
   [junit4]   2> 2234961 INFO  (TEST-TestCloudSchemaless.test-seed#[F4BBC4C798DC9271]) [     ] o.a.s.c.ZkTestServer put /home/jenkins/jenkins-slave/workspace/Lucene-Solr-Tests-master/solr/core/src/test-files/solr/collection1/conf/stopwords.txt to /configs/conf1/stopwords.txt
   [junit4]   2> 2234974 INFO  (TEST-TestCloudSchemaless.test-seed#[F4BBC4C798DC9271]) [     ] o.a.s.c.ZkTestServer put /home/jenkins/jenkins-slave/workspace/Lucene-Solr-Tests-master/solr/core/src/test-files/solr/collection1/conf/protwords.txt to /configs/conf1/protwords.txt
   [junit4]   2> 2234975 INFO  (TEST-TestCloudSchemaless.test-seed#[F4BBC4C798DC9271]) [     ] o.a.s.c.ZkTestServer put /home/jenkins/jenkins-slave/workspace/Lucene-Solr-Tests-master/solr/core/src/test-files/solr/collection1/conf/currency.xml to /configs/conf1/currency.xml
   [junit4]   2> 2234976 INFO  (TEST-TestCloudSchemaless.test-seed#[F4BBC4C798DC9271]) [     ] o.a.s.c.ZkTestServer put /home/jenkins/jenkins-slave/workspace/Lucene-Solr-Tests-master/solr/core/src/test-files/solr/collection1/conf/enumsConfig.xml to /configs/conf1/enumsConfig.xml
   [junit4]   2> 2234977 INFO  (TEST-TestCloudSchemaless.test-seed#[F4BBC4C798DC9271]) [     ] o.a.s.c.ZkTestServer put /home/jenkins/jenkins-slave/workspace/Lucene-Solr-Tests-master/solr/core/src/test-files/solr/collection1/conf/open-exchange-rates.json to /configs/conf1/open-exchange-rates.json
   [junit4]   2> 2234978 INFO  (TEST-TestCloudSchemaless.test-seed#[F4BBC4C798DC9271]) [     ] o.a.s.c.ZkTestServer put /home/jenkins/jenkins-slave/workspace/Lucene-Solr-Tests-master/solr/core/src/test-files/solr/collection1/conf/mapping-ISOLatin1Accent.txt to /configs/conf1/mapping-ISOLatin1Accent.txt
   [junit4]   2> 2235012 INFO  (TEST-TestCloudSchemaless.test-seed#[F4BBC4C798DC9271]) [     ] o.a.s.c.ZkTestServer put /home/jenkins/jenkins-slave/workspace/Lucene-Solr-Tests-master/solr/core/src/test-files/solr/collection1/conf/old_synonyms.txt to /configs/conf1/old_synonyms.txt
   [junit4]   2> 2235013 INFO  (TEST-TestCloudSchemaless.test-seed#[F4BBC4C798DC9271]) [     ] o.a.s.c.ZkTestServer put /home/jenkins/jenkins-slave/workspace/Lucene-Solr-Tests-master/solr/core/src/test-files/solr/collection1/conf/synonyms.txt to /configs/conf1/synonyms.txt
   [junit4]   2> 2235014 INFO  (TEST-TestCloudSchemaless.test-seed#[F4BBC4C798DC9271]) [     ] o.a.s.c.AbstractFullDistribZkTestBase Will use NRT replicas unless explicitly asked otherwise
   [junit4]   2> 2235892 WARN  (TEST-TestCloudSchemaless.test-seed#[F4BBC4C798DC9271]) [     ] o.e.j.s.AbstractConnector Ignoring deprecated socket close linger time
   [junit4]   2> 2235893 INFO  (TEST-TestCloudSchemaless.test-seed#[F4BBC4C798DC9271]) [     ] o.a.s.c.s.e.JettySolrRunner Start Jetty (original configured port=0)
   [junit4]   2> 2235893 INFO  (TEST-TestCloudSchemaless.test-seed#[F4BBC4C798DC9271]) [     ] o.a.s.c.s.e.JettySolrRunner Trying to start Jetty on port 0 try number 1 ...
   [junit4]   2> 2235910 INFO  (TEST-TestCloudSchemaless.test-seed#[F4BBC4C798DC9271]) [     ] o.e.j.s.Server jetty-9.4.19.v20190610; built: 2019-06-10T16:30:51.723Z; git: afcf563148970e98786327af5e07c261fda175d3; jvm 11.0.1+13-LTS
   [junit4]   2> 2235931 INFO  (TEST-TestCloudSchemaless.test-seed#[F4BBC4C798DC9271]) [     ] o.e.j.s.session DefaultSessionIdManager workerName=node0
   [junit4]   2> 2235931 INFO  (TEST-TestCloudSchemaless.test-seed#[F4BBC4C798DC9271]) [     ] o.e.j.s.session No SessionScavenger set, using defaults
   [junit4]   2> 2235931 INFO  (TEST-TestCloudSchemaless.test-seed#[F4BBC4C798DC9271]) [     ] o.e.j.s.session node0 Scavenging every 600000ms
   [junit4]   2> 2235932 INFO  (TEST-TestCloudSchemaless.test-seed#[F4BBC4C798DC9271]) [     ] o.e.j.s.h.ContextHandler Started o.e.j.s.ServletContextHandler@7a2064ce{/d,null,AVAILABLE}
   [junit4]   2> 2235932 INFO  (TEST-TestCloudSchemaless.test-seed#[F4BBC4C798DC9271]) [     ] o.e.j.s.AbstractConnector Started ServerConnector@7b777dbe{HTTP/1.1,[http/1.1, h2c]}{127.0.0.1:39138}
   [junit4]   2> 2235932 INFO  (TEST-TestCloudSchemaless.test-seed#[F4BBC4C798DC9271]) [     ] o.e.j.s.Server Started @2236049ms
   [junit4]   2> 2235932 INFO  (TEST-TestCloudSchemaless.test-seed#[F4BBC4C798DC9271]) [     ] o.a.s.c.s.e.JettySolrRunner Jetty properties: {hostContext=/d, solr.data.dir=/home/jenkins/jenkins-slave/workspace/Lucene-Solr-Tests-master/solr/build/solr-core/test/J1/temp/solr.schema.TestCloudSchemaless_F4BBC4C798DC9271-001/tempDir-001/control/data, hostPort=39138, coreRootDirectory=/home/jenkins/jenkins-slave/workspace/Lucene-Solr-Tests-master/solr/build/solr-core/test/J1/temp/solr.schema.TestCloudSchemaless_F4BBC4C798DC9271-001/control-001/cores, replicaType=NRT}
   [junit4]   2> 2235933 ERROR (TEST-TestCloudSchemaless.test-seed#[F4BBC4C798DC9271]) [     ] o.a.s.u.StartupLoggingUtils Missing Java Option solr.log.dir. Logging may be missing or incomplete.
   [junit4]   2> 2235933 INFO  (TEST-TestCloudSchemaless.test-seed#[F4BBC4C798DC9271]) [     ] o.a.s.s.SolrDispatchFilter Using logger factory org.apache.logging.slf4j.Log4jLoggerFactory
   [junit4]   2> 2235933 INFO  (TEST-TestCloudSchemaless.test-seed#[F4BBC4C798DC9271]) [     ] o.a.s.s.SolrDispatchFilter  ___      _       Welcome to Apache Solr? version 9.0.0
   [junit4]   2> 2235933 INFO  (TEST-TestCloudSchemaless.test-seed#[F4BBC4C798DC9271]) [     ] o.a.s.s.SolrDispatchFilter / __| ___| |_ _   Starting in cloud mode on port null
   [junit4]   2> 2235933 INFO  (TEST-TestCloudSchemaless.test-seed#[F4BBC4C798DC9271]) [     ] o.a.s.s.SolrDispatchFilter \__ \/ _ \ | '_|  Install dir: null
   [junit4]   2> 2235933 INFO  (TEST-TestCloudSchemaless.test-seed#[F4BBC4C798DC9271]) [     ] o.a.s.s.SolrDispatchFilter |___/\___/_|_|    Start time: 2019-08-30T01:18:06.321486Z
   [junit4]   2> 2235946 INFO  (TEST-TestCloudSchemaless.test-seed#[F4BBC4C798DC9271]) [     ] o.a.s.c.c.ConnectionManager Waiting for client to connect to ZooKeeper
   [junit4]   2> 2235979 INFO  (zkConnectionManagerCallback-8870-thread-1) [     ] o.a.s.c.c.ConnectionManager zkClient has connected
   [junit4]   2> 2235979 INFO  (TEST-TestCloudSchemaless.test-seed#[F4BBC4C798DC9271]) [     ] o.a.s.c.c.ConnectionManager Client is connected to ZooKeeper
   [junit4]   2> 2236121 INFO  (TEST-TestCloudSchemaless.test-seed#[F4BBC4C798DC9271]) [     ] o.a.s.s.SolrDispatchFilter Loading solr.xml from SolrHome (not found in ZooKeeper)
   [junit4]   2> 2236121 INFO  (TEST-TestCloudSchemaless.test-seed#[F4BBC4C798DC9271]) [     ] o.a.s.c.SolrXmlConfig Loading container configuration from /home/jenkins/jenkins-slave/workspace/Lucene-Solr-Tests-master/solr/build/solr-core/test/J1/temp/solr.schema.TestCloudSchemaless_F4BBC4C798DC9271-001/control-001/solr.xml
   [junit4]   2> 2236123 INFO  (TEST-TestCloudSchemaless.test-seed#[F4BBC4C798DC9271]) [     ] o.a.s.c.SolrXmlConfig Configuration parameter autoReplicaFailoverWorkLoopDelay is ignored
   [junit4]   2> 2236123 INFO  (TEST-TestCloudSchemaless.test-seed#[F4BBC4C798DC9271]) [     ] o.a.s.c.SolrXmlConfig Configuration parameter autoReplicaFailoverBadNodeExpiration is ignored
   [junit4]   2> 2236303 INFO  (TEST-TestCloudSchemaless.test-seed#[F4BBC4C798DC9271]) [     ] o.a.s.c.SolrXmlConfig MBean server found: com.sun.jmx.mbeanserver.JmxMBeanServer@3eba98e2, but no JMX reporters were configured - adding default JMX reporter.
   [junit4]   2> 2236631 INFO  (TEST-TestCloudSchemaless.test-seed#[F4BBC4C798DC9271]) [     ] o.a.s.h.c.HttpShardHandlerFactory Host whitelist initialized: WhitelistHostChecker [whitelistHosts=null, whitelistHostCheckingEnabled=false]
   [junit4]   2> 2236644 WARN  (TEST-TestCloudSchemaless.test-seed#[F4BBC4C798DC9271]) [     ] o.e.j.u.s.S.config Trusting all certificates configured for Client@ffdc568[provider=null,keyStore=null,trustStore=null]
   [junit4]   2> 2236644 WARN  (TEST-TestCloudSchemaless.test-seed#[F4BBC4C798DC9271]) [     ] o.e.j.u.s.S.config No Client EndPointIdentificationAlgorithm configured for Client@ffdc568[provider=null,keyStore=null,trustStore=null]
   [junit4]   2> 2236646 WARN  (TEST-TestCloudSchemaless.test-seed#[F4BBC4C798DC9271]) [     ] o.e.j.u.s.S.config Trusting all certificates configured for Client@472d57ce[provider=null,keyStore=null,trustStore=null]
   [junit4]   2> 2236646 WARN  (TEST-TestCloudSchemaless.test-seed#[F4BBC4C798DC9271]) [     ] o.e.j.u.s.S.config No Client EndPointIdentificationAlgorithm configured for Client@472d57ce[provider=null,keyStore=null,trustStore=null]
   [junit4]   2> 2236664 INFO  (TEST-TestCloudSchemaless.test-seed#[F4BBC4C798DC9271]) [     ] o.a.s.c.ZkContainer Zookeeper client=127.0.0.1:44625/solr
   [junit4]   2> 2236665 INFO  (TEST-TestCloudSchemaless.test-seed#[F4BBC4C798DC9271]) [     ] o.a.s.c.c.ConnectionManager Waiting for client to connect to ZooKeeper
   [junit4]   2> 2236681 INFO  (zkConnectionManagerCallback-8877-thread-1) [     ] o.a.s.c.c.ConnectionManager zkClient has connected
   [junit4]   2> 2236681 INFO  (TEST-TestCloudSchemaless.test-seed#[F4BBC4C798DC9271]) [     ] o.a.s.c.c.ConnectionManager Client is connected to ZooKeeper
   [junit4]   2> 2236807 INFO  (TEST-TestCloudSchemaless.test-seed#[F4BBC4C798DC9271]) [n:127.0.0.1:39138_d     ] o.a.s.c.c.ConnectionManager Waiting for client to connect to ZooKeeper
   [junit4]   2> 2236834 INFO  (zkConnectionManagerCallback-8879-thread-1) [     ] o.a.s.c.c.ConnectionManager zkClient has connected
   [junit4]   2> 2236834 INFO  (TEST-TestCloudSchemaless.test-seed#[F4BBC4C798DC9271]) [n:127.0.0.1:39138_d     ] o.a.s.c.c.ConnectionManager Client is connected to ZooKeeper
   [junit4]   2> 2237235 INFO  (TEST-TestCloudSchemaless.test-seed#[F4BBC4C798DC9271]) [n:127.0.0.1:39138_d     ] o.a.s.c.OverseerElectionContext I am going to be the leader 127.0.0.1:39138_d
   [junit4]   2> 2237236 INFO  (TEST-TestCloudSchemaless.test-seed#[F4BBC4C798DC9271]) [n:127.0.0.1:39138_d     ] o.a.s.c.Overseer Overseer (id=75299351029678084-127.0.0.1:39138_d-n_0000000000) starting
   [junit4]   2> 2237270 INFO  (TEST-TestCloudSchemaless.test-seed#[F4BBC4C798DC9271]) [n:127.0.0.1:39138_d     ] o.a.s.c.c.ConnectionManager Waiting for client to connect to ZooKeeper
   [junit4]   2> 2237271 INFO  (zkConnectionManagerCallback-8886-thread-1) [     ] o.a.s.c.c.ConnectionManager zkClient has connected
   [junit4]   2> 2237271 INFO  (TEST-TestCloudSchemaless.test-seed#[F4BBC4C798DC9271]) [n:127.0.0.1:39138_d     ] o.a.s.c.c.ConnectionManager Client is connected to ZooKeeper
   [junit4]   2> 2237285 INFO  (TEST-TestCloudSchemaless.test-seed#[F4BBC4C798DC9271]) [n:127.0.0.1:39138_d     ] o.a.s.c.s.i.ZkClientClusterStateProvider Cluster at 127.0.0.1:44625/solr ready
   [junit4]   2> 2237287 INFO  (OverseerStateUpdate-75299351029678084-127.0.0.1:39138_d-n_0000000000) [n:127.0.0.1:39138_d     ] o.a.s.c.Overseer Starting to work on the main queue : 127.0.0.1:39138_d
   [junit4]   2> 2237296 INFO  (TEST-TestCloudSchemaless.test-seed#[F4BBC4C798DC9271]) [n:127.0.0.1:39138_d     ] o.a.s.c.ZkController Register node as live in ZooKeeper:/live_nodes/127.0.0.1:39138_d
   [junit4]   2> 2237298 INFO  (zkCallback-8878-thread-1) [     ] o.a.s.c.c.ZkStateReader Updated live nodes from ZooKeeper... (0) -> (1)
   [junit4]   2> 2237299 INFO  (TEST-TestCloudSchemaless.test-seed#[F4BBC4C798DC9271]) [n:127.0.0.1:39138_d     ] o.a.s.c.PackageManager clusterprops.json changed , version 0
   [junit4]   2> 2237333 INFO  (zkCallback-8885-thread-1) [     ] o.a.s.c.c.ZkStateReader Updated live nodes from ZooKeeper... (0) -> (1)
   [junit4]   2> 2237382 INFO  (TEST-TestCloudSchemaless.test-seed#[F4BBC4C798DC9271]) [n:127.0.0.1:39138_d     ] o.a.s.h.a.MetricsHistoryHandler No .system collection, keeping metrics history in memory.
   [junit4]   2> 2237438 INFO  (TEST-TestCloudSchemaless.test-seed#[F4BBC4C798DC9271]) [n:127.0.0.1:39138_d     ] o.a.s.m.r.SolrJmxReporter JMX monitoring for 'solr.node' (registry 'solr.node') enabled at server: com.sun.jmx.mbeanserver.JmxMBeanServer@3eba98e2
   [junit4]   2> 2237468 INFO  (TEST-TestCloudSchemaless.test-seed#[F4BBC4C798DC9271]) [n:127.0.0.1:39138_d     ] o.a.s.m.r.SolrJmxReporter JMX monitoring for 'solr.jvm' (registry 'solr.jvm') enabled at server: com.sun.jmx.mbeanserver.JmxMBeanServer@3eba98e2
   [junit4]   2> 2237468 INFO  (TEST-TestCloudSchemaless.test-seed#[F4BBC4C798DC9271]) [n:127.0.0.1:39138_d     ] o.a.s.m.r.SolrJmxReporter JMX monitoring for 'solr.jetty' (registry 'solr.jetty') enabled at server: com.sun.jmx.mbeanserver.JmxMBeanServer@3eba98e2
   [junit4]   2> 2237470 INFO  (TEST-TestCloudSchemaless.test-seed#[F4BBC4C798DC9271]) [n:127.0.0.1:39138_d     ] o.a.s.c.CorePropertiesLocator Found 0 core definitions underneath /home/jenkins/jenkins-slave/workspace/Lucene-Solr-Tests-master/solr/build/solr-core/test/J1/temp/solr.schema.TestCloudSchemaless_F4BBC4C798DC9271-001/control-001/cores
   [junit4]   2> 2237541 INFO  (TEST-TestCloudSchemaless.test-seed#[F4BBC4C798DC9271]) [     ] o.a.s.c.c.ConnectionManager Waiting for client to connect to ZooKeeper
   [junit4]   2> 2237542 INFO  (zkConnectionManagerCallback-8892-thread-1) [     ] o.a.s.c.c.ConnectionManager zkClient has connected
   [junit4]   2> 2237542 INFO  (TEST-TestCloudSchemaless.test-seed#[F4BBC4C798DC9271]) [     ] o.a.s.c.c.ConnectionManager Client is connected to ZooKeeper
   [junit4]   2> 2237555 INFO  (TEST-TestCloudSchemaless.test-seed#[F4BBC4C798DC9271]) [     ] o.a.s.c.c.ZkStateReader Updated live nodes from ZooKeeper... (0) -> (1)
   [junit4]   2> 2237556 INFO  (TEST-TestCloudSchemaless.test-seed#[F4BBC4C798DC9271]) [     ] o.a.s.c.s.i.ZkClientClusterStateProvider Cluster at 127.0.0.1:44625/solr ready
   [junit4]   2> 2237559 INFO  (qtp2076424284-22154) [n:127.0.0.1:39138_d     ] o.a.s.h.a.CollectionsHandler Invoked Collection Action :create with params collection.configName=conf1&name=control_collection&nrtReplicas=1&action=CREATE&numShards=1&createNodeSet=127.0.0.1:39138_d&wt=javabin&version=2 and sendToOCPQueue=true
   [junit4]   2> 2237562 INFO  (OverseerThreadFactory-6480-thread-1-processing-n:127.0.0.1:39138_d) [n:127.0.0.1:39138_d     ] o.a.s.c.a.c.CreateCollectionCmd Create collection control_collection
   [junit4]   2> 2237691 INFO  (qtp2076424284-22156) [n:127.0.0.1:39138_d    x:control_collection_shard1_replica_n1 ] o.a.s.h.a.CoreAdminOperation core create command qt=/admin/cores&collection.configName=conf1&newCollection=true&name=control_collection_shard1_replica_n1&action=CREATE&numShards=1&collection=control_collection&shard=shard1&wt=javabin&version=2&replicaType=NRT
   [junit4]   2> 2237691 INFO  (qtp2076424284-22156) [n:127.0.0.1:39138_d    x:control_collection_shard1_replica_n1 ] o.a.s.c.TransientSolrCoreCacheDefault Allocating transient cache for 4 transient cores
   [junit4]   2> 2238895 INFO  (qtp2076424284-22156) [n:127.0.0.1:39138_d c:control_collection s:shard1  x:control_collection_shard1_replica_n1 ] o.a.s.c.SolrConfig Using Lucene MatchVersion: 9.0.0
   [junit4]   2> 2238965 INFO  (qtp2076424284-22156) [n:127.0.0.1:39138_d c:control_collection s:shard1  x:control_collection_shard1_replica_n1 ] o.a.s.s.ManagedIndexSchemaFactory The schema is configured as managed, but managed schema resource managed-schema not found - loading non-managed schema schema.xml instead
   [junit4]   2> 2238979 INFO  (qtp2076424284-22156) [n:127.0.0.1:39138_d c:control_collection s:shard1  x:control_collection_shard1_replica_n1 ] o.a.s.s.IndexSchema [control_collection_shard1_replica_n1] Schema name=add-schema-fields-update-processor
   [junit4]   2> 2239011 INFO  (qtp2076424284-22156) [n:127.0.0.1:39138_d c:control_collection s:shard1  x:control_collection_shard1_replica_n1 ] o.a.s.s.IndexSchema Loaded schema add-schema-fields-update-processor/1.6 with uniqueid field id
   [junit4]   2> 2239012 INFO  (qtp2076424284-22156) [n:127.0.0.1:39138_d c:control_collection s:shard1  x:control_collection_shard1_replica_n1 ] o.a.s.s.ManagedIndexSchema Created and persisted managed schema znode at /configs/conf1/managed-schema
   [junit4]   2> 2239039 INFO  (qtp2076424284-22156) [n:127.0.0.1:39138_d c:control_collection s:shard1  x:control_collection_shard1_replica_n1 ] o.a.s.s.ManagedIndexSchemaFactory After upgrading to managed schema in ZooKeeper, renamed the non-managed schema /configs/conf1/schema.xml to /configs/conf1/schema.xml.bak
   [junit4]   2> 2239039 INFO  (qtp2076424284-22156) [n:127.0.0.1:39138_d c:control_collection s:shard1  x:control_collection_shard1_replica_n1 ] o.a.s.c.CoreContainer Creating SolrCore 'control_collection_shard1_replica_n1' using configuration from collection control_collection, trusted=true
   [junit4]   2> 2239040 INFO  (qtp2076424284-22156) [n:127.0.0.1:39138_d c:control_collection s:shard1  x:control_collection_shard1_replica_n1 ] o.a.s.m.r.SolrJmxReporter JMX monitoring for 'solr.core.control_collection.shard1.replica_n1' (registry 'solr.core.control_collection.shard1.replica_n1') enabled at server: com.sun.jmx.mbeanserver.JmxMBeanServer@3eba98e2
   [junit4]   2> 2239040 INFO  (qtp2076424284-22156) [n:127.0.0.1:39138_d c:control_collection s:shard1  x:control_collection_shard1_replica_n1 ] o.a.s.c.SolrCore [[control_collection_shard1_replica_n1] ] Opening new SolrCore at [/home/jenkins/jenkins-slave/workspace/Lucene-Solr-Tests-master/solr/build/solr-core/test/J1/temp/solr.schema.TestCloudSchemaless_F4BBC4C798DC9271-001/control-001/cores/control_collection_shard1_replica_n1], dataDir=[/home/jenkins/jenkins-slave/workspace/Lucene-Solr-Tests-master/solr/build/solr-core/test/J1/temp/solr.schema.TestCloudSchemaless_F4BBC4C798DC9271-001/control-001/cores/control_collection_shard1_replica_n1/data/]
   [junit4]   2> 2239056 INFO  (qtp2076424284-22156) [n:127.0.0.1:39138_d c:control_collection s:shard1  x:control_collection_shard1_replica_n1 ] o.a.s.u.RandomMergePolicy RandomMergePolicy wrapping class org.apache.lucene.index.TieredMergePolicy: [TieredMergePolicy: maxMergeAtOnce=40, maxMergeAtOnceExplicit=35, maxMergedSegmentMB=74.4970703125, floorSegmentMB=0.8603515625, forceMergeDeletesPctAllowed=26.266074566004953, segmentsPerTier=10.0, maxCFSSegmentSizeMB=8.796093022207999E12, noCFSRatio=0.0, deletesPctAllowed=41.79850237561874
   [junit4]   2> 2239536 INFO  (qtp2076424284-22156) [n:127.0.0.1:39138_d c:control_collection s:shard1  x:control_collection_shard1_replica_n1 ] o.a.s.u.UpdateHandler Using UpdateLog implementation: org.apache.solr.update.UpdateLog
   [junit4]   2> 2239536 INFO  (qtp2076424284-22156) [n:127.0.0.1:39138_d c:control_collection s:shard1  x:control_collection_shard1_replica_n1 ] o.a.s.u.UpdateLog Initializing UpdateLog: dataDir= defaultSyncLevel=FLUSH numRecordsToKeep=100 maxNumLogsToKeep=10 numVersionBuckets=65536
   [junit4]   2> 2239537 INFO  (qtp2076424284-22156) [n:127.0.0.1:39138_d c:control_collection s:shard1  x:control_collection_shard1_replica_n1 ] o.a.s.u.CommitTracker Hard AutoCommit: disabled
   [junit4]   2> 2239537 INFO  (qtp2076424284-22156) [n:127.0.0.1:39138_d c:control_collection s:shard1  x:control_collection_shard1_replica_n1 ] o.a.s.u.CommitTracker Soft AutoCommit: disabled
   [junit4]   2> 2239539 INFO  (qtp2076424284-22156) [n:127.0.0.1:39138_d c:control_collection s:shard1  x:control_collection_shard1_replica_n1 ] o.a.s.u.RandomMergePolicy RandomMergePolicy wrapping class org.apache.lucene.index.TieredMergePolicy: [TieredMergePolicy: maxMergeAtOnce=29, maxMergeAtOnceExplicit=24, maxMergedSegmentMB=99.921875, floorSegmentMB=1.583984375, forceMergeDeletesPctAllowed=8.272167120147756, segmentsPerTier=17.0, maxCFSSegmentSizeMB=8.796093022207999E12, noCFSRatio=1.0, deletesPctAllowed=22.217569572783653
   [junit4]   2> 2239540 INFO  (qtp2076424284-22156) [n:127.0.0.1:39138_d c:control_collection s:shard1  x:control_collection_shard1_replica_n1 ] o.a.s.s.SolrIndexSearcher Opening [Searcher@26fdaad6[control_collection_shard1_replica_n1] main]
   [junit4]   2> 2239619 INFO  (qtp2076424284-22156) [n:127.0.0.1:39138_d c:control_collection s:shard1  x:control_collection_shard1_replica_n1 ] o.a.s.r.ManagedResourceStorage Configured ZooKeeperStorageIO with znodeBase: /configs/conf1
   [junit4]   2> 2239620 INFO  (qtp2076424284-22156) [n:127.0.0.1:39138_d c:control_collection s:shard1  x:control_collection_shard1_replica_n1 ] o.a.s.r.ManagedResourceStorage Loaded null at path _rest_managed.json using ZooKeeperStorageIO:path=/configs/conf1
   [junit4]   2> 2239620 INFO  (qtp2076424284-22156) [n:127.0.0.1:39138_d c:control_collection s:shard1  x:control_collection_shard1_replica_n1 ] o.a.s.s.ZkIndexSchemaReader Creating ZooKeeper watch for the managed schema at /configs/conf1/managed-schema
   [junit4]   2> 2239621 INFO  (qtp2076424284-22156) [n:127.0.0.1:39138_d c:control_collection s:shard1  x:control_collection_shard1_replica_n1 ] o.a.s.s.ZkIndexSchemaReader Current schema version 0 is already the latest
   [junit4]   2> 2239621 INFO  (qtp2076424284-22156) [n:127.0.0.1:39138_d c:control_collection s:shard1  x:control_collection_shard1_replica_n1 ] o.a.s.h.ReplicationHandler Commits will be reserved for 10000ms.
   [junit4]   2> 2239621 INFO  (qtp2076424284-22156) [n:127.0.0.1:39138_d c:control_collection s:shard1  x:control_collection_shard1_replica_n1 ] o.a.s.u.UpdateLog Could not find max version in index or recent updates, using new clock 1643252694394077184
   [junit4]   2> 2239624 INFO  (searcherExecutor-6485-thread-1-processing-n:127.0.0.1:39138_d x:control_collection_shard1_replica_n1 c:control_collection s:shard1) [n:127.0.0.1:39138_d c:control_collection s:shard1  x:control_collection_shard1_replica_n1 ] o.a.s.c.SolrCore [control_collection_shard1_replica_n1] Registered new searcher Searcher@26fdaad6[control_collection_shard1_replica_n1] main{ExitableDirectoryReader(UninvertingDirectoryReader())}
   [junit4]   2> 2239650 INFO  (qtp2076424284-22156) [n:127.0.0.1:39138_d c:control_collection s:shard1  x:control_collection_shard1_replica_n1 ] o.a.s.c.ZkShardTerms Successful update of terms at /collections/control_collection/terms/shard1 to Terms{values={core_node2=0}, version=0}
   [junit4]   2> 2239650 INFO  (qtp2076424284-22156) [n:127.0.0.1:39138_d c:control_collection s:shard1  x:control_collection_shard1_replica_n1 ] o.a.s.c.ShardLeaderElectionContextBase make sure parent is created /collections/control_collection/leaders/shard1
   [junit4]   2> 2239653 INFO  (qtp2076424284-22156) [n:127.0.0.1:39138_d c:control_collection s:shard1  x:control_collection_shard1_replica_n1 ] o.a.s.c.ShardLeaderElectionContext Enough replicas found to continue.
   [junit4]   2> 2239653 INFO  (qtp2076424284-22156) [n:127.0.0.1:39138_d c:control_collection s:shard1  x:control_collection_shard1_replica_n1 ] o.a.s.c.ShardLeaderElectionContext I may be the new leader - try and sync
   [junit4]   2> 2239653 INFO  (qtp2076424284-22156) [n:127.0.0.1:39138_d c:control_collection s:shard1  x:control_collection_shard1_replica_n1 ] o.a.s.c.SyncStrategy Sync replicas to http://127.0.0.1:39138/d/control_collection_shard1_replica_n1/
   [junit4]   2> 2239653 INFO  (qtp2076424284-22156) [n:127.0.0.1:39138_d c:control_collection s:shard1  x:control_collection_shard1_replica_n1 ] o.a.s.c.SyncStrategy Sync Success - now sync replicas to me
   [junit4]   2> 2239653 INFO  (qtp2076424284-22156) [n:127.0.0.1:39138_d c:control_collection s:shard1  x:control_collection_shard1_replica_n1 ] o.a.s.c.SyncStrategy http://127.0.0.1:39138/d/control_collection_shard1_replica_n1/ has no replicas
   [junit4]   2> 2239666 INFO  (qtp2076424284-22156) [n:127.0.0.1:39138_d c:control_collection s:shard1  x:control_collection_shard1_replica_n1 ] o.a.s.c.ShardLeaderElectionContextBase Creating leader registration node /collections/control_collection/leaders/shard1/leader after winning as /collections/control_collection/leader_elect/shard1/election/75299351029678084-core_node2-n_0000000000
   [junit4]   2> 2239736 INFO  (qtp2076424284-22156) [n:127.0.0.1:39138_d c:control_collection s:shard1  x:control_collection_shard1_replica_n1 ] o.a.s.c.ShardLeaderElectionContext I am the new leader: http://127.0.0.1:39138/d/control_collection_shard1_replica_n1/ shard1
   [junit4]   2> 2239845 INFO  (zkCallback-8878-thread-1) [     ] o.a.s.c.c.ZkStateReader A cluster state change: [WatchedEvent state:SyncConnected type:NodeDataChanged path:/collections/control_collection/state.json] for collection [control_collection] has occurred - updating... (live nodes size: [1])
   [junit4]   2> 2239845 INFO  (zkCallback-8878-thread-2) [     ] o.a.s.c.c.ZkStateReader A cluster state change: [WatchedEvent state:SyncConnected type:NodeDataChanged path:/collections/control_collection/state.json] for collection [control_collection] has occurred - updating... (live nodes size: [1])
   [junit4]   2> 2239847 INFO  (qtp2076424284-22156) [n:127.0.0.1:39138_d c:control_collection s:shard1  x:control_collection_shard1_replica_n1 ] o.a.s.c.ZkController I am the leader, no recovery necessary
   [junit4]   2> 2239879 INFO  (qtp2076424284-22156) [n:127.0.0.1:39138_d c:control_collection s:shard1  x:control_collection_shard1_replica_n1 ] o.a.s.s.HttpSolrCall [admin] webapp=null path=/admin/cores params={qt=/admin/cores&collection.configName=conf1&newCollection=true&name=control_collection_shard1_replica_n1&action=CREATE&numShards=1&collection=control_collection&shard=shard1&wt=javabin&version=2&replicaType=NRT} status=0 QTime=2188
   [junit4]   2> 2239990 INFO  (qtp2076424284-22154) [n:127.0.0.1:39138_d     ] o.a.s.h.a.CollectionsHandler Wait for new collection to be active for at most 45 seconds. Check all shard replicas
   [junit4]   2> 2240006 INFO  (zkCallback-8878-thread-2) [     ] o.a.s.c.c.ZkStateReader A cluster state change: [WatchedEvent state:SyncConnected type:NodeDataChanged path:/collections/control_collection/state.json] for collection [control_collection] has occurred - updating... (live nodes size: [1])
   [junit4]   2> 2240006 INFO  (zkCallback-8878-thread-3) [     ] o.a.s.c.c.ZkStateReader A cluster state change: [WatchedEvent state:SyncConnected type:NodeDataChanged path:/collections/control_collection/state.json] for collection [control_collection] has occurred - updating... (live nodes size: [1])
   [junit4]   2> 2240038 INFO  (zkCallback-8878-thread-1) [     ] o.a.s.c.c.ZkStateReader A cluster state change: [WatchedEvent state:SyncConnected type:NodeDataChanged path:/collections/control_collection/state.json] for collection [control_collection] has occurred - updating... (live nodes size: [1])
   [junit4]   2> 2240039 INFO  (qtp2076424284-22154) [n:127.0.0.1:39138_d     ] o.a.s.s.HttpSolrCall [admin] webapp=null path=/admin/collections params={collection.configName=conf1&name=control_collection&nrtReplicas=1&action=CREATE&numShards=1&createNodeSet=127.0.0.1:39138_d&wt=javabin&version=2} status=0 QTime=2480
   [junit4]   2> 2240039 INFO  (TEST-TestCloudSchemaless.test-seed#[F4BBC4C798DC9271]) [     ] o.a.s.c.AbstractFullDistribZkTestBase Waiting to see 1 active replicas in collection: control_collection
   [junit4]   2> 2240214 INFO  (TEST-TestCloudSchemaless.test-seed#[F4BBC4C798DC9271]) [     ] o.a.s.c.c.ConnectionManager Waiting for client to connect to ZooKeeper
   [junit4]   2> 2240215 INFO  (zkConnectionManagerCallback-8898-thread-1) [     ] o.a.s.c.c.ConnectionManager zkClient has connected
   [junit4]   2> 2240215 INFO  (TEST-TestCloudSchemaless.test-seed#[F4BBC4C798DC9271]) [     ] o.a.s.c.c.ConnectionManager Client is connected to ZooKeeper
   [junit4]   2> 2240216 INFO  (TEST-TestCloudSchemaless.test-seed#[F4BBC4C798DC9271]) [     ] o.a.s.c.c.ZkStateReader Updated live nodes from ZooKeeper... (0) -> (1)
   [junit4]   2> 2240216 INFO  (TEST-TestCloudSchemaless.test-seed#[F4BBC4C798DC9271]) [     ] o.a.s.c.s.i.ZkClientClusterStateProvider Cluster at 127.0.0.1:44625/solr ready
   [junit4]   2> 2240216 INFO  (TEST-TestCloudSchemaless.test-seed#[F4BBC4C798DC9271]) [     ] o.a.s.c.ChaosMonkey monkey: init - expire sessions:false cause connection loss:false
   [junit4]   2> 2240250 INFO  (qtp2076424284-22156) [n:127.0.0.1:39138_d     ] o.a.s.h.a.CollectionsHandler Invoked Collection Action :create with params collection.configName=conf1&name=collection1&nrtReplicas=1&action=CREATE&numShards=4&createNodeSet=&stateFormat=2&wt=javabin&version=2 and sendToOCPQueue=true
   [junit4]   2> 2240283 INFO  (OverseerCollectionConfigSetProcessor-75299351029678084-127.0.0.1:39138_d-n_0000000000) [n:127.0.0.1:39138_d     ] o.a.s.c.OverseerTaskQueue Response ZK path: /overseer/collection-queue-work/qnr-0000000000 doesn't exist.  Requestor may have disconnected from ZooKeeper
   [junit4]   2> 2240284 INFO  (OverseerThreadFactory-6480-thread-2-processing-n:127.0.0.1:39138_d) [n:127.0.0.1:39138_d     ] o.a.s.c.a.c.CreateCollectionCmd Create collection collection1
   [junit4]   2> 2240519 WARN  (OverseerThreadFactory-6480-thread-2-processing-n:127.0.0.1:39138_d) [n:127.0.0.1:39138_d     ] o.a.s.c.a.c.CreateCollectionCmd It is unusual to create a collection (collection1) without cores.
   [junit4]   2> 2240520 INFO  (qtp2076424284-22156) [n:127.0.0.1:39138_d     ] o.a.s.h.a.CollectionsHandler Wait for new collection to be active for at most 45 seconds. Check all shard replicas
   [junit4]   2> 2240521 INFO  (qtp2076424284-22156) [n:127.0.0.1:39138_d     ] o.a.s.s.HttpSolrCall [admin] webapp=null path=/admin/collections params={collection.configName=conf1&name=collection1&nrtReplicas=1&action=CREATE&numShards=4&createNodeSet=&stateFormat=2&wt=javabin&version=2} status=0 QTime=272
   [junit4]   2> 2240522 INFO  (TEST-TestCloudSchemaless.test-seed#[F4BBC4C798DC9271]) [     ] o.a.s.c.SolrCloudTestCase active slice count: 4 expected:4
   [junit4]   2> 2240522 INFO  (TEST-TestCloudSchemaless.test-seed#[F4BBC4C798DC9271]) [     ] o.a.s.c.SolrCloudTestCase active replica count: 0 expected replica count: 0
   [junit4]   2> 2240523 INFO  (TEST-TestCloudSchemaless.test-seed#[F4BBC4C798DC9271]) [     ] o.a.s.c.SolrCloudTestCase active slice count: 4 expected:4
   [junit4]   2> 2240523 INFO  (TEST-TestCloudSchemaless.test-seed#[F4BBC4C798DC9271]) [     ] o.a.s.c.SolrCloudTestCase active replica count: 0 expected replica count: 0
   [junit4]   2> 2240523 INFO  (TEST-TestCloudSchemaless.test-seed#[F4BBC4C798DC9271]) [     ] o.a.s.c.SolrCloudTestCase active slice count: 4 expected:4
   [junit4]   2> 2240523 INFO  (TEST-TestCloudSchemaless.test-seed#[F4BBC4C798DC9271]) [     ] o.a.s.c.SolrCloudTestCase active replica count: 0 expected replica count: 0
   [junit4]   2> 2240523 INFO  (TEST-TestCloudSchemaless.test-seed#[F4BBC4C798DC9271]) [     ] o.a.s.c.AbstractFullDistribZkTestBase Creating jetty instances pullReplicaCount=0 numOtherReplicas=8
   [junit4]   2> 2242057 INFO  (TEST-TestCloudSchemaless.test-seed#[F4BBC4C798DC9271]) [     ] o.a.s.c.AbstractFullDistribZkTestBase create jetty 1 in directory /home/jenkins/jenkins-slave/workspace/Lucene-Solr-Tests-master/solr/build/solr-core/test/J1/temp/solr.schema.TestCloudSchemaless_F4BBC4C798DC9271-001/shard-1-001 of type NRT
   [junit4]   2> 2242077 WARN  (closeThreadPool-8899-thread-1) [     ] o.e.j.s.AbstractConnector Ignoring deprecated socket close linger time
   [junit4]   2> 2242077 INFO  (closeThreadPool-8899-thread-1) [     ] o.a.s.c.s.e.JettySolrRunner Start Jetty (original configured port=0)
   [junit4]   2> 2242077 INFO  (closeThreadPool-8899-thread-1) [     ] o.a.s.c.s.e.JettySolrRunner Trying to start Jetty on port 0 try number 1 ...
   [junit4]   2> 2242077 INFO  (closeThreadPool-8899-thread-1) [     ] o.e.j.s.Server jetty-9.4.19.v20190610; built: 2019-06-10T16:30:51.723Z; git: afcf563148970e98786327af5e07c261fda175d3; jvm 11.0.1+13-LTS
   [junit4]   2> 2242207 INFO  (closeThreadPool-8899-thread-1) [     ] o.e.j.s.session DefaultSessionIdManager workerName=node0
   [junit4]   2> 2242207 INFO  (closeThreadPool-8899-thread-1) [     ] o.e.j.s.session No SessionScavenger set, using defaults
   [junit4]   2> 2242207 INFO  (closeThreadPool-8899-thread-1) [     ] o.e.j.s.session node0 Scavenging every 600000ms
   [junit4]   2> 2242208 INFO  (closeThreadPool-8899-thread-1) [     ] o.e.j.s.h.ContextHandler Started o.e.j.s.ServletContextHandler@75b8d3d5{/d,null,AVAILABLE}
   [junit4]   2> 2242210 INFO  (closeThreadPool-8899-thread-1) [     ] o.e.j.s.AbstractConnector Started ServerConnector@537441e1{HTTP/1.1,[http/1.1, h2c]}{127.0.0.1:36500}
   [junit4]   2> 2242210 INFO  (closeThreadPool-8899-thread-1) [     ] o.e.j.s.Server Started @2242326ms
   [junit4]   2> 2242210 INFO  (closeThreadPool-8899-thread-1) [     ] o.a.s.c.s.e.JettySolrRunner Jetty properties: {hostContext=/d, solrconfig=solrconfig.xml, solr.data.dir=/home/jenkins/jenkins-slave/workspace/Lucene-Solr-Tests-master/solr/build/solr-core/test/J1/temp/solr.schema.TestCloudSchemaless_F4BBC4C798DC9271-001/tempDir-001/jetty1, hostPort=36500, coreRootDirectory=/home/jenkins/jenkins-slave/workspace/Lucene-Solr-Tests-master/solr/build/solr-core/test/J1/../../../../../../../../../../home/jenkins/jenkins-slave/workspace/Lucene-Solr-Tests-master/solr/build/solr-core/test/J1/temp/solr.schema.TestCloudSchemaless_F4BBC4C798DC9271-001/shard-1-001/cores, replicaType=NRT}
   [junit4]   2> 2242230 ERROR (closeThreadPool-8899-thread-1) [     ] o.a.s.u.StartupLoggingUtils Missing Java Option solr.log.dir. Logging may be missing or incomplete.
   [junit4]   2> 2242230 INFO  (closeThreadPool-8899-thread-1) [     ] o.a.s.s.SolrDispatchFilter Using logger factory org.apache.logging.slf4j.Log4jLoggerFactory
   [junit4]   2> 2242230 INFO  (closeThreadPool-8899-thread-1) [     ] o.a.s.s.SolrDispatchFilter  ___      _       Welcome to Apache Solr? version 9.0.0
   [junit4]   2> 2242230 INFO  (closeThreadPool-8899-thread-1) [     ] o.a.s.s.SolrDispatchFilter / __| ___| |_ _   Starting in cloud mode on port null
   [junit4]   2> 2242230 INFO  (closeThreadPool-8899-thread-1) [     ] o.a.s.s.SolrDispatchFilter \__ \/ _ \ | '_|  Install dir: null
   [junit4]   2> 2242230 INFO  (closeThreadPool-8899-thread-1) [     ] o.a.s.s.SolrDispatchFilter |___/\___/_|_|    Start time: 2019-08-30T01:18:12.618728Z
   [junit4]   2> 2242303 INFO  (closeThreadPool-8899-thread-1) [     ] o.a.s.c.c.ConnectionManager Waiting for client to connect to ZooKeeper
   [junit4]   2> 2242323 INFO  (zkConnectionManagerCallback-8901-thread-1) [     ] o.a.s.c.c.ConnectionManager zkClient has connected
   [junit4]   2> 2242339 INFO  (closeThreadPool-8899-thread-1) [     ] o.a.s.c.c.ConnectionManager Client is connected to ZooKeeper
   [junit4]   2> 2242359 INFO  (OverseerCollectionConfigSetProcessor-75299351029678084-127.0.0.1:39138_d-n_0000000000) [n:127.0.0.1:39138_d     ] o.a.s.c.OverseerTaskQueue Response ZK path: /overseer/collection-queue-work/qnr-0000000002 doesn't exist.  Requestor may have disconnected from ZooKeeper
   [junit4]   2> 2242522 INFO  (closeThreadPool-8899-thread-1) [     ] o.a.s.s.SolrDispatchFilter Loading solr.xml from SolrHome (not found in ZooKeeper)
   [junit4]   2> 2242522 INFO  (closeThreadPool-8899-thread-1) [     ] o.a.s.c.SolrXmlConfig Loading container configuration from /home/jenkins/jenkins-slave/workspace/Lucene-Solr-Tests-master/solr/build/solr-core/test/J1/temp/solr.schema.TestCloudSchemaless_F4BBC4C798DC9271-001/shard-1-001/solr.xml
   [junit4]   2> 2242525 INFO  (closeThreadPool-8899-thread-1) [     ] o.a.s.c.SolrXmlConfig Configuration parameter autoReplicaFailoverWorkLoopDelay is ignored
   [junit4]   2> 2242525 INFO  (closeThreadPool-8899-thread-1) [     ] o.a.s.c.SolrXmlConfig Configuration parameter autoReplicaFailoverBadNodeExpiration is ignored
   [junit4]   2> 2242575 INFO  (closeThreadPool-8899-thread-1) [     ] o.a.s.c.SolrXmlConfig MBean server found: com.sun.jmx.mbeanserver.JmxMBeanServer@3eba98e2, but no JMX reporters were configured - adding default JMX reporter.
   [junit4]   2> 2243461 INFO  (TEST-TestCloudSchemaless.test-seed#[F4BBC4C798DC9271]) [     ] o.a.s.c.AbstractFullDistribZkTestBase create jetty 2 in directory /home/jenkins/jenkins-slave/workspace/Lucene-Solr-Tests-master/solr/build/solr-core/test/J1/temp/solr.schema.TestCloudSchemaless_F4BBC4C798DC9271-001/shard-2-001 of type NRT
   [junit4]   2> 2243478 WARN  (closeThreadPool-8899-thread-2) [     ] o.e.j.s.AbstractConnector Ignoring deprecated socket close linger time
   [junit4]   2> 2243478 INFO  (closeThreadPool-8899-thread-2) [     ] o.a.s.c.s.e.JettySolrRunner Start Jetty (original configured port=0)
   [junit4]   2> 2243479 INFO  (closeThreadPool-8899-thread-2) [     ] o.a.s.c.s.e.JettySolrRunner Trying to start Jetty on port 0 try number 1 ...
   [junit4]   2> 2243479 INFO  (closeThreadPool-8899-thread-2) [     ] o.e.j.s.Server jetty-9.4.19.v20190610; built: 2019-06-10T16:30:51.723Z; git: afcf563148970e98786327af5e07c261fda175d3; jvm 11.0.1+13-LTS
   [junit4]   2> 2243531 INFO  (closeThreadPool-8899-thread-2) [     ] o.e.j.s.session DefaultSessionIdManager workerName=node0
   [junit4]   2> 2243531 INFO  (closeThreadPool-8899-thread-2) [     ] o.e.j.s.session No SessionScavenger set, using defaults
   [junit4]   2> 2243531 INFO  (closeThreadPool-8899-thread-2) [     ] o.e.j.s.session node0 Scavenging every 600000ms
   [junit4]   2> 2243551 INFO  (closeThreadPool-8899-thread-2) [     ] o.e.j.s.h.ContextHandler Started o.e.j.s.ServletContextHandler@91d3f06{/d,null,AVAILABLE}
   [junit4]   2> 2243579 INFO  (closeThreadPool-8899-thread-2) [     ] o.e.j.s.AbstractConnector Started ServerConnector@6c02704f{HTTP/1.1,[http/1.1, h2c]}{127.0.0.1:36841}
   [junit4]   2> 2243579 INFO  (closeThreadPool-8899-thread-2) [     ] o.e.j.s.Server Started @2243695ms
   [junit4]   2> 2243579 INFO  (closeThreadPool-8899-thread-2) [     ] o.a.s.c.s.e.JettySolrRunner Jetty properties: {hostContext=/d, solrconfig=solrconfig.xml, solr.data.dir=/home/jenkins/jenkins-slave/workspace/Lucene-Solr-Tests-master/solr/build/solr-core/test/J1/temp/solr.schema.TestCloudSchemaless_F4BBC4C798DC9271-001/tempDir-001/jetty2, hostPort=36841, coreRootDirectory=/home/jenkins/jenkins-slave/workspace/Lucene-Solr-Tests-master/solr/build/solr-core/test/J1/../../../../../../../../../../home/jenkins/jenkins-slave/workspace/Lucene-Solr-Tests-master/solr/build/solr-core/test/J1/temp/solr.schema.TestCloudSchemaless_F4BBC4C798DC9271-001/shard-2-001/cores, replicaType=NRT}
   [junit4]   2> 2243579 ERROR (closeThreadPool-8899-thread-2) [     ] o.a.s.u.StartupLoggingUtils Missing Java Option solr.log.dir. Logging may be missing or incomplete.
   [junit4]   2> 2243579 INFO  (closeThreadPool-8899-thread-2) [     ] o.a.s.s.SolrDispatchFilter Using logger factory org.apache.logging.slf4j.Log4jLoggerFactory
   [junit4]   2> 2243615 INFO  (closeThreadPool-8899-thread-2) [     ] o.a.s.s.SolrDispatchFilter  ___      _       Welcome to Apache Solr? version 9.0.0
   [junit4]   2> 2243615 INFO  (closeThreadPool-8899-thread-2) [     ] o.a.s.s.SolrDispatchFilter / __| ___| |_ _   Starting in cloud mode on port null
   [junit4]   2> 2243615 INFO  (closeThreadPool-8899-thread-2) [     ] o.a.s.s.SolrDispatchFilter \__ \/ _ \ | '_|  Install dir: null
   [junit4]   2> 2243616 INFO  (closeThreadPool-8899-thread-2) [     ] o.a.s.s.SolrDispatchFilter |___/\___/_|_|    Start time: 2019-08-30T01:18:14.004006Z
   [junit4]   2> 2243672 INFO  (closeThreadPool-8899-thread-2) [     ] o.a.s.c.c.ConnectionManager Waiting for client to connect to ZooKeeper
   [junit4]   2> 2243761 INFO  (zkConnectionManagerCallback-8904-thread-1) [     ] o.a.s.c.c.ConnectionManager zkClient has connected
   [junit4]   2> 2243761 INFO  (closeThreadPool-8899-thread-2) [     ] o.a.s.c.c.ConnectionManager Client is connected to ZooKeeper
   [junit4]   2> 2243848 INFO  (closeThreadPool-8899-thread-1) [     ] o.a.s.h.c.HttpShardHandlerFactory Host whitelist initialized: WhitelistHostChecker [whitelistHosts=null, whitelistHostCheckingEnabled=false]
   [junit4]   2> 2243849 WARN  (closeThreadPool-8899-thread-1) [     ] o.e.j.u.s.S.config Trusting all certificates configured for Client@6e5b5a39[provider=null,keyStore=null,trustStore=null]
   [junit4]   2> 2243849 WARN  (closeThreadPool-8899-thread-1) [     ] o.e.j.u.s.S.config No Client EndPointIdentificationAlgorithm configured for Client@6e5b5a39[provider=null,keyStore=null,trustStore=null]
   [junit4]   2> 2243864 WARN  (closeThreadPool-8899-thread-1) [     ] o.e.j.u.s.S.config Trusting all certificates configured for Client@36857532[provider=null,keyStore=null,trustStore=null]
   [junit4]   2> 2243864 WARN  (closeThreadPool-8899-thread-1) [     ] o.e.j.u.s.S.config No Client EndPointIdentificationAlgorithm configured for Client@36857532[provider=null,keyStore=null,trustStore=null]
   [junit4]   2> 2243865 INFO  (closeThreadPool-8899-thread-1) [     ] o.a.s.c.ZkContainer Zookeeper client=127.0.0.1:44625/solr
   [junit4]   2> 2243866 INFO  (closeThreadPool-8899-thread-1) [     ] o.a.s.c.c.ConnectionManager Waiting for client to connect to ZooKeeper
   [junit4]   2> 2243895 INFO  (zkConnectionManagerCallback-8910-thread-1) [     ] o.a.s.c.c.ConnectionManager zkClient has connected
   [junit4]   2> 2243895 INFO  (closeThreadPool-8899-thread-1) [     ] o.a.s.c.c.ConnectionManager Client is connected to ZooKeeper
   [junit4]   2> 2243960 INFO  (closeThreadPool-8899-thread-2) [     ] o.a.s.s.SolrDispatchFilter Loading solr.xml from SolrHome (not found in ZooKeeper)
   [junit4]   2> 2243960 INFO  (closeThreadPool-8899-thread-2) [     ] o.a.s.c.SolrXmlConfig Loading container configuration from /home/jenkins/jenkins-slave/workspace/Lucene-Solr-Tests-master/solr/build/solr-core/test/J1/temp/solr.schema.TestCloudSchemaless_F4BBC4C798DC9271-001/shard-2-001/solr.xml
   [junit4]   2> 2243962 INFO  (closeThreadPool-8899-thread-2) [     ] o.a.s.c.SolrXmlConfig Configuration parameter autoReplicaFailoverWorkLoopDelay is ignored
   [junit4]   2> 2243962 INFO  (closeThreadPool-8899-thread-2) [     ] o.a.s.c.SolrXmlConfig Configuration parameter autoReplicaFailoverBadNodeExpiration is ignored
   [junit4]   2> 2243983 INFO  (closeThreadPool-8899-thread-2) [     ] o.a.s.c.SolrXmlConfig MBean server found: com.sun.jmx.mbeanserver.JmxMBeanServer@3eba98e2, but no JMX reporters were configured - adding default JMX reporter.
   [junit4]   2> 2244187 INFO  (closeThreadPool-8899-thread-1) [n:127.0.0.1:36500_d     ] o.a.s.c.c.ConnectionManager Waiting for client to connect to ZooKeeper
   [junit4]   2> 2244207 INFO  (zkConnectionManagerCallback-8913-thread-1) [     ] o.a.s.c.c.ConnectionManager zkClient has connected
   [junit4]   2> 2244207 INFO  (closeThreadPool-8899-thread-1) [n:127.0.0.1:36500_d     ] o.a.s.c.c.ConnectionManager Client is connected to ZooKeeper
   [junit4]   2> 2244646 INFO  (closeThreadPool-8899-thread-1) [n:127.0.0.1:36500_d     ] o.a.s.c.c.ZkStateReader Updated live nodes from ZooKeeper... (0) -> (1)
   [junit4]   2> 2244807 INFO  (closeThreadPool-8899-thread-1) [n:127.0.0.1:36500_d     ] o.a.s.c.ZkController Publish node=127.0.0.1:36500_d as DOWN
   [junit4]   2> 2245111 INFO  (closeThreadPool-8899-thread-1) [n:127.0.0.1:36500_d     ] o.a.s.c.TransientSolrCoreCacheDefault Allocating transient cache for 4 transient cores
   [junit4]   2> 2245111 INFO  (closeThreadPool-8899-thread-1) [n:127.0.0.1:36500_d     ] o.a.s.c.ZkController Register node as live in ZooKeeper:/live_nodes/127.0.0.1:36500_d
   [junit4]   2> 2245168 INFO  (zkCallback-8878-thread-1) [     ] o.a.s.c.c.ZkStateReader Updated live nodes from ZooKeeper... (1) -> (2)
   [junit4]   2> 2245204 INFO  (zkCallback-8912-thread-1) [     ] o.a.s.c.c.ZkStateReader Updated live nodes from ZooKeeper... (1) -> (2)
   [junit4]   2> 2245208 INFO  (zkCallback-8885-thread-1) [     ] o.a.s.c.c.ZkStateReader Updated live nodes from ZooKeeper... (1) -> (2)
   [junit4]   2> 2245305 INFO  (zkCallback-8897-thread-1) [     ] o.a.s.c.c.ZkStateReader Updated live nodes from ZooKeeper... (1) -> (2)
   [junit4]   2> 2245317 INFO  (closeThreadPool-8899-thread-1) [n:127.0.0.1:36500_d     ] o.a.s.c.c.ConnectionManager Waiting for client to connect to ZooKeeper
   [junit4]   2> 2245484 INFO  (zkConnectionManagerCallback-8920-thread-1) [     ] o.a.s.c.c.ConnectionManager zkClient has connected
   [junit4]   2> 2245484 INFO  (closeThreadPool-8899-thread-1) [n:127.0.0.1:36500_d     ] o.a.s.c.c.ConnectionManager Client is connected to ZooKeeper
   [junit4]   2> 2245529 INFO  (closeThreadPool-8899-thread-1) [n:127.0.0.1:36500_d     ] o.a.s.c.c.ZkStateReader Updated live nodes from ZooKeeper... (0) -> (2)
   [junit4]   2> 2245529 INFO  (closeThreadPool-8899-thread-1) [n:127.0.0.1:36500_d     ] o.a.s.c.s.i.ZkClientClusterStateProvider Cluster at 127.0.0.1:44625/solr ready
   [junit4]   2> 2245530 INFO  (closeThreadPool-8899-thread-1) [n:127.0.0.1:36500_d     ] o.a.s.c.PackageManager clusterprops.json changed , version 0
   [junit4]   2> 2245755 INFO  (closeThreadPool-8899-thread-1) [n:127.0.0.1:36500_d     ] o.a.s.h.a.MetricsHistoryHandler No .system collection, keeping metrics history in memory.
   [junit4]   2> 2245845 INFO  (closeThreadPool-8899-thread-1) [n:127.0.0.1:36500_d     ] o.a.s.m.r.SolrJmxReporter JMX monitoring for 'solr.node' (registry 'solr.node') enabled at server: com.sun.jmx.mbeanserver.JmxMBeanServer@3eba98e2
   [junit4]   2> 2245940 INFO  (closeThreadPool-8899-thread-1) [n:127.0.0.1:36500_d     ] o.a.s.m.r.SolrJmxReporter JMX monitoring for 'solr.jvm' (registry 'solr.jvm') enabled at server: com.sun.jmx.mbeanserver.JmxMBeanServer@3eba98e2
   [junit4]   2> 2245940 INFO  (closeThreadPool-8899-thread-1) [n:127.0.0.1:36500_d     ] o.a.s.m.r.SolrJmxReporter JMX monitoring for 'solr.jetty' (registry 'solr.jetty') enabled at server: com.sun.jmx.mbeanserver.JmxMBeanServer@3eba98e2
   [junit4]   2> 2245941 INFO  (closeThreadPool-8899-thread-1) [n:127.0.0.1:36500_d     ] o.a.s.c.CorePropertiesLocator Found 0 core definitions underneath /home/jenkins/jenkins-slave/workspace/Lucene-Solr-Tests-master/solr/build/solr-core/test/J1/../../../../../../../../../../home/jenkins/jenkins-slave/workspace/Lucene-Solr-Tests-master/solr/build/solr-core/test/J1/temp/solr.schema.TestCloudSchemaless_F4BBC4C798DC9271-001/shard-1-001/cores
   [junit4]   2> 2246197 INFO  (TEST-TestCloudSchemaless.test-seed#[F4BBC4C798DC9271]) [     ] o.a.s.c.AbstractFullDistribZkTestBase create jetty 3 in directory /home/jenkins/jenkins-slave/workspace/Lucene-Solr-Tests-master/solr/build/solr-core/test/J1/temp/solr.schema.TestCloudSchemaless_F4BBC4C798DC9271-001/shard-3-001 of type NRT
   [junit4]   2> 2246234 WARN  (closeThreadPool-8899-thread-3) [     ] o.e.j.s.AbstractConnector Ignoring deprecated socket close linger time
   [junit4]   2> 2246234 INFO  (closeThreadPool-8899-thread-3) [     ] o.a.s.c.s.e.JettySolrRunner Start Jetty (original configured port=0)
   [junit4]   2> 2246234 INFO  (closeThreadPool-8899-thread-3) [     ] o.a.s.c.s.e.JettySolrRunner Trying to start Jetty on port 0 try number 1 ...
   [junit4]   2> 2246234 INFO  (closeThreadPool-8899-thread-3) [     ] o.e.j.s.Server jetty-9.4.19.v20190610; built: 2019-06-10T16:30:51.723Z; git: afcf563148970e98786327af5e07c261fda175d3; jvm 11.0.1+13-LTS
   [junit4]   2> 2246467 INFO  (closeThreadPool-8899-thread-3) [     ] o.e.j.s.session DefaultSessionIdManager workerName=node0
   [junit4]   2> 2246467 INFO  (closeThreadPool-8899-thread-3) [     ] o.e.j.s.session No SessionScavenger set, using defaults
   [junit4]   2> 2246467 INFO  (closeThreadPool-8899-thread-3) [     ] o.e.j.s.session node0 Scavenging every 600000ms
   [junit4]   2> 2246559 INFO  (closeThreadPool-8899-thread-3) [     ] o.e.j.s.h.ContextHandler Started o.e.j.s.ServletContextHandler@79eaaebd{/d,null,AVAILABLE}
   [junit4]   2> 2246562 INFO  (closeThreadPool-8899-thread-3) [     ] o.e.j.s.AbstractConnector Started ServerConnector@5df8b731{HTTP/1.1,[http/1.1, h2c]}{127.0.0.1:33210}
   [junit4]   2> 2246562 INFO  (closeThreadPool-8899-thread-3) [     ] o.e.j.s.Server Started @2246678ms
   [junit4]   2> 2246562 INFO  (closeThreadPool-8899-thread-3) [     ] o.a.s.c.s.e.JettySolrRunner Jetty properties: {hostContext=/d, solrconfig=solrconfig.xml, solr.data.dir=/home/jenkins/jenkins-slave/workspace/Lucene-Solr-Tests-master/solr/build/solr-core/test/J1/temp/solr.schema.TestCloudSchemaless_F4BBC4C798DC9271-001/tempDir-001/jetty3, hostPort=33210, coreRootDirectory=/home/jenkins/jenkins-slave/workspace/Lucene-Solr-Tests-master/solr/build/solr-core/test/J1/../../../../../../../../../../home/jenkins/jenkins-slave/workspace/Lucene-Solr-Tests-master/solr/build/solr-core/test/J1/temp/solr.schema.TestCloudSchemaless_F4BBC4C798DC9271-001/shard-3-001/cores, replicaType=NRT}
   [junit4]   2> 2246562 ERROR (closeThreadPool-8899-thread-3) [     ] o.a.s.u.StartupLoggingUtils Missing Java Option solr.log.dir. Logging may be missing or incomplete.
   [junit4]   2> 2246562 INFO  (closeThreadPool-8899-thread-3) [     ] o.a.s.s.SolrDispatchFilter Using logger factory org.apache.logging.slf4j.Log4jLoggerFactory
   [junit4]   2> 2246562 INFO  (closeThreadPool-8899-thread-3) [     ] o.a.s.s.SolrDispatchFilter  ___      _       Welcome to Apache Solr? version 9.0.0
   [junit4]   2> 2246562 INFO  (closeThreadPool-8899-thread-3) [     ] o.a.s.s.SolrDispatchFilter / __| ___| |_ _   Starting in cloud mode on port null
   [junit4]   2> 2246562 INFO  (closeThreadPool-8899-thread-3) [     ] o.a.s.s.SolrDispatchFilter \__ \/ _ \ | '_|  Install dir: null
   [junit4]   2> 2246562 INFO  (closeThreadPool-8899-thread-3) [     ] o.a.s.s.SolrDispatchFilter |___/\___/_|_|    Start time: 2019-08-30T01:18:16.950886Z
   [junit4]   2> 2246565 INFO  (closeThreadPool-8899-thread-1) [     ] o.a.s.c.AbstractFullDistribZkTestBase waitForLiveNode: 127.0.0.1:36500_d
   [junit4]   2> 2246598 INFO  (closeThreadPool-8899-thread-3) [     ] o.a.s.c.c.ConnectionManager Waiting for client to connect to ZooKeeper
   [junit4]   2> 2246807 INFO  (zkConnectionManagerCallback-8923-thread-1) [     ] o.a.s.c.c.ConnectionManager zkClient has connected
   [junit4]   2> 2246817 INFO  (closeThreadPool-8899-thread-3) [     ] o.a.s.c.c.ConnectionManager Client is connected to ZooKeeper
   [junit4]   2> 2246962 INFO  (closeThreadPool-8899-thread-3) [     ] o.a.s.s.SolrDispatchFilter Loading solr.xml from SolrHome (not found in ZooKeeper)
   [junit4]   2> 2246962 INFO  (closeThreadPool-8899-thread-3) [     ] o.a.s.c.SolrXmlConfig Loading container configuration from /home/jenkins/jenkins-slave/workspace/Lucene-Solr-Tests-master/solr/build/solr-core/test/J1/temp/solr.schema.TestCloudSchemaless_F4BBC4C798DC9271-001/shard-3-001/solr.xml
   [junit4]   2> 2247005 INFO  (closeThreadPool-8899-thread-3) [     ] o.a.s.c.SolrXmlConfig Configuration parameter autoReplicaFailoverWorkLoopDelay is ignored
   [junit4]   2> 2247005 INFO  (closeThreadPool-8899-thread-3) [     ] o.a.s.c.SolrXmlConfig Configuration parameter autoReplicaFailoverBadNodeExpiration is ignored
   [junit4]   2> 2247006 INFO  (closeThreadPool-8899-thread-3) [     ] o.a.s.c.SolrXmlConfig MBean server found: com.sun.jmx.mbeanserver.JmxMBeanServer@3eba98e2, but no JMX reporters were configured - adding default JMX reporter.
   [junit4]   2> 2247027 INFO  (closeThreadPool-8899-thread-2) [     ] o.a.s.h.c.HttpShardHandlerFactory Host whitelist initialized: WhitelistHostChecker [whitelistHosts=null, whitelistHostCheckingEnabled=false]
   [junit4]   2> 2247084 WARN  (closeThreadPool-8899-thread-2) [     ] o.e.j.u.s.S.config Trusting all certificates configured for Client@28800eb4[provider=null,keyStore=null,trustStore=null]
   [junit4]   2> 2247084 WARN  (closeThreadPool-8899-thread-2) [     ] o.e.j.u.s.S.config No Client EndPointIdentificationAlgorithm configured for Client@28800eb4[provider=null,keyStore=null,trustStore=null]
   [junit4]   2> 2247121 WARN  (closeThreadPool-8899-thread-2) [     ] o.e.j.u.s.S.config Trusting all certificates configured for Client@37cf93d0[provider=null,keyStore=null,trustStore=null]
   [junit4]   2> 2247121 WARN  (closeThreadPool-8899-thread-2) [     ] o.e.j.u.s.S.config No Client EndPointIdentificationAlgorithm configured for Client@37cf93d0[provider=null,keyStore=null,trustStore=null]
   [junit4]   2> 2247122 INFO  (closeThreadPool-8899-thread-2) [     ] o.a.s.c.ZkContainer Zookeeper client=127.0.0.1:44625/solr
   [junit4]   2> 2247173 INFO  (closeThreadPool-8899-thread-2) [     ] o.a.s.c.c.ConnectionManager Waiting for client to connect to ZooKeeper
   [junit4]   2> 2247242 INFO  (zkConnectionManagerCallback-8930-thread-1) [     ] o.a.s.c.c.ConnectionManager zkClient has connected
   [junit4]   2> 2247246 INFO  (closeThreadPool-8899-thread-2) [     ] o.a.s.c.c.ConnectionManager Client is connected to ZooKeeper
   [junit4]   2> 2247421 INFO  (closeThreadPool-8899-thread-2) [n:127.0.0.1:36841_d     ] o.a.s.c.c.ConnectionManager Waiting for client to connect to ZooKeeper
   [junit4]   2> 2247513 INFO  (zkConnectionManagerCallback-8932-thread-1) [     ] o.a.s.c.c.ConnectionManager zkClient has connected
   [junit4]   2> 2247513 INFO  (closeThreadPool-8899-thread-2) [n:127.0.0.1:36841_d     ] o.a.s.c.c.ConnectionManager Client is connected to ZooKeeper
   [junit4]   2> 2247716 INFO  (closeThreadPool-8899-thread-2) [n:127.0.0.1:36841_d     ] o.a.s.c.c.ZkStateReader Updated live nodes from ZooKeeper... (0) -> (2)
   [junit4]   2> 2247789 INFO  (closeThreadPool-8899-thread-2) [n:127.0.0.1:36841_d     ] o.a.s.c.ZkController Publish node=127.0.0.1:36841_d as DOWN
   [junit4]   2> 2247805 INFO  (closeThreadPool-8899-thread-2) [n:127.0.0.1:36841_d     ] o.a.s.c.TransientSolrCoreCacheDefault Allocating transient cache for 4 transient cores
   [junit4]   2> 2247805 INFO  (closeThreadPool-8899-thread-2) [n:127.0.0.1:36841_d     ] o.a.s.c.ZkController Register node as live in ZooKeeper:/live_nodes/127.0.0.1:36841_d
   [junit4]   2> 2247854 INFO  (zkCallback-8897-thread-1) [     ] o.a.s.c.c.ZkStateReader Updated live nodes from ZooKeeper... (2) -> (3)
   [junit4]   2> 2247862 INFO  (zkCallback-8878-thread-1) [     ] o.a.s.c.c.ZkStateReader Updated live nodes from ZooKeeper... (2) -> (3)
   [junit4]   2> 2247862 INFO  (zkCallback-8885-thread-1) [     ] o.a.s.c.c.ZkStateReader Updated live nodes from ZooKeeper... (2) -> (3)
   [junit4]   2> 2247878 INFO  (zkCallback-8919-thread-1) [     ] o.a.s.c.c.ZkStateReader Updated live nodes from ZooKeeper... (2) -> (3)
   [junit4]   2> 2247878 INFO  (zkCallback-8912-thread-1) [     ] o.a.s.c.c.ZkStateReader Updated live nodes from ZooKeeper... (2) -> (3)
   [junit4]   2> 2247995 INFO  (zkCallback-8931-thread-1) [     ] o.a.s.c.c.ZkStateReader Updated live nodes from ZooKeeper... (2) -> (3)
   [junit4]   2> 2247995 INFO  (closeThreadPool-8899-thread-2) [n:127.0.0.1:36841_d     ] o.a.s.c.c.ConnectionManager Waiting for client to connect to ZooKeeper
   [junit4]   2> 2248007 INFO  (zkConnectionManagerCallback-8939-thread-1) [     ] o.a.s.c.c.ConnectionManager zkClient has connected
   [junit4]   2> 2248011 INFO  (closeThreadPool-8899-thread-2) [n:127.0.0.1:36841_d     ] o.a.s.c.c.ConnectionManager Client is connected to ZooKeeper
   [junit4]   2> 2248032 INFO  (closeThreadPool-8899-thread-2) [n:127.0.0.1:36841_d     ] o.a.s.c.c.ZkStateReader Updated live nodes from ZooKeeper... (0) -> (3)
   [junit4]   2> 2248084 INFO  (closeThreadPool-8899-thread-2) [n:127.0.0.1:36841_d     ] o.a.s.c.s.i.ZkClientClusterStateProvider Cluster at 127.0.0.1:44625/solr ready
   [junit4]   2> 2248085 INFO  (closeThreadPool-8899-thread-2) [n:127.0.0.1:36841_d     ] o.a.s.c.PackageManager clusterprops.json changed , version 0
   [junit4]   2> 2248230 INFO  (closeThreadPool-8899-thread-2) [n:127.0.0.1:36841_d     ] o.a.s.h.a.MetricsHistoryHandler No .system collection, keeping metrics history in memory.
   [junit4]   2> 2248291 INFO  (closeThreadPool-8899-thread-2) [n:127.0.0.1:36841_d     ] o.a.s.m.r.SolrJmxReporter JMX monitoring for 'solr.node' (registry 'solr.node') enabled at server: com.sun.jmx.mbeanserver.JmxMBeanServer@3eba98e2
   [junit4]   2> 2248378 INFO  (closeThreadPool-8899-thread-2) [n:127.0.0.1:36841_d     ] o.a.s.m.r.SolrJmxReporter JMX monitoring for 'solr.jvm' (registry 'solr.jvm') enabled at server: com.sun.jmx.mbeanserver.JmxMBeanServer@3eba98e2
   [junit4]   2> 2248396 INFO  (closeThreadPool-8899-thread-2) [n:127.0.0.1:36841_d     ] o.a.s.m.r.SolrJmxReporter JMX monitoring for 'solr.jetty' (registry 'solr.jetty') enabled at server: com.sun.jmx.mbeanserver.JmxMBeanServer@3eba98e2
   [junit4]   2> 2248398 INFO  (closeThreadPool-8899-thread-2) [n:127.0.0.1:36841_d     ] o.a.s.c.CorePropertiesLocator Found 0 core definitions underneath /home/jenkins/jenkins-slave/workspace/Lucene-Solr-Tests-master/solr/build/solr-core/test/J1/../../../../../../../../../../home/jenkins/jenkins-slave/workspace/Lucene-Solr-Tests-master/solr/build/solr-core/test/J1/temp/solr.schema.TestCloudSchemaless_F4BBC4C798DC9271-001/shard-2-001/cores
   [junit4]   2> 2248447 INFO  (closeThreadPool-8899-thread-3) [     ] o.a.s.h.c.HttpShardHandlerFactory Host whitelist initialized: WhitelistHostChecker [whitelistHosts=null, whitelistHostCheckingEnabled=false]
   [junit4]   2> 2248450 WARN  (closeThreadPool-8899-thread-3) [     ] o.e.j.u.s.S.config Trusting all certificates configured for Client@39a0aa10[provider=null,keyStore=null,trustStore=null]
   [junit4]   2> 2248450 WARN  (closeThreadPool-8899-thread-3) [     ] o.e.j.u.s.S.config No Client EndPointIdentificationAlgorithm configured for Client@39a0aa10[provider=null,keyStore=null,trustStore=null]
   [junit4]   2> 2248555 WARN  (closeThreadPool-8899-thread-3) [     ] o.e.j.u.s.S.config Trusting all certificates configured for Client@6d4785a4[provider=null,keyStore=null,trustStore=null]
   [junit4]   2> 2248555 WARN  (closeThreadPool-8899-thread-3) [     ] o.e.j.u.s.S.config No Client EndPointIdentificationAlgorithm configured for Client@6d4785a4[provider=null,keyStore=null,trustStore=null]
   [junit4]   2> 2248556 INFO  (closeThreadPool-8899-thread-3) [     ] o.a.s.c.ZkContainer Zookeeper client=127.0.0.1:44625/solr
   [junit4]   2> 2248571 INFO  (closeThreadPool-8899-thread-3) [     ] o.a.s.c.c.ConnectionManager Waiting for client to connect to ZooKeeper
   [junit4]   2> 2248624 INFO  (closeThreadPool-8899-thread-2) [     ] o.a.s.c.AbstractFullDistribZkTestBase waitForLiveNode: 127.0.0.1:36841_d
   [junit4]   2> 2248656 INFO  (zkConnectionManagerCallback-8946-thread-1) [     ] o.a.s.c.c.ConnectionManager zkClient has connected
   [junit4]   2> 2248656 INFO  (closeThreadPool-8899-thread-3) [     ] o.a.s.c.c.ConnectionManager Client is connected to ZooKeeper
   [junit4]   2> 2248919 INFO  (closeThreadPool-8899-thread-3) [n:127.0.0.1:33210_d     ] o.a.s.c.c.ConnectionManager Waiting for client to connect to ZooKeeper
   [junit4]   2> 2249012 INFO  (zkConnectionManagerCallback-8948-thread-1) [     ] o.a.s.c.c.ConnectionManager zkClient has connected
   [junit4]   2> 2249012 INFO  (closeThreadPool-8899-thread-3) [n:127.0.0.1:33210_d     ] o.a.s.c.c.ConnectionManager Client is connected to ZooKeeper
   [junit4]   2> 2249052 INFO  (closeThreadPool-8899-thread-3) [n:127.0.0.1:33210_d     ] o.a.s.c.c.ZkStateReader Updated live nodes from ZooKeeper... (0) -> (3)
   [junit4]   2> 2249117 INFO  (closeThreadPool-8899-thread-3) [n:127.0.0.1:33210_d     ] o.a.s.c.ZkController Publish node=127.0.0.1:33210_d as DOWN
   [junit4]   2> 2249134 INFO  (closeThreadPool-8899-thread-3) [n:127.0.0.1:33210_d     ] o.a.s.c.TransientSolrCoreCacheDefault Allocating transient cache for 4 transient cores
   [junit4]   2> 2249134 INFO  (closeThreadPool-8899-thread-3) [n:127.0.0.1:33210_d     ] o.a.s.c.ZkController Register node as live in ZooKeeper:/live_nodes/127.0.0.1:33210_d
   [junit4]   2> 2249136 INFO  (zkCallback-8878-thread-1) [     ] o.a.s.c.c.ZkStateReader Updated live nodes from ZooKeeper... (3) -> (4)
   [junit4]   2> 2249154 INFO  (zkCallback-8931-thread-1) [     ] o.a.s.c.c.ZkStateReader Updated live nodes from ZooKeeper... (3) -> (4)
   [junit4]   2> 2249155 INFO  (zkCallback-8897-thread-1) [     ] o.a.s.c.c.ZkStateReader Updated live nodes from ZooKeeper... (3) -> (4)
   [junit4]   2> 2249155 INFO  (zkCallback-8912-thread-1) [     ] o.a.s.c.c.ZkStateReader Updated live nodes from ZooKeeper... (3) -> (4)
   [junit4]   2> 2249155 INFO  (zkCallback-8885-thread-1) [     ] o.a.s.c.c.ZkStateReader Updated live nodes from ZooKeeper... (3) -> (4)
   [junit4]   2> 2249174 INFO  (closeThreadPool-8899-thread-3) [n:127.0.0.1:33210_d     ] o.a.s.c.c.ConnectionManager Waiting for client to connect to ZooKeeper
   [junit4]   2> 2249175 INFO  (zkConnectionManagerCallback-8955-thread-1) [     ] o.a.s.c.c.ConnectionManager zkClient has connected
   [junit4]   2> 2249175 INFO  (closeThreadPool-8899-thread-3) [n:127.0.0.1:33210_d     ] o.a.s.c.c.ConnectionManager Client is connected to ZooKeeper
   [junit4]   2> 2249176 INFO  (zkCallback-8947-thread-1) [     ] o.a.s.c.c.ZkStateReader Updated live nodes from ZooKeeper... (3) -> (4)
   [junit4]   2> 2249176 INFO  (zkCallback-8938-thread-1) [     ] o.a.s.c.c.ZkStateReader Updated live nodes from ZooKeeper... (3) -> (4)
   [junit4]   2> 2249176 INFO  (closeThreadPool-8899-thread-3) [n:127.0.0.1:33210_d     ] o.a.s.c.c.ZkStateReader Updated live nodes from ZooKeeper... (0) -> (4)
   [junit4]   2> 2249177 INFO  (closeThreadPool-8899-thread-3) [n:127.0.0.1:33210_d     ] o.a.s.c.s.i.ZkClientClusterStateProvider Cluster at 127.0.0.1:44625/solr ready
   [junit4]   2> 2249178 INFO  (closeThreadPool-8899-thread-3) [n:127.0.0.1:33210_d     ] o.a.s.c.PackageManager clusterprops.json changed , version 0
   [junit4]   2> 2249186 INFO  (zkCallback-8919-thread-1) [     ] o.a.s.c.c.ZkStateReader Updated live nodes from ZooKeeper... (3) -> (4)
   [junit4]   2> 2249280 INFO  (closeThreadPool-8899-thread-3) [n:127.0.0.1:33210_d     ] o.a.s.h.a.MetricsHistoryHandler No .system collection, keeping metrics history in memory.
   [junit4]   2> 2249480 INFO  (TEST-TestCloudSchemaless.test-seed#[F4BBC4C798DC9271]) [     ] o.a.s.c.AbstractFullDistribZkTestBase create jetty 4 in directory /home/jenkins/jenkins-slave/workspace/Lucene-Solr-Tests-master/solr/build/solr-core/test/J1/temp/solr.schema.TestCloudSchemaless_F4BBC4C798DC9271-001/shard-4-001 of type NRT
   [junit4]   2> 2249481 WARN  (closeThreadPool-8899-thread-2) [     ] o.e.j.s.AbstractConnector Ignoring deprecated socket close linger time
   [junit4]   2> 2249481 INFO  (closeThreadPool-8899-thread-2) [     ] o.a.s.c.s.e.JettySolrRunner Start Jetty (original configured port=0)
   [junit4]   2> 2249481 INFO  (closeThreadPool-8899-thread-2) [     ] o.a.s.c.s.e.JettySolrRunner Trying to start Jetty on port 0 try number 1 ...
   [junit4]   2> 2249481 INFO  (closeThreadPool-8899-thread-2) [     ] o.e.j.s.Server jetty-9.4.19.v20190610; built: 2019-06-10T16:30:51.723Z; git: afcf563148970e98786327af5e07c261fda175d3; jvm 11.0.1+13-LTS
   [junit4]   2> 2249500 INFO  (closeThreadPool-8899-thread-3) [n:127.0.0.1:33210_d     ] o.a.s.m.r.SolrJmxReporter JMX monitoring for 'solr.node' (registry 'solr.node') enabled at server: com.sun.jmx.mbeanserver.JmxMBeanServer@3eba98e2
   [junit4]   2> 2249591 INFO  (closeThreadPool-8899-thread-3) [n:127.0.0.1:33210_d     ] o.a.s.m.r.SolrJmxReporter JMX monitoring for 'solr.jvm' (registry 'solr.jvm') enabled at server: com.sun.jmx.mbeanserver.JmxMBeanServer@3eba98e2
   [junit4]   2> 2249591 INFO  (closeThreadPool-8899-thread-3) [n:127.0.0.1:33210_d     ] o.a.s.m.r.SolrJmxReporter JMX monitoring for 'solr.jetty' (registry 'solr.jetty') enabled at server: com.sun.jmx.mbeanserver.JmxMBeanServer@3eba98e2
   [junit4]   2> 2249609 INFO  (closeThreadPool-8899-thread-3) [n:127.0.0.1:33210_d     ] o.a.s.c.CorePropertiesLocator Found 0 core definitions underneath /home/jenkins/jenkins-slave/workspace/Lucene-Solr-Tests-master/solr/build/solr-core/test/J1/../../../../../../../../../../home/jenkins/jenkins-slave/workspace/Lucene-Solr-Tests-master/solr/build/solr-core/test/J1/temp/solr.schema.TestCloudSchemaless_F4BBC4C798DC9271-001/shard-3-001/cores
   [junit4]   2> 2250042 INFO  (closeThreadPool-8899-thread-2) [     ] o.e.j.s.session DefaultSessionIdManager workerName=node0
   [junit4]   2> 2250042 INFO  (closeThreadPool-8899-thread-2) [     ] o.e.j.s.session No SessionScavenger set, using defaults
   [junit4]   2> 2250042 INFO  (closeThreadPool-8899-thread-2) [     ] o.e.j.s.session node0 Scavenging every 660000ms
   [junit4]   2> 2250086 INFO  (closeThreadPool-8899-thread-2) [     ] o.e.j.s.h.ContextHandler Started o.e.j.s.ServletContextHandler@6c7034cb{/d,null,AVAILABLE}
   [junit4]   2> 2250094 INFO  (closeThreadPool-8899-thread-2) [     ] o.e.j.s.AbstractConnector Started ServerConnector@38bec018{HTTP/1.1,[http/1.1, h2c]}{127.0.0.1:45764}
   [junit4]   2> 2250094 INFO  (closeThreadPool-8899-thread-2) [     ] o.e.j.s.Server Started @2250210ms
   [junit4]   2> 2250094 INFO  (closeThreadPool-8899-thread-2) [     ] o.a.s.c.s.e.JettySolrRunner Jetty properties: {hostContext=/d, solrconfig=solrconfig.xml, solr.data.dir=/home/jenkins/jenkins-slave/workspace/Lucene-Solr-Tests-master/solr/build/solr-core/test/J1/temp/solr.schema.TestCloudSchemaless_F4BBC4C798DC9271-001/tempDir-001/jetty4, hostPort=45764, coreRootDirectory=/home/jenkins/jenkins-slave/workspace/Lucene-Solr-Tests-master/solr/build/solr-core/test/J1/../../../../../../../../../../home/jenkins/jenkins-slave/workspace/Lucene-Solr-Tests-master/solr/build/solr-core/test/J1/temp/solr.schema.TestCloudSchemaless_F4BBC4C798DC9271-001/shard-4-001/cores, replicaType=NRT}
   [junit4]   2> 2250095 ERROR (closeThreadPool-8899-thread-2) [     ] o.a.s.u.StartupLoggingUtils Missing Java Option solr.log.dir. Logging may be missing or incomplete.
   [junit4]   2> 2250095 INFO  (closeThreadPool-8899-thread-2) [     ] o.a.s.s.SolrDispatchFilter Using logger factory org.apache.logging.slf4j.Log4jLoggerFactory
   [junit4]   2> 2250095 INFO  (closeThreadPool-8899-thread-2) [     ] o.a.s.s.SolrDispatchFilter  ___      _       Welcome to Apache Solr? version 9.0.0
   [junit4]   2> 2250095 INFO  (closeThreadPool-8899-thread-2) [     ] o.a.s.s.SolrDispatchFilter / __| ___| |_ _   Starting in cloud mode on port null
   [junit4]   2> 2250095 INFO  (closeThreadPool-8899-thread-2) [     ] o.a.s.s.SolrDispatchFilter \__ \/ _ \ | '_|  Install dir: null
   [junit4]   2> 2250095 INFO  (closeThreadPool-8899-thread-2) [     ] o.a.s.s.SolrDispatchFilter |___/\___/_|_|    Start time: 2019-08-30T01:18:20.483256Z
   [junit4]   2> 2250188 INFO  (closeThreadPool-8899-thread-2) [     ] o.a.s.c.c.ConnectionManager Waiting for client to connect to ZooKeeper
   [junit4]   2> 2250227 INFO  (zkConnectionManagerCallback-8958-thread-1) [     ] o.a.s.c.c.ConnectionManager zkClient has connected
   [junit4]   2> 2250227 INFO  (closeThreadPool-8899-thread-2) [     ] o.a.s.c.c.ConnectionManager Client is connected to ZooKeeper
   [junit4]   2> 2250365 INFO  (closeThreadPool-8899-thread-2) [     ] o.a.s.s.SolrDispatchFilter Loading solr.xml from SolrHome (not found in ZooKeeper)
   [junit4]   2> 2250365 INFO  (closeThreadPool-8899-thread-2) [     ] o.a.s.c.SolrXmlConfig Loading container configuration from /home/jenkins/jenkins-slave/workspace/Lucene-Solr-Tests-master/solr/build/solr-core/test/J1/temp/solr.schema.TestCloudSchemaless_F4BBC4C798DC9271-001/shard-4-001/solr.xml
   [junit4]   2> 2250368 INFO  (closeThreadPool-8899-thread-2) [     ] o.a.s.c.SolrXmlConfig Configuration parameter autoReplicaFailoverWorkLoopDelay is ignored
   [junit4]   2> 2250368 INFO  (closeThreadPool-8899-thread-2) [     ] o.a.s.c.SolrXmlConfig Configuration parameter autoReplicaFailoverBadNodeExpiration is ignored
   [junit4]   2> 2250369 INFO  (closeThreadPool-8899-thread-2) [     ] o.a.s.c.SolrXmlConfig MBean server found: com.sun.jmx.mbeanserver.JmxMBeanServer@3eba98e2, but no JMX reporters were configured - adding default JMX reporter.
   [junit4]   2> 2250644 INFO  (closeThreadPool-8899-thread-3) [     ] o.a.s.c.AbstractFullDistribZkTestBase waitForLiveNode: 127.0.0.1:33210_d
   [junit4]   2> 2251338 INFO  (TEST-TestCloudSchemaless.test-seed#[F4BBC4C798DC9271]) [     ] o.a.s.c.AbstractFullDistribZkTestBase create jetty 5 in directory /home/jenkins/jenkins-slave/workspace/Lucene-Solr-Tests-master/solr/build/solr-core/test/J1/temp/solr.schema.TestCloudSchemaless_F4BBC4C798DC9271-001/shard-5-001 of type NRT
   [junit4]   2> 2251371 WARN  (closeThreadPool-8899-thread-3) [     ] o.e.j.s.AbstractConnector Ignoring deprecated socket close linger time
   [junit4]   2> 2251371 INFO  (closeThreadPool-8899-thread-3) [     ] o.a.s.c.s.e.JettySolrRunner Start Jetty (original configured port=0)
   [junit4]   2> 2251371 INFO  (closeThreadPool-8899-thread-3) [     ] o.a.s.c.s.e.JettySolrRunner Trying to start Jetty on port 0 try number 1 ...
   [junit4]   2> 2251371 INFO  (closeThreadPool-8899-thread-3) [     ] o.e.j.s.Server jetty-9.4.19.v20190610; built: 2019-06-10T16:30:51.723Z; git: afcf563148970e98786327af5e07c261fda175d3; jvm 11.0.1+13-LTS
   [junit4]   2> 2251513 INFO  (closeThreadPool-8899-thread-3) [     ] o.e.j.s.session DefaultSessionIdManager workerName=node0
   [junit4]   2> 2251513 INFO  (closeThreadPool-8899-thread-3) [     ] o.e.j.s.session No SessionScavenger set, using defaults
   [junit4]   2> 2251513 INFO  (closeThreadPool-8899-thread-3) [     ] o.e.j.s.session node0 Scavenging every 600000ms
   [junit4]   2> 2251513 INFO  (closeThreadPool-8899-thread-3) [     ] o.e.j.s.h.ContextHandler Started o.e.j.s.ServletContextHandler@67945334{/d,null,AVAILABLE}
   [junit4]   2> 2251529 INFO  (closeThreadPool-8899-thread-3) [     ] o.e.j.s.AbstractConnector Started ServerConnector@5ce4d692{HTTP/1.1,[http/1.1, h2c]}{127.0.0.1:38005}
   [junit4]   2> 2251529 INFO  (closeThreadPool-8899-thread-3) [     ] o.e.j.s.Server Started @2251645ms
   [junit4]   2> 2251529 INFO  (closeThreadPool-8899-thread-3) [     ] o.a.s.c.s.e.JettySolrRunner Jetty properties: {hostContext=/d, solrconfig=solrconfig.xml, solr.data.dir=/home/jenkins/jenkins-slave/workspace/Lucene-Solr-Tests-master/solr/build/solr-core/test/J1/temp/solr.schema.TestCloudSchemaless_F4BBC4C798DC9271-001/tempDir-001/jetty5, hostPort=38005, coreRootDirectory=/home/jenkins/jenkins-slave/workspace/Lucene-Solr-Tests-master/solr/build/solr-core/test/J1/../../../../../../../../../../home/jenkins/jenkins-slave/workspace/Lucene-Solr-Tests-master/solr/build/solr-core/test/J1/temp/solr.schema.TestCloudSchemaless_F4BBC4C798DC9271-001/shard-5-001/cores, replicaType=NRT}
   [junit4]   2> 2251529 ERROR (closeThreadPool-8899-thread-3) [     ] o.a.s.u.StartupLoggingUtils Missing Java Option solr.log.dir. Logging may be missing or incomplete.
   [junit4]   2> 2251529 INFO  (closeThreadPool-8899-thread-3) [     ] o.a.s.s.SolrDispatchFilter Using logger factory org.apache.logging.slf4j.Log4jLoggerFactory
   [junit4]   2> 2251529 INFO  (closeThreadPool-8899-thread-3) [     ] o.a.s.s.SolrDispatchFilter  ___      _       Welcome to Apache Solr? version 9.0.0
   [junit4]   2> 2251529 INFO  (closeThreadPool-8899-thread-3) [     ] o.a.s.s.SolrDispatchFilter / __| ___| |_ _   Starting in cloud mode on port null
   [junit4]   2> 2251529 INFO  (closeThreadPool-8899-thread-3) [     ] o.a.s.s.SolrDispatchFilter \__ \/ _ \ | '_|  Install dir: null
   [junit4]   2> 2251529 INFO  (closeThreadPool-8899-thread-3) [     ] o.a.s.s.SolrDispatchFilter |___/\___/_|_|    Start time: 2019-08-30T01:18:21.917565Z
   [junit4]   2> 2251530 INFO  (closeThreadPool-8899-thread-3) [     ] o.a.s.c.c.ConnectionManager Waiting for client to connect to ZooKeeper
   [junit4]   2> 2251545 INFO  (zkConnectionManagerCallback-8961-thread-1) [     ] o.a.s.c.c.ConnectionManager zkClient has connected
   [junit4]   2> 2251545 INFO  (closeThreadPool-8899-thread-3) [     ] o.a.s.c.c.ConnectionManager Client is connected to ZooKeeper
   [junit4]   2> 2251658 INFO  (closeThreadPool-8899-thread-3) [     ] o.a.s.s.SolrDispatchFilter Loading solr.xml from SolrHome (not found in ZooKeeper)
   [junit4]   2> 2251658 INFO  (closeThreadPool-8899-thread-3) [     ] o.a.s.c.SolrXmlConfig Loading container configuration from /home/jenkins/jenkins-slave/workspace/Lucene-Solr-Tests-master/solr/build/solr-core/test/J1/temp/solr.schema.TestCloudSchemaless_F4BBC4C798DC9271-001/shard-5-001/solr.xml
   [junit4]   2> 2251661 INFO  (closeThreadPool-8899-thread-3) [     ] o.a.s.c.SolrXmlConfig Configuration parameter autoReplicaFailoverWorkLoopDelay is ignored
   [junit4]   2> 2251661 INFO  (closeThreadPool-8899-thread-3) [     ] o.a.s.c.SolrXmlConfig Configuration parameter autoReplicaFailoverBadNodeExpiration is ignored
   [junit4]   2> 2251662 INFO  (closeThreadPool-8899-thread-3) [     ] o.a.s.c.SolrXmlConfig MBean server found: com.sun.jmx.mbeanserver.JmxMBeanServer@3eba98e2, but no JMX reporters were configured - adding default JMX reporter.
   [junit4]   2> 2251672 INFO  (closeThreadPool-8899-thread-2) [     ] o.a.s.h.c.HttpShardHandlerFactory Host whitelist initialized: WhitelistHostChecker [whitelistHosts=null, whitelistHostCheckingEnabled=false]
   [junit4]   2> 2251703 WARN  (closeThreadPool-8899-thread-2) [     ] o.e.j.u.s.S.config Trusting all certificates configured for Client@63aee9b2[provider=null,keyStore=null,trustStore=null]
   [junit4]   2> 2251703 WARN  (closeThreadPool-8899-thread-2) [     ] o.e.j.u.s.S.config No Client EndPointIdentificationAlgorithm configured for Client@63aee9b2[provider=null,keyStore=null,trustStore=null]
   [junit4]   2> 2251846 WARN  (closeThreadPool-8899-thread-2) [     ] o.e.j.u.s.S.config Trusting all certificates configured for Client@b656832[provider=null,keyStore=null,trustStore=null]
   [junit4]   2> 2251846 WARN  (closeThreadPool-8899-thread-2) [     ] o.e.j.u.s.S.config No Client EndPointIdentificationAlgorithm configured for Client@b656832[provider=null,keyStore=null,trustStore=null]
   [junit4]   2> 2251847 INFO  (closeThreadPool-8899-thread-2) [     ] o.a.s.c.ZkContainer Zookeeper client=127.0.0.1:44625/solr
   [junit4]   2> 2251901 INFO  (closeThreadPool-8899-thread-2) [     ] o.a.s.c.c.ConnectionManager Waiting for client to connect to ZooKeeper
   [junit4]   2> 2251917 INFO  (zkConnectionManagerCallback-8968-thread-1) [     ] o.a.s.c.c.ConnectionManager zkClient has connected
   [junit4]   2> 2251921 INFO  (closeThreadPool-8899-thread-2) [     ] o.a.s.c.c.ConnectionManager Client is connected to ZooKeeper
   [junit4]   2> 2252157 INFO  (closeThreadPool-8899-thread-2) [     ] o.a.s.c.c.ConnectionManager Waiting for client to connect to ZooKeeper
   [junit4]   2> 2252157 INFO  (zkConnectionManagerCallback-8970-thread-1) [     ] o.a.s.c.c.ConnectionManager zkClient has connected
   [junit4]   2> 2252157 INFO  (closeThreadPool-8899-thread-2) [     ] o.a.s.c.c.ConnectionManager Client is connected to ZooKeeper
   [junit4]   2> 2252289 INFO  (closeThreadPool-8899-thread-2) [     ] o.a.s.c.c.ZkStateReader Updated live nodes from ZooKeeper... (0) -> (4)
   [junit4]   2> 2252488 INFO  (closeThreadPool-8899-thread-3) [     ] o.a.s.h.c.HttpShardHandlerFactory Host whitelist initialized: WhitelistHostChecker [whitelistHosts=null, whitelistHostCheckingEnabled=false]
   [junit4]   2> 2252502 WARN  (closeThreadPool-8899-thread-3) [     ] o.e.j.u.s.S.config Trusting all certificates configured for Client@63df95c0[provider=null,keyStore=null,trustStore=null]
   [junit4]   2> 2252502 WARN  (closeThreadPool-8899-thread-3) [     ] o.e.j.u.s.S.config No Client EndPointIdentificationAlgorithm configured for Client@63df95c0[provider=null,keyStore=null,trustStore=null]
   [junit4]   2> 2252523 WARN  (closeThreadPool-8899-thread-3) [     ] o.e.j.u.s.S.config Trusting all certificates configured for Client@58404c79[provider=null,keyStore=null,trustStore=null]
   [junit4]   2> 2252523 WARN  (closeThreadPool-8899-thread-3) [     ] o.e.j.u.s.S.config No Client EndPointIdentificationAlgorithm configured for Client@58404c79[provider=null,keyStore=null,trustStore=null]
   [junit4]   2> 2252524 INFO  (closeThreadPool-8899-thread-3) [     ] o.a.s.c.ZkContainer Zookeeper client=127.0.0.1:44625/solr
   [junit4]   2> 2252525 INFO  (closeThreadPool-8899-thread-2) [     ] o.a.s.c.ZkController Publish node=127.0.0.1:45764_d as DOWN
   [junit4]   2> 2252538 INFO  (closeThreadPool-8899-thread-3) [     ] o.a.s.c.c.ConnectionManager Waiting for client to connect to ZooKeeper
   [junit4]   2> 2252546 INFO  (closeThreadPool-8899-thread-2) [     ] o.a.s.c.TransientSolrCoreCacheDefault Allocating transient cache for 4 transient cores
   [junit4]   2> 2252546 INFO  (closeThreadPool-8899-thread-2) [     ] o.a.s.c.ZkController Register node as live in ZooKeeper:/live_nodes/127.0.0.1:45764_d
   [junit4]   2> 2252559 INFO  (TEST-TestCloudSchemaless.test-seed#[F4BBC4C798DC9271]) [     ] o.a.s.c.AbstractFullDistribZkTestBase create jetty 6 in directory /home/jenkins/jenkins-slave/workspace/Lucene-Solr-Tests-master/solr/build/solr-core/test/J1/temp/solr.schema.TestCloudSchemaless_F4BBC4C798DC9271-001/shard-6-001 of type NRT
   [junit4]   2> 2252559 WARN  (closeThreadPool-8899-thread-1) [     ] o.e.j.s.AbstractConnector Ignoring deprecated socket close linger time
   [junit4]   2> 2252560 INFO  (closeThreadPool-8899-thread-1) [     ] o.a.s.c.s.e.JettySolrRunner Start Jetty (original configured port=0)
   [junit4]   2> 2252560 INFO  (closeThreadPool-8899-thread-1) [     ] o.a.s.c.s.e.JettySolrRunner Trying to start Jetty on port 0 try number 1 ...
   [junit4]   2> 2252560 INFO  (closeThreadPool-8899-thread-1) [     ] o.e.j.s.Server jetty-9.4.19.v20190610; built: 2019-06-10T16:30:51.723Z; git: afcf563148970e98786327af5e07c261fda175d3; jvm 11.0.1+13-LTS
   [junit4]   2> 2252574 INFO  (zkConnectionManagerCallback-8978-thread-1) [     ] o.a.s.c.c.ConnectionManager zkClient has connected
   [junit4]   2> 2252578 INFO  (closeThreadPool-8899-thread-3) [     ] o.a.s.c.c.ConnectionManager Client is connected to ZooKeeper
   [junit4]   2> 2252583 INFO  (zkCallback-8912-thread-1) [     ] o.a.s.c.c.ZkStateReader Updated live nodes from ZooKeeper... (4) -> (5)
   [junit4]   2> 2252583 INFO  (zkCallback-8931-thread-1) [     ] o.a.s.c.c.ZkStateReader Updated live nodes from ZooKeeper... (4) -> (5)
   [junit4]   2> 2252583 INFO  (zkCallback-8878-thread-1) [     ] o.a.s.c.c.ZkStateReader Updated live nodes from ZooKeeper... (4) -> (5)
   [junit4]   2> 2252583 INFO  (zkCallback-8897-thread-1) [     ] o.a.s.c.c.ZkStateReader Updated live nodes from ZooKeeper... (4) -> (5)
   [junit4]   2> 2252594 INFO  (zkCallback-8947-thread-1) [     ] o.a.s.c.c.ZkStateReader Updated live nodes from ZooKeeper... (4) -> (5)
   [junit4]   2> 2252599 INFO  (zkCallback-8885-thread-1) [     ] o.a.s.c.c.ZkStateReader Updated live nodes from ZooKeeper... (4) -> (5)
   [junit4]   2> 2252599 INFO  (zkCallback-8938-thread-1) [     ] o.a.s.c.c.ZkStateReader Updated live nodes from ZooKeeper... (4) -> (5)
   [junit4]   2> 2252630 INFO  (zkCallback-8919-thread-1) [     ] o.a.s.c.c.ZkStateReader Updated live nodes from ZooKeeper... (4) -> (5)
   [junit4]   2> 2252651 INFO  (zkCallback-8954-thread-1) [     ] o.a.s.c.c.ZkStateReader Updated live nodes from ZooKeeper... (4) -> (5)
   [junit4]   2> 2252651 INFO  (zkCallback-8969-thread-1) [     ] o.a.s.c.c.ZkStateReader Updated live nodes from ZooKeeper... (4) -> (5)
   [junit4]   2> 2252673 INFO  (closeThreadPool-8899-thread-2) [     ] o.a.s.c.c.ConnectionManager Waiting for client to connect to ZooKeeper
   [junit4]   2> 2252687 INFO  (zkConnectionManagerCallback-8983-thread-1) [     ] o.a.s.c.c.ConnectionManager zkClient has connected
   [junit4]   2> 2252687 INFO  (closeThreadPool-8899-thread-2) [     ] o.a.s.c.c.ConnectionManager Client is connected to ZooKeeper
   [junit4]   2> 2252741 INFO  (closeThreadPool-8899-thread-1) [     ] o.e.j.s.session DefaultSessionIdManager workerName=node0
   [junit4]   2> 2252741 INFO  (closeThreadPool-8899-thread-1) [     ] o.e.j.s.session No SessionScavenger set, using defaults
   [junit4]   2> 2252741 INFO  (closeThreadPool-8899-thread-1) [     ] o.e.j.s.session node0 Scavenging every 600000ms
   [junit4]   2> 2252742 INFO  (closeThreadPool-8899-thread-1) [     ] o.e.j.s.h.ContextHandler Started o.e.j.s.ServletContextHandler@2465b1f5{/d,null,AVAILABLE}
   [junit4]   2> 2252742 INFO  (closeThreadPool-8899-thread-1) [     ] o.e.j.s.A

[...truncated too long message...]

Lucene-Solr-Tests-master/lucene/top-level-ivy-settings.xml

resolve:

ivy-availability-check:
[loadresource] Do not set property disallowed.ivy.jars.list as its length is 0.

-ivy-fail-disallowed-ivy-version:

ivy-fail:

ivy-configure:
[ivy:configure] :: loading settings :: file = /home/jenkins/jenkins-slave/workspace/Lucene-Solr-Tests-master/lucene/top-level-ivy-settings.xml

resolve:

ivy-availability-check:
[loadresource] Do not set property disallowed.ivy.jars.list as its length is 0.

-ivy-fail-disallowed-ivy-version:

ivy-fail:

ivy-fail:

ivy-configure:
[ivy:configure] :: loading settings :: file = /home/jenkins/jenkins-slave/workspace/Lucene-Solr-Tests-master/lucene/top-level-ivy-settings.xml

resolve:

ivy-availability-check:
[loadresource] Do not set property disallowed.ivy.jars.list as its length is 0.

-ivy-fail-disallowed-ivy-version:

ivy-fail:

ivy-configure:
[ivy:configure] :: loading settings :: file = /home/jenkins/jenkins-slave/workspace/Lucene-Solr-Tests-master/lucene/top-level-ivy-settings.xml

resolve:

ivy-availability-check:
[loadresource] Do not set property disallowed.ivy.jars.list as its length is 0.

-ivy-fail-disallowed-ivy-version:

ivy-fail:

ivy-fail:

ivy-configure:
[ivy:configure] :: loading settings :: file = /home/jenkins/jenkins-slave/workspace/Lucene-Solr-Tests-master/lucene/top-level-ivy-settings.xml

resolve:

ivy-availability-check:
[loadresource] Do not set property disallowed.ivy.jars.list as its length is 0.

-ivy-fail-disallowed-ivy-version:

ivy-fail:

ivy-fail:

ivy-configure:
[ivy:configure] :: loading settings :: file = /home/jenkins/jenkins-slave/workspace/Lucene-Solr-Tests-master/lucene/top-level-ivy-settings.xml

resolve:

ivy-availability-check:
[loadresource] Do not set property disallowed.ivy.jars.list as its length is 0.

-ivy-fail-disallowed-ivy-version:

ivy-fail:

ivy-fail:

ivy-configure:
[ivy:configure] :: loading settings :: file = /home/jenkins/jenkins-slave/workspace/Lucene-Solr-Tests-master/lucene/top-level-ivy-settings.xml

resolve:

ivy-availability-check:
[loadresource] Do not set property disallowed.ivy.jars.list as its length is 0.

-ivy-fail-disallowed-ivy-version:

ivy-fail:

ivy-fail:

ivy-configure:
[ivy:configure] :: loading settings :: file = /home/jenkins/jenkins-slave/workspace/Lucene-Solr-Tests-master/lucene/top-level-ivy-settings.xml

resolve:

ivy-availability-check:
[loadresource] Do not set property disallowed.ivy.jars.list as its length is 0.

-ivy-fail-disallowed-ivy-version:

ivy-fail:

ivy-fail:

ivy-configure:
[ivy:configure] :: loading settings :: file = /home/jenkins/jenkins-slave/workspace/Lucene-Solr-Tests-master/lucene/top-level-ivy-settings.xml

resolve:

ivy-availability-check:
[loadresource] Do not set property disallowed.ivy.jars.list as its length is 0.

-ivy-fail-disallowed-ivy-version:

ivy-fail:

ivy-fail:

ivy-configure:
[ivy:configure] :: loading settings :: file = /home/jenkins/jenkins-slave/workspace/Lucene-Solr-Tests-master/lucene/top-level-ivy-settings.xml

resolve:

ivy-availability-check:
[loadresource] Do not set property disallowed.ivy.jars.list as its length is 0.

-ivy-fail-disallowed-ivy-version:

ivy-fail:

ivy-fail:

ivy-configure:
[ivy:configure] :: loading settings :: file = /home/jenkins/jenkins-slave/workspace/Lucene-Solr-Tests-master/lucene/top-level-ivy-settings.xml

resolve:

ivy-availability-check:
[loadresource] Do not set property disallowed.ivy.jars.list as its length is 0.

-ivy-fail-disallowed-ivy-version:

ivy-fail:

ivy-fail:

ivy-configure:
[ivy:configure] :: loading settings :: file = /home/jenkins/jenkins-slave/workspace/Lucene-Solr-Tests-master/lucene/top-level-ivy-settings.xml

resolve:

ivy-availability-check:
[loadresource] Do not set property disallowed.ivy.jars.list as its length is 0.

-ivy-fail-disallowed-ivy-version:

ivy-fail:

ivy-fail:

ivy-configure:
[ivy:configure] :: loading settings :: file = /home/jenkins/jenkins-slave/workspace/Lucene-Solr-Tests-master/lucene/top-level-ivy-settings.xml

resolve:

ivy-availability-check:
[loadresource] Do not set property disallowed.ivy.jars.list as its length is 0.

-ivy-fail-disallowed-ivy-version:

ivy-fail:

ivy-fail:

ivy-configure:
[ivy:configure] :: loading settings :: file = /home/jenkins/jenkins-slave/workspace/Lucene-Solr-Tests-master/lucene/top-level-ivy-settings.xml

resolve:

ivy-availability-check:
[loadresource] Do not set property disallowed.ivy.jars.list as its length is 0.

-ivy-fail-disallowed-ivy-version:

ivy-fail:

ivy-fail:

ivy-configure:
[ivy:configure] :: loading settings :: file = /home/jenkins/jenkins-slave/workspace/Lucene-Solr-Tests-master/lucene/top-level-ivy-settings.xml

resolve:

jar-checksums:
    [mkdir] Created dir: /home/jenkins/jenkins-slave/workspace/Lucene-Solr-Tests-master/solr/null895241698
     [copy] Copying 249 files to /home/jenkins/jenkins-slave/workspace/Lucene-Solr-Tests-master/solr/null895241698
   [delete] Deleting directory /home/jenkins/jenkins-slave/workspace/Lucene-Solr-Tests-master/solr/null895241698

check-working-copy:
[ivy:cachepath] :: resolving dependencies :: #;[hidden email]
[ivy:cachepath] confs: [default]
[ivy:cachepath] found org.eclipse.jgit#org.eclipse.jgit;5.3.0.201903130848-r in public
[ivy:cachepath] found com.jcraft#jsch;0.1.54 in public
[ivy:cachepath] found com.jcraft#jzlib;1.1.1 in public
[ivy:cachepath] found com.googlecode.javaewah#JavaEWAH;1.1.6 in public
[ivy:cachepath] found org.slf4j#slf4j-api;1.7.2 in public
[ivy:cachepath] found org.bouncycastle#bcpg-jdk15on;1.60 in public
[ivy:cachepath] found org.bouncycastle#bcprov-jdk15on;1.60 in public
[ivy:cachepath] found org.bouncycastle#bcpkix-jdk15on;1.60 in public
[ivy:cachepath] found org.slf4j#slf4j-nop;1.7.2 in public
[ivy:cachepath] :: resolution report :: resolve 23ms :: artifacts dl 5ms
        ---------------------------------------------------------------------
        |                  |            modules            ||   artifacts   |
        |       conf       | number| search|dwnlded|evicted|| number|dwnlded|
        ---------------------------------------------------------------------
        |      default     |   9   |   0   |   0   |   0   ||   9   |   0   |
        ---------------------------------------------------------------------
[wc-checker] Initializing working copy...
[wc-checker] Checking working copy status...

-jenkins-base:

BUILD SUCCESSFUL
Total time: 184 minutes 46 seconds
Archiving artifacts
java.lang.InterruptedException: no matches found within 10000
        at hudson.FilePath$ValidateAntFileMask.hasMatch(FilePath.java:2847)
        at hudson.FilePath$ValidateAntFileMask.invoke(FilePath.java:2726)
        at hudson.FilePath$ValidateAntFileMask.invoke(FilePath.java:2707)
        at hudson.FilePath$FileCallableWrapper.call(FilePath.java:3086)
Also:   hudson.remoting.Channel$CallSiteStackTrace: Remote call to lucene2
                at hudson.remoting.Channel.attachCallSiteStackTrace(Channel.java:1741)
                at hudson.remoting.UserRequest$ExceptionResponse.retrieve(UserRequest.java:357)
                at hudson.remoting.Channel.call(Channel.java:955)
                at hudson.FilePath.act(FilePath.java:1072)
                at hudson.FilePath.act(FilePath.java:1061)
                at hudson.FilePath.validateAntFileMask(FilePath.java:2705)
                at hudson.tasks.ArtifactArchiver.perform(ArtifactArchiver.java:243)
                at hudson.tasks.BuildStepCompatibilityLayer.perform(BuildStepCompatibilityLayer.java:81)
                at hudson.tasks.BuildStepMonitor$1.perform(BuildStepMonitor.java:20)
                at hudson.model.AbstractBuild$AbstractBuildExecution.perform(AbstractBuild.java:744)
                at hudson.model.AbstractBuild$AbstractBuildExecution.performAllBuildSteps(AbstractBuild.java:690)
                at hudson.model.Build$BuildExecution.post2(Build.java:186)
                at hudson.model.AbstractBuild$AbstractBuildExecution.post(AbstractBuild.java:635)
                at hudson.model.Run.execute(Run.java:1835)
                at hudson.model.FreeStyleBuild.run(FreeStyleBuild.java:43)
                at hudson.model.ResourceController.execute(ResourceController.java:97)
                at hudson.model.Executor.run(Executor.java:429)
Caused: hudson.FilePath$TunneledInterruptedException
        at hudson.FilePath$FileCallableWrapper.call(FilePath.java:3088)
        at hudson.remoting.UserRequest.perform(UserRequest.java:212)
        at hudson.remoting.UserRequest.perform(UserRequest.java:54)
        at hudson.remoting.Request$2.run(Request.java:369)
        at hudson.remoting.InterceptingExecutorService$1.call(InterceptingExecutorService.java:72)
        at java.util.concurrent.FutureTask.run(FutureTask.java:266)
        at java.util.concurrent.ThreadPoolExecutor.runWorker(ThreadPoolExecutor.java:1142)
        at java.util.concurrent.ThreadPoolExecutor$Worker.run(ThreadPoolExecutor.java:617)
        at java.lang.Thread.run(Thread.java:748)
Caused: java.lang.InterruptedException: java.lang.InterruptedException: no matches found within 10000
        at hudson.FilePath.act(FilePath.java:1074)
        at hudson.FilePath.act(FilePath.java:1061)
        at hudson.FilePath.validateAntFileMask(FilePath.java:2705)
        at hudson.tasks.ArtifactArchiver.perform(ArtifactArchiver.java:243)
        at hudson.tasks.BuildStepCompatibilityLayer.perform(BuildStepCompatibilityLayer.java:81)
        at hudson.tasks.BuildStepMonitor$1.perform(BuildStepMonitor.java:20)
        at hudson.model.AbstractBuild$AbstractBuildExecution.perform(AbstractBuild.java:744)
        at hudson.model.AbstractBuild$AbstractBuildExecution.performAllBuildSteps(AbstractBuild.java:690)
        at hudson.model.Build$BuildExecution.post2(Build.java:186)
        at hudson.model.AbstractBuild$AbstractBuildExecution.post(AbstractBuild.java:635)
        at hudson.model.Run.execute(Run.java:1835)
        at hudson.model.FreeStyleBuild.run(FreeStyleBuild.java:43)
        at hudson.model.ResourceController.execute(ResourceController.java:97)
        at hudson.model.Executor.run(Executor.java:429)
No artifacts found that match the file pattern "**/*.events,heapdumps/**,**/hs_err_pid*". Configuration error?
Recording test results
Build step 'Publish JUnit test result report' changed build result to UNSTABLE
Email was triggered for: Unstable (Test Failures)
Sending email for trigger: Unstable (Test Failures)


---------------------------------------------------------------------
To unsubscribe, e-mail: [hidden email]
For additional commands, e-mail: [hidden email]
Reply | Threaded
Open this post in threaded view
|

[JENKINS] Lucene-Solr-Tests-master - Build # 3649 - Failure

Apache Jenkins Server-2
Build: https://builds.apache.org/job/Lucene-Solr-Tests-master/3649/

All tests passed

Build Log:
[...truncated 63909 lines...]
-ecj-javadoc-lint-src:
    [mkdir] Created dir: /tmp/ecj237353181
 [ecj-lint] Compiling 1289 source files to /tmp/ecj237353181
 [ecj-lint] Processing annotations
 [ecj-lint] Annotations processed
 [ecj-lint] Processing annotations
 [ecj-lint] No elements to process
 [ecj-lint] invalid Class-Path header in manifest of jar file: /home/jenkins/.ivy2/cache/org.restlet.jee/org.restlet/jars/org.restlet-2.3.0.jar
 [ecj-lint] invalid Class-Path header in manifest of jar file: /home/jenkins/.ivy2/cache/org.restlet.jee/org.restlet.ext.servlet/jars/org.restlet.ext.servlet-2.3.0.jar
 [ecj-lint] ----------
 [ecj-lint] 1. WARNING in /home/jenkins/jenkins-slave/workspace/Lucene-Solr-Tests-master/solr/core/src/java/org/apache/solr/client/solrj/embedded/EmbeddedSolrServer.java (at line 219)
 [ecj-lint] return (NamedList<Object>) new JavaBinCodec(resolver).unmarshal(in);
 [ecj-lint]                           ^^^^^^^^^^^^^^^^^^^^^^^^^^
 [ecj-lint] Resource leak: '<unassigned Closeable value>' is never closed
 [ecj-lint] ----------
 [ecj-lint] ----------
 [ecj-lint] 2. WARNING in /home/jenkins/jenkins-slave/workspace/Lucene-Solr-Tests-master/solr/core/src/java/org/apache/solr/cloud/RecoveryStrategy.java (at line 232)
 [ecj-lint] ReplicationHandler replicationHandler = (ReplicationHandler) handler;
 [ecj-lint]                   ^^^^^^^^^^^^^^^^^^
 [ecj-lint] Resource leak: 'replicationHandler' is never closed
 [ecj-lint] ----------
 [ecj-lint] 3. WARNING in /home/jenkins/jenkins-slave/workspace/Lucene-Solr-Tests-master/solr/core/src/java/org/apache/solr/cloud/RecoveryStrategy.java (at line 628)
 [ecj-lint] PeerSyncWithLeader peerSyncWithLeader = new PeerSyncWithLeader(core,
 [ecj-lint]                   ^^^^^^^^^^^^^^^^^^
 [ecj-lint] Resource leak: 'peerSyncWithLeader' is never closed
 [ecj-lint] ----------
 [ecj-lint] ----------
 [ecj-lint] 4. WARNING in /home/jenkins/jenkins-slave/workspace/Lucene-Solr-Tests-master/solr/core/src/java/org/apache/solr/cloud/SyncStrategy.java (at line 186)
 [ecj-lint] PeerSync peerSync = new PeerSync(core, syncWith, core.getUpdateHandler().getUpdateLog().getNumRecordsToKeep(), true, peerSyncOnlyWithActive, false);
 [ecj-lint]         ^^^^^^^^
 [ecj-lint] Resource leak: 'peerSync' is never closed
 [ecj-lint] ----------
 [ecj-lint] ----------
 [ecj-lint] 5. WARNING in /home/jenkins/jenkins-slave/workspace/Lucene-Solr-Tests-master/solr/core/src/java/org/apache/solr/cloud/autoscaling/sim/SimCloudManager.java (at line 788)
 [ecj-lint] throw new UnsupportedOperationException("must add at least 1 node first");
 [ecj-lint] ^^^^^^^^^^^^^^^^^^^^^^^^^^^^^^^^^^^^^^^^^^^^^^^^^^^^^^^^^^^^^^^^^^^^^^^^^^
 [ecj-lint] Resource leak: 'queryRequest' is not closed at this location
 [ecj-lint] ----------
 [ecj-lint] 6. WARNING in /home/jenkins/jenkins-slave/workspace/Lucene-Solr-Tests-master/solr/core/src/java/org/apache/solr/cloud/autoscaling/sim/SimCloudManager.java (at line 794)
 [ecj-lint] throw new UnsupportedOperationException("must add at least 1 node first");
 [ecj-lint] ^^^^^^^^^^^^^^^^^^^^^^^^^^^^^^^^^^^^^^^^^^^^^^^^^^^^^^^^^^^^^^^^^^^^^^^^^^
 [ecj-lint] Resource leak: 'queryRequest' is not closed at this location
 [ecj-lint] ----------
 [ecj-lint] ----------
 [ecj-lint] 7. WARNING in /home/jenkins/jenkins-slave/workspace/Lucene-Solr-Tests-master/solr/core/src/java/org/apache/solr/core/CoreContainer.java (at line 726)
 [ecj-lint] SolrFieldCacheBean fieldCacheBean = new SolrFieldCacheBean();
 [ecj-lint]                   ^^^^^^^^^^^^^^
 [ecj-lint] Resource leak: 'fieldCacheBean' is never closed
 [ecj-lint] ----------
 [ecj-lint] ----------
 [ecj-lint] 8. ERROR in /home/jenkins/jenkins-slave/workspace/Lucene-Solr-Tests-master/solr/core/src/java/org/apache/solr/core/SolrResourceLoader.java (at line 19)
 [ecj-lint] import javax.naming.Context;
 [ecj-lint]       ^^^^^^^^^^^^^^^^^^^^
 [ecj-lint] The type javax.naming.Context is not accessible
 [ecj-lint] ----------
 [ecj-lint] 9. ERROR in /home/jenkins/jenkins-slave/workspace/Lucene-Solr-Tests-master/solr/core/src/java/org/apache/solr/core/SolrResourceLoader.java (at line 20)
 [ecj-lint] import javax.naming.InitialContext;
 [ecj-lint]       ^^^^^^^^^^^^^^^^^^^^^^^^^^^
 [ecj-lint] The type javax.naming.InitialContext is not accessible
 [ecj-lint] ----------
 [ecj-lint] 10. ERROR in /home/jenkins/jenkins-slave/workspace/Lucene-Solr-Tests-master/solr/core/src/java/org/apache/solr/core/SolrResourceLoader.java (at line 21)
 [ecj-lint] import javax.naming.NamingException;
 [ecj-lint]       ^^^^^^^^^^^^^^^^^^^^^^^^^^^^
 [ecj-lint] The type javax.naming.NamingException is not accessible
 [ecj-lint] ----------
 [ecj-lint] 11. ERROR in /home/jenkins/jenkins-slave/workspace/Lucene-Solr-Tests-master/solr/core/src/java/org/apache/solr/core/SolrResourceLoader.java (at line 22)
 [ecj-lint] import javax.naming.NoInitialContextException;
 [ecj-lint]       ^^^^^^^^^^^^^^^^^^^^^^^^^^^^^^^^^^^^^^
 [ecj-lint] The type javax.naming.NoInitialContextException is not accessible
 [ecj-lint] ----------
 [ecj-lint] 12. ERROR in /home/jenkins/jenkins-slave/workspace/Lucene-Solr-Tests-master/solr/core/src/java/org/apache/solr/core/SolrResourceLoader.java (at line 776)
 [ecj-lint] Context c = new InitialContext();
 [ecj-lint] ^^^^^^^
 [ecj-lint] Context cannot be resolved to a type
 [ecj-lint] ----------
 [ecj-lint] 13. ERROR in /home/jenkins/jenkins-slave/workspace/Lucene-Solr-Tests-master/solr/core/src/java/org/apache/solr/core/SolrResourceLoader.java (at line 776)
 [ecj-lint] Context c = new InitialContext();
 [ecj-lint]                ^^^^^^^^^^^^^^
 [ecj-lint] InitialContext cannot be resolved to a type
 [ecj-lint] ----------
 [ecj-lint] 14. ERROR in /home/jenkins/jenkins-slave/workspace/Lucene-Solr-Tests-master/solr/core/src/java/org/apache/solr/core/SolrResourceLoader.java (at line 779)
 [ecj-lint] } catch (NoInitialContextException e) {
 [ecj-lint]         ^^^^^^^^^^^^^^^^^^^^^^^^^
 [ecj-lint] NoInitialContextException cannot be resolved to a type
 [ecj-lint] ----------
 [ecj-lint] 15. ERROR in /home/jenkins/jenkins-slave/workspace/Lucene-Solr-Tests-master/solr/core/src/java/org/apache/solr/core/SolrResourceLoader.java (at line 781)
 [ecj-lint] } catch (NamingException e) {
 [ecj-lint]         ^^^^^^^^^^^^^^^
 [ecj-lint] NamingException cannot be resolved to a type
 [ecj-lint] ----------
 [ecj-lint] ----------
 [ecj-lint] 16. WARNING in /home/jenkins/jenkins-slave/workspace/Lucene-Solr-Tests-master/solr/core/src/java/org/apache/solr/handler/CdcrRequestHandler.java (at line 741)
 [ecj-lint] ReplicationHandler replicationHandler = (ReplicationHandler) handler;
 [ecj-lint]                   ^^^^^^^^^^^^^^^^^^
 [ecj-lint] Resource leak: 'replicationHandler' is never closed
 [ecj-lint] ----------
 [ecj-lint] 17. WARNING in /home/jenkins/jenkins-slave/workspace/Lucene-Solr-Tests-master/solr/core/src/java/org/apache/solr/handler/CdcrRequestHandler.java (at line 760)
 [ecj-lint] ReplicationHandler replicationHandler = (ReplicationHandler) handler;
 [ecj-lint]                   ^^^^^^^^^^^^^^^^^^
 [ecj-lint] Resource leak: 'replicationHandler' is never closed
 [ecj-lint] ----------
 [ecj-lint] ----------
 [ecj-lint] 18. WARNING in /home/jenkins/jenkins-slave/workspace/Lucene-Solr-Tests-master/solr/core/src/java/org/apache/solr/handler/SolrConfigHandler.java (at line 819)
 [ecj-lint] new RuntimeLib(req.getCore().getCoreContainer()).init(new PluginInfo(info.tag, op.getDataMap()));
 [ecj-lint] ^^^^^^^^^^^^^^^^^^^^^^^^^^^^^^^^^^^^^^^^^^^^^^^^
 [ecj-lint] Resource leak: '<unassigned Closeable value>' is never closed
 [ecj-lint] ----------
 [ecj-lint] ----------
 [ecj-lint] 19. WARNING in /home/jenkins/jenkins-slave/workspace/Lucene-Solr-Tests-master/solr/core/src/java/org/apache/solr/handler/admin/CollectionHandlerApi.java (at line 207)
 [ecj-lint] RuntimeLib lib = new RuntimeLib(handler.handler.coreContainer);
 [ecj-lint]           ^^^
 [ecj-lint] Resource leak: 'lib' is never closed
 [ecj-lint] ----------
 [ecj-lint] ----------
 [ecj-lint] 20. WARNING in /home/jenkins/jenkins-slave/workspace/Lucene-Solr-Tests-master/solr/core/src/java/org/apache/solr/handler/admin/SegmentsInfoRequestHandler.java (at line 244)
 [ecj-lint] leafReader = ((FilterLeafReader)leafReader).getDelegate();
 [ecj-lint] ^^^^^^^^^^^^^^^^^^^^^^^^^^^^^^^^^^^^^^^^^^^^^^^^^^^^^^^^^
 [ecj-lint] Resource leak: 'leafReader' is not closed at this location
 [ecj-lint] ----------
 [ecj-lint] ----------
 [ecj-lint] 21. WARNING in /home/jenkins/jenkins-slave/workspace/Lucene-Solr-Tests-master/solr/core/src/java/org/apache/solr/handler/component/HttpShardHandler.java (at line 148)
 [ecj-lint] return new JavaBinCodec(null, stringCache).setReadStringAsCharSeq(true);
 [ecj-lint]       ^^^^^^^^^^^^^^^^^^^^^^^^^^^^^^^^^^^
 [ecj-lint] Resource leak: '<unassigned Closeable value>' is never closed
 [ecj-lint] ----------
 [ecj-lint] ----------
 [ecj-lint] 22. WARNING in /home/jenkins/jenkins-slave/workspace/Lucene-Solr-Tests-master/solr/core/src/java/org/apache/solr/handler/component/HttpShardHandlerFactory.java (at line 637)
 [ecj-lint] ZkController zkController = core == null ? null : core.getCoreContainer().getZkController();
 [ecj-lint]             ^^^^^^^^^^^^
 [ecj-lint] Resource leak: 'zkController' is never closed
 [ecj-lint] ----------
 [ecj-lint] ----------
 [ecj-lint] 23. WARNING in /home/jenkins/jenkins-slave/workspace/Lucene-Solr-Tests-master/solr/core/src/java/org/apache/solr/handler/component/RealTimeGetComponent.java (at line 1118)
 [ecj-lint] PeerSyncWithLeader peerSync = new PeerSyncWithLeader(rb.req.getCore(), syncWithLeader, nVersions);
 [ecj-lint]                   ^^^^^^^^
 [ecj-lint] Resource leak: 'peerSync' is never closed
 [ecj-lint] ----------
 [ecj-lint] 24. WARNING in /home/jenkins/jenkins-slave/workspace/Lucene-Solr-Tests-master/solr/core/src/java/org/apache/solr/handler/component/RealTimeGetComponent.java (at line 1140)
 [ecj-lint] PeerSync peerSync = new PeerSync(rb.req.getCore(), replicas, nVersions, cantReachIsSuccess);
 [ecj-lint]         ^^^^^^^^
 [ecj-lint] Resource leak: 'peerSync' is never closed
 [ecj-lint] ----------
 [ecj-lint] ----------
 [ecj-lint] 25. WARNING in /home/jenkins/jenkins-slave/workspace/Lucene-Solr-Tests-master/solr/core/src/java/org/apache/solr/handler/loader/JavabinLoader.java (at line 137)
 [ecj-lint] new JavaBinCodec() {
 [ecj-lint]       SolrParams params;
 [ecj-lint]       AddUpdateCommand addCmd = null;
 [ecj-lint]
 [ecj-lint]       @Override
 [ecj-lint]       public List<Object> readIterator(DataInputInputStream fis) throws IOException {
 [ecj-lint]         while (true) {
 [ecj-lint]           Object o = readVal(fis);
 [ecj-lint]           if (o == END_OBJ) break;
 [ecj-lint]           if (o instanceof NamedList) {
 [ecj-lint]             params = ((NamedList) o).toSolrParams();
 [ecj-lint]           } else {
 [ecj-lint]             try {
 [ecj-lint]               if (o instanceof byte[]) {
 [ecj-lint]                 if (params != null) req.setParams(params);
 [ecj-lint]                 byte[] buf = (byte[]) o;
 [ecj-lint]                 contentStreamLoader.load(req, rsp, new ContentStreamBase.ByteArrayStream(buf, null), processor);
 [ecj-lint]               } else {
 [ecj-lint]                 throw new RuntimeException("unsupported type ");
 [ecj-lint]               }
 [ecj-lint]             } catch (Exception e) {
 [ecj-lint]               throw new RuntimeException(e);
 [ecj-lint]             } finally {
 [ecj-lint]               params = null;
 [ecj-lint]               req.setParams(old);
 [ecj-lint]             }
 [ecj-lint]           }
 [ecj-lint]         }
 [ecj-lint]         return Collections.emptyList();
 [ecj-lint]       }
 [ecj-lint]
 [ecj-lint]     }.unmarshal(in);
 [ecj-lint] ^^^^^^^^^^^^^^^^^^^^^^^^^^^^^^^^^^^^^^^^^^^^^^^^^^^^^^^^^^^^^^^^^^^^^^^^^^^^^^^^^^^^^^^^^^^^^^^^^^^^^^^^^^^^^^^^^^^^^^^^^^^^^^^^^^^^^^^^^^^^^^^^^^^^^^^^^^^^^^^^^^^^^^^^^^^^^^^^^^^^^^^^^^^^^^^^^^^^^^^^^^^^^^^^^^^^^^^^^^^^^^^^^^^^^^^^^^^^^^^^^^^^^^^^^^^^^^^^^^^^^^^^^^^^^^^^^^^^^^^^^^^^^^^^^^^^^^^^^^^^^^^^^^^^^^^^^^^^^^^^^^^^^^^^^^^^^^^^^^^^^^^^^^^^^^^^^^^^^^^^^^^^^^^^^^^^^^^^^^^^^^^^^^^^^^^^^^^^^^^^^^^^^^^^^^^^^^^^^^^^^^^^^^^^^^^^^^^^^^^^^^^^^^^^^^^^^^^^^^^^^^^^^^^^^^^^^^^^^^^^^^^^^^^^^^^^^^^^^^^^^^^^^^^^^^^^^^^^^^^^^^^^^^^^^^^^^^^^^^^^^^^^^^^^^^^^^^^^^^^^^^^^^^^^^^^^^^^^^^^^^^^^^^^^^^^^^^^^^^^^^^^^^^^^^^^^^^^^^^^^^^^^^^^^^^^^^^^^^^^^^^^^^^^^^^^^^^^^^^^^^^^^^^^^^^^^^^^^^^^^^^^^^^^^^^^^^^^^^^^^^^^^^^^^^^^^^^^^^^^^^^^^^^^^^^^^^^^^^^^^^^^^^^^^^^^^^^^^^^^^^^^^^^^^^^^^^^^^^^^^^^^^^^^^^^^^^^^^^^^^^^^^^^^^^^^^^^^^^^^^^^^^^^^^^^^^^^^^^^^^^^^^^^^^^^^^^^^^^^^^^^^^^^^^^^^^^^^^^^^^^^^^^^^^^^^^^^^^^^^^^^^^^^^^^^^^^^^^^^^^^^^^^^^^^^^^^^^^^^^^^^^^^^^^^^^^^^^^^^^^^^^^^^^^^^^^^^^^^^^^^^^^^^^^^^^^^^^^^^^^^^^^^^^^^^^^^^^^^^^^^^^^^^
 [ecj-lint] Resource leak: '<unassigned Closeable value>' is never closed
 [ecj-lint] ----------
 [ecj-lint] ----------
 [ecj-lint] 26. INFO in /home/jenkins/jenkins-slave/workspace/Lucene-Solr-Tests-master/solr/core/src/java/org/apache/solr/logging/log4j2/Log4j2Watcher.java (at line 187)
 [ecj-lint] if (logger == root || root.equals(logger) || isRootLogger(name) || "".equals(name)) {
 [ecj-lint]                                  ^^^^^^
 [ecj-lint] Unlikely argument type for equals(): Map.Entry<String,LoggerConfig> seems to be unrelated to Logger
 [ecj-lint] ----------
 [ecj-lint] ----------
 [ecj-lint] 27. WARNING in /home/jenkins/jenkins-slave/workspace/Lucene-Solr-Tests-master/solr/core/src/java/org/apache/solr/search/CacheConfig.java (at line 147)
 [ecj-lint] MemClassLoader memClassLoader = (MemClassLoader) loader;
 [ecj-lint]               ^^^^^^^^^^^^^^
 [ecj-lint] Resource leak: 'memClassLoader' is never closed
 [ecj-lint] ----------
 [ecj-lint] ----------
 [ecj-lint] 28. WARNING in /home/jenkins/jenkins-slave/workspace/Lucene-Solr-Tests-master/solr/core/src/java/org/apache/solr/update/SolrIndexSplitter.java (at line 258)
 [ecj-lint] HardlinkCopyDirectoryWrapper hardLinkedDir = new HardlinkCopyDirectoryWrapper(splitDir);
 [ecj-lint]                             ^^^^^^^^^^^^^
 [ecj-lint] Resource leak: 'hardLinkedDir' is never closed
 [ecj-lint] ----------
 [ecj-lint] ----------
 [ecj-lint] 29. WARNING in /home/jenkins/jenkins-slave/workspace/Lucene-Solr-Tests-master/solr/core/src/java/org/apache/solr/util/FileUtils.java (at line 52)
 [ecj-lint] try (FileChannel in = new FileInputStream(src).getChannel();
 [ecj-lint]                      ^^^^^^^^^^^^^^^^^^^^^^^^
 [ecj-lint] Resource leak: '<unassigned Closeable value>' is never closed
 [ecj-lint] ----------
 [ecj-lint] 30. WARNING in /home/jenkins/jenkins-slave/workspace/Lucene-Solr-Tests-master/solr/core/src/java/org/apache/solr/util/FileUtils.java (at line 53)
 [ecj-lint] FileChannel out = new FileOutputStream(destination).getChannel()) {
 [ecj-lint]                  ^^^^^^^^^^^^^^^^^^^^^^^^^^^^^^^^^
 [ecj-lint] Resource leak: '<unassigned Closeable value>' is never closed
 [ecj-lint] ----------
 [ecj-lint] ----------
 [ecj-lint] 31. WARNING in /home/jenkins/jenkins-slave/workspace/Lucene-Solr-Tests-master/solr/core/src/java/org/apache/solr/util/SolrCLI.java (at line 1146)
 [ecj-lint] SnapshotCloudManager snapshotCloudManager = new SnapshotCloudManager(simCloudManager, config);
 [ecj-lint]                     ^^^^^^^^^^^^^^^^^^^^
 [ecj-lint] Resource leak: 'snapshotCloudManager' is never closed
 [ecj-lint] ----------
 [ecj-lint] ----------
 [ecj-lint] 32. WARNING in /home/jenkins/jenkins-slave/workspace/Lucene-Solr-Tests-master/solr/core/src/java/org/apache/solr/util/TestInjection.java (at line 263)
 [ecj-lint] timers.remove(this);
 [ecj-lint]              ^^^^
 [ecj-lint] Unlikely argument type new TimerTask(){} for remove(Object) on a Collection<Timer>
 [ecj-lint] ----------
 [ecj-lint] 32 problems (8 errors, 23 warnings, 1 info)

BUILD FAILED
/home/jenkins/jenkins-slave/workspace/Lucene-Solr-Tests-master/build.xml:634: The following error occurred while executing this line:
/home/jenkins/jenkins-slave/workspace/Lucene-Solr-Tests-master/build.xml:101: The following error occurred while executing this line:
/home/jenkins/jenkins-slave/workspace/Lucene-Solr-Tests-master/solr/build.xml:645: The following error occurred while executing this line:
/home/jenkins/jenkins-slave/workspace/Lucene-Solr-Tests-master/lucene/common-build.xml:2009: The following error occurred while executing this line:
/home/jenkins/jenkins-slave/workspace/Lucene-Solr-Tests-master/lucene/common-build.xml:2048: Compile failed; see the compiler error output for details.

Total time: 102 minutes 9 seconds
Build step 'Invoke Ant' marked build as failure
Archiving artifacts
Recording test results
Email was triggered for: Failure - Any
Sending email for trigger: Failure - Any


---------------------------------------------------------------------
To unsubscribe, e-mail: [hidden email]
For additional commands, e-mail: [hidden email]