[JENKINS] Lucene-Solr-Tests-master - Build # 3676 - Unstable

classic Classic list List threaded Threaded
1 message Options
Reply | Threaded
Open this post in threaded view
|

[JENKINS] Lucene-Solr-Tests-master - Build # 3676 - Unstable

Apache Jenkins Server-2
Build: https://builds.apache.org/job/Lucene-Solr-Tests-master/3676/

1 tests failed.
FAILED:  org.apache.solr.search.facet.TestCloudJSONFacetSKG.testRandom

Error Message:
No live SolrServers available to handle this request:[http://127.0.0.1:33121/solr/org.apache.solr.search.facet.TestCloudJSONFacetSKG_collection]

Stack Trace:
org.apache.solr.client.solrj.SolrServerException: No live SolrServers available to handle this request:[http://127.0.0.1:33121/solr/org.apache.solr.search.facet.TestCloudJSONFacetSKG_collection]
        at __randomizedtesting.SeedInfo.seed([5D445E53BDFA995:779860EA8ABF1FE6]:0)
        at org.apache.solr.client.solrj.impl.LBSolrClient.request(LBSolrClient.java:345)
        at org.apache.solr.client.solrj.impl.BaseCloudSolrClient.sendRequest(BaseCloudSolrClient.java:1128)
        at org.apache.solr.client.solrj.impl.BaseCloudSolrClient.requestWithRetryOnStaleState(BaseCloudSolrClient.java:897)
        at org.apache.solr.client.solrj.impl.BaseCloudSolrClient.request(BaseCloudSolrClient.java:829)
        at org.apache.solr.client.solrj.SolrRequest.process(SolrRequest.java:207)
        at org.apache.solr.client.solrj.SolrClient.query(SolrClient.java:987)
        at org.apache.solr.client.solrj.SolrClient.query(SolrClient.java:1002)
        at org.apache.solr.search.facet.TestCloudJSONFacetSKG.getNumFound(TestCloudJSONFacetSKG.java:669)
        at org.apache.solr.search.facet.TestCloudJSONFacetSKG.verifySKGResults(TestCloudJSONFacetSKG.java:446)
        at org.apache.solr.search.facet.TestCloudJSONFacetSKG.assertFacetSKGsAreCorrect(TestCloudJSONFacetSKG.java:392)
        at org.apache.solr.search.facet.TestCloudJSONFacetSKG.assertFacetSKGsAreCorrect(TestCloudJSONFacetSKG.java:402)
        at org.apache.solr.search.facet.TestCloudJSONFacetSKG.assertFacetSKGsAreCorrect(TestCloudJSONFacetSKG.java:402)
        at org.apache.solr.search.facet.TestCloudJSONFacetSKG.assertFacetSKGsAreCorrect(TestCloudJSONFacetSKG.java:349)
        at org.apache.solr.search.facet.TestCloudJSONFacetSKG.testRandom(TestCloudJSONFacetSKG.java:274)
        at java.base/jdk.internal.reflect.NativeMethodAccessorImpl.invoke0(Native Method)
        at java.base/jdk.internal.reflect.NativeMethodAccessorImpl.invoke(NativeMethodAccessorImpl.java:62)
        at java.base/jdk.internal.reflect.DelegatingMethodAccessorImpl.invoke(DelegatingMethodAccessorImpl.java:43)
        at java.base/java.lang.reflect.Method.invoke(Method.java:566)
        at com.carrotsearch.randomizedtesting.RandomizedRunner.invoke(RandomizedRunner.java:1750)
        at com.carrotsearch.randomizedtesting.RandomizedRunner$8.evaluate(RandomizedRunner.java:938)
        at com.carrotsearch.randomizedtesting.RandomizedRunner$9.evaluate(RandomizedRunner.java:974)
        at com.carrotsearch.randomizedtesting.RandomizedRunner$10.evaluate(RandomizedRunner.java:988)
        at com.carrotsearch.randomizedtesting.rules.SystemPropertiesRestoreRule$1.evaluate(SystemPropertiesRestoreRule.java:57)
        at org.apache.lucene.util.TestRuleSetupTeardownChained$1.evaluate(TestRuleSetupTeardownChained.java:49)
        at org.apache.lucene.util.AbstractBeforeAfterRule$1.evaluate(AbstractBeforeAfterRule.java:45)
        at org.apache.lucene.util.TestRuleThreadAndTestName$1.evaluate(TestRuleThreadAndTestName.java:48)
        at org.apache.lucene.util.TestRuleIgnoreAfterMaxFailures$1.evaluate(TestRuleIgnoreAfterMaxFailures.java:64)
        at org.apache.lucene.util.TestRuleMarkFailure$1.evaluate(TestRuleMarkFailure.java:47)
        at com.carrotsearch.randomizedtesting.rules.StatementAdapter.evaluate(StatementAdapter.java:36)
        at com.carrotsearch.randomizedtesting.ThreadLeakControl$StatementRunner.run(ThreadLeakControl.java:368)
        at com.carrotsearch.randomizedtesting.ThreadLeakControl.forkTimeoutingTask(ThreadLeakControl.java:817)
        at com.carrotsearch.randomizedtesting.ThreadLeakControl$3.evaluate(ThreadLeakControl.java:468)
        at com.carrotsearch.randomizedtesting.RandomizedRunner.runSingleTest(RandomizedRunner.java:947)
        at com.carrotsearch.randomizedtesting.RandomizedRunner$5.evaluate(RandomizedRunner.java:832)
        at com.carrotsearch.randomizedtesting.RandomizedRunner$6.evaluate(RandomizedRunner.java:883)
        at com.carrotsearch.randomizedtesting.RandomizedRunner$7.evaluate(RandomizedRunner.java:894)
        at com.carrotsearch.randomizedtesting.rules.StatementAdapter.evaluate(StatementAdapter.java:36)
        at com.carrotsearch.randomizedtesting.rules.SystemPropertiesRestoreRule$1.evaluate(SystemPropertiesRestoreRule.java:57)
        at org.apache.lucene.util.AbstractBeforeAfterRule$1.evaluate(AbstractBeforeAfterRule.java:45)
        at com.carrotsearch.randomizedtesting.rules.StatementAdapter.evaluate(StatementAdapter.java:36)
        at org.apache.lucene.util.TestRuleStoreClassName$1.evaluate(TestRuleStoreClassName.java:41)
        at com.carrotsearch.randomizedtesting.rules.NoShadowingOrOverridesOnMethodsRule$1.evaluate(NoShadowingOrOverridesOnMethodsRule.java:40)
        at com.carrotsearch.randomizedtesting.rules.NoShadowingOrOverridesOnMethodsRule$1.evaluate(NoShadowingOrOverridesOnMethodsRule.java:40)
        at com.carrotsearch.randomizedtesting.rules.StatementAdapter.evaluate(StatementAdapter.java:36)
        at com.carrotsearch.randomizedtesting.rules.StatementAdapter.evaluate(StatementAdapter.java:36)
        at org.apache.lucene.util.TestRuleAssertionsRequired$1.evaluate(TestRuleAssertionsRequired.java:53)
        at org.apache.lucene.util.TestRuleMarkFailure$1.evaluate(TestRuleMarkFailure.java:47)
        at org.apache.lucene.util.TestRuleIgnoreAfterMaxFailures$1.evaluate(TestRuleIgnoreAfterMaxFailures.java:64)
        at org.apache.lucene.util.TestRuleIgnoreTestSuites$1.evaluate(TestRuleIgnoreTestSuites.java:54)
        at com.carrotsearch.randomizedtesting.rules.StatementAdapter.evaluate(StatementAdapter.java:36)
        at com.carrotsearch.randomizedtesting.ThreadLeakControl$StatementRunner.run(ThreadLeakControl.java:368)
        at java.base/java.lang.Thread.run(Thread.java:834)
Caused by: org.apache.solr.client.solrj.impl.HttpSolrClient$RemoteSolrException: Error from server at http://127.0.0.1:33121/solr/org.apache.solr.search.facet.TestCloudJSONFacetSKG_collection: Expected mime type application/octet-stream but got text/html. <html>
<head>
<meta http-equiv="Content-Type" content="text/html;charset=utf-8"/>
<title>Error 500 Server Error</title>
</head>
<body><h2>HTTP ERROR 500</h2>
<p>Problem accessing /solr/org.apache.solr.search.facet.TestCloudJSONFacetSKG_collection/select. Reason:
<pre>    Server Error</pre></p><h3>Caused by:</h3><pre>java.lang.AssertionError
        at java.base/java.util.HashMap$TreeNode.moveRootToFront(HashMap.java:1896)
        at java.base/java.util.HashMap$TreeNode.putTreeVal(HashMap.java:2061)
        at java.base/java.util.HashMap.putVal(HashMap.java:633)
        at java.base/java.util.HashMap.put(HashMap.java:607)
        at org.apache.solr.search.LRUCache.put(LRUCache.java:197)
        at org.apache.solr.search.SolrCacheHolder.put(SolrCacheHolder.java:88)
        at org.apache.solr.search.SolrIndexSearcher.getDocListC(SolrIndexSearcher.java:1449)
        at org.apache.solr.search.SolrIndexSearcher.search(SolrIndexSearcher.java:568)
        at org.apache.solr.handler.component.QueryComponent.doProcessUngroupedSearch(QueryComponent.java:1484)
        at org.apache.solr.handler.component.QueryComponent.process(QueryComponent.java:398)
        at org.apache.solr.handler.component.SearchHandler.handleRequestBody(SearchHandler.java:305)
        at org.apache.solr.handler.RequestHandlerBase.handleRequest(RequestHandlerBase.java:200)
        at org.apache.solr.core.SolrCore.execute(SolrCore.java:2598)
        at org.apache.solr.servlet.HttpSolrCall.execute(HttpSolrCall.java:780)
        at org.apache.solr.servlet.HttpSolrCall.call(HttpSolrCall.java:566)
        at org.apache.solr.servlet.SolrDispatchFilter.doFilter(SolrDispatchFilter.java:424)
        at org.apache.solr.servlet.SolrDispatchFilter.doFilter(SolrDispatchFilter.java:351)
        at org.eclipse.jetty.servlet.ServletHandler$CachedChain.doFilter(ServletHandler.java:1610)
        at org.apache.solr.client.solrj.embedded.JettySolrRunner$DebugFilter.doFilter(JettySolrRunner.java:167)
        at org.eclipse.jetty.servlet.ServletHandler$CachedChain.doFilter(ServletHandler.java:1610)
        at org.eclipse.jetty.servlet.ServletHandler.doHandle(ServletHandler.java:540)
        at org.eclipse.jetty.server.handler.ScopedHandler.nextHandle(ScopedHandler.java:255)
        at org.eclipse.jetty.server.session.SessionHandler.doHandle(SessionHandler.java:1711)
        at org.eclipse.jetty.server.handler.ScopedHandler.nextHandle(ScopedHandler.java:255)
        at org.eclipse.jetty.server.handler.ContextHandler.doHandle(ContextHandler.java:1347)
        at org.eclipse.jetty.server.handler.ScopedHandler.nextScope(ScopedHandler.java:203)
        at org.eclipse.jetty.servlet.ServletHandler.doScope(ServletHandler.java:480)
        at org.eclipse.jetty.server.session.SessionHandler.doScope(SessionHandler.java:1678)
        at org.eclipse.jetty.server.handler.ScopedHandler.nextScope(ScopedHandler.java:201)
        at org.eclipse.jetty.server.handler.ContextHandler.doScope(ContextHandler.java:1249)
        at org.eclipse.jetty.server.handler.ScopedHandler.handle(ScopedHandler.java:144)
        at org.eclipse.jetty.server.handler.HandlerWrapper.handle(HandlerWrapper.java:132)
        at org.eclipse.jetty.rewrite.handler.RewriteHandler.handle(RewriteHandler.java:335)
        at org.eclipse.jetty.server.handler.gzip.GzipHandler.handle(GzipHandler.java:753)
        at org.eclipse.jetty.server.handler.HandlerWrapper.handle(HandlerWrapper.java:132)
        at org.eclipse.jetty.server.Server.handle(Server.java:505)
        at org.eclipse.jetty.server.HttpChannel.handle(HttpChannel.java:370)
        at org.eclipse.jetty.server.HttpConnection.onFillable(HttpConnection.java:267)
        at org.eclipse.jetty.io.AbstractConnection$ReadCallback.succeeded(AbstractConnection.java:305)
        at org.eclipse.jetty.io.FillInterest.fillable(FillInterest.java:103)
        at org.eclipse.jetty.io.ChannelEndPoint$2.run(ChannelEndPoint.java:117)
        at org.eclipse.jetty.util.thread.QueuedThreadPool.runJob(QueuedThreadPool.java:781)
        at org.eclipse.jetty.util.thread.QueuedThreadPool$Runner.run(QueuedThreadPool.java:917)
        at java.base/java.lang.Thread.run(Thread.java:834)
</pre>
<hr><a href="http://eclipse.org/jetty">Powered by Jetty:// 9.4.19.v20190610</a><hr/>

</body>
</html>

        at org.apache.solr.client.solrj.impl.HttpSolrClient.executeMethod(HttpSolrClient.java:620)
        at org.apache.solr.client.solrj.impl.HttpSolrClient.request(HttpSolrClient.java:262)
        at org.apache.solr.client.solrj.impl.HttpSolrClient.request(HttpSolrClient.java:245)
        at org.apache.solr.client.solrj.impl.LBSolrClient.doRequest(LBSolrClient.java:368)
        at org.apache.solr.client.solrj.impl.LBSolrClient.request(LBSolrClient.java:296)
        ... 51 more




Build Log:
[...truncated 15342 lines...]
   [junit4] Suite: org.apache.solr.search.facet.TestCloudJSONFacetSKG
   [junit4]   2> 1779699 INFO  (SUITE-TestCloudJSONFacetSKG-seed#[5D445E53BDFA995]-worker) [     ] o.a.s.SolrTestCaseJ4 SecureRandom sanity checks: test.solr.allowed.securerandom=null & java.security.egd=file:/dev/./urandom
   [junit4]   2> 1779700 INFO  (SUITE-TestCloudJSONFacetSKG-seed#[5D445E53BDFA995]-worker) [     ] o.a.s.SolrTestCaseJ4 Created dataDir: /home/jenkins/jenkins-slave/workspace/Lucene-Solr-Tests-master/solr/build/solr-core/test/J0/temp/solr.search.facet.TestCloudJSONFacetSKG_5D445E53BDFA995-001/data-dir-220-001
   [junit4]   2> 1779700 INFO  (SUITE-TestCloudJSONFacetSKG-seed#[5D445E53BDFA995]-worker) [     ] o.a.s.SolrTestCaseJ4 Using PointFields (NUMERIC_POINTS_SYSPROP=true) w/NUMERIC_DOCVALUES_SYSPROP=true
   [junit4]   2> 1779701 INFO  (SUITE-TestCloudJSONFacetSKG-seed#[5D445E53BDFA995]-worker) [     ] o.a.s.SolrTestCaseJ4 Randomized ssl (false) and clientAuth (true) via: @org.apache.solr.util.RandomizeSSL(reason="", ssl=0.0/0.0, value=0.0/0.0, clientAuth=0.0/0.0)
   [junit4]   2> 1779702 INFO  (SUITE-TestCloudJSONFacetSKG-seed#[5D445E53BDFA995]-worker) [     ] o.a.s.c.MiniSolrCloudCluster Starting cluster of 1 servers in /home/jenkins/jenkins-slave/workspace/Lucene-Solr-Tests-master/solr/build/solr-core/test/J0/temp/solr.search.facet.TestCloudJSONFacetSKG_5D445E53BDFA995-001/tempDir-001
   [junit4]   2> 1779703 INFO  (SUITE-TestCloudJSONFacetSKG-seed#[5D445E53BDFA995]-worker) [     ] o.a.s.c.ZkTestServer STARTING ZK TEST SERVER
   [junit4]   2> 1779703 INFO  (ZkTestServer Run Thread) [     ] o.a.s.c.ZkTestServer client port:0.0.0.0/0.0.0.0:0
   [junit4]   2> 1779703 INFO  (ZkTestServer Run Thread) [     ] o.a.s.c.ZkTestServer Starting server
   [junit4]   2> 1779803 INFO  (SUITE-TestCloudJSONFacetSKG-seed#[5D445E53BDFA995]-worker) [     ] o.a.s.c.ZkTestServer start zk server on port:43535
   [junit4]   2> 1779803 INFO  (SUITE-TestCloudJSONFacetSKG-seed#[5D445E53BDFA995]-worker) [     ] o.a.s.c.ZkTestServer waitForServerUp: 127.0.0.1:43535
   [junit4]   2> 1779803 INFO  (SUITE-TestCloudJSONFacetSKG-seed#[5D445E53BDFA995]-worker) [     ] o.a.s.c.ZkTestServer parse host and port list: 127.0.0.1:43535
   [junit4]   2> 1779803 INFO  (SUITE-TestCloudJSONFacetSKG-seed#[5D445E53BDFA995]-worker) [     ] o.a.s.c.ZkTestServer connecting to 127.0.0.1 43535
   [junit4]   2> 1779829 INFO  (SUITE-TestCloudJSONFacetSKG-seed#[5D445E53BDFA995]-worker) [     ] o.a.s.c.c.ConnectionManager Waiting for client to connect to ZooKeeper
   [junit4]   2> 1779831 INFO  (zkConnectionManagerCallback-10681-thread-1) [     ] o.a.s.c.c.ConnectionManager zkClient has connected
   [junit4]   2> 1779831 INFO  (SUITE-TestCloudJSONFacetSKG-seed#[5D445E53BDFA995]-worker) [     ] o.a.s.c.c.ConnectionManager Client is connected to ZooKeeper
   [junit4]   2> 1779839 INFO  (SUITE-TestCloudJSONFacetSKG-seed#[5D445E53BDFA995]-worker) [     ] o.a.s.c.c.ConnectionManager Waiting for client to connect to ZooKeeper
   [junit4]   2> 1779846 INFO  (zkConnectionManagerCallback-10683-thread-1) [     ] o.a.s.c.c.ConnectionManager zkClient has connected
   [junit4]   2> 1779846 INFO  (SUITE-TestCloudJSONFacetSKG-seed#[5D445E53BDFA995]-worker) [     ] o.a.s.c.c.ConnectionManager Client is connected to ZooKeeper
   [junit4]   2> 1779853 INFO  (SUITE-TestCloudJSONFacetSKG-seed#[5D445E53BDFA995]-worker) [     ] o.a.s.c.c.ConnectionManager Waiting for client to connect to ZooKeeper
   [junit4]   2> 1779866 INFO  (zkConnectionManagerCallback-10685-thread-1) [     ] o.a.s.c.c.ConnectionManager zkClient has connected
   [junit4]   2> 1779866 INFO  (SUITE-TestCloudJSONFacetSKG-seed#[5D445E53BDFA995]-worker) [     ] o.a.s.c.c.ConnectionManager Client is connected to ZooKeeper
   [junit4]   2> 1779984 WARN  (jetty-launcher-10686-thread-1) [     ] o.e.j.s.AbstractConnector Ignoring deprecated socket close linger time
   [junit4]   2> 1779984 INFO  (jetty-launcher-10686-thread-1) [     ] o.a.s.c.s.e.JettySolrRunner Start Jetty (original configured port=0)
   [junit4]   2> 1779984 INFO  (jetty-launcher-10686-thread-1) [     ] o.a.s.c.s.e.JettySolrRunner Trying to start Jetty on port 0 try number 1 ...
   [junit4]   2> 1779984 INFO  (jetty-launcher-10686-thread-1) [     ] o.e.j.s.Server jetty-9.4.19.v20190610; built: 2019-06-10T16:30:51.723Z; git: afcf563148970e98786327af5e07c261fda175d3; jvm 11.0.1+13-LTS
   [junit4]   2> 1780070 INFO  (jetty-launcher-10686-thread-1) [     ] o.e.j.s.session DefaultSessionIdManager workerName=node0
   [junit4]   2> 1780070 INFO  (jetty-launcher-10686-thread-1) [     ] o.e.j.s.session No SessionScavenger set, using defaults
   [junit4]   2> 1780070 INFO  (jetty-launcher-10686-thread-1) [     ] o.e.j.s.session node0 Scavenging every 600000ms
   [junit4]   2> 1780076 INFO  (jetty-launcher-10686-thread-1) [     ] o.e.j.s.h.ContextHandler Started o.e.j.s.ServletContextHandler@125bc173{/solr,null,AVAILABLE}
   [junit4]   2> 1780076 INFO  (jetty-launcher-10686-thread-1) [     ] o.e.j.s.AbstractConnector Started ServerConnector@66dda65f{HTTP/1.1,[http/1.1, h2c]}{127.0.0.1:33121}
   [junit4]   2> 1780076 INFO  (jetty-launcher-10686-thread-1) [     ] o.e.j.s.Server Started @1780174ms
   [junit4]   2> 1780076 INFO  (jetty-launcher-10686-thread-1) [     ] o.a.s.c.s.e.JettySolrRunner Jetty properties: {hostContext=/solr, hostPort=33121}
   [junit4]   2> 1780077 ERROR (jetty-launcher-10686-thread-1) [     ] o.a.s.u.StartupLoggingUtils Missing Java Option solr.log.dir. Logging may be missing or incomplete.
   [junit4]   2> 1780077 INFO  (jetty-launcher-10686-thread-1) [     ] o.a.s.s.SolrDispatchFilter Using logger factory org.apache.logging.slf4j.Log4jLoggerFactory
   [junit4]   2> 1780077 INFO  (jetty-launcher-10686-thread-1) [     ] o.a.s.s.SolrDispatchFilter  ___      _       Welcome to Apache Solr™ version 9.0.0
   [junit4]   2> 1780077 INFO  (jetty-launcher-10686-thread-1) [     ] o.a.s.s.SolrDispatchFilter / __| ___| |_ _   Starting in cloud mode on port null
   [junit4]   2> 1780077 INFO  (jetty-launcher-10686-thread-1) [     ] o.a.s.s.SolrDispatchFilter \__ \/ _ \ | '_|  Install dir: null
   [junit4]   2> 1780077 INFO  (jetty-launcher-10686-thread-1) [     ] o.a.s.s.SolrDispatchFilter |___/\___/_|_|    Start time: 2019-09-04T03:00:12.466456Z
   [junit4]   2> 1780089 INFO  (jetty-launcher-10686-thread-1) [     ] o.a.s.c.c.ConnectionManager Waiting for client to connect to ZooKeeper
   [junit4]   2> 1780104 INFO  (zkConnectionManagerCallback-10688-thread-1) [     ] o.a.s.c.c.ConnectionManager zkClient has connected
   [junit4]   2> 1780104 INFO  (jetty-launcher-10686-thread-1) [     ] o.a.s.c.c.ConnectionManager Client is connected to ZooKeeper
   [junit4]   2> 1780108 INFO  (jetty-launcher-10686-thread-1) [     ] o.a.s.s.SolrDispatchFilter solr.xml found in ZooKeeper. Loading...
   [junit4]   2> 1780343 INFO  (jetty-launcher-10686-thread-1) [     ] o.a.s.h.c.HttpShardHandlerFactory Host whitelist initialized: WhitelistHostChecker [whitelistHosts=null, whitelistHostCheckingEnabled=true]
   [junit4]   2> 1780345 WARN  (jetty-launcher-10686-thread-1) [     ] o.e.j.u.s.S.config Trusting all certificates configured for Client@5a89011[provider=null,keyStore=null,trustStore=null]
   [junit4]   2> 1780345 WARN  (jetty-launcher-10686-thread-1) [     ] o.e.j.u.s.S.config No Client EndPointIdentificationAlgorithm configured for Client@5a89011[provider=null,keyStore=null,trustStore=null]
   [junit4]   2> 1780348 WARN  (jetty-launcher-10686-thread-1) [     ] o.e.j.u.s.S.config Trusting all certificates configured for Client@7e168156[provider=null,keyStore=null,trustStore=null]
   [junit4]   2> 1780348 WARN  (jetty-launcher-10686-thread-1) [     ] o.e.j.u.s.S.config No Client EndPointIdentificationAlgorithm configured for Client@7e168156[provider=null,keyStore=null,trustStore=null]
   [junit4]   2> 1780349 INFO  (jetty-launcher-10686-thread-1) [     ] o.a.s.c.ZkContainer Zookeeper client=127.0.0.1:43535/solr
   [junit4]   2> 1780351 INFO  (jetty-launcher-10686-thread-1) [     ] o.a.s.c.c.ConnectionManager Waiting for client to connect to ZooKeeper
   [junit4]   2> 1780353 INFO  (zkConnectionManagerCallback-10695-thread-1) [     ] o.a.s.c.c.ConnectionManager zkClient has connected
   [junit4]   2> 1780353 INFO  (jetty-launcher-10686-thread-1) [     ] o.a.s.c.c.ConnectionManager Client is connected to ZooKeeper
   [junit4]   2> 1780456 INFO  (jetty-launcher-10686-thread-1) [n:127.0.0.1:33121_solr     ] o.a.s.c.c.ConnectionManager Waiting for client to connect to ZooKeeper
   [junit4]   2> 1780458 INFO  (zkConnectionManagerCallback-10697-thread-1) [     ] o.a.s.c.c.ConnectionManager zkClient has connected
   [junit4]   2> 1780458 INFO  (jetty-launcher-10686-thread-1) [n:127.0.0.1:33121_solr     ] o.a.s.c.c.ConnectionManager Client is connected to ZooKeeper
   [junit4]   2> 1780580 INFO  (jetty-launcher-10686-thread-1) [n:127.0.0.1:33121_solr     ] o.a.s.c.OverseerElectionContext I am going to be the leader 127.0.0.1:33121_solr
   [junit4]   2> 1780581 INFO  (jetty-launcher-10686-thread-1) [n:127.0.0.1:33121_solr     ] o.a.s.c.Overseer Overseer (id=72318925744504837-127.0.0.1:33121_solr-n_0000000000) starting
   [junit4]   2> 1780609 INFO  (jetty-launcher-10686-thread-1) [n:127.0.0.1:33121_solr     ] o.a.s.c.c.ConnectionManager Waiting for client to connect to ZooKeeper
   [junit4]   2> 1780614 INFO  (zkConnectionManagerCallback-10704-thread-1) [     ] o.a.s.c.c.ConnectionManager zkClient has connected
   [junit4]   2> 1780614 INFO  (jetty-launcher-10686-thread-1) [n:127.0.0.1:33121_solr     ] o.a.s.c.c.ConnectionManager Client is connected to ZooKeeper
   [junit4]   2> 1780618 INFO  (jetty-launcher-10686-thread-1) [n:127.0.0.1:33121_solr     ] o.a.s.c.s.i.ZkClientClusterStateProvider Cluster at 127.0.0.1:43535/solr ready
   [junit4]   2> 1780619 INFO  (OverseerStateUpdate-72318925744504837-127.0.0.1:33121_solr-n_0000000000) [n:127.0.0.1:33121_solr     ] o.a.s.c.Overseer Starting to work on the main queue : 127.0.0.1:33121_solr
   [junit4]   2> 1780623 INFO  (jetty-launcher-10686-thread-1) [n:127.0.0.1:33121_solr     ] o.a.s.c.ZkController Register node as live in ZooKeeper:/live_nodes/127.0.0.1:33121_solr
   [junit4]   2> 1780626 INFO  (jetty-launcher-10686-thread-1) [n:127.0.0.1:33121_solr     ] o.a.s.c.PackageManager clusterprops.json changed , version -1
   [junit4]   2> 1780636 INFO  (zkCallback-10703-thread-1) [     ] o.a.s.c.c.ZkStateReader Updated live nodes from ZooKeeper... (0) -> (1)
   [junit4]   2> 1780643 INFO  (zkCallback-10696-thread-1) [     ] o.a.s.c.c.ZkStateReader Updated live nodes from ZooKeeper... (0) -> (1)
   [junit4]   2> 1780663 INFO  (jetty-launcher-10686-thread-1) [n:127.0.0.1:33121_solr     ] o.a.s.h.a.MetricsHistoryHandler No .system collection, keeping metrics history in memory.
   [junit4]   2> 1780697 INFO  (jetty-launcher-10686-thread-1) [n:127.0.0.1:33121_solr     ] o.a.s.m.r.SolrJmxReporter JMX monitoring for 'solr_33121.solr.node' (registry 'solr.node') enabled at server: com.sun.jmx.mbeanserver.JmxMBeanServer@2557c4f4
   [junit4]   2> 1780715 INFO  (jetty-launcher-10686-thread-1) [n:127.0.0.1:33121_solr     ] o.a.s.m.r.SolrJmxReporter JMX monitoring for 'solr_33121.solr.jvm' (registry 'solr.jvm') enabled at server: com.sun.jmx.mbeanserver.JmxMBeanServer@2557c4f4
   [junit4]   2> 1780715 INFO  (jetty-launcher-10686-thread-1) [n:127.0.0.1:33121_solr     ] o.a.s.m.r.SolrJmxReporter JMX monitoring for 'solr_33121.solr.jetty' (registry 'solr.jetty') enabled at server: com.sun.jmx.mbeanserver.JmxMBeanServer@2557c4f4
   [junit4]   2> 1780717 INFO  (jetty-launcher-10686-thread-1) [n:127.0.0.1:33121_solr     ] o.a.s.c.CorePropertiesLocator Found 0 core definitions underneath /home/jenkins/jenkins-slave/workspace/Lucene-Solr-Tests-master/solr/build/solr-core/test/J0/temp/solr.search.facet.TestCloudJSONFacetSKG_5D445E53BDFA995-001/tempDir-001/node1/.
   [junit4]   2> 1780742 INFO  (SUITE-TestCloudJSONFacetSKG-seed#[5D445E53BDFA995]-worker) [     ] o.a.s.c.MiniSolrCloudCluster waitForAllNodes: numServers=1
   [junit4]   2> 1780746 INFO  (SUITE-TestCloudJSONFacetSKG-seed#[5D445E53BDFA995]-worker) [     ] o.a.s.c.c.ConnectionManager Waiting for client to connect to ZooKeeper
   [junit4]   2> 1780750 INFO  (zkConnectionManagerCallback-10710-thread-1) [     ] o.a.s.c.c.ConnectionManager zkClient has connected
   [junit4]   2> 1780750 INFO  (SUITE-TestCloudJSONFacetSKG-seed#[5D445E53BDFA995]-worker) [     ] o.a.s.c.c.ConnectionManager Client is connected to ZooKeeper
   [junit4]   2> 1780752 INFO  (SUITE-TestCloudJSONFacetSKG-seed#[5D445E53BDFA995]-worker) [     ] o.a.s.c.c.ZkStateReader Updated live nodes from ZooKeeper... (0) -> (1)
   [junit4]   2> 1780754 INFO  (SUITE-TestCloudJSONFacetSKG-seed#[5D445E53BDFA995]-worker) [     ] o.a.s.c.s.i.ZkClientClusterStateProvider Cluster at 127.0.0.1:43535/solr ready
   [junit4]   2> 1781319 INFO  (qtp1746552108-27919) [n:127.0.0.1:33121_solr     ] o.a.s.h.a.CollectionsHandler Invoked Collection Action :create with params property.schema=schema_latest.xml&property.config=solrconfig-tlog.xml&collection.configName=org.apache.solr.search.facet.TestCloudJSONFacetSKG_config-set&name=org.apache.solr.search.facet.TestCloudJSONFacetSKG_collection&nrtReplicas=1&action=CREATE&numShards=1&wt=javabin&version=2 and sendToOCPQueue=true
   [junit4]   2> 1781328 INFO  (OverseerThreadFactory-7373-thread-1-processing-n:127.0.0.1:33121_solr) [n:127.0.0.1:33121_solr     ] o.a.s.c.a.c.CreateCollectionCmd Create collection org.apache.solr.search.facet.TestCloudJSONFacetSKG_collection
   [junit4]   2> 1781441 INFO  (OverseerStateUpdate-72318925744504837-127.0.0.1:33121_solr-n_0000000000) [n:127.0.0.1:33121_solr     ] o.a.s.c.o.SliceMutator createReplica() {
   [junit4]   2>   "operation":"ADDREPLICA",
   [junit4]   2>   "collection":"org.apache.solr.search.facet.TestCloudJSONFacetSKG_collection",
   [junit4]   2>   "shard":"shard1",
   [junit4]   2>   "core":"org.apache.solr.search.facet.TestCloudJSONFacetSKG_collection_shard1_replica_n1",
   [junit4]   2>   "state":"down",
   [junit4]   2>   "base_url":"http://127.0.0.1:33121/solr",
   [junit4]   2>   "type":"NRT",
   [junit4]   2>   "waitForFinalState":"false"}
   [junit4]   2> 1781646 INFO  (qtp1746552108-27921) [n:127.0.0.1:33121_solr    x:org.apache.solr.search.facet.TestCloudJSONFacetSKG_collection_shard1_replica_n1 ] o.a.s.h.a.CoreAdminOperation core create command qt=/admin/cores&collection.configName=org.apache.solr.search.facet.TestCloudJSONFacetSKG_config-set&newCollection=true&collection=org.apache.solr.search.facet.TestCloudJSONFacetSKG_collection&version=2&replicaType=NRT&property.schema=schema_latest.xml&property.config=solrconfig-tlog.xml&coreNodeName=core_node2&name=org.apache.solr.search.facet.TestCloudJSONFacetSKG_collection_shard1_replica_n1&action=CREATE&numShards=1&shard=shard1&wt=javabin
   [junit4]   2> 1781647 INFO  (qtp1746552108-27921) [n:127.0.0.1:33121_solr    x:org.apache.solr.search.facet.TestCloudJSONFacetSKG_collection_shard1_replica_n1 ] o.a.s.c.TransientSolrCoreCacheDefault Allocating transient cache for 2147483647 transient cores
   [junit4]   2> 1782665 INFO  (qtp1746552108-27921) [n:127.0.0.1:33121_solr c:org.apache.solr.search.facet.TestCloudJSONFacetSKG_collection s:shard1 r:core_node2 x:org.apache.solr.search.facet.TestCloudJSONFacetSKG_collection_shard1_replica_n1 ] o.a.s.c.SolrConfig Using Lucene MatchVersion: 9.0.0
   [junit4]   2> 1782686 INFO  (qtp1746552108-27921) [n:127.0.0.1:33121_solr c:org.apache.solr.search.facet.TestCloudJSONFacetSKG_collection s:shard1 r:core_node2 x:org.apache.solr.search.facet.TestCloudJSONFacetSKG_collection_shard1_replica_n1 ] o.a.s.s.IndexSchema [org.apache.solr.search.facet.TestCloudJSONFacetSKG_collection_shard1_replica_n1] Schema name=example
   [junit4]   2> 1782752 INFO  (qtp1746552108-27921) [n:127.0.0.1:33121_solr c:org.apache.solr.search.facet.TestCloudJSONFacetSKG_collection s:shard1 r:core_node2 x:org.apache.solr.search.facet.TestCloudJSONFacetSKG_collection_shard1_replica_n1 ] o.a.s.s.IndexSchema Loaded schema example/1.6 with uniqueid field id
   [junit4]   2> 1782774 INFO  (qtp1746552108-27921) [n:127.0.0.1:33121_solr c:org.apache.solr.search.facet.TestCloudJSONFacetSKG_collection s:shard1 r:core_node2 x:org.apache.solr.search.facet.TestCloudJSONFacetSKG_collection_shard1_replica_n1 ] o.a.s.c.CoreContainer Creating SolrCore 'org.apache.solr.search.facet.TestCloudJSONFacetSKG_collection_shard1_replica_n1' using configuration from collection org.apache.solr.search.facet.TestCloudJSONFacetSKG_collection, trusted=true
   [junit4]   2> 1782776 INFO  (qtp1746552108-27921) [n:127.0.0.1:33121_solr c:org.apache.solr.search.facet.TestCloudJSONFacetSKG_collection s:shard1 r:core_node2 x:org.apache.solr.search.facet.TestCloudJSONFacetSKG_collection_shard1_replica_n1 ] o.a.s.m.r.SolrJmxReporter JMX monitoring for 'solr_33121.solr.core.org.apache.solr.search.facet.TestCloudJSONFacetSKG_collection.shard1.replica_n1' (registry 'solr.core.org.apache.solr.search.facet.TestCloudJSONFacetSKG_collection.shard1.replica_n1') enabled at server: com.sun.jmx.mbeanserver.JmxMBeanServer@2557c4f4
   [junit4]   2> 1782776 INFO  (qtp1746552108-27921) [n:127.0.0.1:33121_solr c:org.apache.solr.search.facet.TestCloudJSONFacetSKG_collection s:shard1 r:core_node2 x:org.apache.solr.search.facet.TestCloudJSONFacetSKG_collection_shard1_replica_n1 ] o.a.s.c.SolrCore [[org.apache.solr.search.facet.TestCloudJSONFacetSKG_collection_shard1_replica_n1] ] Opening new SolrCore at [/home/jenkins/jenkins-slave/workspace/Lucene-Solr-Tests-master/solr/build/solr-core/test/J0/temp/solr.search.facet.TestCloudJSONFacetSKG_5D445E53BDFA995-001/tempDir-001/node1/org.apache.solr.search.facet.TestCloudJSONFacetSKG_collection_shard1_replica_n1], dataDir=[/home/jenkins/jenkins-slave/workspace/Lucene-Solr-Tests-master/solr/build/solr-core/test/J0/temp/solr.search.facet.TestCloudJSONFacetSKG_5D445E53BDFA995-001/tempDir-001/node1/./org.apache.solr.search.facet.TestCloudJSONFacetSKG_collection_shard1_replica_n1/data/]
   [junit4]   2> 1782780 INFO  (qtp1746552108-27921) [n:127.0.0.1:33121_solr c:org.apache.solr.search.facet.TestCloudJSONFacetSKG_collection s:shard1 r:core_node2 x:org.apache.solr.search.facet.TestCloudJSONFacetSKG_collection_shard1_replica_n1 ] o.a.s.u.RandomMergePolicy RandomMergePolicy wrapping class org.apache.lucene.index.LogDocMergePolicy: [LogDocMergePolicy: minMergeSize=1000, mergeFactor=14, maxMergeSize=9223372036854775807, maxMergeSizeForForcedMerge=9223372036854775807, calibrateSizeByDeletes=true, maxMergeDocs=2147483647, maxCFSSegmentSizeMB=8.796093022207999E12, noCFSRatio=0.0]
   [junit4]   2> 1782783 WARN  (qtp1746552108-27921) [n:127.0.0.1:33121_solr c:org.apache.solr.search.facet.TestCloudJSONFacetSKG_collection s:shard1 r:core_node2 x:org.apache.solr.search.facet.TestCloudJSONFacetSKG_collection_shard1_replica_n1 ] o.a.s.c.RequestHandlers INVALID paramSet a in requestHandler {type = requestHandler,name = /dump,class = DumpRequestHandler,attributes = {initParams=a, name=/dump, class=DumpRequestHandler},args = {defaults={a=A,b=B}}}
   [junit4]   2> 1782858 INFO  (qtp1746552108-27921) [n:127.0.0.1:33121_solr c:org.apache.solr.search.facet.TestCloudJSONFacetSKG_collection s:shard1 r:core_node2 x:org.apache.solr.search.facet.TestCloudJSONFacetSKG_collection_shard1_replica_n1 ] o.a.s.u.UpdateHandler Using UpdateLog implementation: org.apache.solr.update.UpdateLog
   [junit4]   2> 1782858 INFO  (qtp1746552108-27921) [n:127.0.0.1:33121_solr c:org.apache.solr.search.facet.TestCloudJSONFacetSKG_collection s:shard1 r:core_node2 x:org.apache.solr.search.facet.TestCloudJSONFacetSKG_collection_shard1_replica_n1 ] o.a.s.u.UpdateLog Initializing UpdateLog: dataDir= defaultSyncLevel=FLUSH numRecordsToKeep=100 maxNumLogsToKeep=10 numVersionBuckets=65536
   [junit4]   2> 1782860 INFO  (qtp1746552108-27921) [n:127.0.0.1:33121_solr c:org.apache.solr.search.facet.TestCloudJSONFacetSKG_collection s:shard1 r:core_node2 x:org.apache.solr.search.facet.TestCloudJSONFacetSKG_collection_shard1_replica_n1 ] o.a.s.u.CommitTracker Hard AutoCommit: disabled
   [junit4]   2> 1782860 INFO  (qtp1746552108-27921) [n:127.0.0.1:33121_solr c:org.apache.solr.search.facet.TestCloudJSONFacetSKG_collection s:shard1 r:core_node2 x:org.apache.solr.search.facet.TestCloudJSONFacetSKG_collection_shard1_replica_n1 ] o.a.s.u.CommitTracker Soft AutoCommit: disabled
   [junit4]   2> 1782862 INFO  (qtp1746552108-27921) [n:127.0.0.1:33121_solr c:org.apache.solr.search.facet.TestCloudJSONFacetSKG_collection s:shard1 r:core_node2 x:org.apache.solr.search.facet.TestCloudJSONFacetSKG_collection_shard1_replica_n1 ] o.a.s.u.RandomMergePolicy RandomMergePolicy wrapping class org.apache.lucene.index.LogDocMergePolicy: [LogDocMergePolicy: minMergeSize=1000, mergeFactor=13, maxMergeSize=9223372036854775807, maxMergeSizeForForcedMerge=9223372036854775807, calibrateSizeByDeletes=true, maxMergeDocs=2147483647, maxCFSSegmentSizeMB=8.796093022207999E12, noCFSRatio=0.0]
   [junit4]   2> 1782863 INFO  (qtp1746552108-27921) [n:127.0.0.1:33121_solr c:org.apache.solr.search.facet.TestCloudJSONFacetSKG_collection s:shard1 r:core_node2 x:org.apache.solr.search.facet.TestCloudJSONFacetSKG_collection_shard1_replica_n1 ] o.a.s.s.SolrIndexSearcher Opening [Searcher@54f21e26[org.apache.solr.search.facet.TestCloudJSONFacetSKG_collection_shard1_replica_n1] main]
   [junit4]   2> 1782865 INFO  (qtp1746552108-27921) [n:127.0.0.1:33121_solr c:org.apache.solr.search.facet.TestCloudJSONFacetSKG_collection s:shard1 r:core_node2 x:org.apache.solr.search.facet.TestCloudJSONFacetSKG_collection_shard1_replica_n1 ] o.a.s.r.ManagedResourceStorage Configured ZooKeeperStorageIO with znodeBase: /configs/org.apache.solr.search.facet.TestCloudJSONFacetSKG_config-set
   [junit4]   2> 1782866 INFO  (qtp1746552108-27921) [n:127.0.0.1:33121_solr c:org.apache.solr.search.facet.TestCloudJSONFacetSKG_collection s:shard1 r:core_node2 x:org.apache.solr.search.facet.TestCloudJSONFacetSKG_collection_shard1_replica_n1 ] o.a.s.r.ManagedResourceStorage Loaded null at path _rest_managed.json using ZooKeeperStorageIO:path=/configs/org.apache.solr.search.facet.TestCloudJSONFacetSKG_config-set
   [junit4]   2> 1782867 INFO  (qtp1746552108-27921) [n:127.0.0.1:33121_solr c:org.apache.solr.search.facet.TestCloudJSONFacetSKG_collection s:shard1 r:core_node2 x:org.apache.solr.search.facet.TestCloudJSONFacetSKG_collection_shard1_replica_n1 ] o.a.s.h.ReplicationHandler Commits will be reserved for 10000ms.
   [junit4]   2> 1782867 INFO  (qtp1746552108-27921) [n:127.0.0.1:33121_solr c:org.apache.solr.search.facet.TestCloudJSONFacetSKG_collection s:shard1 r:core_node2 x:org.apache.solr.search.facet.TestCloudJSONFacetSKG_collection_shard1_replica_n1 ] o.a.s.u.UpdateLog Could not find max version in index or recent updates, using new clock 1643712102013075456
   [junit4]   2> 1782874 INFO  (searcherExecutor-7378-thread-1-processing-n:127.0.0.1:33121_solr x:org.apache.solr.search.facet.TestCloudJSONFacetSKG_collection_shard1_replica_n1 c:org.apache.solr.search.facet.TestCloudJSONFacetSKG_collection s:shard1 r:core_node2) [n:127.0.0.1:33121_solr c:org.apache.solr.search.facet.TestCloudJSONFacetSKG_collection s:shard1 r:core_node2 x:org.apache.solr.search.facet.TestCloudJSONFacetSKG_collection_shard1_replica_n1 ] o.a.s.c.SolrCore [org.apache.solr.search.facet.TestCloudJSONFacetSKG_collection_shard1_replica_n1] Registered new searcher Searcher@54f21e26[org.apache.solr.search.facet.TestCloudJSONFacetSKG_collection_shard1_replica_n1] main{ExitableDirectoryReader(UninvertingDirectoryReader())}
   [junit4]   2> 1782875 INFO  (qtp1746552108-27921) [n:127.0.0.1:33121_solr c:org.apache.solr.search.facet.TestCloudJSONFacetSKG_collection s:shard1 r:core_node2 x:org.apache.solr.search.facet.TestCloudJSONFacetSKG_collection_shard1_replica_n1 ] o.a.s.c.ZkShardTerms Successful update of terms at /collections/org.apache.solr.search.facet.TestCloudJSONFacetSKG_collection/terms/shard1 to Terms{values={core_node2=0}, version=0}
   [junit4]   2> 1782875 INFO  (qtp1746552108-27921) [n:127.0.0.1:33121_solr c:org.apache.solr.search.facet.TestCloudJSONFacetSKG_collection s:shard1 r:core_node2 x:org.apache.solr.search.facet.TestCloudJSONFacetSKG_collection_shard1_replica_n1 ] o.a.s.c.ShardLeaderElectionContextBase make sure parent is created /collections/org.apache.solr.search.facet.TestCloudJSONFacetSKG_collection/leaders/shard1
   [junit4]   2> 1782880 INFO  (qtp1746552108-27921) [n:127.0.0.1:33121_solr c:org.apache.solr.search.facet.TestCloudJSONFacetSKG_collection s:shard1 r:core_node2 x:org.apache.solr.search.facet.TestCloudJSONFacetSKG_collection_shard1_replica_n1 ] o.a.s.c.ShardLeaderElectionContext Enough replicas found to continue.
   [junit4]   2> 1782880 INFO  (qtp1746552108-27921) [n:127.0.0.1:33121_solr c:org.apache.solr.search.facet.TestCloudJSONFacetSKG_collection s:shard1 r:core_node2 x:org.apache.solr.search.facet.TestCloudJSONFacetSKG_collection_shard1_replica_n1 ] o.a.s.c.ShardLeaderElectionContext I may be the new leader - try and sync
   [junit4]   2> 1782880 INFO  (qtp1746552108-27921) [n:127.0.0.1:33121_solr c:org.apache.solr.search.facet.TestCloudJSONFacetSKG_collection s:shard1 r:core_node2 x:org.apache.solr.search.facet.TestCloudJSONFacetSKG_collection_shard1_replica_n1 ] o.a.s.c.SyncStrategy Sync replicas to http://127.0.0.1:33121/solr/org.apache.solr.search.facet.TestCloudJSONFacetSKG_collection_shard1_replica_n1/
   [junit4]   2> 1782880 INFO  (qtp1746552108-27921) [n:127.0.0.1:33121_solr c:org.apache.solr.search.facet.TestCloudJSONFacetSKG_collection s:shard1 r:core_node2 x:org.apache.solr.search.facet.TestCloudJSONFacetSKG_collection_shard1_replica_n1 ] o.a.s.c.SyncStrategy Sync Success - now sync replicas to me
   [junit4]   2> 1782881 INFO  (qtp1746552108-27921) [n:127.0.0.1:33121_solr c:org.apache.solr.search.facet.TestCloudJSONFacetSKG_collection s:shard1 r:core_node2 x:org.apache.solr.search.facet.TestCloudJSONFacetSKG_collection_shard1_replica_n1 ] o.a.s.c.SyncStrategy http://127.0.0.1:33121/solr/org.apache.solr.search.facet.TestCloudJSONFacetSKG_collection_shard1_replica_n1/ has no replicas
   [junit4]   2> 1782881 INFO  (qtp1746552108-27921) [n:127.0.0.1:33121_solr c:org.apache.solr.search.facet.TestCloudJSONFacetSKG_collection s:shard1 r:core_node2 x:org.apache.solr.search.facet.TestCloudJSONFacetSKG_collection_shard1_replica_n1 ] o.a.s.c.ShardLeaderElectionContextBase Creating leader registration node /collections/org.apache.solr.search.facet.TestCloudJSONFacetSKG_collection/leaders/shard1/leader after winning as /collections/org.apache.solr.search.facet.TestCloudJSONFacetSKG_collection/leader_elect/shard1/election/72318925744504837-core_node2-n_0000000000
   [junit4]   2> 1782883 INFO  (qtp1746552108-27921) [n:127.0.0.1:33121_solr c:org.apache.solr.search.facet.TestCloudJSONFacetSKG_collection s:shard1 r:core_node2 x:org.apache.solr.search.facet.TestCloudJSONFacetSKG_collection_shard1_replica_n1 ] o.a.s.c.ShardLeaderElectionContext I am the new leader: http://127.0.0.1:33121/solr/org.apache.solr.search.facet.TestCloudJSONFacetSKG_collection_shard1_replica_n1/ shard1
   [junit4]   2> 1782986 INFO  (zkCallback-10696-thread-1) [     ] o.a.s.c.c.ZkStateReader A cluster state change: [WatchedEvent state:SyncConnected type:NodeDataChanged path:/collections/org.apache.solr.search.facet.TestCloudJSONFacetSKG_collection/state.json] for collection [org.apache.solr.search.facet.TestCloudJSONFacetSKG_collection] has occurred - updating... (live nodes size: [1])
   [junit4]   2> 1782986 INFO  (zkCallback-10696-thread-2) [     ] o.a.s.c.c.ZkStateReader A cluster state change: [WatchedEvent state:SyncConnected type:NodeDataChanged path:/collections/org.apache.solr.search.facet.TestCloudJSONFacetSKG_collection/state.json] for collection [org.apache.solr.search.facet.TestCloudJSONFacetSKG_collection] has occurred - updating... (live nodes size: [1])
   [junit4]   2> 1782987 INFO  (qtp1746552108-27921) [n:127.0.0.1:33121_solr c:org.apache.solr.search.facet.TestCloudJSONFacetSKG_collection s:shard1 r:core_node2 x:org.apache.solr.search.facet.TestCloudJSONFacetSKG_collection_shard1_replica_n1 ] o.a.s.c.ZkController I am the leader, no recovery necessary
   [junit4]   2> 1782990 INFO  (qtp1746552108-27921) [n:127.0.0.1:33121_solr c:org.apache.solr.search.facet.TestCloudJSONFacetSKG_collection s:shard1 r:core_node2 x:org.apache.solr.search.facet.TestCloudJSONFacetSKG_collection_shard1_replica_n1 ] o.a.s.s.HttpSolrCall [admin] webapp=null path=/admin/cores params={qt=/admin/cores&collection.configName=org.apache.solr.search.facet.TestCloudJSONFacetSKG_config-set&newCollection=true&collection=org.apache.solr.search.facet.TestCloudJSONFacetSKG_collection&version=2&replicaType=NRT&property.schema=schema_latest.xml&property.config=solrconfig-tlog.xml&coreNodeName=core_node2&name=org.apache.solr.search.facet.TestCloudJSONFacetSKG_collection_shard1_replica_n1&action=CREATE&numShards=1&shard=shard1&wt=javabin} status=0 QTime=1344
   [junit4]   2> 1782993 INFO  (qtp1746552108-27919) [n:127.0.0.1:33121_solr     ] o.a.s.h.a.CollectionsHandler Wait for new collection to be active for at most 45 seconds. Check all shard replicas
   [junit4]   2> 1783090 INFO  (zkCallback-10696-thread-2) [     ] o.a.s.c.c.ZkStateReader A cluster state change: [WatchedEvent state:SyncConnected type:NodeDataChanged path:/collections/org.apache.solr.search.facet.TestCloudJSONFacetSKG_collection/state.json] for collection [org.apache.solr.search.facet.TestCloudJSONFacetSKG_collection] has occurred - updating... (live nodes size: [1])
   [junit4]   2> 1783090 INFO  (zkCallback-10696-thread-1) [     ] o.a.s.c.c.ZkStateReader A cluster state change: [WatchedEvent state:SyncConnected type:NodeDataChanged path:/collections/org.apache.solr.search.facet.TestCloudJSONFacetSKG_collection/state.json] for collection [org.apache.solr.search.facet.TestCloudJSONFacetSKG_collection] has occurred - updating... (live nodes size: [1])
   [junit4]   2> 1783090 INFO  (zkCallback-10696-thread-3) [     ] o.a.s.c.c.ZkStateReader A cluster state change: [WatchedEvent state:SyncConnected type:NodeDataChanged path:/collections/org.apache.solr.search.facet.TestCloudJSONFacetSKG_collection/state.json] for collection [org.apache.solr.search.facet.TestCloudJSONFacetSKG_collection] has occurred - updating... (live nodes size: [1])
   [junit4]   2> 1783091 INFO  (qtp1746552108-27919) [n:127.0.0.1:33121_solr     ] o.a.s.s.HttpSolrCall [admin] webapp=null path=/admin/collections params={property.schema=schema_latest.xml&property.config=solrconfig-tlog.xml&collection.configName=org.apache.solr.search.facet.TestCloudJSONFacetSKG_config-set&name=org.apache.solr.search.facet.TestCloudJSONFacetSKG_collection&nrtReplicas=1&action=CREATE&numShards=1&wt=javabin&version=2} status=0 QTime=1772
   [junit4]   2> 1783091 INFO  (SUITE-TestCloudJSONFacetSKG-seed#[5D445E53BDFA995]-worker) [     ] o.a.s.c.AbstractDistribZkTestBase Wait for recoveries to finish - collection: org.apache.solr.search.facet.TestCloudJSONFacetSKG_collection failOnTimeout:true timeout (sec):330
   [junit4]   1> replica:core_node2 rstate:active live:true
   [junit4]   1> no one is recoverying
   [junit4]   1> replica:core_node2 rstate:active live:true
   [junit4]   1> no one is recoverying
   [junit4]   1> replica:core_node2 rstate:active live:true
   [junit4]   1> no one is recoverying
   [junit4]   2> 1783094 INFO  (SUITE-TestCloudJSONFacetSKG-seed#[5D445E53BDFA995]-worker) [     ] o.a.s.c.AbstractDistribZkTestBase Recoveries finished - collection: org.apache.solr.search.facet.TestCloudJSONFacetSKG_collection
   [junit4]   2> 1783110 INFO  (qtp1746552108-27922) [n:127.0.0.1:33121_solr c:org.apache.solr.search.facet.TestCloudJSONFacetSKG_collection s:shard1 r:core_node2 x:org.apache.solr.search.facet.TestCloudJSONFacetSKG_collection_shard1_replica_n1 ] o.a.s.c.ZkShardTerms Successful update of terms at /collections/org.apache.solr.search.facet.TestCloudJSONFacetSKG_collection/terms/shard1 to Terms{values={core_node2=1}, version=1}
   [junit4]   2> 1783110 INFO  (qtp1746552108-27922) [n:127.0.0.1:33121_solr c:org.apache.solr.search.facet.TestCloudJSONFacetSKG_collection s:shard1 r:core_node2 x:org.apache.solr.search.facet.TestCloudJSONFacetSKG_collection_shard1_replica_n1 ] o.a.s.u.p.LogUpdateProcessorFactory [org.apache.solr.search.facet.TestCloudJSONFacetSKG_collection_shard1_replica_n1]  webapp=/solr path=/update params={wt=javabin&version=2}{add=[0 (1643712102263685120)]} 0 5
   [junit4]   2> 1783117 INFO  (qtp1746552108-27918) [n:127.0.0.1:33121_solr c:org.apache.solr.search.facet.TestCloudJSONFacetSKG_collection s:shard1 r:core_node2 x:org.apache.solr.search.facet.TestCloudJSONFacetSKG_collection_shard1_replica_n1 ] o.a.s.u.p.LogUpdateProcessorFactory [org.apache.solr.search.facet.TestCloudJSONFacetSKG_collection_shard1_replica_n1]  webapp=/solr path=/update params={wt=javabin&version=2}{add=[1 (1643712102274170880)]} 0 2
   [junit4]   2> 1783119 INFO  (qtp1746552108-27920) [n:127.0.0.1:33121_solr c:org.apache.solr.search.facet.TestCloudJSONFacetSKG_collection s:shard1 r:core_node2 x:org.apache.solr.search.facet.TestCloudJSONFacetSKG_collection_shard1_replica_n1 ] o.a.s.u.p.LogUpdateProcessorFactory [org.apache.solr.search.facet.TestCloudJSONFacetSKG_collection_shard1_replica_n1]  webapp=/solr path=/update params={wt=javabin&version=2}{add=[2 (1643712102277316608)]} 0 0
   [junit4]   2> 1783121 INFO  (qtp1746552108-27921) [n:127.0.0.1:33121_solr c:org.apache.solr.search.facet.TestCloudJSONFacetSKG_collection s:shard1 r:core_node2 x:org.apache.solr.search.facet.TestCloudJSONFacetSKG_collection_shard1_replica_n1 ] o.a.s.u.p.LogUpdateProcessorFactory [org.apache.solr.search.facet.TestCloudJSONFacetSKG_collection_shard1_replica_n1]  webapp=/solr path=/update params={wt=javabin&version=2}{add=[3 (1643712102279413760)]} 0 0
   [junit4]   2> 1783127 INFO  (qtp1746552108-27919) [n:127.0.0.1:33121_solr c:org.apache.solr.search.facet.TestCloudJSONFacetSKG_collection s:shard1 r:core_node2 x:org.apache.solr.search.facet.TestCloudJSONFacetSKG_collection_shard1_replica_n1 ] o.a.s.u.p.LogUpdateProcessorFactory [org.apache.solr.search.facet.TestCloudJSONFacetSKG_collection_shard1_replica_n1]  webapp=/solr path=/update params={wt=javabin&version=2}{add=[4 (1643712102285705216)]} 0 0
   [junit4]   2> 1783129 INFO  (qtp1746552108-27922) [n:127.0.0.1:33121_solr c:org.apache.solr.search.facet.TestCloudJSONFacetSKG_collection s:shard1 r:core_node2 x:org.apache.solr.search.facet.TestCloudJSONFacetSKG_collection_shard1_replica_n1 ] o.a.s.u.p.LogUpdateProcessorFactory [org.apache.solr.search.facet.TestCloudJSONFacetSKG_collection_shard1_replica_n1]  webapp=/solr path=/update params={wt=javabin&version=2}{add=[5 (1643712102287802368)]} 0 0
   [junit4]   2> 1783130 INFO  (qtp1746552108-27918) [n:127.0.0.1:33121_solr c:org.apache.solr.search.facet.TestCloudJSONFacetSKG_collection s:shard1 r:core_node2 x:org.apache.solr.search.facet.TestCloudJSONFacetSKG_collection_shard1_replica_n1 ] o.a.s.u.p.LogUpdateProcessorFactory [org.apache.solr.search.facet.TestCloudJSONFacetSKG_collection_shard1_replica_n1]  webapp=/solr path=/update params={wt=javabin&version=2}{add=[6 (1643712102288850944)]} 0 0
   [junit4]   2> 1783131 INFO  (qtp1746552108-27920) [n:127.0.0.1:33121_solr c:org.apache.solr.search.facet.TestCloudJSONFacetSKG_collection s:shard1 r:core_node2 x:org.apache.solr.search.facet.TestCloudJSONFacetSKG_collection_shard1_replica_n1 ] o.a.s.u.p.LogUpdateProcessorFactory [org.apache.solr.search.facet.TestCloudJSONFacetSKG_collection_shard1_replica_n1]  webapp=/solr path=/update params={wt=javabin&version=2}{add=[7 (1643712102289899520)]} 0 0
   [junit4]   2> 1783133 INFO  (qtp1746552108-27921) [n:127.0.0.1:33121_solr c:org.apache.solr.search.facet.TestCloudJSONFacetSKG_collection s:shard1 r:core_node2 x:org.apache.solr.search.facet.TestCloudJSONFacetSKG_collection_shard1_replica_n1 ] o.a.s.u.p.LogUpdateProcessorFactory [org.apache.solr.search.facet.TestCloudJSONFacetSKG_collection_shard1_replica_n1]  webapp=/solr path=/update params={wt=javabin&version=2}{add=[8 (1643712102290948096)]} 0 0
   [junit4]   2> 1783143 INFO  (qtp1746552108-27919) [n:127.0.0.1:33121_solr c:org.apache.solr.search.facet.TestCloudJSONFacetSKG_collection s:shard1 r:core_node2 x:org.apache.solr.search.facet.TestCloudJSONFacetSKG_collection_shard1_replica_n1 ] o.a.s.u.p.LogUpdateProcessorFactory [org.apache.solr.search.facet.TestCloudJSONFacetSKG_collection_shard1_replica_n1]  webapp=/solr path=/update params={wt=javabin&version=2}{add=[9 (1643712102302482432)]} 0 0
   [junit4]   2> 1783162 INFO  (qtp1746552108-27922) [n:127.0.0.1:33121_solr c:org.apache.solr.search.facet.TestCloudJSONFacetSKG_collection s:shard1 r:core_node2 x:org.apache.solr.search.facet.TestCloudJSONFacetSKG_collection_shard1_replica_n1 ] o.a.s.u.p.LogUpdateProcessorFactory [org.apache.solr.search.facet.TestCloudJSONFacetSKG_collection_shard1_replica_n1]  webapp=/solr path=/update params={wt=javabin&version=2}{add=[10 (1643712102322405376)]} 0 0
   [junit4]   2> 1783164 INFO  (qtp1746552108-27918) [n:127.0.0.1:33121_solr c:org.apache.solr.search.facet.TestCloudJSONFacetSKG_collection s:shard1 r:core_node2 x:org.apache.solr.search.facet.TestCloudJSONFacetSKG_collection_shard1_replica_n1 ] o.a.s.u.p.LogUpdateProcessorFactory [org.apache.solr.search.facet.TestCloudJSONFacetSKG_collection_shard1_replica_n1]  webapp=/solr path=/update params={wt=javabin&version=2}{add=[11 (1643712102323453952)]} 0 0
   [junit4]   2> 1783165 INFO  (qtp1746552108-27920) [n:127.0.0.1:33121_solr c:org.apache.solr.search.facet.TestCloudJSONFacetSKG_collection s:shard1 r:core_node2 x:org.apache.solr.search.facet.TestCloudJSONFacetSKG_collection_shard1_replica_n1 ] o.a.s.u.p.LogUpdateProcessorFactory [org.apache.solr.search.facet.TestCloudJSONFacetSKG_collection_shard1_replica_n1]  webapp=/solr path=/update params={wt=javabin&version=2}{add=[12 (1643712102325551104)]} 0 0
   [junit4]   2> 1783166 INFO  (qtp1746552108-27921) [n:127.0.0.1:33121_solr c:org.apache.solr.search.facet.TestCloudJSONFacetSKG_collection s:shard1 r:core_node2 x:org.apache.solr.search.facet.TestCloudJSONFacetSKG_collection_shard1_replica_n1 ] o.a.s.u.p.LogUpdateProcessorFactory [org.apache.solr.search.facet.TestCloudJSONFacetSKG_collection_shard1_replica_n1]  webapp=/solr path=/update params={wt=javabin&version=2}{add=[13 (1643712102326599680)]} 0 0
   [junit4]   2> 1783168 INFO  (qtp1746552108-27919) [n:127.0.0.1:33121_solr c:org.apache.solr.search.facet.TestCloudJSONFacetSKG_collection s:shard1 r:core_node2 x:org.apache.solr.search.facet.TestCloudJSONFacetSKG_collection_shard1_replica_n1 ] o.a.s.u.p.LogUpdateProcessorFactory [org.apache.solr.search.facet.TestCloudJSONFacetSKG_collection_shard1_replica_n1]  webapp=/solr path=/update params={wt=javabin&version=2}{add=[14 (1643712102327648256)]} 0 0
   [junit4]   2> 1783169 INFO  (qtp1746552108-27922) [n:127.0.0.1:33121_solr c:org.apache.solr.search.facet.TestCloudJSONFacetSKG_collection s:shard1 r:core_node2 x:org.apache.solr.search.facet.TestCloudJSONFacetSKG_collection_shard1_replica_n1 ] o.a.s.u.p.LogUpdateProcessorFactory [org.apache.solr.search.facet.TestCloudJSONFacetSKG_collection_shard1_replica_n1]  webapp=/solr path=/update params={wt=javabin&version=2}{add=[15 (1643712102329745408)]} 0 0
   [junit4]   2> 1783170 INFO  (qtp1746552108-27918) [n:127.0.0.1:33121_solr c:org.apache.solr.search.facet.TestCloudJSONFacetSKG_collection s:shard1 r:core_node2 x:org.apache.solr.search.facet.TestCloudJSONFacetSKG_collection_shard1_replica_n1 ] o.a.s.u.p.LogUpdateProcessorFactory [org.apache.solr.search.facet.TestCloudJSONFacetSKG_collection_shard1_replica_n1]  webapp=/solr path=/update params={wt=javabin&version=2}{add=[16 (1643712102330793984)]} 0 0
   [junit4]   2> 1783172 INFO  (qtp1746552108-27920) [n:127.0.0.1:33121_solr c:org.apache.solr.search.facet.TestCloudJSONFacetSKG_collection s:shard1 r:core_node2 x:org.apache.solr.search.facet.TestCloudJSONFacetSKG_collection_shard1_replica_n1 ] o.a.s.u.p.LogUpdateProcessorFactory [org.apache.solr.search.facet.TestCloudJSONFacetSKG_collection_shard1_replica_n1]  webapp=/solr path=/update params={wt=javabin&version=2}{add=[17 (1643712102331842560)]} 0 0
   [junit4]   2> 1783173 INFO  (qtp1746552108-27921) [n:127.0.0.1:33121_solr c:org.apache.solr.search.facet.TestCloudJSONFacetSKG_collection s:shard1 r:core_node2 x:org.apache.solr.search.facet.TestCloudJSONFacetSKG_collection_shard1_replica_n1 ] o.a.s.u.p.LogUpdateProcessorFactory [org.apache.solr.search.facet.TestCloudJSONFacetSKG_collection_shard1_replica_n1]  webapp=/solr path=/update params={wt=javabin&version=2}{add=[18 (1643712102333939712)]} 0 0
   [junit4]   2> 1783174 INFO  (qtp1746552108-27919) [n:127.0.0.1:33121_solr c:org.apache.solr.search.facet.TestCloudJSONFacetSKG_collection s:shard1 r:core_node2 x:org.apache.solr.search.facet.TestCloudJSONFacetSKG_collection_shard1_replica_n1 ] o.a.s.u.p.LogUpdateProcessorFactory [org.apache.solr.search.facet.TestCloudJSONFacetSKG_collection_shard1_replica_n1]  webapp=/solr path=/update params={wt=javabin&version=2}{add=[18 (1643712102334988288)]} 0 0
   [junit4]   2> 1783176 INFO  (qtp1746552108-27922) [n:127.0.0.1:33121_solr c:org.apache.solr.search.facet.TestCloudJSONFacetSKG_collection s:shard1 r:core_node2 x:org.apache.solr.search.facet.TestCloudJSONFacetSKG_collection_shard1_replica_n1 ] o.a.s.u.p.LogUpdateProcessorFactory [org.apache.solr.search.facet.TestCloudJSONFacetSKG_collection_shard1_replica_n1]  webapp=/solr path=/update params={wt=javabin&version=2}{add=[19 (1643712102336036864)]} 0 0
   [junit4]   2> 1783177 INFO  (qtp1746552108-27918) [n:127.0.0.1:33121_solr c:org.apache.solr.search.facet.TestCloudJSONFacetSKG_collection s:shard1 r:core_node2 x:org.apache.solr.search.facet.TestCloudJSONFacetSKG_collection_shard1_replica_n1 ] o.a.s.u.p.LogUpdateProcessorFactory [org.apache.solr.search.facet.TestCloudJSONFacetSKG_collection_shard1_replica_n1]  webapp=/solr path=/update params={wt=javabin&version=2}{add=[20 (1643712102338134016)]} 0 0
   [junit4]   2> 1783178 INFO  (qtp1746552108-27920) [n:127.0.0.1:33121_solr c:org.apache.solr.search.facet.TestCloudJSONFacetSKG_collection s:shard1 r:core_node2 x:org.apache.solr.search.facet.TestCloudJSONFacetSKG_collection_shard1_replica_n1 ] o.a.s.u.p.LogUpdateProcessorFactory [org.apache.solr.search.facet.TestCloudJSONFacetSKG_collection_shard1_replica_n1]  webapp=/solr path=/update params={wt=javabin&version=2}{add=[20 (1643712102339182592)]} 0 0
   [junit4]   2> 1783180 INFO  (qtp1746552108-27921) [n:127.0.0.1:33121_solr c:org.apache.solr.search.facet.TestCloudJSONFacetSKG_collection s:shard1 r:core_node2 x:org.apache.solr.search.facet.TestCloudJSONFacetSKG_collection_shard1_replica_n1 ] o.a.s.u.p.LogUpdateProcessorFactory [org.apache.solr.search.facet.TestCloudJSONFacetSKG_collection_shard1_replica_n1]  webapp=/solr path=/update params={wt=javabin&version=2}{add=[21 (1643712102340231168)]} 0 0
   [junit4]   2> 1783181 INFO  (qtp1746552108-27919) [n:127.0.0.1:33121_solr c:org.apache.solr.search.facet.TestCloudJSONFacetSKG_collection s:shard1 r:core_node2 x:org.apache.solr.search.facet.TestCloudJSONFacetSKG_collection_shard1_replica_n1 ] o.a.s.u.p.LogUpdateProcessorFactory [org.apache.solr.search.facet.TestCloudJSONFacetSKG_collection_shard1_replica_n1]  webapp=/solr path=/update params={wt=javabin&version=2}{add=[22 (1643712102342328320)]} 0 0
   [junit4]   2> 1783182 INFO  (qtp1746552108-27922) [n:127.0.0.1:33121_solr c:org.apache.solr.search.facet.TestCloudJSONFacetSKG_collection s:shard1 r:core_node2 x:org.apache.solr.search.facet.TestCloudJSONFacetSKG_collection_shard1_replica_n1 ] o.a.s.u.p.LogUpdateProcessorFactory [org.apache.solr.search.facet.TestCloudJSONFacetSKG_collection_shard1_replica_n1]  webapp=/solr path=/update params={wt=javabin&version=2}{add=[23 (1643712102343376896)]} 0 0
   [junit4]   2> 1783184 INFO  (qtp1746552108-27918) [n:127.0.0.1:33121_solr c:org.apache.solr.search.facet.TestCloudJSONFacetSKG_collection s:shard1 r:core_node2 x:org.apache.solr.search.facet.TestCloudJSONFacetSKG_collection_shard1_replica_n1 ] o.a.s.u.p.LogUpdateProcessorFactory [org.apache.solr.search.facet.TestCloudJSONFacetSKG_collection_shard1_replica_n1]  webapp=/solr path=/update params={wt=javabin&version=2}{add=[24 (1643712102345474048)]} 0 0
   [junit4]   2> 1783185 INFO  (qtp1746552108-27920) [n:127.0.0.1:33121_solr c:org.apache.solr.search.facet.TestCloudJSONFacetSKG_collection s:shard1 r:core_node2 x:org.apache.solr.search.facet.TestCloudJSONFacetSKG_collection_shard1_replica_n1 ] o.a.s.u.p.LogUpdateProcessorFactory [org.apache.solr.search.facet.TestCloudJSONFacetSKG_collection_shard1_replica_n1]  webapp=/solr path=/update params={wt=javabin&version=2}{add=[25 (1643712102346522624)]} 0 0
   [junit4]   2> 1783190 INFO  (qtp1746552108-27921) [n:127.0.0.1:33121_solr c:org.apache.solr.search.facet.TestCloudJSONFacetSKG_collection s:shard1 r:core_node2 x:org.apache.solr.search.facet.TestCloudJSONFacetSKG_collection_shard1_replica_n1 ] o.a.s.u.p.LogUpdateProcessorFactory [org.apache.solr.search.facet.TestCloudJSONFacetSKG_collection_shard1_replica_n1]  webapp=/solr path=/update params={wt=javabin&version=2}{add=[26 (1643712102350716928)]} 0 0
   [junit4]   2> 1783191 INFO  (qtp1746552108-27919) [n:127.0.0.1:33121_solr c:org.apache.solr.search.facet.TestCloudJSONFacetSKG_collection s:shard1 r:core_node2 x:org.apache.solr.search.facet.TestCloudJSONFacetSKG_collection_shard1_replica_n1 ] o.a.s.u.p.LogUpdateProcessorFactory [org.apache.solr.search.facet.TestCloudJSONFacetSKG_collection_shard1_replica_n1]  webapp=/solr path=/update params={wt=javabin&version=2}{add=[27 (1643712102352814080)]} 0 0
   [junit4]   2> 1783193 INFO  (qtp1746552108-27922) [n:127.0.0.1:33121_solr c:org.apache.solr.search.facet.TestCloudJSONFacetSKG_collection s:shard1 r:core_node2 x:org.apache.solr.search.facet.TestCloudJSONFacetSKG_collection_shard1_replica_n1 ] o.a.s.u.p.LogUpdateProcessorFactory [org.apache.solr.search.facet.TestCloudJSONFacetSKG_collection_shard1_replica_n1]  webapp=/solr path=/update params={wt=javabin&version=2}{add=[28 (1643712102354911232)]} 0 0
   [junit4]   2> 1783194 INFO  (qtp1746552108-27918) [n:127.0.0.1:33121_solr c:org.apache.solr.search.facet.TestCloudJSONFacetSKG_collection s:shard1 r:core_node2 x:org.apache.solr.search.facet.TestCloudJSONFacetSKG_collection_shard1_replica_n1 ] o.a.s.u.p.LogUpdateProcessorFactory [org.apache.solr.search.facet.TestCloudJSONFacetSKG_collection_shard1_replica_n1]  webapp=/solr path=/update params={wt=javabin&version=2}{add=[29 (1643712102355959808)]} 0 0
   [junit4]   2> 1783195 INFO  (qtp1746552108-27920) [n:127.0.0.1:33121_solr c:org.apache.solr.search.facet.TestCloudJSONFacetSKG_collection s:shard1 r:core_node2 x:org.apache.solr.search.facet.TestCloudJSONFacetSKG_collection_shard1_replica_n1 ] o.a.s.u.p.LogUpdateProcessorFactory [org.apache.solr.search.facet.TestCloudJSONFacetSKG_collection_shard1_replica_n1]  webapp=/solr path=/update params={wt=javabin&version=2}{add=[30 (1643712102357008384)]} 0 0
   [junit4]   2> 1783197 INFO  (qtp1746552108-27921) [n:127.0.0.1:33121_solr c:org.apache.solr.search.facet.TestCloudJSONFacetSKG_collection s:shard1 r:core_node2 x:org.apache.solr.search.facet.TestCloudJSONFacetSKG_collection_shard1_replica_n1 ] o.a.s.u.p.LogUpdateProcessorFactory [org.apache.solr.search.facet.TestCloudJSONFacetSKG_collection_shard1_replica_n1]  webapp=/solr path=/update params={wt=javabin&version=2}{add=[31 (1643712102359105536)]} 0 0
   [junit4]   2> 1783198 INFO  (qtp1746552108-27919) [n:127.0.0.1:33121_solr c:org.apache.solr.search.facet.TestCloudJSONFacetSKG_collection s:shard1 r:core_node2 x:org.apache.solr.search.facet.TestCloudJSONFacetSKG_collection_shard1_replica_n1 ] o.a.s.u.p.LogUpdateProcessorFactory [org.apache.solr.search.facet.TestCloudJSONFacetSKG_collection_shard1_replica_n1]  webapp=/solr path=/update params={wt=javabin&version=2}{add=[32 (1643712102360154112)]} 0 0
   [junit4]   2> 1783200 INFO  (qtp1746552108-27922) [n:127.0.0.1:33121_solr c:org.apache.solr.search.facet.TestCloudJSONFacetSKG_collection s:shard1 r:core_node2 x:org.apache.solr.search.facet.TestCloudJSONFacetSKG_collection_shard1_replica_n1 ] o.a.s.u.p.LogUpdateProcessorFactory [org.apache.solr.search.facet.TestCloudJSONFacetSKG_collection_shard1_replica_n1]  webapp=/solr path=/update params={wt=javabin&version=2}{add=[33 (1643712102361202688)]} 0 0
   [junit4]   2> 1783201 INFO  (qtp1746552108-27918) [n:127.0.0.1:33121_solr c:org.apache.solr.search.facet.TestCloudJSONFacetSKG_collection s:shard1 r:core_node2 x:org.apache.solr.search.facet.TestCloudJSONFacetSKG_collection_shard1_replica_n1 ] o.a.s.u.p.LogUpdateProcessorFactory [org.apache.solr.search.facet.TestCloudJSONFacetSKG_collection_shard1_replica_n1]  webapp=/solr path=/update params={wt=javabin&version=2}{add=[33 (1643712102363299840)]} 0 0
   [junit4]   2> 1783202 INFO  (qtp1746552108-27920) [n:127.0.0.1:33121_solr c:org.apache.solr.search.facet.TestCloudJSONFacetSKG_collection s:shard1 r:core_node2 x:org.apache.solr.search.facet.TestCloudJSONFacetSKG_collection_shard1_replica_n1 ] o.a.s.u.p.LogUpdateProcessorFactory [org.apache.solr.search.facet.TestCloudJSONFacetSKG_collection_shard1_replica_n1]  webapp=/solr path=/update params={wt=javabin&version=2}{add=[34 (1643712102364348416)]} 0 0
   [junit4]   2> 1783203 INFO  (qtp1746552108-27921) [n:127.0.0.1:33121_solr c:org.apache.solr.search.facet.TestCloudJSONFacetSKG_collection s:shard1 r:core_node2 x:org.apache.solr.search.facet.TestCloudJSONFacetSKG_collection_shard1_replica_n1 ] o.a.s.u.p.LogUpdateProcessorFactory [org.apache.solr.search.facet.TestCloudJSONFacetSKG_collection_shard1_replica_n1]  webapp=/solr path=/update params={wt=javabin&version=2}{add=[35 (1643712102365396992)]} 0 0
   [junit4]   2> 1783205 INFO  (qtp1746552108-27919) [n:127.0.0.1:33121_solr c:org.apache.solr.search.facet.TestCloudJSONFacetSKG_collection s:shard1 r:core_node2 x:org.apache.solr.search.facet.TestCloudJSONFacetSKG_collection_shard1_replica_n1 ] o.a.s.u.p.LogUpdateProcessorFactory [org.apache.solr.search.facet.TestCloudJSONFacetSKG_collection_shard1_replica_n1]  webapp=/solr path=/update params={wt=javabin&version=2}{add=[36 (1643712102366445568)]} 0 0
   [junit4]   2> 1783206 INFO  (qtp1746552108-27922) [n:127.0.0.1:33121_solr c:org.apache.solr.search.facet.TestCloudJSONFacetSKG_collection s:shard1 r:core_node2 x:org.apache.solr.search.facet.TestCloudJSONFacetSKG_collection_shard1_replica_n1 ] o.a.s.u.p.LogUpdateProcessorFactory [org.apache.solr.search.facet.TestCloudJSONFacetSKG_collection_shard1_replica_n1]  webapp=/solr path=/update params={wt=javabin&version=2}{add=[37 (1643712102368542720)]} 0 0
   [junit4]   2> 1783207 INFO  (qtp1746552108-27918) [n:127.0.0.1:33121_solr c:org.apache.solr.search.facet.TestCloudJSONFacetSKG_collection s:shard1 r:core_node2 x:org.apache.solr.search.facet.TestCloudJSONFacetSKG_collection_shard1_replica_n1 ] o.a.s.u.p.LogUpdateProcessorFactory [org.apache.solr.search.facet.TestCloudJSONFacetSKG_collection_shard1_replica_n1]  webapp=/solr path=/update params={wt=javabin&version=2}{add=[38 (1643712102369591296)]} 0 0
   [junit4]   2> 1783209 INFO  (qtp1746552108-27920) [n:127.0.0.1:33121_solr c:org.apache.solr.search.facet.TestCloudJSONFacetSKG_collection s:shard1 r:core_node2 x:org.apache.solr.search.facet.TestCloudJSONFacetSKG_collection_shard1_replica_n1 ] o.a.s.u.p.LogUpdateProcessorFactory [org.apache.solr.search.facet.TestCloudJSONFacetSKG_collection_shard1_replica_n1]  webapp=/solr path=/update params={wt=javabin&version=2}{add=[39 (1643712102370639872)]} 0 0
   [junit4]   2> 1783210 INFO  (qtp1746552108-27921) [n:127.0.0.1:33121_solr c:org.apache.solr.search.facet.TestCloudJSONFacetSKG_collection s:shard1 r:core_node2 x:org.apache.solr.search.facet.TestCloudJSONFacetSKG_collection_shard1_replica_n1 ] o.a.s.u.p.LogUpdateProcessorFactory [org.apache.solr.search.facet.TestCloudJSONFacetSKG_collection_shard1_replica_n1]  webapp=/solr path=/update params={wt=javabin&version=2}{add=[40 (1643712102372737024)]} 0 0
   [junit4]   2> 1783212 INFO  (qtp1746552108-27919) [n:127.0.0.1:33121_solr c:org.apache.solr.search.facet.TestCloudJSONFacetSKG_collection s:shard1 r:core_node2 x:org.apache.solr.search.facet.TestCloudJSONFacetSKG_collection_shard1_replica_n1 ] o.a.s.u.p.LogUpdateProcessorFactory [org.apache.solr.search.facet.TestCloudJSONFacetSKG_collection_shard1_replica_n1]  webapp=/solr path=/update params={wt=javabin&version=2}{add=[41 (1643712102373785600)]} 0 0
   [junit4]   2> 1783213 INFO  (qtp1746552108-27922) [n:127.0.0.1:33121_solr c:org.apache.solr.search.facet.TestCloudJSONFacetSKG_collection s:shard1 r:core_node2 x:org.apache.solr.search.facet.TestCloudJSONFacetSKG_collection_shard1_replica_n1 ] o.a.s.u.p.LogUpdateProcessorFactory [org.apache.solr.search.facet.TestCloudJSONFacetSKG_collection_shard1_replica_n1]  webapp=/solr path=/update params={wt=javabin&version=2}{add=[42 (1643712102375882752)]} 0 0
   [junit4]   2> 1783214 INFO  (qtp1746552108-27918) [n:127.0.0.1:33121_solr c:org.apache.solr.search.facet.TestCloudJSONFacetSKG_collection s:shard1 r:core_node2 x:org.apache.solr.search.facet.TestCloudJSONFacetSKG_collection_shard1_replica_n1 ] o.a.s.u.p.LogUpdateProcessorFactory [org.apache.solr.search.facet.TestCloudJSONFacetSKG_collection_shard1_replica_n1]  webapp=/solr path=/update params={wt=javabin&version=2}{add=[43 (1643712102376931328)]} 0 0
   [junit4]   2> 1783216 INFO  (qtp1746552108-27920) [n:127.0.0.1:33121_solr c:org.apache.solr.search.facet.TestCloudJSONFacetSKG_collection s:shard1 r:core_node2 x:org.apache.solr.search.facet.TestCloudJSONFacetSKG_collection_shard1_replica_n1 ] o.a.s.u.p.LogUpdateProcessorFactory [org.apache.solr.search.facet.TestCloudJSONFacetSKG_collection_shard1_replica_n1]  webapp=/solr path=/update params={wt=javabin&version=2}{add=[44 (1643712102379028480)]} 0 0
   [junit4]   2> 1783217 INFO  (qtp1746552108-27921) [n:127.0.0.1:33121_solr c:org.apache.solr.search.facet.TestCloudJSONFacetSKG_collection s:shard1 r:core_node2 x:org.apache.solr.search.facet.TestCloudJSONFacetSKG_collection_shard1_replica_n1 ] o.a.s.u.p.LogUpdateProcessorFactory [org.apache.solr.search.facet.TestCloudJSONFacetSKG_collection_shard1_replica_n1]  webapp=/solr path=/update params={wt=javabin&version=2}{add=[44 (1643712102380077056)]} 0 0
   [junit4]   2> 1783219 INFO  (qtp1746552108-27919) [n:127.0.0.1:33121_solr c:org.apache.solr.search.facet.TestCloudJSONFacetSKG_collection s:shard1 r:core_node2 x:org.apache.solr.search.facet.TestCloudJSONFacetSKG_collection_shard1_replica_n1 ] o.a.s.u.p.LogUpdateProcessorFactory [org.apache.solr.search.facet.TestCloudJSONFacetSKG_collection_shard1_replica_n1]  webapp=/solr path=/update params={wt=javabin&version=2}{add=[45 (1643712102381125632)]} 0 0
   [junit4]   2> 1783220 INFO  (qtp1746552108-27922) [n:127.0.0.1:33121_solr c:org.apache.solr.search.facet.TestCloudJSONFacetSKG_collection s:shard1 r:core_node2 x:org.apache.solr.search.facet.TestCloudJSONFacetSKG_collection_shard1_replica_n1 ] o.a.s.u.p.LogUpdateProcessorFactory [org.apache.solr.search.facet.TestCloudJSONFacetSKG_collection_shard1_replica_n1]  webapp=/solr path=/update params={wt=javabin&version=2}{add=[46 (1643712102383222784)]} 0 0
   [junit4]   2> 1783221 INFO  (qtp1746552108-27918) [n:127.0.0.1:33121_solr c:org.apache.solr.search.facet.TestCloudJSONFacetSKG_collection s:shard1 r:core_node2 x:org.apache.solr.search.facet.TestCloudJSONFacetSKG_collection_shard1_replica_n1 ] o.a.s.u.p.LogUpdateProcessorFactory [org.apache.solr.search.facet.TestCloudJSONFacetSKG_collection_shard1_replica_n1]  webapp=/solr path=/update params={wt=javabin&version=2}{add=[47 (1643712102384271360)]} 0 0
   [junit4]   2> 1783223 INFO  (qtp1746552108-27920) [n:127.0.0.1:33121_solr c:org.apache.solr.search.facet.TestCloudJSONFacetSKG_collection s:shard1 r:core_node2 x:org.apache.solr.search.facet.TestCloudJSONFacetSKG_collection_shard1_replica_n1 ] o.a.s.u.p.LogUpdateProcessorFactory [org.apache.solr.search.facet.TestCloudJSONFacetSKG_collection_shard1_replica_n1]  webapp=/solr path=/update params={wt=javabin&version=2}{add=[48 (1643712102386368512)]} 0 0
   [junit4]   2> 1783224 INFO  (qtp1746552108-27921) [n:127.0.0.1:33121_solr c:org.apache.solr.search.facet.TestCloudJSONFacetSKG_collection s:shard1 r:core_node2 x:org.apache.solr.search.facet.TestCloudJSONFacetSKG_collection_shard1_replica_n1 ] o.a.s.u.p.LogUpdateProcessorFactory [org.apache.solr.search.facet.TestCloudJSONFacetSKG_collection_shard1_replica_n1]  webapp=/solr path=/update params={wt=javabin&version=2}{add=[49 (1643712102387417088)]} 0 0
   [junit4]   2> 1783226 INFO  (qtp1746552108-27919) [n:127.0.0.1:33121_solr c:org.apache.solr.search.facet.TestCloudJSONFacetSKG_collection s:shard1 r:core_node2 x:org.apache.solr.search.facet.TestCloudJSONFacetSKG_collection_shard1_replica_n1 ] o.a.s.u.p.LogUpdateProcessorFactory [org.apache.solr.search.facet.TestCloudJSONFacetSKG_collection_shard1_replica_n1]  webapp=/solr path=/update params={wt=javabin&version=2}{add=[50 (1643712102388465664)]} 0 0
   [junit4]   2> 1783227 INFO  (qtp1746552108-27922) [n:127.0.0.1:33121_solr c:org.apache.solr.search.facet.TestCloudJSONFacetSKG_collection s:shard1 r:core_node2 x:org.apache.solr.search.facet.TestCloudJSONFacetSKG_collection_shard1_replica_n1 ] o.a.s.u.p.LogUpdateProcessorFactory [org.apache.solr.search.facet.TestCloudJSONFacetSKG_collection_shard1_replica_n1]  webapp=/solr path=/update params={wt=javabin&version=2}{add=[51 (1643712102390562816)]} 0 0
   [junit4]   2> 1783228 INFO  (qtp1746552108-27918) [n:127.0.0.1:33121_solr c:org.apache.solr.search.facet.TestCloudJSONFacetSKG_collection s:shard1 r:core_node2 x:org.apache.solr.search.facet.TestCloudJSONFacetSKG_collection_shard1_replica_n1 ] o.a.s.u.p.LogUpdateProcessorFactory [org.apache.solr.search.facet.TestCloudJSONFacetSKG_collection_shard1_replica_n1]  webapp=/solr path=/update params={wt=javabin&version=2}{add=[52 (1643712102391611392)]} 0 0
   [junit4]   2> 1783230 INFO  (qtp1746552108-27920) [n:127.0.0.1:33121_solr c:org.apache.solr.search.facet.TestCloudJSONFacetSKG_collection s:shard1 r:core_node2 x:org.apache.solr.search.facet.TestCloudJSONFacetSKG_collection_shard1_replica_n1 ] o.a.s.u.p.LogUpdateProcessorFactory [org.apache.solr.search.facet.TestCloudJSONFacetSKG_collection_shard1_replica_n1]  webapp=/solr path=/update params={wt=javabin&version=2}{add=[53 (1643712102393708544)]} 0 0
   [junit4]   2> 1783232 INFO  (qtp1746552108-27921) [n:127.0.0.1:33121_solr c:org.apache.solr.search.facet.TestCloudJSONFacetSKG_collection s:shard1 r:core_node2 x:org.apache.solr.search.facet.TestCloudJSONFacetSKG_collection_shard1_replica_n1 ] o.a.s.u.p.LogUpdateProcessorFactory [org.apache.solr.search.facet.TestCloudJSONFacetSKG_collection_shard1_replica_n1]  webapp=/solr path=/update params={wt=javabin&version=2}{add=[54 (1643712102394757120)]} 0 0
   [junit4]   2> 1783233 INFO  (qtp1746552108-27919) [n:127.0.0.1:33121_solr c:org.apache.solr.search.facet.TestCloudJSONFacetSKG_collection s:shard1 r:core_node2 x:org.apache.solr.search.facet.TestCloudJSONFacetSKG_collection_shard1_replica_n1 ] o.a.s.u.p.LogUpdateProcessorFactory [org.apache.solr.search.facet.TestCloudJSONFacetSKG_collection_shard1_replica_n1]  webapp=/solr path=/update params={wt=javabin&version=2}{add=[55 (1643712102396854272)]} 0 0
   [junit4]   2> 1783235 INFO  (qtp1746552108-27922) [n:127.0.0.1:33121_solr c:org.apache.solr.search.facet.TestCloudJSONFacetSKG_collection s:shard1 r:core_node2 x:org.apache.solr.search.facet.TestCloudJSONFacetSKG_collection_shard1_replica_n1 ] o.a.s.u.p.LogUpdateProcessorFactory [org.apache.solr.search.facet.TestCloudJSONFacetSKG_collection_shard1_replica_n1]  webapp=/solr path=/update params={wt=javabin&version=2}{add=[56 (1643712102397902848)]} 0 0
   [junit4]   2> 1783236 INFO  (qtp1746552108-27918) [n:127.0.0.1:33121_solr c:org.apache.solr.search.facet.TestCloudJSONFacetSKG_collection s:shard1 r:core_node2 x:org.apache.solr.search.facet.TestCloudJSONFacetSKG_collection_shard1_replica_n1 ] o.a.s.u.p.LogUpdateProcessorFactory [org.apache.solr.search.facet.TestCloudJSONFacetSKG_collection_shard1_replica_n1]  webapp=/solr path=/update params={wt=javabin&version=2}{add=[57 (1643712102400000000)]} 0 0
   [junit4]   2> 1783237 INFO  (qtp1746552108-27920) [n:127.0.0.1:33121_solr c:org.apache.solr.search.facet.TestCloudJSONFacetSKG_collection s:shard1 r:core_node2 x:org.apache.solr.search.facet.TestCloudJSONFacetSKG_collection_shard1_replica_n1 ] o.a.s.u.p.LogUpdateProcessorFactory [org.apache.solr.search.facet.TestCloudJSONFacetSKG_collection_shard1_replica_n1]  webapp=/solr path=/update params={wt=javabin&version=2}{add=[58 (1643712102401048576)]} 0 0
   [junit4]   2> 1783239 INFO  (qtp1746552108-27921) [n:127.0.0.1:33121_solr c:org.apache.solr.search.facet.TestCloudJSONFacetSKG_collection s:shard1 r:core_node2 x:org.apache.solr.search.facet.TestCloudJSONFacetSKG_collection_shard1_replica_n1 ] o.a.s.u.p.LogUpdateProcessorFactory [org.apache.solr.search.facet.TestCloudJSONFacetSKG_collection_shard1_replica_n1]  webapp=/solr path=/update params={wt=javabin&version=2}{add=[59 (1643712102402097152)]} 0 0
   [junit4]   2> 1783240 INFO  (qtp1746552108-27919) [n:127.0.0.1:33121_solr c:org.apache.solr.search.facet.TestCloudJSONFacetSKG_collection s:shard1 r:core_node2 x:org.apache.solr.search.facet.TestCloudJSONFacetSKG_collection_shard1_replica_n1 ] o.a.s.u.p.LogUpdateProcessorFactory [org.apache.solr.search.facet.TestCloudJSONFacetSKG_collection_shard1_replica_n1]  webapp=/solr path=/update params={wt=javabin&version=2}{add=[60 (1643712102404194304)]} 0 0
   [junit4]   2> 1783242 INFO  (qtp1746552108-27922) [n:127.0.0.1:33121_solr c:org.apache.solr.search.facet.TestCloudJSONFacetSKG_collection s:shard1 r:core_node2 x:org.apache.solr.search.facet.TestCloudJSONFacetSKG_collection_shard1_replica_n1 ] o.a.s.u.p.LogUpdateProcessorFactory [org.apache.solr.search.facet.TestCloudJSONFacetSKG_collection_shard1_replica_n1]  webapp=/solr path=/update params={wt=javabin&version=2}{add=[61 (1643712102405242880)]} 0 0
   [junit4]   2> 1783243 INFO  (qtp1746552108-27918) [n:127.0.0.1:33121_solr c:org.apache.solr.search.facet.TestCloudJSONFacetSKG_collection s:shard1 r:core_node2 x:org.apache.solr.search.facet.TestCloudJSONFacetSKG_collection_shard1_replica_n1 ] o.a.s.u.p.LogUpdateProcessorFactory [org.apache.solr.search.facet.TestCloudJSONFacetSKG_collection_shard1_replica_n1]  webapp=/solr path=/update params={wt=javabin&version=2}{add=[62 (1643712102407340032)]} 0 0
   [junit4]   2> 1783245 INFO  (qtp1746552108-27920) [n:127.0.0.1:33121_solr c:org.apache.solr.search.facet.TestCloudJSONFacetSKG_collection s:shard1 r:core_node2 x:org.apache.solr.search.facet.TestCloudJSONFacetSKG_collection_shard1_replica_n1 ] o.a.s.u.p.LogUpdateProcessorFactory [org.apache.solr.search.facet.TestCloudJSONFacetSKG_collection_shard1_replica_n1]  webapp=/solr path=/update params={wt=javabin&version=2}{add=[63 (1643712102408388608)]} 0 0
   [junit4]   2> 1783246 INFO  (qtp1746552108-27921) [n:127.0.0.1:33121_solr c:org.apache.solr.search.facet.TestCloudJSONFacetSKG_collection s:shard1 r:core_node2 x:org.apache.solr.search.facet.TestCloudJSONFacetSKG_collection_shard1_replica_n1 ] o.a.s.u.p.LogUpdateProcessorFactory [org.apache.solr.search.facet.TestCloudJSONFacetSKG_collection_shard1_replica_n1]  webapp=/solr path=/update params={wt=javabin&version=2}{add=[64 (1643712102410485760)]} 0 0
   [junit4]   2> 1783247 INFO  (qtp1746552108-27919) [n:127.0.0.1:33121_solr c:org.apache.solr.search.facet.TestCloudJSONFacetSKG_collection s:shard1 r:core_node2 x:org.apache.solr.search.facet.TestCloudJSONFacetSKG_collection_shard1_replica_n1 ] o.a.s.u.p.LogUpdateProcessorFactory [org.apache.solr.search.facet.TestCloudJSONFacetSKG_collection_shard1_replica_n1]  webapp=/solr path=/update params={wt=javabin&version=2}{add=[65 (1643712102411534336)]} 0 0
   [junit4]   2> 1783249 INFO  (qtp1746552108-27922) [n:127.0.0.1:33121_solr c:org.apache.solr.search.facet.TestCloudJSONFacetSKG_collection s:shard1 r:core_node2 x:org.apache.solr.search.facet.TestCloudJSONFacetSKG_collection_shard1_replica_n1 ] o.a.s.u.p.LogUpdateProcessorFactory [org.apache.solr.search.facet.TestCloudJSONFacetSKG_collection_shard1_replica_n1]  webapp=/solr path=/update params={wt=javabin&version=2}{add=[66 (1643712102413631488)]} 0 0
   [junit4]   2> 1783250 INFO  (qtp1746552108-27918) [n:127.0.0.1:33121_solr c:org.apache.solr.search.facet.TestCloudJSONFacetSKG_collection s:shard1 r:core_node2 x:org.apache.solr.search.facet.TestCloudJSONFacetSKG_collection_shard1_replica_n1 ] o.a.s.u.p.LogUpdateProcessorFactory [org.apache.solr.search.facet.TestCloudJSONFacetSKG_collection_shard1_replica_n1]  webapp=/solr path=/update params={wt=javabin&version=2}{add=[67 (1643712102414680064)]} 0 0
   [junit4]   2> 1783252 INFO  (qtp1746552108-27920) [n:127.0.0.1:33121_solr c:org.apache.solr.search.facet.TestCloudJSONFacetSKG_collection s:shard1 r:core_node2 x:org.apache.solr.search.facet.TestCloudJSONFacetSKG_collection_shard1_replica_n1 ] o.a.s.u.p.LogUpdateProcessorFactory [org.apache.solr.search.facet.TestCloudJSONFacetSKG_collection_shard1_replica_n1]  webapp=/solr path=/update params={wt=javabin&version=2}{add=[68 (1643712102415728640)]} 0 0
   [junit4]   2> 1783253 INFO  (qtp1746552108-27921) [n:127.0.0.1:33121_solr c:org.apache.solr.search.facet.TestCloudJSONFacetSKG_collection s:shard1 r:core_node2 x:org.apache.solr.search.facet.TestCloudJSONFacetSKG_collection_shard1_replica_n1 ] o.a.s.u.p.LogUpdateProcessorFactory [org.apache.solr.search.facet.TestCloudJSONFacetSKG_collection_shard1_replica_n1]  webapp=/solr path=/update params={wt=javabin&version=2}{add=[69 (1643712102417825792)]} 0 0
   [junit4]   2> 1783254 INFO  (qtp1746552108-27919) [n:127.0.0.1:33121_solr c:org.apache.solr.search.facet.TestCloudJSONFacetSKG_collection s:shard1 r:core_node2 x:org.apache.solr.search.facet.TestCloudJSONFacetSKG_collection_shard1_replica_n1 ] o.a.s.u.p.LogUpdateProcessorFactory [org.apache.solr.search.facet.TestCloudJSONFacetSKG_collection_shard1_replica_n1]  webapp=/solr path=/update params={wt=javabin&version=2}{add=[70 (1643712102418874368)]} 0 0
   [junit4]   2> 1783256 INFO  (qtp1746552108-27922) [n:127.0.0.1:33121_solr c:org.apache.solr.search.facet.TestCloudJSONFacetSKG_collection s:shard1 r:core_node2 x:org.apache.solr.search.facet.TestCloudJSONFacetSKG_collection_shard1_replica_n1 ] o.a.s.u.p.LogUpdateProcessorFactory [org.apache.solr.search.facet.TestCloudJSONFacetSKG_collection_shard1_replica_n1]  webapp=/solr path=/update params={wt=javabin&version=2}{add=[71 (1643712102420971520)]} 0 0
   [junit4]   2> 1783257 INFO  (qtp1746552108-27918) [n:127.0.0.1:33121_solr c:org.apache.solr.search.facet.TestCloudJSONFacetSKG_collection s:shard1 r:core_node2 x:org.apache.solr.search.facet.TestCloudJSONFacetSKG_collection_shard1_replica_n1 ] o.a.s.u.p.LogUpdateProcessorFactory [org.apache.solr.search.facet.TestCloudJSONFacetSKG_collection_shard1_replica_n1]  webapp=/solr path=/update params={wt=javabin&version=2}{add=[71 (1643712102422020096)]} 0 0
   [junit4]   2> 1783260 INFO  (qtp1746552108-27920) [n:127.0.0.1:33121_solr c:org.apache.solr.search.facet.TestCloudJSONFacetSKG_collection s:shard1 r:core_node2 x:org.apache.solr.search.facet.TestCloudJSONFacetSKG_collection_shard1_replica_n1 ] o.a.s.u.p.LogUpdateProcessorFactory [org.apache.solr.search.facet.TestCloudJSONFacetSKG_collection_shard1_replica_n1]  webapp=/solr path=/update params={wt=javabin&version=2}{add=[72 (1643712102424117248)]} 0 1
   [junit4]   2> 1783262 INFO  (qtp1746552108-27921) [n:127.0.0.1:33121_solr c:org.apache.solr.search.facet.TestCloudJSONFacetSKG_collection s:shard1 r:core_node2 x:org.apache.solr.search.facet.TestCloudJSONFacetSKG_collection_shard1_replica_n1 ] o.a.s.u.p.LogUpdateProcessorFactory [org.apache.solr.search.facet.TestCloudJSONFacetSKG_collection_shard1_replica_n1]  webapp=/solr path=/update params={wt=javabin&version=2}{add=[73 (1643712102426214400)]} 0 0
   [junit4]   2> 1783263 INFO  (qtp1746552108-27919) [n:127.0.0.1:33121_solr c:org.apache.solr.search.facet.TestCloudJSONFacetSKG_collection s:shard1 r:core_node2 x:org.apache.solr.search.facet.TestCloudJSONFacetSKG_collection_shard1_replica_n1 ] o.a.s.u.p.LogUpdateProcessorFactory [org.apache.solr.search.facet.TestCloudJSONFacetSKG_collection_shard1_replica_n1]  webapp=/solr path=/update params={wt=javabin&version=2}{add=[74 (1643712102428311552)]} 0 0
   [junit4]   2> 1783264 INFO  (qtp1746552108-27922) [n:127.0.0.1:33121_solr c:org.apache.solr.search.facet.TestCloudJSONFacetSKG_collection s:shard1 r:core_node2 x:org.apache.solr.search.facet.TestCloudJSONFacetSKG_collection_shard1_replica_n1 ] o.a.s.u.p.LogUpdateProcessorFactory [org.apache.solr.search.facet.TestCloudJSONFacetSKG_collection_shard1_replica_n1]  webapp=/solr path=/update params={wt=javabin&version=2}{add=[75 (1643712102429360128)]} 0 0
   [junit4]   2> 1783266 INFO  (qtp1746552108-27918) [n:127.0.0.1:33121_solr c:org.apache.solr.search.facet.TestCloudJSONFacetSKG_collection s:shard1 r:core_node2 x:org.apache.solr.search.facet.TestCloudJSONFacetSKG_collection_shard1_replica_n1 ] o.a.s.u.p.LogUpdateProcessorFactory [org.apache.solr.search.facet.TestCloudJSONFacetSKG_collection_shard1_replica_n1]  webapp=/solr path=/update params={wt=javabin&version=2}{add=[75 (1643712102430408704)]} 0 0
   [junit4]   2> 1783267 INFO  (qtp1746552108-27920) [n:127.0.0.1:33121_solr c:org.apache.solr.search.facet.TestCloudJSONFacetSKG_collection s:shard1 r:core_node2 x:org.apache.solr.search.facet.TestCloudJSONFacetSKG_collection_shard1_replica_n1 ] o.a.s.u.p.LogUpdateProcessorFactory [org.apache.solr.search.facet.TestCloudJSONFacetSKG_collection_shard1_replica_n1]  webapp=/solr path=/update params={wt=javabin&version=2}{add=[76 (1643712102432505856)]} 0 0
   [junit4]   2> 1783269 INFO  (qtp1746552108-27921) [n:127.0.0.1:33121_solr c:org.apache.solr.search.facet.TestCloudJSONFacetSKG_collection s:shard1 r:core_node2 x:org.apache.solr.search.facet.TestCloudJSONFacetSKG_collection_shard1_replica_n1 ] o.a.s.u.p.LogUpdateProcessorFactory [org.apache.solr.search.facet.TestCloudJSONFacetSKG_collection_shard1_replica_n1]  webapp=/solr path=/update params={wt=javabin&version=2}{add=[77 (1643712102434603008)]} 0 0
   [junit4]   2> 1783271 INFO  (qtp1746552108-27919) [n:127.0.0.1:33121_solr c:org.apache.solr.search.facet.TestCloudJSONFacetSKG_collection s:shard1 r:core_node2 x:org.apache.solr.search.facet.TestCloudJSONFacetSKG_collection_shard1_replica_n1 ] o.a.s.u.p.LogUpdateProcessorFactory [org.apache.solr.search.facet.TestCloudJSONFacetSKG_collection_shard1_replica_n1]  webapp=/solr path=/update params={wt=javabin&version=2}{add=[78 (1643712102435651584)]} 0 0
   [junit4]   2> 1783272 INFO  (qtp1746552108-27922) [n:127.0.0.1:33121_solr c:org.apache.solr.search.facet.TestCloudJSONFacetSKG_collection s:shard1 r:core_node2 x:org.apache.solr.search.facet.TestCloudJSONFacetSKG_collection_shard1_replica_n1 ] o.a.s.u.p.LogUpdateProcessorFactory [org.apache.solr.search.facet.TestCloudJSONFacetSKG_collection_shard1_replica_n1]  webapp=/solr path=/update params={wt=javabin&version=2}{add=[79 (1643712102437748736)]} 0 0
   [junit4]   2> 1783274 INFO  (qtp1746552108-27918) [n:127.0.0.1:33121_solr c:org.apache.solr.search.facet.TestCloudJSONFacetSKG_collection s:shard1 r:core_node2 x:org.apache.solr.search.facet.TestCloudJSONFacetSKG_collection_shard1_replica_n1 ] o.a.s.u.p.LogUpdateProcessorFactory [org.apache.solr.search.facet.TestCloudJSONFacetSKG_collection_shard1_replica_n1]  webapp=/solr path=/update params={wt=javabin&version=2}{add=[80 (1643712102438797312)]} 0 0
   [junit4]   2> 1783275 INFO  (qtp1746552108-27920) [n:127.0.0.1:33121_solr c:org.apache.solr.search.facet.TestCloudJSONFacetSKG_collection s:shard1 r:core_node2 x:org.apache.solr.search.facet.TestCloudJSONFacetSKG_collection_shard1_replica_n1 ] o.a.s.u.p.LogUpdateProcessorFactory [org.apache.solr.search.facet.TestCloudJSONFacetSKG_collection_shard1_replica_n1]  webapp=/solr path=/update params={wt=javabin&version=2}{add=[81 (1643712102440894464)]} 0 0
   [junit4]   2> 1783276 INFO  (qtp1746552108-27921) [n:127.0.0.1:33121_solr c:org.apache.solr.search.facet.TestCloudJSONFacetSKG_collection s:shard1 r:core_node2 x:org.apache.solr.search.facet.TestCloudJSONFacetSKG_collection_shard1_replica_n1 ] o.a.s.u.p.LogUpdateProcessorFactory [org.apache.solr.search.facet.TestCloudJSONFacetSKG_collection_shard1_replica_n1]  webapp=/solr path=/update params={wt=javabin&version=2}{add=[82 (1643712102441943040)]} 0 0
   [junit4]   2> 1783278 INFO  (qtp1746552108-27919) [n:127.0.0.1:33121_solr c:org.apache.solr.search.facet.TestCloudJSONFacetSKG_collection s:shard1 r:core_node2 x:org.apache.solr.search.facet.TestCloudJSONFacetSKG_collection_shard1_replica_n1 ] o.a.s.u.p.LogUpdateProcessorFactory [org.apache.solr.search.facet.TestCloudJSONFacetSKG_collection_shard1_replica_n1]  webapp=/solr path=/update params={wt=javabin&version=2}{add=[83 (1643712102442991616)]} 0 0
   [junit4]   2> 1783279 INFO  (qtp1746552108-27922) [n:127.0.0.1:33121_solr c:org.apache.solr.search.facet.TestCloudJSONFacetSKG_collection s:shard1 r:core_node2 x:org.apache.solr.search.facet.TestCloudJSONFacetSKG_collection_shard1_replica_n1 ] o.a.s.u.p.LogUpdateProcessorFactory [org.apache.solr.search.facet.TestCloudJSONFacetSKG_collection_shard1_replica_n1]  webapp=/solr path=/update params={wt=javabin&version=2}{add=[84 (1643712102445088768)]} 0 0
   [junit4]   2> 1783281 INFO  (qtp1746552108-27918) [n:127.0.0.1:33121_solr c:org.apache.solr.search.facet.TestCloudJSONFacetSKG_collection s:shard1 r:core_node2 x:org.apache.solr.search.facet.TestCloudJSONFacetSKG_collection_shard1_replica_n1 ] o.a.s.u.p.LogUpdateProcessorFactory [org.apache.solr.search.facet.TestCloudJSONFacetSKG_collection_shard1_replica_n1]  webapp=/solr path=/update params={wt=javabin&version=2}{add=[85 (1643712102446137344)]} 0 0
   [junit4]   2> 1783282 INFO  (qtp1746552108-27920) [n:127.0.0.1:33121_solr c:org.apache.solr.search.facet.TestCloudJSONFacetSKG_collection s:shard1 r:core_node2 x:org.apache.solr.search.facet.TestCloudJSONFacetSKG_collection_shard1_replica_n1 ] o.a.s.u.p.LogUpdateProcessorFactory [org.apache.solr.search.facet.TestCloudJSONFacetSKG_collection_shard1_replica_n1]  webapp=/solr path=/update params={wt=javabin&version=2}{add=[86 (1643712102448234496)]} 0 0
   [junit4]   2> 1783283 INFO  (qtp1746552108-27921) [n:127.0.0.1:33121_solr c:org.apache.solr.search.facet.TestCloudJSONFacetSKG_collection s:shard1 r:core_node2 x:org.apache.solr.search.facet.TestCloudJSONFacetSKG_collection_shard1_replica_n1 ] o.a.s.u.p.LogUpdateProcessorFactory [org.apache.solr.search.facet.TestCloudJSONFacetSKG_collection_shard1_replica_n1]  webapp=/solr path=/update params={wt=javabin&version=2}{add=[86 (1643712102449283072)]} 0 0
   [junit4]   2> 1783285 INFO  (qtp1746552108-27919) [n:127.0.0.1:33121_solr c:org.apache.solr.search.facet.TestCloudJSONFacetSKG_collection s:shard1 r:core_node2 x:org.apache.solr.search.facet.TestCloudJSONFacetSKG_collection_shard1_replica_n1 ] o.a.s.u.p.LogUpdateProcessorFactory [org.apache.solr.search.facet.TestCloudJSONFacetSKG_collection_shard1_replica_n1]  webapp=/solr path=/update params={wt=javabin&version=2}{add=[87 (1643712102450331648)]} 0 0
   [junit4]   2> 1783286 INFO  (qtp1746552108-27922) [n:127.0.0.1:33121_solr c:org.apache.solr.search.facet.TestCloudJSONFacetSKG_collection s:shard1 r:core_node2 x:org.apache.solr.search.facet.TestCloudJSONFacetSKG_collection_shard1_replica_n1 ] o.a.s.u.p.LogUpdateProcessorFactory [org.apache.solr.search.facet.TestCloudJSONFacetSKG_collection_shard1_replica_n1]  webapp=/solr path=/update params={wt=javabin&version=2}{add=[88 (1643712102452428800)]} 0 0
   [junit4]   2> 1783288 INFO  (qtp1746552108-27918) [n:127.0.0.1:33121_solr c:org.apache.solr.search.facet.TestCloudJSONFacetSKG_collection s:shard1 r:core_node2 x:org.apache.solr.search.facet.TestCloudJSONFacetSKG_collection_shard1_replica_n1 ] o.a.s.u.p.LogUpdateProcessorFactory [org.apache.solr.search.facet.TestCloudJSONFacetSKG_collection_shard1_replica_n1]  webapp=/solr path=/update params={wt=javabin&version=2}{add=[89 (1643712102454525952)]} 0 0
   [junit4]   2> 1783289 INFO  (qtp1746552108-27920) [n:127.0.0.1:33121_solr c:org.apache.solr.search.facet.TestCloudJSONFacetSKG_collection s:shard1 r:core_node2 x:org.apache.solr.search.facet.TestCloudJSONFacetSKG_collection_shard1_replica_n1 ] o.a.s.u.p.LogUpdateProcessorFactory [org.apache.solr.search.facet.TestCloudJSONFacetSKG_collection_shard1_replica_n1]  webapp=/solr path=/update params={wt=javabin&version=2}{add=[90 (1643712102455574528)]} 0 0
   [junit4]   2> 1783291 INFO  (qtp1746552108-27921) [n:127.0.0.1:33121_solr c:org.apache.solr.search.facet.TestCloudJSONFacetSKG_collection s:shard1 r:core_node2 x:org.apache.solr.search.facet.TestCloudJSONFacetSKG_collection_shard1_replica_n1 ] o.a.s.u.p.LogUpdateProcessorFactory [org.apache.solr.search.facet.TestCloudJSONFacetSKG_collection_shard1_replica_n1]  webapp=/solr path=/update params={wt=javabin&version=2}{add=[91 (1643712102457671680)]} 0 0
   [junit4]   2> 1783292 INFO  (qtp1746552108-27919) [n:127.0.0.1:33121_solr c:org.apache.solr.search.facet.TestCloudJSONFacetSKG_collection s:shard1 r:core_node2 x:org.apache.solr.search.facet.TestCloudJSONFacetSKG_collection_shard1_replica_n1 ] o.a.s.u.p.LogUpdateProcessorFactory [org.apache.solr.search.facet.TestCloudJSONFacetSKG_collection_shard1_replica_n1]  webapp=/solr path=/update params={wt=javabin&version=2}{add=[92 (1643712102458720256)]} 0 0
   [junit4]   2> 1783294 INFO  (qtp1746552108-27922) [n:127.0.0.1:33121_solr c:org.apache.solr.search.facet.TestCloudJSONFacetSKG_collection s:shard1 r:core_node2 x:org.apache.solr.search.facet.TestCloudJSONFacetSKG_collection_shard1_replica_n1 ] o.a.s.u.p.LogUpdateProcessorFactory [org.apache.solr.search.facet.TestCloudJSONFacetSKG_collection_shard1_replica_n1]  webapp=/solr path=/update params={wt=javabin&version=2}{add=[93 (1643712102459768832)]} 0 0
   [junit4]   2> 1783295 INFO  (qtp1746552108-27918) [n:127.0.0.1:33121_solr c:org.apache.solr.search.facet.TestCloudJSONFacetSKG_collection s:shard1 r:core_node2 x:org.apache.solr.search.facet.TestCloudJSONFacetSKG_collection_shard1_replica_n1 ] o.a.s.u.p.LogUpdateProcessorFactory [org.apache.solr.search.facet.TestCloudJSONFacetSKG_collection_shard1_replica_n1]  webapp=/solr path=/update params={wt=javabin&version=2}{add=[94 (1643712102461865984)]} 0 0
   [junit4]   2> 1783296 INFO  (qtp1746552108-27920) [n:127.0.0.1:33121_solr c:org.apache.solr.search.facet.TestCloudJSONFacetSKG_collection s:shard1 r:core_node2 x:org.apache.solr.search.facet.TestCloudJSONFacetSKG_collection_shard1_replica_n1 ] o.a.s.u.p.LogUpdateProcessorFactory [org.apache.solr.search.facet.TestCloudJSONFacetSKG_collection_shard1_replica_n1]  webapp=/solr path=/update params={wt=javabin&version=2}{add=[95 (1643712102462914560)]} 0 0
   [junit4]   2> 1783298 INFO  (qtp1746552108-27921) [n:127.0.0.1:33121_solr c:org.apache.solr.search.facet.TestCloudJSONFacetSKG_collection s:shard1 r:core_node2 x:org.apache.solr.search.facet.TestClou

[...truncated too long message...]

e/workspace/Lucene-Solr-Tests-master/lucene/top-level-ivy-settings.xml

resolve:

ivy-availability-check:
[loadresource] Do not set property disallowed.ivy.jars.list as its length is 0.

-ivy-fail-disallowed-ivy-version:

ivy-fail:

ivy-configure:
[ivy:configure] :: loading settings :: file = /home/jenkins/jenkins-slave/workspace/Lucene-Solr-Tests-master/lucene/top-level-ivy-settings.xml

resolve:

ivy-availability-check:
[loadresource] Do not set property disallowed.ivy.jars.list as its length is 0.

-ivy-fail-disallowed-ivy-version:

ivy-fail:

ivy-fail:

ivy-configure:
[ivy:configure] :: loading settings :: file = /home/jenkins/jenkins-slave/workspace/Lucene-Solr-Tests-master/lucene/top-level-ivy-settings.xml

resolve:

ivy-availability-check:
[loadresource] Do not set property disallowed.ivy.jars.list as its length is 0.

-ivy-fail-disallowed-ivy-version:

ivy-fail:

ivy-configure:
[ivy:configure] :: loading settings :: file = /home/jenkins/jenkins-slave/workspace/Lucene-Solr-Tests-master/lucene/top-level-ivy-settings.xml

resolve:

ivy-availability-check:
[loadresource] Do not set property disallowed.ivy.jars.list as its length is 0.

-ivy-fail-disallowed-ivy-version:

ivy-fail:

ivy-fail:

ivy-configure:
[ivy:configure] :: loading settings :: file = /home/jenkins/jenkins-slave/workspace/Lucene-Solr-Tests-master/lucene/top-level-ivy-settings.xml

resolve:

ivy-availability-check:
[loadresource] Do not set property disallowed.ivy.jars.list as its length is 0.

-ivy-fail-disallowed-ivy-version:

ivy-fail:

ivy-fail:

ivy-configure:
[ivy:configure] :: loading settings :: file = /home/jenkins/jenkins-slave/workspace/Lucene-Solr-Tests-master/lucene/top-level-ivy-settings.xml

resolve:

ivy-availability-check:
[loadresource] Do not set property disallowed.ivy.jars.list as its length is 0.

-ivy-fail-disallowed-ivy-version:

ivy-fail:

ivy-fail:

ivy-configure:
[ivy:configure] :: loading settings :: file = /home/jenkins/jenkins-slave/workspace/Lucene-Solr-Tests-master/lucene/top-level-ivy-settings.xml

resolve:

ivy-availability-check:
[loadresource] Do not set property disallowed.ivy.jars.list as its length is 0.

-ivy-fail-disallowed-ivy-version:

ivy-fail:

ivy-fail:

ivy-configure:
[ivy:configure] :: loading settings :: file = /home/jenkins/jenkins-slave/workspace/Lucene-Solr-Tests-master/lucene/top-level-ivy-settings.xml

resolve:

ivy-availability-check:
[loadresource] Do not set property disallowed.ivy.jars.list as its length is 0.

-ivy-fail-disallowed-ivy-version:

ivy-fail:

ivy-fail:

ivy-configure:
[ivy:configure] :: loading settings :: file = /home/jenkins/jenkins-slave/workspace/Lucene-Solr-Tests-master/lucene/top-level-ivy-settings.xml

resolve:

ivy-availability-check:
[loadresource] Do not set property disallowed.ivy.jars.list as its length is 0.

-ivy-fail-disallowed-ivy-version:

ivy-fail:

ivy-fail:

ivy-configure:
[ivy:configure] :: loading settings :: file = /home/jenkins/jenkins-slave/workspace/Lucene-Solr-Tests-master/lucene/top-level-ivy-settings.xml

resolve:

ivy-availability-check:
[loadresource] Do not set property disallowed.ivy.jars.list as its length is 0.

-ivy-fail-disallowed-ivy-version:

ivy-fail:

ivy-fail:

ivy-configure:
[ivy:configure] :: loading settings :: file = /home/jenkins/jenkins-slave/workspace/Lucene-Solr-Tests-master/lucene/top-level-ivy-settings.xml

resolve:

ivy-availability-check:
[loadresource] Do not set property disallowed.ivy.jars.list as its length is 0.

-ivy-fail-disallowed-ivy-version:

ivy-fail:

ivy-fail:

ivy-configure:
[ivy:configure] :: loading settings :: file = /home/jenkins/jenkins-slave/workspace/Lucene-Solr-Tests-master/lucene/top-level-ivy-settings.xml

resolve:

ivy-availability-check:
[loadresource] Do not set property disallowed.ivy.jars.list as its length is 0.

-ivy-fail-disallowed-ivy-version:

ivy-fail:

ivy-fail:

ivy-configure:
[ivy:configure] :: loading settings :: file = /home/jenkins/jenkins-slave/workspace/Lucene-Solr-Tests-master/lucene/top-level-ivy-settings.xml

resolve:

ivy-availability-check:
[loadresource] Do not set property disallowed.ivy.jars.list as its length is 0.

-ivy-fail-disallowed-ivy-version:

ivy-fail:

ivy-fail:

ivy-configure:
[ivy:configure] :: loading settings :: file = /home/jenkins/jenkins-slave/workspace/Lucene-Solr-Tests-master/lucene/top-level-ivy-settings.xml

resolve:

ivy-availability-check:
[loadresource] Do not set property disallowed.ivy.jars.list as its length is 0.

-ivy-fail-disallowed-ivy-version:

ivy-fail:

ivy-fail:

ivy-configure:
[ivy:configure] :: loading settings :: file = /home/jenkins/jenkins-slave/workspace/Lucene-Solr-Tests-master/lucene/top-level-ivy-settings.xml

resolve:

jar-checksums:
    [mkdir] Created dir: /home/jenkins/jenkins-slave/workspace/Lucene-Solr-Tests-master/solr/null716425490
     [copy] Copying 249 files to /home/jenkins/jenkins-slave/workspace/Lucene-Solr-Tests-master/solr/null716425490
   [delete] Deleting directory /home/jenkins/jenkins-slave/workspace/Lucene-Solr-Tests-master/solr/null716425490

check-working-copy:
[ivy:cachepath] :: resolving dependencies :: #;working@lucene1-us-west
[ivy:cachepath] confs: [default]
[ivy:cachepath] found org.eclipse.jgit#org.eclipse.jgit;5.3.0.201903130848-r in public
[ivy:cachepath] found com.jcraft#jsch;0.1.54 in public
[ivy:cachepath] found com.jcraft#jzlib;1.1.1 in public
[ivy:cachepath] found com.googlecode.javaewah#JavaEWAH;1.1.6 in public
[ivy:cachepath] found org.slf4j#slf4j-api;1.7.2 in public
[ivy:cachepath] found org.bouncycastle#bcpg-jdk15on;1.60 in public
[ivy:cachepath] found org.bouncycastle#bcprov-jdk15on;1.60 in public
[ivy:cachepath] found org.bouncycastle#bcpkix-jdk15on;1.60 in public
[ivy:cachepath] found org.slf4j#slf4j-nop;1.7.2 in public
[ivy:cachepath] :: resolution report :: resolve 35ms :: artifacts dl 3ms
        ---------------------------------------------------------------------
        |                  |            modules            ||   artifacts   |
        |       conf       | number| search|dwnlded|evicted|| number|dwnlded|
        ---------------------------------------------------------------------
        |      default     |   9   |   0   |   0   |   0   ||   9   |   0   |
        ---------------------------------------------------------------------
[wc-checker] Initializing working copy...
[wc-checker] Checking working copy status...

-jenkins-base:

BUILD SUCCESSFUL
Total time: 106 minutes 12 seconds
Archiving artifacts
java.lang.InterruptedException: no matches found within 10000
        at hudson.FilePath$ValidateAntFileMask.hasMatch(FilePath.java:2847)
        at hudson.FilePath$ValidateAntFileMask.invoke(FilePath.java:2726)
        at hudson.FilePath$ValidateAntFileMask.invoke(FilePath.java:2707)
        at hudson.FilePath$FileCallableWrapper.call(FilePath.java:3086)
Also:   hudson.remoting.Channel$CallSiteStackTrace: Remote call to lucene
                at hudson.remoting.Channel.attachCallSiteStackTrace(Channel.java:1741)
                at hudson.remoting.UserRequest$ExceptionResponse.retrieve(UserRequest.java:357)
                at hudson.remoting.Channel.call(Channel.java:955)
                at hudson.FilePath.act(FilePath.java:1072)
                at hudson.FilePath.act(FilePath.java:1061)
                at hudson.FilePath.validateAntFileMask(FilePath.java:2705)
                at hudson.tasks.ArtifactArchiver.perform(ArtifactArchiver.java:243)
                at hudson.tasks.BuildStepCompatibilityLayer.perform(BuildStepCompatibilityLayer.java:81)
                at hudson.tasks.BuildStepMonitor$1.perform(BuildStepMonitor.java:20)
                at hudson.model.AbstractBuild$AbstractBuildExecution.perform(AbstractBuild.java:744)
                at hudson.model.AbstractBuild$AbstractBuildExecution.performAllBuildSteps(AbstractBuild.java:690)
                at hudson.model.Build$BuildExecution.post2(Build.java:186)
                at hudson.model.AbstractBuild$AbstractBuildExecution.post(AbstractBuild.java:635)
                at hudson.model.Run.execute(Run.java:1835)
                at hudson.model.FreeStyleBuild.run(FreeStyleBuild.java:43)
                at hudson.model.ResourceController.execute(ResourceController.java:97)
                at hudson.model.Executor.run(Executor.java:429)
Caused: hudson.FilePath$TunneledInterruptedException
        at hudson.FilePath$FileCallableWrapper.call(FilePath.java:3088)
        at hudson.remoting.UserRequest.perform(UserRequest.java:212)
        at hudson.remoting.UserRequest.perform(UserRequest.java:54)
        at hudson.remoting.Request$2.run(Request.java:369)
        at hudson.remoting.InterceptingExecutorService$1.call(InterceptingExecutorService.java:72)
        at java.util.concurrent.FutureTask.run(FutureTask.java:266)
        at java.util.concurrent.ThreadPoolExecutor.runWorker(ThreadPoolExecutor.java:1142)
        at java.util.concurrent.ThreadPoolExecutor$Worker.run(ThreadPoolExecutor.java:617)
        at java.lang.Thread.run(Thread.java:744)
Caused: java.lang.InterruptedException: java.lang.InterruptedException: no matches found within 10000
        at hudson.FilePath.act(FilePath.java:1074)
        at hudson.FilePath.act(FilePath.java:1061)
        at hudson.FilePath.validateAntFileMask(FilePath.java:2705)
        at hudson.tasks.ArtifactArchiver.perform(ArtifactArchiver.java:243)
        at hudson.tasks.BuildStepCompatibilityLayer.perform(BuildStepCompatibilityLayer.java:81)
        at hudson.tasks.BuildStepMonitor$1.perform(BuildStepMonitor.java:20)
        at hudson.model.AbstractBuild$AbstractBuildExecution.perform(AbstractBuild.java:744)
        at hudson.model.AbstractBuild$AbstractBuildExecution.performAllBuildSteps(AbstractBuild.java:690)
        at hudson.model.Build$BuildExecution.post2(Build.java:186)
        at hudson.model.AbstractBuild$AbstractBuildExecution.post(AbstractBuild.java:635)
        at hudson.model.Run.execute(Run.java:1835)
        at hudson.model.FreeStyleBuild.run(FreeStyleBuild.java:43)
        at hudson.model.ResourceController.execute(ResourceController.java:97)
        at hudson.model.Executor.run(Executor.java:429)
No artifacts found that match the file pattern "**/*.events,heapdumps/**,**/hs_err_pid*". Configuration error?
Recording test results
Build step 'Publish JUnit test result report' changed build result to UNSTABLE
Email was triggered for: Unstable (Test Failures)
Sending email for trigger: Unstable (Test Failures)


---------------------------------------------------------------------
To unsubscribe, e-mail: [hidden email]
For additional commands, e-mail: [hidden email]