[JENKINS] Lucene-Solr-Tests-master - Build # 3692 - Failure

classic Classic list List threaded Threaded
2 messages Options
Reply | Threaded
Open this post in threaded view
|

[JENKINS] Lucene-Solr-Tests-master - Build # 3692 - Failure

Apache Jenkins Server-2
Build: https://builds.apache.org/job/Lucene-Solr-Tests-master/3692/

1 tests failed.
FAILED:  org.apache.solr.cloud.autoscaling.sim.TestSnapshotCloudManager.testComplexSnapshot

Error Message:
expected:<1> but was:<0>

Stack Trace:
java.lang.AssertionError: expected:<1> but was:<0>
        at __randomizedtesting.SeedInfo.seed([4FD8CBE766421DBB:1BFCCB5C4D0ABA00]:0)
        at org.junit.Assert.fail(Assert.java:88)
        at org.junit.Assert.failNotEquals(Assert.java:834)
        at org.junit.Assert.assertEquals(Assert.java:645)
        at org.junit.Assert.assertEquals(Assert.java:631)
        at org.apache.solr.cloud.autoscaling.sim.TestSnapshotCloudManager.testComplexSnapshot(TestSnapshotCloudManager.java:136)
        at java.base/jdk.internal.reflect.NativeMethodAccessorImpl.invoke0(Native Method)
        at java.base/jdk.internal.reflect.NativeMethodAccessorImpl.invoke(NativeMethodAccessorImpl.java:62)
        at java.base/jdk.internal.reflect.DelegatingMethodAccessorImpl.invoke(DelegatingMethodAccessorImpl.java:43)
        at java.base/java.lang.reflect.Method.invoke(Method.java:566)
        at com.carrotsearch.randomizedtesting.RandomizedRunner.invoke(RandomizedRunner.java:1750)
        at com.carrotsearch.randomizedtesting.RandomizedRunner$8.evaluate(RandomizedRunner.java:938)
        at com.carrotsearch.randomizedtesting.RandomizedRunner$9.evaluate(RandomizedRunner.java:974)
        at com.carrotsearch.randomizedtesting.RandomizedRunner$10.evaluate(RandomizedRunner.java:988)
        at com.carrotsearch.randomizedtesting.rules.SystemPropertiesRestoreRule$1.evaluate(SystemPropertiesRestoreRule.java:57)
        at org.apache.lucene.util.TestRuleSetupTeardownChained$1.evaluate(TestRuleSetupTeardownChained.java:49)
        at org.apache.lucene.util.AbstractBeforeAfterRule$1.evaluate(AbstractBeforeAfterRule.java:45)
        at org.apache.lucene.util.TestRuleThreadAndTestName$1.evaluate(TestRuleThreadAndTestName.java:48)
        at org.apache.lucene.util.TestRuleIgnoreAfterMaxFailures$1.evaluate(TestRuleIgnoreAfterMaxFailures.java:64)
        at org.apache.lucene.util.TestRuleMarkFailure$1.evaluate(TestRuleMarkFailure.java:47)
        at com.carrotsearch.randomizedtesting.rules.StatementAdapter.evaluate(StatementAdapter.java:36)
        at com.carrotsearch.randomizedtesting.ThreadLeakControl$StatementRunner.run(ThreadLeakControl.java:368)
        at com.carrotsearch.randomizedtesting.ThreadLeakControl.forkTimeoutingTask(ThreadLeakControl.java:817)
        at com.carrotsearch.randomizedtesting.ThreadLeakControl$3.evaluate(ThreadLeakControl.java:468)
        at com.carrotsearch.randomizedtesting.RandomizedRunner.runSingleTest(RandomizedRunner.java:947)
        at com.carrotsearch.randomizedtesting.RandomizedRunner$5.evaluate(RandomizedRunner.java:832)
        at com.carrotsearch.randomizedtesting.RandomizedRunner$6.evaluate(RandomizedRunner.java:883)
        at com.carrotsearch.randomizedtesting.RandomizedRunner$7.evaluate(RandomizedRunner.java:894)
        at com.carrotsearch.randomizedtesting.rules.StatementAdapter.evaluate(StatementAdapter.java:36)
        at com.carrotsearch.randomizedtesting.rules.SystemPropertiesRestoreRule$1.evaluate(SystemPropertiesRestoreRule.java:57)
        at org.apache.lucene.util.AbstractBeforeAfterRule$1.evaluate(AbstractBeforeAfterRule.java:45)
        at com.carrotsearch.randomizedtesting.rules.StatementAdapter.evaluate(StatementAdapter.java:36)
        at org.apache.lucene.util.TestRuleStoreClassName$1.evaluate(TestRuleStoreClassName.java:41)
        at com.carrotsearch.randomizedtesting.rules.NoShadowingOrOverridesOnMethodsRule$1.evaluate(NoShadowingOrOverridesOnMethodsRule.java:40)
        at com.carrotsearch.randomizedtesting.rules.NoShadowingOrOverridesOnMethodsRule$1.evaluate(NoShadowingOrOverridesOnMethodsRule.java:40)
        at com.carrotsearch.randomizedtesting.rules.StatementAdapter.evaluate(StatementAdapter.java:36)
        at com.carrotsearch.randomizedtesting.rules.StatementAdapter.evaluate(StatementAdapter.java:36)
        at org.apache.lucene.util.TestRuleAssertionsRequired$1.evaluate(TestRuleAssertionsRequired.java:53)
        at org.apache.lucene.util.TestRuleMarkFailure$1.evaluate(TestRuleMarkFailure.java:47)
        at org.apache.lucene.util.TestRuleIgnoreAfterMaxFailures$1.evaluate(TestRuleIgnoreAfterMaxFailures.java:64)
        at org.apache.lucene.util.TestRuleIgnoreTestSuites$1.evaluate(TestRuleIgnoreTestSuites.java:54)
        at com.carrotsearch.randomizedtesting.rules.StatementAdapter.evaluate(StatementAdapter.java:36)
        at com.carrotsearch.randomizedtesting.ThreadLeakControl$StatementRunner.run(ThreadLeakControl.java:368)
        at java.base/java.lang.Thread.run(Thread.java:834)




Build Log:
[...truncated 13092 lines...]
   [junit4] Suite: org.apache.solr.cloud.autoscaling.sim.TestSnapshotCloudManager
   [junit4]   2> 240039 INFO  (SUITE-TestSnapshotCloudManager-seed#[4FD8CBE766421DBB]-worker) [     ] o.a.s.SolrTestCaseJ4 SecureRandom sanity checks: test.solr.allowed.securerandom=null & java.security.egd=file:/dev/./urandom
   [junit4]   2> 240039 INFO  (SUITE-TestSnapshotCloudManager-seed#[4FD8CBE766421DBB]-worker) [     ] o.a.s.SolrTestCaseJ4 Created dataDir: /home/jenkins/jenkins-slave/workspace/Lucene-Solr-Tests-master/solr/build/solr-core/test/J1/temp/solr.cloud.autoscaling.sim.TestSnapshotCloudManager_4FD8CBE766421DBB-001/data-dir-21-001
   [junit4]   2> 240049 INFO  (SUITE-TestSnapshotCloudManager-seed#[4FD8CBE766421DBB]-worker) [     ] o.a.s.SolrTestCaseJ4 Using PointFields (NUMERIC_POINTS_SYSPROP=true) w/NUMERIC_DOCVALUES_SYSPROP=false
   [junit4]   2> 240050 INFO  (SUITE-TestSnapshotCloudManager-seed#[4FD8CBE766421DBB]-worker) [     ] o.a.s.SolrTestCaseJ4 Randomized ssl (false) and clientAuth (true) via: @org.apache.solr.util.RandomizeSSL(reason="", value=0.0/0.0, ssl=0.0/0.0, clientAuth=0.0/0.0)
   [junit4]   2> 240051 INFO  (SUITE-TestSnapshotCloudManager-seed#[4FD8CBE766421DBB]-worker) [     ] o.a.s.c.MiniSolrCloudCluster Starting cluster of 3 servers in /home/jenkins/jenkins-slave/workspace/Lucene-Solr-Tests-master/solr/build/solr-core/test/J1/temp/solr.cloud.autoscaling.sim.TestSnapshotCloudManager_4FD8CBE766421DBB-001/tempDir-001
   [junit4]   2> 240051 INFO  (SUITE-TestSnapshotCloudManager-seed#[4FD8CBE766421DBB]-worker) [     ] o.a.s.c.ZkTestServer STARTING ZK TEST SERVER
   [junit4]   2> 240061 INFO  (ZkTestServer Run Thread) [     ] o.a.s.c.ZkTestServer client port:0.0.0.0/0.0.0.0:0
   [junit4]   2> 240061 INFO  (ZkTestServer Run Thread) [     ] o.a.s.c.ZkTestServer Starting server
   [junit4]   2> 240162 INFO  (SUITE-TestSnapshotCloudManager-seed#[4FD8CBE766421DBB]-worker) [     ] o.a.s.c.ZkTestServer start zk server on port:38627
   [junit4]   2> 240162 INFO  (SUITE-TestSnapshotCloudManager-seed#[4FD8CBE766421DBB]-worker) [     ] o.a.s.c.ZkTestServer waitForServerUp: 127.0.0.1:38627
   [junit4]   2> 240162 INFO  (SUITE-TestSnapshotCloudManager-seed#[4FD8CBE766421DBB]-worker) [     ] o.a.s.c.ZkTestServer parse host and port list: 127.0.0.1:38627
   [junit4]   2> 240162 INFO  (SUITE-TestSnapshotCloudManager-seed#[4FD8CBE766421DBB]-worker) [     ] o.a.s.c.ZkTestServer connecting to 127.0.0.1 38627
   [junit4]   2> 240167 INFO  (SUITE-TestSnapshotCloudManager-seed#[4FD8CBE766421DBB]-worker) [     ] o.a.s.c.c.ConnectionManager Waiting for client to connect to ZooKeeper
   [junit4]   2> 240176 INFO  (zkConnectionManagerCallback-591-thread-1) [     ] o.a.s.c.c.ConnectionManager zkClient has connected
   [junit4]   2> 240176 INFO  (SUITE-TestSnapshotCloudManager-seed#[4FD8CBE766421DBB]-worker) [     ] o.a.s.c.c.ConnectionManager Client is connected to ZooKeeper
   [junit4]   2> 240182 INFO  (SUITE-TestSnapshotCloudManager-seed#[4FD8CBE766421DBB]-worker) [     ] o.a.s.c.c.ConnectionManager Waiting for client to connect to ZooKeeper
   [junit4]   2> 240184 INFO  (zkConnectionManagerCallback-593-thread-1) [     ] o.a.s.c.c.ConnectionManager zkClient has connected
   [junit4]   2> 240184 INFO  (SUITE-TestSnapshotCloudManager-seed#[4FD8CBE766421DBB]-worker) [     ] o.a.s.c.c.ConnectionManager Client is connected to ZooKeeper
   [junit4]   2> 240186 INFO  (SUITE-TestSnapshotCloudManager-seed#[4FD8CBE766421DBB]-worker) [     ] o.a.s.c.c.ConnectionManager Waiting for client to connect to ZooKeeper
   [junit4]   2> 240189 INFO  (zkConnectionManagerCallback-595-thread-1) [     ] o.a.s.c.c.ConnectionManager zkClient has connected
   [junit4]   2> 240189 INFO  (SUITE-TestSnapshotCloudManager-seed#[4FD8CBE766421DBB]-worker) [     ] o.a.s.c.c.ConnectionManager Client is connected to ZooKeeper
   [junit4]   2> 240300 WARN  (jetty-launcher-596-thread-1) [     ] o.e.j.s.AbstractConnector Ignoring deprecated socket close linger time
   [junit4]   2> 240301 INFO  (jetty-launcher-596-thread-1) [     ] o.a.s.c.s.e.JettySolrRunner Start Jetty (original configured port=0)
   [junit4]   2> 240301 INFO  (jetty-launcher-596-thread-1) [     ] o.a.s.c.s.e.JettySolrRunner Trying to start Jetty on port 0 try number 1 ...
   [junit4]   2> 240301 INFO  (jetty-launcher-596-thread-1) [     ] o.e.j.s.Server jetty-9.4.19.v20190610; built: 2019-06-10T16:30:51.723Z; git: afcf563148970e98786327af5e07c261fda175d3; jvm 11.0.1+13-LTS
   [junit4]   2> 240301 WARN  (jetty-launcher-596-thread-2) [     ] o.e.j.s.AbstractConnector Ignoring deprecated socket close linger time
   [junit4]   2> 240301 INFO  (jetty-launcher-596-thread-2) [     ] o.a.s.c.s.e.JettySolrRunner Start Jetty (original configured port=0)
   [junit4]   2> 240302 INFO  (jetty-launcher-596-thread-2) [     ] o.a.s.c.s.e.JettySolrRunner Trying to start Jetty on port 0 try number 1 ...
   [junit4]   2> 240302 INFO  (jetty-launcher-596-thread-2) [     ] o.e.j.s.Server jetty-9.4.19.v20190610; built: 2019-06-10T16:30:51.723Z; git: afcf563148970e98786327af5e07c261fda175d3; jvm 11.0.1+13-LTS
   [junit4]   2> 240303 WARN  (jetty-launcher-596-thread-3) [     ] o.e.j.s.AbstractConnector Ignoring deprecated socket close linger time
   [junit4]   2> 240304 INFO  (jetty-launcher-596-thread-3) [     ] o.a.s.c.s.e.JettySolrRunner Start Jetty (original configured port=0)
   [junit4]   2> 240304 INFO  (jetty-launcher-596-thread-3) [     ] o.a.s.c.s.e.JettySolrRunner Trying to start Jetty on port 0 try number 1 ...
   [junit4]   2> 240304 INFO  (jetty-launcher-596-thread-3) [     ] o.e.j.s.Server jetty-9.4.19.v20190610; built: 2019-06-10T16:30:51.723Z; git: afcf563148970e98786327af5e07c261fda175d3; jvm 11.0.1+13-LTS
   [junit4]   2> 240341 INFO  (jetty-launcher-596-thread-2) [     ] o.e.j.s.session DefaultSessionIdManager workerName=node0
   [junit4]   2> 240341 INFO  (jetty-launcher-596-thread-2) [     ] o.e.j.s.session No SessionScavenger set, using defaults
   [junit4]   2> 240342 INFO  (jetty-launcher-596-thread-2) [     ] o.e.j.s.session node0 Scavenging every 600000ms
   [junit4]   2> 240345 INFO  (jetty-launcher-596-thread-2) [     ] o.e.j.s.h.ContextHandler Started o.e.j.s.ServletContextHandler@12d491fa{/solr,null,AVAILABLE}
   [junit4]   2> 240350 INFO  (jetty-launcher-596-thread-3) [     ] o.e.j.s.session DefaultSessionIdManager workerName=node0
   [junit4]   2> 240351 INFO  (jetty-launcher-596-thread-3) [     ] o.e.j.s.session No SessionScavenger set, using defaults
   [junit4]   2> 240351 INFO  (jetty-launcher-596-thread-3) [     ] o.e.j.s.session node0 Scavenging every 600000ms
   [junit4]   2> 240351 INFO  (jetty-launcher-596-thread-3) [     ] o.e.j.s.h.ContextHandler Started o.e.j.s.ServletContextHandler@11e1f048{/solr,null,AVAILABLE}
   [junit4]   2> 240359 INFO  (jetty-launcher-596-thread-1) [     ] o.e.j.s.session DefaultSessionIdManager workerName=node0
   [junit4]   2> 240359 INFO  (jetty-launcher-596-thread-1) [     ] o.e.j.s.session No SessionScavenger set, using defaults
   [junit4]   2> 240359 INFO  (jetty-launcher-596-thread-1) [     ] o.e.j.s.session node0 Scavenging every 600000ms
   [junit4]   2> 240360 INFO  (jetty-launcher-596-thread-2) [     ] o.e.j.s.AbstractConnector Started ServerConnector@2f1a36ec{HTTP/1.1,[http/1.1, h2c]}{127.0.0.1:41017}
   [junit4]   2> 240360 INFO  (jetty-launcher-596-thread-2) [     ] o.e.j.s.Server Started @240462ms
   [junit4]   2> 240360 INFO  (jetty-launcher-596-thread-1) [     ] o.e.j.s.h.ContextHandler Started o.e.j.s.ServletContextHandler@4e8d6578{/solr,null,AVAILABLE}
   [junit4]   2> 240360 INFO  (jetty-launcher-596-thread-2) [     ] o.a.s.c.s.e.JettySolrRunner Jetty properties: {hostContext=/solr, hostPort=41017}
   [junit4]   2> 240361 ERROR (jetty-launcher-596-thread-2) [     ] o.a.s.u.StartupLoggingUtils Missing Java Option solr.log.dir. Logging may be missing or incomplete.
   [junit4]   2> 240361 INFO  (jetty-launcher-596-thread-2) [     ] o.a.s.s.SolrDispatchFilter Using logger factory org.apache.logging.slf4j.Log4jLoggerFactory
   [junit4]   2> 240364 INFO  (jetty-launcher-596-thread-3) [     ] o.e.j.s.AbstractConnector Started ServerConnector@1661952b{HTTP/1.1,[http/1.1, h2c]}{127.0.0.1:37663}
   [junit4]   2> 240364 INFO  (jetty-launcher-596-thread-1) [     ] o.e.j.s.AbstractConnector Started ServerConnector@2e3f9fad{HTTP/1.1,[http/1.1, h2c]}{127.0.0.1:36503}
   [junit4]   2> 240364 INFO  (jetty-launcher-596-thread-3) [     ] o.e.j.s.Server Started @240466ms
   [junit4]   2> 240364 INFO  (jetty-launcher-596-thread-1) [     ] o.e.j.s.Server Started @240466ms
   [junit4]   2> 240364 INFO  (jetty-launcher-596-thread-3) [     ] o.a.s.c.s.e.JettySolrRunner Jetty properties: {hostContext=/solr, hostPort=37663}
   [junit4]   2> 240364 INFO  (jetty-launcher-596-thread-1) [     ] o.a.s.c.s.e.JettySolrRunner Jetty properties: {hostContext=/solr, hostPort=36503}
   [junit4]   2> 240365 ERROR (jetty-launcher-596-thread-3) [     ] o.a.s.u.StartupLoggingUtils Missing Java Option solr.log.dir. Logging may be missing or incomplete.
   [junit4]   2> 240365 INFO  (jetty-launcher-596-thread-3) [     ] o.a.s.s.SolrDispatchFilter Using logger factory org.apache.logging.slf4j.Log4jLoggerFactory
   [junit4]   2> 240365 INFO  (jetty-launcher-596-thread-3) [     ] o.a.s.s.SolrDispatchFilter  ___      _       Welcome to Apache Solr™ version 9.0.0
   [junit4]   2> 240365 INFO  (jetty-launcher-596-thread-3) [     ] o.a.s.s.SolrDispatchFilter / __| ___| |_ _   Starting in cloud mode on port null
   [junit4]   2> 240365 INFO  (jetty-launcher-596-thread-3) [     ] o.a.s.s.SolrDispatchFilter \__ \/ _ \ | '_|  Install dir: null
   [junit4]   2> 240365 INFO  (jetty-launcher-596-thread-3) [     ] o.a.s.s.SolrDispatchFilter |___/\___/_|_|    Start time: 2019-09-07T12:53:33.487467Z
   [junit4]   2> 240365 ERROR (jetty-launcher-596-thread-1) [     ] o.a.s.u.StartupLoggingUtils Missing Java Option solr.log.dir. Logging may be missing or incomplete.
   [junit4]   2> 240365 INFO  (jetty-launcher-596-thread-1) [     ] o.a.s.s.SolrDispatchFilter Using logger factory org.apache.logging.slf4j.Log4jLoggerFactory
   [junit4]   2> 240365 INFO  (jetty-launcher-596-thread-1) [     ] o.a.s.s.SolrDispatchFilter  ___      _       Welcome to Apache Solr™ version 9.0.0
   [junit4]   2> 240365 INFO  (jetty-launcher-596-thread-1) [     ] o.a.s.s.SolrDispatchFilter / __| ___| |_ _   Starting in cloud mode on port null
   [junit4]   2> 240365 INFO  (jetty-launcher-596-thread-1) [     ] o.a.s.s.SolrDispatchFilter \__ \/ _ \ | '_|  Install dir: null
   [junit4]   2> 240365 INFO  (jetty-launcher-596-thread-1) [     ] o.a.s.s.SolrDispatchFilter |___/\___/_|_|    Start time: 2019-09-07T12:53:33.487687Z
   [junit4]   2> 240367 INFO  (jetty-launcher-596-thread-3) [     ] o.a.s.c.c.ConnectionManager Waiting for client to connect to ZooKeeper
   [junit4]   2> 240361 INFO  (jetty-launcher-596-thread-2) [     ] o.a.s.s.SolrDispatchFilter  ___      _       Welcome to Apache Solr™ version 9.0.0
   [junit4]   2> 240367 INFO  (jetty-launcher-596-thread-2) [     ] o.a.s.s.SolrDispatchFilter / __| ___| |_ _   Starting in cloud mode on port null
   [junit4]   2> 240367 INFO  (jetty-launcher-596-thread-2) [     ] o.a.s.s.SolrDispatchFilter \__ \/ _ \ | '_|  Install dir: null
   [junit4]   2> 240367 INFO  (jetty-launcher-596-thread-2) [     ] o.a.s.s.SolrDispatchFilter |___/\___/_|_|    Start time: 2019-09-07T12:53:33.489223Z
   [junit4]   2> 240372 INFO  (jetty-launcher-596-thread-2) [     ] o.a.s.c.c.ConnectionManager Waiting for client to connect to ZooKeeper
   [junit4]   2> 240417 INFO  (jetty-launcher-596-thread-1) [     ] o.a.s.c.c.ConnectionManager Waiting for client to connect to ZooKeeper
   [junit4]   2> 240432 INFO  (zkConnectionManagerCallback-598-thread-1) [     ] o.a.s.c.c.ConnectionManager zkClient has connected
   [junit4]   2> 240432 INFO  (jetty-launcher-596-thread-3) [     ] o.a.s.c.c.ConnectionManager Client is connected to ZooKeeper
   [junit4]   2> 240450 INFO  (jetty-launcher-596-thread-3) [     ] o.a.s.s.SolrDispatchFilter solr.xml found in ZooKeeper. Loading...
   [junit4]   2> 240451 INFO  (zkConnectionManagerCallback-602-thread-1) [     ] o.a.s.c.c.ConnectionManager zkClient has connected
   [junit4]   2> 240451 INFO  (jetty-launcher-596-thread-2) [     ] o.a.s.c.c.ConnectionManager Client is connected to ZooKeeper
   [junit4]   2> 240459 INFO  (jetty-launcher-596-thread-2) [     ] o.a.s.s.SolrDispatchFilter solr.xml found in ZooKeeper. Loading...
   [junit4]   2> 240465 INFO  (zkConnectionManagerCallback-600-thread-1) [     ] o.a.s.c.c.ConnectionManager zkClient has connected
   [junit4]   2> 240465 INFO  (jetty-launcher-596-thread-1) [     ] o.a.s.c.c.ConnectionManager Client is connected to ZooKeeper
   [junit4]   2> 240467 INFO  (jetty-launcher-596-thread-1) [     ] o.a.s.s.SolrDispatchFilter solr.xml found in ZooKeeper. Loading...
   [junit4]   2> 240904 INFO  (jetty-launcher-596-thread-3) [     ] o.a.s.h.c.HttpShardHandlerFactory Host whitelist initialized: WhitelistHostChecker [whitelistHosts=null, whitelistHostCheckingEnabled=true]
   [junit4]   2> 240913 WARN  (jetty-launcher-596-thread-3) [     ] o.e.j.u.s.S.config Trusting all certificates configured for Client@616013bb[provider=null,keyStore=null,trustStore=null]
   [junit4]   2> 240913 WARN  (jetty-launcher-596-thread-3) [     ] o.e.j.u.s.S.config No Client EndPointIdentificationAlgorithm configured for Client@616013bb[provider=null,keyStore=null,trustStore=null]
   [junit4]   2> 240933 WARN  (jetty-launcher-596-thread-3) [     ] o.e.j.u.s.S.config Trusting all certificates configured for Client@1788ad4a[provider=null,keyStore=null,trustStore=null]
   [junit4]   2> 240933 WARN  (jetty-launcher-596-thread-3) [     ] o.e.j.u.s.S.config No Client EndPointIdentificationAlgorithm configured for Client@1788ad4a[provider=null,keyStore=null,trustStore=null]
   [junit4]   2> 240935 INFO  (jetty-launcher-596-thread-3) [     ] o.a.s.c.ZkContainer Zookeeper client=127.0.0.1:38627/solr
   [junit4]   2> 240949 INFO  (jetty-launcher-596-thread-3) [     ] o.a.s.c.c.ConnectionManager Waiting for client to connect to ZooKeeper
   [junit4]   2> 240969 INFO  (zkConnectionManagerCallback-611-thread-1) [     ] o.a.s.c.c.ConnectionManager zkClient has connected
   [junit4]   2> 240969 INFO  (jetty-launcher-596-thread-3) [     ] o.a.s.c.c.ConnectionManager Client is connected to ZooKeeper
   [junit4]   2> 241017 INFO  (jetty-launcher-596-thread-1) [     ] o.a.s.h.c.HttpShardHandlerFactory Host whitelist initialized: WhitelistHostChecker [whitelistHosts=null, whitelistHostCheckingEnabled=true]
   [junit4]   2> 241027 WARN  (jetty-launcher-596-thread-1) [     ] o.e.j.u.s.S.config Trusting all certificates configured for Client@769d6f49[provider=null,keyStore=null,trustStore=null]
   [junit4]   2> 241027 WARN  (jetty-launcher-596-thread-1) [     ] o.e.j.u.s.S.config No Client EndPointIdentificationAlgorithm configured for Client@769d6f49[provider=null,keyStore=null,trustStore=null]
   [junit4]   2> 241053 WARN  (jetty-launcher-596-thread-1) [     ] o.e.j.u.s.S.config Trusting all certificates configured for Client@514f39de[provider=null,keyStore=null,trustStore=null]
   [junit4]   2> 241053 WARN  (jetty-launcher-596-thread-1) [     ] o.e.j.u.s.S.config No Client EndPointIdentificationAlgorithm configured for Client@514f39de[provider=null,keyStore=null,trustStore=null]
   [junit4]   2> 241054 INFO  (jetty-launcher-596-thread-1) [     ] o.a.s.c.ZkContainer Zookeeper client=127.0.0.1:38627/solr
   [junit4]   2> 241065 INFO  (jetty-launcher-596-thread-1) [     ] o.a.s.c.c.ConnectionManager Waiting for client to connect to ZooKeeper
   [junit4]   2> 241089 INFO  (zkConnectionManagerCallback-617-thread-1) [     ] o.a.s.c.c.ConnectionManager zkClient has connected
   [junit4]   2> 241089 INFO  (jetty-launcher-596-thread-1) [     ] o.a.s.c.c.ConnectionManager Client is connected to ZooKeeper
   [junit4]   2> 241109 INFO  (jetty-launcher-596-thread-3) [n:127.0.0.1:37663_solr     ] o.a.s.c.c.ConnectionManager Waiting for client to connect to ZooKeeper
   [junit4]   2> 241127 INFO  (zkConnectionManagerCallback-619-thread-1) [     ] o.a.s.c.c.ConnectionManager zkClient has connected
   [junit4]   2> 241127 INFO  (jetty-launcher-596-thread-3) [n:127.0.0.1:37663_solr     ] o.a.s.c.c.ConnectionManager Client is connected to ZooKeeper
   [junit4]   2> 241149 INFO  (jetty-launcher-596-thread-2) [     ] o.a.s.h.c.HttpShardHandlerFactory Host whitelist initialized: WhitelistHostChecker [whitelistHosts=null, whitelistHostCheckingEnabled=true]
   [junit4]   2> 241165 WARN  (jetty-launcher-596-thread-2) [     ] o.e.j.u.s.S.config Trusting all certificates configured for Client@7bee1c6d[provider=null,keyStore=null,trustStore=null]
   [junit4]   2> 241165 WARN  (jetty-launcher-596-thread-2) [     ] o.e.j.u.s.S.config No Client EndPointIdentificationAlgorithm configured for Client@7bee1c6d[provider=null,keyStore=null,trustStore=null]
   [junit4]   2> 241187 WARN  (jetty-launcher-596-thread-2) [     ] o.e.j.u.s.S.config Trusting all certificates configured for Client@4e073101[provider=null,keyStore=null,trustStore=null]
   [junit4]   2> 241187 WARN  (jetty-launcher-596-thread-2) [     ] o.e.j.u.s.S.config No Client EndPointIdentificationAlgorithm configured for Client@4e073101[provider=null,keyStore=null,trustStore=null]
   [junit4]   2> 241188 INFO  (jetty-launcher-596-thread-2) [     ] o.a.s.c.ZkContainer Zookeeper client=127.0.0.1:38627/solr
   [junit4]   2> 241199 INFO  (jetty-launcher-596-thread-2) [     ] o.a.s.c.c.ConnectionManager Waiting for client to connect to ZooKeeper
   [junit4]   2> 241218 INFO  (zkConnectionManagerCallback-627-thread-1) [     ] o.a.s.c.c.ConnectionManager zkClient has connected
   [junit4]   2> 241218 INFO  (jetty-launcher-596-thread-2) [     ] o.a.s.c.c.ConnectionManager Client is connected to ZooKeeper
   [junit4]   2> 241230 INFO  (jetty-launcher-596-thread-1) [n:127.0.0.1:36503_solr     ] o.a.s.c.c.ConnectionManager Waiting for client to connect to ZooKeeper
   [junit4]   2> 241241 INFO  (zkConnectionManagerCallback-629-thread-1) [     ] o.a.s.c.c.ConnectionManager zkClient has connected
   [junit4]   2> 241241 INFO  (jetty-launcher-596-thread-1) [n:127.0.0.1:36503_solr     ] o.a.s.c.c.ConnectionManager Client is connected to ZooKeeper
   [junit4]   2> 241262 INFO  (jetty-launcher-596-thread-1) [n:127.0.0.1:36503_solr     ] o.a.s.c.OverseerElectionContext I am going to be the leader 127.0.0.1:36503_solr
   [junit4]   2> 241263 INFO  (jetty-launcher-596-thread-1) [n:127.0.0.1:36503_solr     ] o.a.s.c.Overseer Overseer (id=72338245826773002-127.0.0.1:36503_solr-n_0000000000) starting
   [junit4]   2> 241282 INFO  (jetty-launcher-596-thread-1) [n:127.0.0.1:36503_solr     ] o.a.s.c.c.ConnectionManager Waiting for client to connect to ZooKeeper
   [junit4]   2> 241284 INFO  (jetty-launcher-596-thread-3) [n:127.0.0.1:37663_solr     ] o.a.s.c.ZkController Register node as live in ZooKeeper:/live_nodes/127.0.0.1:37663_solr
   [junit4]   2> 241297 INFO  (zkConnectionManagerCallback-636-thread-1) [     ] o.a.s.c.c.ConnectionManager zkClient has connected
   [junit4]   2> 241297 INFO  (jetty-launcher-596-thread-1) [n:127.0.0.1:36503_solr     ] o.a.s.c.c.ConnectionManager Client is connected to ZooKeeper
   [junit4]   2> 241300 INFO  (zkCallback-628-thread-1) [     ] o.a.s.c.c.ZkStateReader Updated live nodes from ZooKeeper... (0) -> (1)
   [junit4]   2> 241301 INFO  (jetty-launcher-596-thread-3) [n:127.0.0.1:37663_solr     ] o.a.s.c.c.ConnectionManager Waiting for client to connect to ZooKeeper
   [junit4]   2> 241307 INFO  (jetty-launcher-596-thread-1) [n:127.0.0.1:36503_solr     ] o.a.s.c.c.ZkStateReader Updated live nodes from ZooKeeper... (0) -> (1)
   [junit4]   2> 241313 INFO  (jetty-launcher-596-thread-1) [n:127.0.0.1:36503_solr     ] o.a.s.c.s.i.ZkClientClusterStateProvider Cluster at 127.0.0.1:38627/solr ready
   [junit4]   2> 241313 INFO  (zkCallback-618-thread-1) [     ] o.a.s.c.c.ZkStateReader Updated live nodes from ZooKeeper... (0) -> (1)
   [junit4]   2> 241317 INFO  (OverseerStateUpdate-72338245826773002-127.0.0.1:36503_solr-n_0000000000) [n:127.0.0.1:36503_solr     ] o.a.s.c.Overseer Starting to work on the main queue : 127.0.0.1:36503_solr
   [junit4]   2> 241327 INFO  (zkConnectionManagerCallback-641-thread-1) [     ] o.a.s.c.c.ConnectionManager zkClient has connected
   [junit4]   2> 241327 INFO  (jetty-launcher-596-thread-3) [n:127.0.0.1:37663_solr     ] o.a.s.c.c.ConnectionManager Client is connected to ZooKeeper
   [junit4]   2> 241328 INFO  (jetty-launcher-596-thread-1) [n:127.0.0.1:36503_solr     ] o.a.s.c.ZkController Publish node=127.0.0.1:36503_solr as DOWN
   [junit4]   2> 241331 INFO  (jetty-launcher-596-thread-1) [n:127.0.0.1:36503_solr     ] o.a.s.c.TransientSolrCoreCacheDefault Allocating transient cache for 2147483647 transient cores
   [junit4]   2> 241331 INFO  (jetty-launcher-596-thread-1) [n:127.0.0.1:36503_solr     ] o.a.s.c.ZkController Register node as live in ZooKeeper:/live_nodes/127.0.0.1:36503_solr
   [junit4]   2> 241332 INFO  (jetty-launcher-596-thread-3) [n:127.0.0.1:37663_solr     ] o.a.s.c.c.ZkStateReader Updated live nodes from ZooKeeper... (0) -> (1)
   [junit4]   2> 241334 INFO  (zkCallback-618-thread-1) [     ] o.a.s.c.c.ZkStateReader Updated live nodes from ZooKeeper... (1) -> (2)
   [junit4]   2> 241334 INFO  (zkCallback-628-thread-1) [     ] o.a.s.c.c.ZkStateReader Updated live nodes from ZooKeeper... (1) -> (2)
   [junit4]   2> 241334 INFO  (jetty-launcher-596-thread-3) [n:127.0.0.1:37663_solr     ] o.a.s.c.s.i.ZkClientClusterStateProvider Cluster at 127.0.0.1:38627/solr ready
   [junit4]   2> 241334 INFO  (jetty-launcher-596-thread-3) [n:127.0.0.1:37663_solr     ] o.a.s.c.PackageManager clusterprops.json changed , version -1
   [junit4]   2> 241339 INFO  (zkCallback-635-thread-1) [     ] o.a.s.c.c.ZkStateReader Updated live nodes from ZooKeeper... (1) -> (2)
   [junit4]   2> 241339 INFO  (jetty-launcher-596-thread-1) [n:127.0.0.1:36503_solr     ] o.a.s.c.PackageManager clusterprops.json changed , version -1
   [junit4]   2> 241343 INFO  (jetty-launcher-596-thread-2) [n:127.0.0.1:41017_solr     ] o.a.s.c.c.ConnectionManager Waiting for client to connect to ZooKeeper
   [junit4]   2> 241346 INFO  (zkCallback-640-thread-1) [     ] o.a.s.c.c.ZkStateReader Updated live nodes from ZooKeeper... (1) -> (2)
   [junit4]   2> 241352 INFO  (zkConnectionManagerCallback-643-thread-1) [     ] o.a.s.c.c.ConnectionManager zkClient has connected
   [junit4]   2> 241352 INFO  (jetty-launcher-596-thread-2) [n:127.0.0.1:41017_solr     ] o.a.s.c.c.ConnectionManager Client is connected to ZooKeeper
   [junit4]   2> 241362 INFO  (jetty-launcher-596-thread-3) [n:127.0.0.1:37663_solr     ] o.a.s.h.a.MetricsHistoryHandler No .system collection, keeping metrics history in memory.
   [junit4]   2> 241363 INFO  (jetty-launcher-596-thread-1) [n:127.0.0.1:36503_solr     ] o.a.s.h.a.MetricsHistoryHandler No .system collection, keeping metrics history in memory.
   [junit4]   2> 241370 INFO  (jetty-launcher-596-thread-2) [n:127.0.0.1:41017_solr     ] o.a.s.c.c.ZkStateReader Updated live nodes from ZooKeeper... (0) -> (2)
   [junit4]   2> 241376 INFO  (jetty-launcher-596-thread-2) [n:127.0.0.1:41017_solr     ] o.a.s.c.ZkController Publish node=127.0.0.1:41017_solr as DOWN
   [junit4]   2> 241378 INFO  (jetty-launcher-596-thread-2) [n:127.0.0.1:41017_solr     ] o.a.s.c.TransientSolrCoreCacheDefault Allocating transient cache for 2147483647 transient cores
   [junit4]   2> 241378 INFO  (jetty-launcher-596-thread-2) [n:127.0.0.1:41017_solr     ] o.a.s.c.ZkController Register node as live in ZooKeeper:/live_nodes/127.0.0.1:41017_solr
   [junit4]   2> 241380 INFO  (zkCallback-635-thread-1) [     ] o.a.s.c.c.ZkStateReader Updated live nodes from ZooKeeper... (2) -> (3)
   [junit4]   2> 241382 INFO  (zkCallback-642-thread-1) [     ] o.a.s.c.c.ZkStateReader Updated live nodes from ZooKeeper... (2) -> (3)
   [junit4]   2> 241383 INFO  (zkCallback-618-thread-1) [     ] o.a.s.c.c.ZkStateReader Updated live nodes from ZooKeeper... (2) -> (3)
   [junit4]   2> 241383 INFO  (zkCallback-640-thread-1) [     ] o.a.s.c.c.ZkStateReader Updated live nodes from ZooKeeper... (2) -> (3)
   [junit4]   2> 241393 INFO  (jetty-launcher-596-thread-2) [n:127.0.0.1:41017_solr     ] o.a.s.c.c.ConnectionManager Waiting for client to connect to ZooKeeper
   [junit4]   2> 241394 INFO  (zkCallback-628-thread-2) [     ] o.a.s.c.c.ZkStateReader Updated live nodes from ZooKeeper... (2) -> (3)
   [junit4]   2> 241394 INFO  (zkConnectionManagerCallback-652-thread-1) [     ] o.a.s.c.c.ConnectionManager zkClient has connected
   [junit4]   2> 241394 INFO  (jetty-launcher-596-thread-2) [n:127.0.0.1:41017_solr     ] o.a.s.c.c.ConnectionManager Client is connected to ZooKeeper
   [junit4]   2> 241400 INFO  (jetty-launcher-596-thread-2) [n:127.0.0.1:41017_solr     ] o.a.s.c.c.ZkStateReader Updated live nodes from ZooKeeper... (0) -> (3)
   [junit4]   2> 241402 INFO  (jetty-launcher-596-thread-2) [n:127.0.0.1:41017_solr     ] o.a.s.c.s.i.ZkClientClusterStateProvider Cluster at 127.0.0.1:38627/solr ready
   [junit4]   2> 241402 INFO  (jetty-launcher-596-thread-2) [n:127.0.0.1:41017_solr     ] o.a.s.c.PackageManager clusterprops.json changed , version -1
   [junit4]   2> 241403 INFO  (jetty-launcher-596-thread-3) [n:127.0.0.1:37663_solr     ] o.a.s.m.r.SolrJmxReporter JMX monitoring for 'solr_37663.solr.node' (registry 'solr.node') enabled at server: com.sun.jmx.mbeanserver.JmxMBeanServer@3a7602f0
   [junit4]   2> 241412 INFO  (jetty-launcher-596-thread-1) [n:127.0.0.1:36503_solr     ] o.a.s.m.r.SolrJmxReporter JMX monitoring for 'solr_36503.solr.node' (registry 'solr.node') enabled at server: com.sun.jmx.mbeanserver.JmxMBeanServer@3a7602f0
   [junit4]   2> 241422 INFO  (jetty-launcher-596-thread-3) [n:127.0.0.1:37663_solr     ] o.a.s.m.r.SolrJmxReporter JMX monitoring for 'solr_37663.solr.jvm' (registry 'solr.jvm') enabled at server: com.sun.jmx.mbeanserver.JmxMBeanServer@3a7602f0
   [junit4]   2> 241422 INFO  (jetty-launcher-596-thread-3) [n:127.0.0.1:37663_solr     ] o.a.s.m.r.SolrJmxReporter JMX monitoring for 'solr_37663.solr.jetty' (registry 'solr.jetty') enabled at server: com.sun.jmx.mbeanserver.JmxMBeanServer@3a7602f0
   [junit4]   2> 241424 INFO  (jetty-launcher-596-thread-3) [n:127.0.0.1:37663_solr     ] o.a.s.c.CorePropertiesLocator Found 0 core definitions underneath /home/jenkins/jenkins-slave/workspace/Lucene-Solr-Tests-master/solr/build/solr-core/test/J1/temp/solr.cloud.autoscaling.sim.TestSnapshotCloudManager_4FD8CBE766421DBB-001/tempDir-001/node3/.
   [junit4]   2> 241432 INFO  (jetty-launcher-596-thread-1) [n:127.0.0.1:36503_solr     ] o.a.s.m.r.SolrJmxReporter JMX monitoring for 'solr_36503.solr.jvm' (registry 'solr.jvm') enabled at server: com.sun.jmx.mbeanserver.JmxMBeanServer@3a7602f0
   [junit4]   2> 241433 INFO  (jetty-launcher-596-thread-2) [n:127.0.0.1:41017_solr     ] o.a.s.h.a.MetricsHistoryHandler No .system collection, keeping metrics history in memory.
   [junit4]   2> 241434 INFO  (jetty-launcher-596-thread-1) [n:127.0.0.1:36503_solr     ] o.a.s.m.r.SolrJmxReporter JMX monitoring for 'solr_36503.solr.jetty' (registry 'solr.jetty') enabled at server: com.sun.jmx.mbeanserver.JmxMBeanServer@3a7602f0
   [junit4]   2> 241436 INFO  (jetty-launcher-596-thread-1) [n:127.0.0.1:36503_solr     ] o.a.s.c.CorePropertiesLocator Found 0 core definitions underneath /home/jenkins/jenkins-slave/workspace/Lucene-Solr-Tests-master/solr/build/solr-core/test/J1/temp/solr.cloud.autoscaling.sim.TestSnapshotCloudManager_4FD8CBE766421DBB-001/tempDir-001/node1/.
   [junit4]   2> 241459 INFO  (jetty-launcher-596-thread-2) [n:127.0.0.1:41017_solr     ] o.a.s.m.r.SolrJmxReporter JMX monitoring for 'solr_41017.solr.node' (registry 'solr.node') enabled at server: com.sun.jmx.mbeanserver.JmxMBeanServer@3a7602f0
   [junit4]   2> 241475 INFO  (jetty-launcher-596-thread-2) [n:127.0.0.1:41017_solr     ] o.a.s.m.r.SolrJmxReporter JMX monitoring for 'solr_41017.solr.jvm' (registry 'solr.jvm') enabled at server: com.sun.jmx.mbeanserver.JmxMBeanServer@3a7602f0
   [junit4]   2> 241475 INFO  (jetty-launcher-596-thread-2) [n:127.0.0.1:41017_solr     ] o.a.s.m.r.SolrJmxReporter JMX monitoring for 'solr_41017.solr.jetty' (registry 'solr.jetty') enabled at server: com.sun.jmx.mbeanserver.JmxMBeanServer@3a7602f0
   [junit4]   2> 241477 INFO  (jetty-launcher-596-thread-2) [n:127.0.0.1:41017_solr     ] o.a.s.c.CorePropertiesLocator Found 0 core definitions underneath /home/jenkins/jenkins-slave/workspace/Lucene-Solr-Tests-master/solr/build/solr-core/test/J1/temp/solr.cloud.autoscaling.sim.TestSnapshotCloudManager_4FD8CBE766421DBB-001/tempDir-001/node2/.
   [junit4]   2> 241572 INFO  (SUITE-TestSnapshotCloudManager-seed#[4FD8CBE766421DBB]-worker) [     ] o.a.s.c.MiniSolrCloudCluster waitForAllNodes: numServers=3
   [junit4]   2> 241577 INFO  (SUITE-TestSnapshotCloudManager-seed#[4FD8CBE766421DBB]-worker) [     ] o.a.s.c.c.ConnectionManager Waiting for client to connect to ZooKeeper
   [junit4]   2> 241581 INFO  (zkConnectionManagerCallback-658-thread-1) [     ] o.a.s.c.c.ConnectionManager zkClient has connected
   [junit4]   2> 241582 INFO  (SUITE-TestSnapshotCloudManager-seed#[4FD8CBE766421DBB]-worker) [     ] o.a.s.c.c.ConnectionManager Client is connected to ZooKeeper
   [junit4]   2> 241584 INFO  (SUITE-TestSnapshotCloudManager-seed#[4FD8CBE766421DBB]-worker) [     ] o.a.s.c.c.ZkStateReader Updated live nodes from ZooKeeper... (0) -> (3)
   [junit4]   2> 241586 INFO  (SUITE-TestSnapshotCloudManager-seed#[4FD8CBE766421DBB]-worker) [     ] o.a.s.c.s.i.ZkClientClusterStateProvider Cluster at 127.0.0.1:38627/solr ready
   [junit4]   2> 241597 INFO  (qtp553149890-1818) [n:127.0.0.1:36503_solr     ] o.a.s.h.a.CollectionsHandler Invoked Collection Action :create with params pullReplicas=1&name=.system&nrtReplicas=2&action=CREATE&numShards=1&tlogReplicas=0&wt=javabin&version=2 and sendToOCPQueue=true
   [junit4]   2> 241609 INFO  (OverseerThreadFactory-732-thread-1-processing-n:127.0.0.1:36503_solr) [n:127.0.0.1:36503_solr     ] o.a.s.c.a.c.CreateCollectionCmd Create collection .system
   [junit4]   2> 241722 INFO  (OverseerStateUpdate-72338245826773002-127.0.0.1:36503_solr-n_0000000000) [n:127.0.0.1:36503_solr     ] o.a.s.c.o.SliceMutator createReplica() {
   [junit4]   2>   "operation":"ADDREPLICA",
   [junit4]   2>   "collection":".system",
   [junit4]   2>   "shard":"shard1",
   [junit4]   2>   "core":".system_shard1_replica_n1",
   [junit4]   2>   "state":"down",
   [junit4]   2>   "base_url":"http://127.0.0.1:36503/solr",
   [junit4]   2>   "type":"NRT",
   [junit4]   2>   "waitForFinalState":"false"}
   [junit4]   2> 241729 INFO  (OverseerStateUpdate-72338245826773002-127.0.0.1:36503_solr-n_0000000000) [n:127.0.0.1:36503_solr     ] o.a.s.c.o.SliceMutator createReplica() {
   [junit4]   2>   "operation":"ADDREPLICA",
   [junit4]   2>   "collection":".system",
   [junit4]   2>   "shard":"shard1",
   [junit4]   2>   "core":".system_shard1_replica_n2",
   [junit4]   2>   "state":"down",
   [junit4]   2>   "base_url":"http://127.0.0.1:41017/solr",
   [junit4]   2>   "type":"NRT",
   [junit4]   2>   "waitForFinalState":"false"}
   [junit4]   2> 241733 INFO  (OverseerStateUpdate-72338245826773002-127.0.0.1:36503_solr-n_0000000000) [n:127.0.0.1:36503_solr     ] o.a.s.c.o.SliceMutator createReplica() {
   [junit4]   2>   "operation":"ADDREPLICA",
   [junit4]   2>   "collection":".system",
   [junit4]   2>   "shard":"shard1",
   [junit4]   2>   "core":".system_shard1_replica_p4",
   [junit4]   2>   "state":"down",
   [junit4]   2>   "base_url":"http://127.0.0.1:37663/solr",
   [junit4]   2>   "type":"PULL",
   [junit4]   2>   "waitForFinalState":"false"}
   [junit4]   2> 241954 INFO  (qtp553149890-1820) [n:127.0.0.1:36503_solr    x:.system_shard1_replica_n1 ] o.a.s.h.a.CoreAdminOperation core create command qt=/admin/cores&coreNodeName=core_node3&collection.configName=.system&newCollection=true&name=.system_shard1_replica_n1&action=CREATE&numShards=1&collection=.system&shard=shard1&wt=javabin&version=2&replicaType=NRT
   [junit4]   2> 241982 INFO  (qtp568183975-1803) [n:127.0.0.1:41017_solr    x:.system_shard1_replica_n2 ] o.a.s.h.a.CoreAdminOperation core create command qt=/admin/cores&coreNodeName=core_node5&collection.configName=.system&newCollection=true&name=.system_shard1_replica_n2&action=CREATE&numShards=1&collection=.system&shard=shard1&wt=javabin&version=2&replicaType=NRT
   [junit4]   2> 242019 INFO  (qtp413562959-1811) [n:127.0.0.1:37663_solr    x:.system_shard1_replica_p4 ] o.a.s.h.a.CoreAdminOperation core create command qt=/admin/cores&coreNodeName=core_node6&collection.configName=.system&newCollection=true&name=.system_shard1_replica_p4&action=CREATE&numShards=1&collection=.system&shard=shard1&wt=javabin&version=2&replicaType=PULL
   [junit4]   2> 242019 INFO  (qtp413562959-1811) [n:127.0.0.1:37663_solr    x:.system_shard1_replica_p4 ] o.a.s.c.TransientSolrCoreCacheDefault Allocating transient cache for 2147483647 transient cores
   [junit4]   2> 242987 WARN  (qtp553149890-1820) [n:127.0.0.1:36503_solr c:.system s:shard1 r:core_node3 x:.system_shard1_replica_n1 ] o.a.s.c.SolrConfig You should not use LATEST as luceneMatchVersion property: if you use this setting, and then Solr upgrades to a newer release of Lucene, sizable changes may happen. If precise back compatibility is important then you should instead explicitly specify an actual Lucene version.
   [junit4]   2> 242987 INFO  (qtp553149890-1820) [n:127.0.0.1:36503_solr c:.system s:shard1 r:core_node3 x:.system_shard1_replica_n1 ] o.a.s.c.SolrConfig Using Lucene MatchVersion: 9.0.0
   [junit4]   2> 243002 INFO  (qtp553149890-1820) [n:127.0.0.1:36503_solr c:.system s:shard1 r:core_node3 x:.system_shard1_replica_n1 ] o.a.s.s.ManagedIndexSchemaFactory The schema is configured as managed, but managed schema resource managed-schema not found - loading non-managed schema schema.xml instead
   [junit4]   2> 243012 INFO  (qtp553149890-1820) [n:127.0.0.1:36503_solr c:.system s:shard1 r:core_node3 x:.system_shard1_replica_n1 ] o.a.s.s.IndexSchema [.system_shard1_replica_n1] Schema name=_system collection or core
   [junit4]   2> 243017 INFO  (qtp568183975-1803) [n:127.0.0.1:41017_solr c:.system s:shard1 r:core_node5 x:.system_shard1_replica_n2 ] o.a.s.c.SolrConfig Using Lucene MatchVersion: 9.0.0
   [junit4]   2> 243028 INFO  (qtp553149890-1820) [n:127.0.0.1:36503_solr c:.system s:shard1 r:core_node3 x:.system_shard1_replica_n1 ] o.a.s.s.IndexSchema Loaded schema _system collection or core/1.1 with uniqueid field id
   [junit4]   2> 243037 INFO  (qtp568183975-1803) [n:127.0.0.1:41017_solr c:.system s:shard1 r:core_node5 x:.system_shard1_replica_n2 ] o.a.s.s.ManagedIndexSchemaFactory The schema is configured as managed, but managed schema resource managed-schema not found - loading non-managed schema schema.xml instead
   [junit4]   2> 243046 INFO  (qtp413562959-1811) [n:127.0.0.1:37663_solr c:.system s:shard1 r:core_node6 x:.system_shard1_replica_p4 ] o.a.s.c.SolrConfig Using Lucene MatchVersion: 9.0.0
   [junit4]   2> 243049 INFO  (qtp553149890-1820) [n:127.0.0.1:36503_solr c:.system s:shard1 r:core_node3 x:.system_shard1_replica_n1 ] o.a.s.s.ManagedIndexSchema Created and persisted managed schema znode at /configs/.system/managed-schema
   [junit4]   2> 243052 INFO  (qtp568183975-1803) [n:127.0.0.1:41017_solr c:.system s:shard1 r:core_node5 x:.system_shard1_replica_n2 ] o.a.s.s.IndexSchema [.system_shard1_replica_n2] Schema name=_system collection or core
   [junit4]   2> 243056 INFO  (qtp568183975-1803) [n:127.0.0.1:41017_solr c:.system s:shard1 r:core_node5 x:.system_shard1_replica_n2 ] o.a.s.s.IndexSchema Loaded schema _system collection or core/1.1 with uniqueid field id
   [junit4]   2> 243061 INFO  (qtp553149890-1820) [n:127.0.0.1:36503_solr c:.system s:shard1 r:core_node3 x:.system_shard1_replica_n1 ] o.a.s.s.ManagedIndexSchemaFactory After upgrading to managed schema in ZooKeeper, renamed the non-managed schema /configs/.system/schema.xml to /configs/.system/schema.xml.bak
   [junit4]   2> 243061 INFO  (qtp553149890-1820) [n:127.0.0.1:36503_solr c:.system s:shard1 r:core_node3 x:.system_shard1_replica_n1 ] o.a.s.c.CoreContainer Creating SolrCore '.system_shard1_replica_n1' using configuration from collection .system, trusted=true
   [junit4]   2> 243062 INFO  (qtp553149890-1820) [n:127.0.0.1:36503_solr c:.system s:shard1 r:core_node3 x:.system_shard1_replica_n1 ] o.a.s.m.r.SolrJmxReporter JMX monitoring for 'solr_36503.solr.core..system.shard1.replica_n1' (registry 'solr.core..system.shard1.replica_n1') enabled at server: com.sun.jmx.mbeanserver.JmxMBeanServer@3a7602f0
   [junit4]   2> 243062 INFO  (qtp553149890-1820) [n:127.0.0.1:36503_solr c:.system s:shard1 r:core_node3 x:.system_shard1_replica_n1 ] o.a.s.c.SolrCore [[.system_shard1_replica_n1] ] Opening new SolrCore at [/home/jenkins/jenkins-slave/workspace/Lucene-Solr-Tests-master/solr/build/solr-core/test/J1/temp/solr.cloud.autoscaling.sim.TestSnapshotCloudManager_4FD8CBE766421DBB-001/tempDir-001/node1/.system_shard1_replica_n1], dataDir=[/home/jenkins/jenkins-slave/workspace/Lucene-Solr-Tests-master/solr/build/solr-core/test/J1/temp/solr.cloud.autoscaling.sim.TestSnapshotCloudManager_4FD8CBE766421DBB-001/tempDir-001/node1/./.system_shard1_replica_n1/data/]
   [junit4]   2> 243065 INFO  (qtp568183975-1803) [n:127.0.0.1:41017_solr c:.system s:shard1 r:core_node5 x:.system_shard1_replica_n2 ] o.a.s.s.ManagedIndexSchema Managed schema znode at /configs/.system/managed-schema already exists - no need to create it
   [junit4]   2> 243069 INFO  (qtp568183975-1803) [n:127.0.0.1:41017_solr c:.system s:shard1 r:core_node5 x:.system_shard1_replica_n2 ] o.a.s.s.ManagedIndexSchemaFactory After upgrading to managed schema in ZooKeeper, the non-managed schema /configs/.system/schema.xml no longer exists.
   [junit4]   2> 243069 INFO  (qtp568183975-1803) [n:127.0.0.1:41017_solr c:.system s:shard1 r:core_node5 x:.system_shard1_replica_n2 ] o.a.s.c.CoreContainer Creating SolrCore '.system_shard1_replica_n2' using configuration from collection .system, trusted=true
   [junit4]   2> 243070 INFO  (qtp568183975-1803) [n:127.0.0.1:41017_solr c:.system s:shard1 r:core_node5 x:.system_shard1_replica_n2 ] o.a.s.m.r.SolrJmxReporter JMX monitoring for 'solr_41017.solr.core..system.shard1.replica_n2' (registry 'solr.core..system.shard1.replica_n2') enabled at server: com.sun.jmx.mbeanserver.JmxMBeanServer@3a7602f0
   [junit4]   2> 243070 INFO  (qtp568183975-1803) [n:127.0.0.1:41017_solr c:.system s:shard1 r:core_node5 x:.system_shard1_replica_n2 ] o.a.s.c.SolrCore [[.system_shard1_replica_n2] ] Opening new SolrCore at [/home/jenkins/jenkins-slave/workspace/Lucene-Solr-Tests-master/solr/build/solr-core/test/J1/temp/solr.cloud.autoscaling.sim.TestSnapshotCloudManager_4FD8CBE766421DBB-001/tempDir-001/node2/.system_shard1_replica_n2], dataDir=[/home/jenkins/jenkins-slave/workspace/Lucene-Solr-Tests-master/solr/build/solr-core/test/J1/temp/solr.cloud.autoscaling.sim.TestSnapshotCloudManager_4FD8CBE766421DBB-001/tempDir-001/node2/./.system_shard1_replica_n2/data/]
   [junit4]   2> 243076 INFO  (qtp413562959-1811) [n:127.0.0.1:37663_solr c:.system s:shard1 r:core_node6 x:.system_shard1_replica_p4 ] o.a.s.s.IndexSchema [.system_shard1_replica_p4] Schema name=_system collection or core
   [junit4]   2> 243083 INFO  (qtp413562959-1811) [n:127.0.0.1:37663_solr c:.system s:shard1 r:core_node6 x:.system_shard1_replica_p4 ] o.a.s.s.IndexSchema Loaded schema _system collection or core/1.1 with uniqueid field id
   [junit4]   2> 243089 INFO  (qtp413562959-1811) [n:127.0.0.1:37663_solr c:.system s:shard1 r:core_node6 x:.system_shard1_replica_p4 ] o.a.s.c.CoreContainer Creating SolrCore '.system_shard1_replica_p4' using configuration from collection .system, trusted=true
   [junit4]   2> 243090 INFO  (qtp413562959-1811) [n:127.0.0.1:37663_solr c:.system s:shard1 r:core_node6 x:.system_shard1_replica_p4 ] o.a.s.m.r.SolrJmxReporter JMX monitoring for 'solr_37663.solr.core..system.shard1.replica_p4' (registry 'solr.core..system.shard1.replica_p4') enabled at server: com.sun.jmx.mbeanserver.JmxMBeanServer@3a7602f0
   [junit4]   2> 243091 INFO  (qtp413562959-1811) [n:127.0.0.1:37663_solr c:.system s:shard1 r:core_node6 x:.system_shard1_replica_p4 ] o.a.s.c.SolrCore [[.system_shard1_replica_p4] ] Opening new SolrCore at [/home/jenkins/jenkins-slave/workspace/Lucene-Solr-Tests-master/solr/build/solr-core/test/J1/temp/solr.cloud.autoscaling.sim.TestSnapshotCloudManager_4FD8CBE766421DBB-001/tempDir-001/node3/.system_shard1_replica_p4], dataDir=[/home/jenkins/jenkins-slave/workspace/Lucene-Solr-Tests-master/solr/build/solr-core/test/J1/temp/solr.cloud.autoscaling.sim.TestSnapshotCloudManager_4FD8CBE766421DBB-001/tempDir-001/node3/./.system_shard1_replica_p4/data/]
   [junit4]   2> 243245 INFO  (qtp553149890-1820) [n:127.0.0.1:36503_solr c:.system s:shard1 r:core_node3 x:.system_shard1_replica_n1 ] o.a.s.u.UpdateHandler Using UpdateLog implementation: org.apache.solr.update.UpdateLog
   [junit4]   2> 243245 INFO  (qtp553149890-1820) [n:127.0.0.1:36503_solr c:.system s:shard1 r:core_node3 x:.system_shard1_replica_n1 ] o.a.s.u.UpdateLog Initializing UpdateLog: dataDir= defaultSyncLevel=FLUSH numRecordsToKeep=100 maxNumLogsToKeep=10 numVersionBuckets=65536
   [junit4]   2> 243248 INFO  (qtp553149890-1820) [n:127.0.0.1:36503_solr c:.system s:shard1 r:core_node3 x:.system_shard1_replica_n1 ] o.a.s.u.CommitTracker Hard AutoCommit: if 1 uncommitted docs;
   [junit4]   2> 243248 INFO  (qtp553149890-1820) [n:127.0.0.1:36503_solr c:.system s:shard1 r:core_node3 x:.system_shard1_replica_n1 ] o.a.s.u.CommitTracker Soft AutoCommit: disabled
   [junit4]   2> 243251 INFO  (qtp553149890-1820) [n:127.0.0.1:36503_solr c:.system s:shard1 r:core_node3 x:.system_shard1_replica_n1 ] o.a.s.s.SolrIndexSearcher Opening [Searcher@5d8155bf[.system_shard1_replica_n1] main]
   [junit4]   2> 243259 INFO  (qtp553149890-1820) [n:127.0.0.1:36503_solr c:.system s:shard1 r:core_node3 x:.system_shard1_replica_n1 ] o.a.s.r.ManagedResourceStorage Configured ZooKeeperStorageIO with znodeBase: /configs/.system
   [junit4]   2> 243259 INFO  (qtp553149890-1820) [n:127.0.0.1:36503_solr c:.system s:shard1 r:core_node3 x:.system_shard1_replica_n1 ] o.a.s.r.ManagedResourceStorage Loaded null at path _rest_managed.json using ZooKeeperStorageIO:path=/configs/.system
   [junit4]   2> 243259 INFO  (qtp553149890-1820) [n:127.0.0.1:36503_solr c:.system s:shard1 r:core_node3 x:.system_shard1_replica_n1 ] o.a.s.s.ZkIndexSchemaReader Creating ZooKeeper watch for the managed schema at /configs/.system/managed-schema
   [junit4]   2> 243260 INFO  (qtp553149890-1820) [n:127.0.0.1:36503_solr c:.system s:shard1 r:core_node3 x:.system_shard1_replica_n1 ] o.a.s.s.ZkIndexSchemaReader Current schema version 0 is already the latest
   [junit4]   2> 243261 INFO  (qtp553149890-1820) [n:127.0.0.1:36503_solr c:.system s:shard1 r:core_node3 x:.system_shard1_replica_n1 ] o.a.s.h.ReplicationHandler Commits will be reserved for 10000ms.
   [junit4]   2> 243261 INFO  (qtp553149890-1820) [n:127.0.0.1:36503_solr c:.system s:shard1 r:core_node3 x:.system_shard1_replica_n1 ] o.a.s.u.UpdateLog Could not find max version in index or recent updates, using new clock 1644021223399620608
   [junit4]   2> 243266 INFO  (searcherExecutor-745-thread-1-processing-n:127.0.0.1:36503_solr x:.system_shard1_replica_n1 c:.system s:shard1 r:core_node3) [n:127.0.0.1:36503_solr c:.system s:shard1 r:core_node3 x:.system_shard1_replica_n1 ] o.a.s.c.SolrCore [.system_shard1_replica_n1] Registered new searcher Searcher@5d8155bf[.system_shard1_replica_n1] main{ExitableDirectoryReader(UninvertingDirectoryReader())}
   [junit4]   2> 243270 INFO  (qtp553149890-1820) [n:127.0.0.1:36503_solr c:.system s:shard1 r:core_node3 x:.system_shard1_replica_n1 ] o.a.s.c.ZkShardTerms Successful update of terms at /collections/.system/terms/shard1 to Terms{values={core_node3=0}, version=0}
   [junit4]   2> 243271 INFO  (qtp553149890-1820) [n:127.0.0.1:36503_solr c:.system s:shard1 r:core_node3 x:.system_shard1_replica_n1 ] o.a.s.c.ShardLeaderElectionContextBase make sure parent is created /collections/.system/leaders/shard1
   [junit4]   2> 243275 INFO  (qtp413562959-1811) [n:127.0.0.1:37663_solr c:.system s:shard1 r:core_node6 x:.system_shard1_replica_p4 ] o.a.s.u.CommitTracker Hard AutoCommit: if 1 uncommitted docs;
   [junit4]   2> 243275 INFO  (qtp413562959-1811) [n:127.0.0.1:37663_solr c:.system s:shard1 r:core_node6 x:.system_shard1_replica_p4 ] o.a.s.u.CommitTracker Soft AutoCommit: disabled
   [junit4]   2> 243277 INFO  (qtp413562959-1811) [n:127.0.0.1:37663_solr c:.system s:shard1 r:core_node6 x:.system_shard1_replica_p4 ] o.a.s.s.SolrIndexSearcher Opening [Searcher@4c9173b8[.system_shard1_replica_p4] main]
   [junit4]   2> 243282 INFO  (qtp413562959-1811) [n:127.0.0.1:37663_solr c:.system s:shard1 r:core_node6 x:.system_shard1_replica_p4 ] o.a.s.r.ManagedResourceStorage Configured ZooKeeperStorageIO with znodeBase: /configs/.system
   [junit4]   2> 243283 INFO  (qtp413562959-1811) [n:127.0.0.1:37663_solr c:.system s:shard1 r:core_node6 x:.system_shard1_replica_p4 ] o.a.s.r.ManagedResourceStorage Loaded null at path _rest_managed.json using ZooKeeperStorageIO:path=/configs/.system
   [junit4]   2> 243283 INFO  (qtp413562959-1811) [n:127.0.0.1:37663_solr c:.system s:shard1 r:core_node6 x:.system_shard1_replica_p4 ] o.a.s.s.ZkIndexSchemaReader Creating ZooKeeper watch for the managed schema at /configs/.system/managed-schema
   [junit4]   2> 243285 INFO  (qtp413562959-1811) [n:127.0.0.1:37663_solr c:.system s:shard1 r:core_node6 x:.system_shard1_replica_p4 ] o.a.s.s.ZkIndexSchemaReader Current schema version 0 is already the latest
   [junit4]   2> 243285 INFO  (qtp413562959-1811) [n:127.0.0.1:37663_solr c:.system s:shard1 r:core_node6 x:.system_shard1_replica_p4 ] o.a.s.h.ReplicationHandler Commits will be reserved for 10000ms.
   [junit4]   2> 243289 INFO  (searcherExecutor-747-thread-1-processing-n:127.0.0.1:37663_solr x:.system_shard1_replica_p4 c:.system s:shard1 r:core_node6) [n:127.0.0.1:37663_solr c:.system s:shard1 r:core_node6 x:.system_shard1_replica_p4 ] o.a.s.c.SolrCore [.system_shard1_replica_p4] Registered new searcher Searcher@4c9173b8[.system_shard1_replica_p4] main{ExitableDirectoryReader(UninvertingDirectoryReader())}
   [junit4]   2> 243291 INFO  (qtp553149890-1820) [n:127.0.0.1:36503_solr c:.system s:shard1 r:core_node3 x:.system_shard1_replica_n1 ] o.a.s.c.ShardLeaderElectionContext Waiting until we see more replicas up for shard shard1: total=2 found=1 timeoutin=9998ms
   [junit4]   2> 243293 INFO  (qtp413562959-1811) [n:127.0.0.1:37663_solr c:.system s:shard1 r:core_node6 x:.system_shard1_replica_p4 ] o.a.s.c.ZkController .system_shard1_replica_p4 starting background replication from leader
   [junit4]   2> 243294 INFO  (qtp413562959-1811) [n:127.0.0.1:37663_solr c:.system s:shard1 r:core_node6 x:.system_shard1_replica_p4 ] o.a.s.c.ReplicateFromLeader Will start replication from leader with poll interval: 00:00:01
   [junit4]   2> 243317 INFO  (qtp568183975-1803) [n:127.0.0.1:41017_solr c:.system s:shard1 r:core_node5 x:.system_shard1_replica_n2 ] o.a.s.u.UpdateHandler Using UpdateLog implementation: org.apache.solr.update.UpdateLog
   [junit4]   2> 243317 INFO  (qtp568183975-1803) [n:127.0.0.1:41017_solr c:.system s:shard1 r:core_node5 x:.system_shard1_replica_n2 ] o.a.s.u.UpdateLog Initializing UpdateLog: dataDir= defaultSyncLevel=FLUSH numRecordsToKeep=100 maxNumLogsToKeep=10 numVersionBuckets=65536
   [junit4]   2> 243319 INFO  (qtp568183975-1803) [n:127.0.0.1:41017_solr c:.system s:shard1 r:core_node5 x:.system_shard1_replica_n2 ] o.a.s.u.CommitTracker Hard AutoCommit: if 1 uncommitted docs;
   [junit4]   2> 243320 INFO  (qtp568183975-1803) [n:127.0.0.1:41017_solr c:.system s:shard1 r:core_node5 x:.system_shard1_replica_n2 ] o.a.s.u.CommitTracker Soft AutoCommit: disabled
   [junit4]   2> 243322 INFO  (qtp568183975-1803) [n:127.0.0.1:41017_solr c:.system s:shard1 r:core_node5 x:.system_shard1_replica_n2 ] o.a.s.s.SolrIndexSearcher Opening [Searcher@709dbc6a[.system_shard1_replica_n2] main]
   [junit4]   2> 243325 INFO  (qtp568183975-1803) [n:127.0.0.1:41017_solr c:.system s:shard1 r:core_node5 x:.system_shard1_replica_n2 ] o.a.s.r.ManagedResourceStorage Configured ZooKeeperStorageIO with znodeBase: /configs/.system
   [junit4]   2> 243326 INFO  (qtp568183975-1803) [n:127.0.0.1:41017_solr c:.system s:shard1 r:core_node5 x:.system_shard1_replica_n2 ] o.a.s.r.ManagedResourceStorage Loaded null at path _rest_managed.json using ZooKeeperStorageIO:path=/configs/.system
   [junit4]   2> 243326 INFO  (qtp568183975-1803) [n:127.0.0.1:41017_solr c:.system s:shard1 r:core_node5 x:.system_shard1_replica_n2 ] o.a.s.s.ZkIndexSchemaReader Creating ZooKeeper watch for the managed schema at /configs/.system/managed-schema
   [junit4]   2> 243327 INFO  (qtp568183975-1803) [n:127.0.0.1:41017_solr c:.system s:shard1 r:core_node5 x:.system_shard1_replica_n2 ] o.a.s.s.ZkIndexSchemaReader Retrieved schema version 0 from ZooKeeper
   [junit4]   2> 243329 INFO  (qtp568183975-1803) [n:127.0.0.1:41017_solr c:.system s:shard1 r:core_node5 x:.system_shard1_replica_n2 ] o.a.s.s.IndexSchema [.system_shard1_replica_n2] Schema name=_system collection or core
   [junit4]   2> 243334 INFO  (qtp568183975-1803) [n:127.0.0.1:41017_solr c:.system s:shard1 r:core_node5 x:.system_shard1_replica_n2 ] o.a.s.s.IndexSchema Loaded schema _system collection or core/1.1 with uniqueid field id
   [junit4]   2> 243338 INFO  (qtp413562959-1811) [n:127.0.0.1:37663_solr c:.system s:shard1 r:core_node6 x:.system_shard1_replica_p4 ] o.a.s.h.ReplicationHandler Poll scheduled at an interval of 1000ms
   [junit4]   2> 243339 INFO  (qtp413562959-1811) [n:127.0.0.1:37663_solr c:.system s:shard1 r:core_node6 x:.system_shard1_replica_p4 ] o.a.s.h.ReplicationHandler Commits will be reserved for 10000ms.
   [junit4]   2> 243339 INFO  (qtp568183975-1803) [n:127.0.0.1:41017_solr c:.system s:shard1 r:core_node5 x:.system_shard1_replica_n2 ] o.a.s.s.ZkIndexSchemaReader Finished refreshing schema in 11 ms
   [junit4]   2> 243340 INFO  (qtp568183975-1803) [n:127.0.0.1:41017_solr c:.system s:shard1 r:core_node5 x:.system_shard1_replica_n2 ] o.a.s.h.ReplicationHandler Commits will be reserved for 10000ms.
   [junit4]   2> 243341 INFO  (qtp568183975-1803) [n:127.0.0.1:41017_solr c:.system s:shard1 r:core_node5 x:.system_shard1_replica_n2 ] o.a.s.u.UpdateLog Could not find max version in index or recent updates, using new clock 1644021223483506688
   [junit4]   2> 243352 INFO  (searcherExecutor-746-thread-1-processing-n:127.0.0.1:41017_solr x:.system_shard1_replica_n2 c:.system s:shard1 r:core_node5) [n:127.0.0.1:41017_solr c:.system s:shard1 r:core_node5 x:.system_shard1_replica_n2 ] o.a.s.c.SolrCore [.system_shard1_replica_n2] Registered new searcher Searcher@709dbc6a[.system_shard1_replica_n2] main{ExitableDirectoryReader(UninvertingDirectoryReader())}
   [junit4]   2> 243358 INFO  (qtp568183975-1803) [n:127.0.0.1:41017_solr c:.system s:shard1 r:core_node5 x:.system_shard1_replica_n2 ] o.a.s.c.ZkShardTerms Successful update of terms at /collections/.system/terms/shard1 to Terms{values={core_node3=0, core_node5=0}, version=1}
   [junit4]   2> 243358 INFO  (qtp568183975-1803) [n:127.0.0.1:41017_solr c:.system s:shard1 r:core_node5 x:.system_shard1_replica_n2 ] o.a.s.c.ShardLeaderElectionContextBase make sure parent is created /collections/.system/leaders/shard1
   [junit4]   2> 243392 INFO  (zkCallback-618-thread-1) [     ] o.a.s.c.c.ZkStateReader A cluster state change: [WatchedEvent state:SyncConnected type:NodeDataChanged path:/collections/.system/state.json] for collection [.system] has occurred - updating... (live nodes size: [3])
   [junit4]   2> 243417 INFO  (zkCallback-618-thread-2) [     ] o.a.s.c.c.ZkStateReader A cluster state change: [WatchedEvent state:SyncConnected type:NodeDataChanged path:/collections/.system/state.json] for collection [.system] has occurred - updating... (live nodes size: [3])
   [junit4]   2> 243792 INFO  (qtp553149890-1820) [n:127.0.0.1:36503_solr c:.system s:shard1 r:core_node3 x:.system_shard1_replica_n1 ] o.a.s.c.ShardLeaderElectionContext Enough replicas found to continue.
   [junit4]   2> 243792 INFO  (qtp553149890-1820) [n:127.0.0.1:36503_solr c:.system s:shard1 r:core_node3 x:.system_shard1_replica_n1 ] o.a.s.c.ShardLeaderElectionContext I may be the new leader - try and sync
   [junit4]   2> 243792 INFO  (qtp553149890-1820) [n:127.0.0.1:36503_solr c:.system s:shard1 r:core_node3 x:.system_shard1_replica_n1 ] o.a.s.c.SyncStrategy Sync replicas to http://127.0.0.1:36503/solr/.system_shard1_replica_n1/
   [junit4]   2> 243793 INFO  (qtp553149890-1820) [n:127.0.0.1:36503_solr c:.system s:shard1 r:core_node3 x:.system_shard1_replica_n1 ] o.a.s.u.PeerSync PeerSync: core=.system_shard1_replica_n1 url=http://127.0.0.1:36503/solr START replicas=[http://127.0.0.1:41017/solr/.system_shard1_replica_n2/] nUpdates=100
   [junit4]   2> 243794 INFO  (qtp553149890-1820) [n:127.0.0.1:36503_solr c:.system s:shard1 r:core_node3 x:.system_shard1_replica_n1 ] o.a.s.u.PeerSync PeerSync: core=.system_shard1_replica_n1 url=http://127.0.0.1:36503/solr DONE.  We have no versions.  sync failed.
   [junit4]   2> 243796 INFO  (qtp568183975-1805) [n:127.0.0.1:41017_solr c:.system s:shard1 r:core_node5 x:.system_shard1_replica_n2 ] o.a.s.c.S.Request [.system_shard1_replica_n2]  webapp=/solr path=/get params={distrib=false&qt=/get&fingerprint=false&getVersions=100&wt=javabin&version=2} status=0 QTime=0
   [junit4]   2> 243797 INFO  (qtp553149890-1820) [n:127.0.0.1:36503_solr c:.system s:shard1 r:core_node3 x:.system_shard1_replica_n1 ] o.a.s.c.SyncStrategy Leader's attempt to sync with shard failed, moving to the next candidate
   [junit4]   2> 243797 INFO  (qtp553149890-1820) [n:127.0.0.1:36503_solr c:.system s:shard1 r:core_node3 x:.system_shard1_replica_n1 ] o.a.s.c.ShardLeaderElectionContext We failed sync, but we have no versions - we can't sync in that case - we were active before, so become leader anyway
   [junit4]   2> 243797 INFO  (qtp553149890-1820) [n:127.0.0.1:36503_solr c:.system s:shard1 r:core_node3 x:.system_shard1_replica_n1 ] o.a.s.c.ShardLeaderElectionContextBase Creating leader registration node /collections/.system/leaders/shard1/leader after winning as /collections/.system/leader_elect/shard1/election/72338245826773002-core_node3-n_0000000000
   [junit4]   2> 243800 INFO  (qtp553149890-1820) [n:127.0.0.1:36503_solr c:.system s:shard1 r:core_node3 x:.system_shard1_replica_n1 ] o.a.s.c.ShardLeaderElectionContext I am the new leader: http://127.0.0.1:36503/solr/.system_shard1_replica_n1/ shard1
   [junit4]   2> 243903 INFO  (zkCallback-628-thread-2) [     ] o.a.s.c.c.ZkStateReader A cluster state change: [WatchedEvent state:SyncConnected type:NodeDataChanged path:/collections/.system/state.json] for collection [.system] has occurred - updating... (live nodes size: [3])
   [junit4]   2> 243903 INFO  (zkCallback-618-thread-2) [     ] o.a.s.c.c.ZkStateReader A cluster state change: [WatchedEvent state:SyncConnected type:NodeDataChanged path:/collections/.system/state.json] for collection [.system] has occurred - updating... (live nodes size: [3])
   [junit4]   2> 243903 INFO  (zkCallback-618-thread-1) [     ] o.a.s.c.c.ZkStateReader A cluster state change: [WatchedEvent state:SyncConnected type:NodeDataChanged path:/collections/.system/state.json] for collection [.system] has occurred - updating... (live nodes size: [3])
   [junit4]   2> 243904 INFO  (indexFetcher-757-thread-1) [     ] o.a.s.h.IndexFetcher Replica core_node3 is leader but it's state is down, skipping replication
   [junit4]   2> 243906 INFO  (qtp553149890-1820) [n:127.0.0.1:36503_solr c:.system s:shard1 r:core_node3 x:.system_shard1_replica_n1 ] o.a.s.c.ZkController I am the leader, no recovery necessary
   [junit4]   2> 243912 INFO  (qtp553149890-1820) [n:127.0.0.1:36503_solr c:.system s:shard1 r:core_node3 x:.system_shard1_replica_n1 ] o.a.s.s.HttpSolrCall [admin] webapp=null path=/admin/cores params={qt=/admin/cores&coreNodeName=core_node3&collection.configName=.system&newCollection=true&name=.system_shard1_replica_n1&action=CREATE&numShards=1&collection=.system&shard=shard1&wt=javabin&version=2&replicaType=NRT} status=0 QTime=1958
   [junit4]   2> 244012 INFO  (zkCallback-628-thread-2) [     ] o.a.s.c.c.ZkStateReader A cluster state change: [WatchedEvent state:SyncConnected type:NodeDataChanged path:/collections/.system/state.json] for collection [.system] has occurred - updating... (live nodes size: [3])
   [junit4]   2> 244012 INFO  (zkCallback-628-thread-1) [     ] o.a.s.c.c.ZkStateReader A cluster state change: [WatchedEvent state:SyncConnected type:NodeDataChanged path:/collections/.system/state.json] for collection [.system] has occurred - updating... (live nodes size: [3])
   [junit4]   2> 244312 INFO  (indexFetcher-757-thread-1) [     ] o.a.s.h.IndexFetcher Last replication failed, so I'll force replication
   [junit4]   2> 244314 INFO  (indexFetcher-757-thread-1) [     ] o.a.s.h.IndexFetcher Updated masterUrl to http://127.0.0.1:36503/solr/.system_shard1_replica_n1/
   [junit4]   2> 244318 INFO  (qtp553149890-1817) [n:127.0.0.1:36503_solr c:.system s:shard1 r:core_node3 x:.system_shard1_replica_n1 ] o.a.s.c.S.Request [.system_shard1_replica_n1]  webapp=/solr path=/replication params={qt=/replication&wt=javabin&version=2&command=indexversion} status=0 QTime=0
   [junit4]   2> 244319 INFO  (indexFetcher-757-thread-1) [     ] o.a.s.h.IndexFetcher Master's generation: 1
   [junit4]   2> 244319 INFO  (indexFetcher-757-thread-1) [     ] o.a.s.h.IndexFetcher Master's version: 0
   [junit4]   2> 244319 INFO  (indexFetcher-757-thread-1) [     ] o.a.s.h.IndexFetcher Slave's generation: 1
   [junit4]   2> 244319 INFO  (indexFetcher-757-thread-1) [     ] o.a.s.h.IndexFetcher Slave's version: 0
   [junit4]   2> 244319 INFO  (indexFetcher-757-thread-1) [     ] o.a.s.h.IndexFetcher New index in Master. Deleting mine...
   [junit4]   2> 244321 INFO  (indexFetcher-757-thread-1) [     ] o.a.s.u.DirectUpdateHandler2 start commit{,optimize=false,openSearcher=true,waitSearcher=true,expungeDeletes=false,softCommit=false,prepareCommit=false}
   [junit4]   2> 244321 INFO  (indexFetcher-757-thread-1) [     ] o.a.s.u.SolrIndexWriter Calling setCommitData with IW:org.apache.solr.update.SolrIndexWriter@27193085 commitCommandVersion:0
   [junit4]   2> 244328 INFO  (indexFetcher-757-thread-1) [     ] o.a.s.s.SolrIndexSearcher Opening [Searcher@63977199[.system_shard1_replica_p4] main]
   [junit4]   2> 244329 INFO  (indexFetcher-757-thread-1) [     ] o.a.s.u.DirectUpdateHandler2 end_commit_flush
   [junit4]   2> 244331 INFO  (searcherExecutor-747-thread-1) [     ] o.a.s.c.SolrCore [.system_shard1_replica_p4] Registered new searcher Searcher@63977199[.system_shard1_replica_p4] main{ExitableDirectoryReader(UninvertingDirectoryReader())}
   [junit4]   2> 244345 INFO  (qtp413562959-1811) [n:127.0.0.1:37663_solr c:.system s:shard1 r:core_node6 x:.system_shard1_replica_p4 ] o.a.s.s.HttpSolrCall [admin] webapp=null path=/admin/cores params={qt=/admin/cores&coreNodeName=core_node6&collection.configName=.system&newCollection=true&name=.system_shard1_replica_p4&action=CREATE&numShards=1&collection=.system&shard=shard1&wt=javabin&version=2&replicaType=PULL} status=0 QTime=2326
   [junit4]   2> 244367 INFO  (qtp568183975-1803) [n:127.0.0.1:41017_solr c:.system s:shard1 r:core_node5 x:.system_shard1_replica_n2 ] o.a.s.s.HttpSolrCall [admin] webapp=null path=/admin/cores params={qt=/admin/cores&coreNodeName=core_node5&collection.configName=.system&newCollection=true&name=.system_shard1_replica_n2&action=CREATE&numShards=1&collection=.system&shard=shard1&wt=javabin&version=2&replicaType=NRT} status=0 QTime=2385
   [junit4]   2> 244373 INFO  (qtp553149890-1818) [n:127.0.0.1:36503_solr     ] o.a.s.h.a.CollectionsHandler Wait for new collection to be active for at most 45 seconds. Check all shard replicas
   [junit4]   2> 244468 INFO  (zkCallback-628-thread-1) [     ] o.a.s.c.c.ZkStateReader A cluster state change: [WatchedEvent state:SyncConnected type:NodeDataChanged path:/collections/.system/state.json] for collection [.system] has occurred - updating... (live nodes size: [3])
   [junit4]   2> 244468 INFO  (zkCallback-642-thread-1) [     ] o.a.s.c.c.ZkStateReader A cluster state change: [WatchedEvent state:SyncConnected type:NodeDataChanged path:/collections/.system/state.json] for collection [.system] has occurred - updating... (live nodes size: [3])
   [junit4]   2> 244468 INFO  (zkCallback-618-thread-2) [     ] o.a.s.c.c.ZkStateReader A cluster state change: [WatchedEvent state:SyncConnected type:NodeDataChanged path:/collections/.system/state.json] for collection [.system] has occurred - updating... (live nodes size: [3])
   [junit4]   2> 244468 INFO  (zkCallback-618-thread-1) [     ] o.a.s.c.c.ZkStateReader A cluster state change: [WatchedEvent state:SyncConnected type:NodeDataChanged path:/collections/.system/state.json] for collection [.system] has occurred - updating... (live nodes size: [3])
   [junit4]   2> 244468 INFO  (zkCallback-628-thread-3) [     ] o.a.s.c.c.ZkStateReader A cluster state change: [WatchedEvent state:SyncConnected type:NodeDataChanged path:/collections/.system/state.json] for collection [.system] has occurred - updating... (live nodes size: [3])
   [junit4]   2> 244469 INFO  (qtp553149890-1818) [n:127.0.0.1:36503_solr     ] o.a.s.s.HttpSolrCall [admin] webapp=null path=/admin/collections params={pullReplicas=1&name=.system&nrtReplicas=2&action=CREATE&numShards=1&tlogReplicas=0&wt=javabin&version=2} status=0 QTime=2871
   [junit4]   2> 244470 INFO  (qtp553149890-1821) [n:127.0.0.1:36503_solr     ] o.a.s.h.a.CollectionsHandler Invoked Collection Action :create with params name=coll1&nrtReplicas=1&action=CREATE&numShards=1&wt=javabin&version=2 and sendToOCPQueue=true
   [junit4]   2> 244474 INFO  (zkCallback-642-thread-2) [     ] o.a.s.c.c.ZkStateReader A cluster state change: [WatchedEvent state:SyncConnected type:NodeDataChanged path:/collections/.system/state.json] for collection [.system] has occurred - updating... (live nodes size: [3])
   [junit4]   2> 244489 INFO  (zkCallback-618-thread-3) [     ] o.a.s.c.c.ZkStateReader A cluster state change: [WatchedEvent state:SyncConnected type:NodeDataChanged path:/collections/.system/state.json] for collection [.system] has occurred - updating... (live nodes size: [3])
   [junit4]   2> 244502 INFO  (OverseerThreadFactory-732-thread-2-processing-n:127.0.0.1:36503_solr) [n:127.0.0.1:36503_solr     ] o.a.s.c.a.c.CreateCollectionCmd Create collection coll1
   [junit4]   2> 244502 INFO  (OverseerCollectionConfigSetProcessor-72338245826773002-127.0.0.1:36503_solr-n_0000000000) [n:127.0.0.1:36503_solr     ] o.a.s.c.OverseerTaskQueue Response ZK path: /overseer/collection-queue-work/qnr-0000000000 doesn't exist.  Requestor may have disconnected from ZooKeeper
   [junit4]   2> 244504 INFO  (OverseerThreadFactory-732-thread-2-processing-n:127.0.0.1:36503_solr) [n:127.0.0.1:36503_solr     ] o.a.s.c.c.ZkConfigManager Copying zk node /configs/_default/protwords.txt to /configs/coll1.AUTOCREATED/protwords.txt
   [junit4]   2> 244506 INFO  (OverseerThreadFactory-732-thread-2-processing-n:127.0.0.1:36503_solr) [n:127.0.0.1:36503_solr     ] o.a.s.c.c.ZkConfigManager Copying zk node /configs/_default/managed-schema to /configs/coll1.AUTOCREATED/managed-schema
   [junit4]   2> 244509 INFO  (OverseerThreadFactory-732-thread-2-processing-n:127.0.0.1:36503_solr) [n:127.0.0.1:36503_solr     ] o.a.s.c.c.ZkConfigManager Copying zk node /configs/_default/solrconfig.xml to /configs/coll1.AUTOCREATED/solrconfig.xml
   [junit4]   2> 244511 INFO  (OverseerThreadFactory-732-thread-2-processing-n:127.0.0.1:36503_solr) [n:127.0.0.1:36503_solr     ] o.a.s.c.c.ZkConfigManager Copying zk node /configs/_default/synonyms.txt to /configs/coll1.AUTOCREATED/synonyms.txt
   [junit4]   2> 244514 INFO  (OverseerThreadFactory-732-thread-2-processing-n:127.0.0.1:36503_solr) [n:127.0.0.1:36503_solr     ] o.a.s.c.c.ZkConfigManager Copying zk node /configs/_default/stopwords.txt to /configs/coll1.AUTOCREATED/stopwords.txt
   [junit4]   2> 244517 INFO  (OverseerThreadFactory-732-thread-2-processing-n:127.0.0.1:36503_solr) [n:127.0.0.1:36503_solr     ] o.a.s.c.c.ZkConfigManager Copying zk node /configs/_default/params.json to /configs/coll1.AUTOCREATED/params.json
   [junit4]   2> 244520 INFO  (OverseerThreadFactory-732-thread-2-processing-n:127.0.0.1:36503_solr) [n:127.0.0.1:36503_solr     ] o.a.s.c.c.ZkConfigManager Copying zk node /configs/_default/lang/contractions_it.txt to /configs/coll1.AUTOCREATED/lang/contractions_it.txt
   [junit4]   2> 244522 INFO  (OverseerThreadFactory-732-thread-2-processing-n:127.0.0.1:36503_solr) [n:127.0.0.1:36503_solr     ] o.a.s.c.c.ZkConfigManager Copying zk node /configs/_default/lang/stopwords_no.txt to /configs/coll1.AUTOCREATED/lang/stopwords_no.txt
   [junit4]   2> 244525 INFO  (OverseerThreadFactory-732-thread-2-processing-n:127.0.0.1:36503_solr) [n:127.0.0.1:36503_solr     ] o.a.s.c.c.ZkConfigManager Copying zk node /configs/_default/lang/contractions_ca.txt to /configs/coll1.AUTOCREATED/lang/contractions_ca.txt
   [junit4]   2> 244527 INFO  (OverseerThreadFactory-732-thread-2-processing-n:127.0.0.1:36503_solr) [n:127.0.0.1:36503_solr     ] o.a.s.c.c.ZkConfigManager Copying zk node /configs/_default/lang/stemdict_nl.txt to /configs/coll1.AUTOCREATED/lang/stemdict_nl.txt
   [junit4]   2> 244530 INFO  (OverseerThreadFactory-732-thread-2-processing-n:127.0.0.1:36503_solr) [n:127.0.0.1:36503_solr     ] o.a.s.c.c.ZkConfigManager Copying zk node /configs/_default/lang/stopwords_hy.txt to /configs/coll1.AUTOCREATED/lang/stopwords_hy.txt
   [junit4]   2> 244532 INFO  (OverseerThreadFactory-732-thread-2-processing-n:127.0.0.1:36503_solr) [n:127.0.0.1:36503_solr     ] o.a.s.c.c.ZkConfigManager Copying zk node /configs/_default/lang/stopwords_id.txt to /configs/coll1.AUTOCREATED/lang/stopwords_id.txt
   [junit4]   2> 244535 INFO  (OverseerThreadFactory-732-thread-2-processing-n:127.0.0.1:36503_solr) [n:127.0.0.1:36503_solr     ] o.a.s.c.c.ZkConfigManager Copying zk node /configs/_default/lang/stopwords_et.txt to /configs/coll1.AUTOCREATED/lang/stopwords_et.txt
   [junit4]   2> 244539 INFO  (OverseerThreadFactory-732-thread-2-processing-n:127.0.0.1:36503_solr) [n:127.0.0.1:36503_solr     ] o.a.s.c.c.ZkConfigManager Copying zk node /configs/_default/lang/stopwords_ga.txt to /configs/coll1.AUTOCREATED/lang/stopwords_ga.txt
   [junit4]   2> 244542 INFO  (OverseerThreadFactory-732-thread-2-processing-n:127.0.0.1:36503_solr) [n:127.0.0.1:36503_solr     ] o.a.s.c.c.ZkConfigManager Copying zk node /configs/_default/lang/stopwords_da.txt to /configs/coll1.AUTOCREATED/lang/stopwords_da.txt
   [junit4]   2> 244544 INFO  (OverseerThreadFactory-732-thread-2-processing-n:127.0.0.1:36503_solr) [n:127.0.0.1:36503_solr     ] o.a.s.c.c.ZkConfigManager Copying zk node /configs/_default/lang/stopwords_hi.txt to /configs/coll1.AUTOCREATED/lang/stopwords_hi.txt
   [junit4]   2> 244547 INFO  (OverseerThreadFactory-732-thread-2-processing-n:127.0.0.1:36503_solr) [n:127.0.0.1:36503_solr     ] o.a.s.c.c.ZkConfigManager Copying zk node /configs/_default/lang/stopwords_ja.txt to /configs/coll1.AUTOCREATED/lang/stopwords_ja.txt
   [junit4]   2> 244554 INFO  (OverseerThreadFactory-732-thread-2-processing-n:127.0.0.1:36503_solr) [n:127.0.0.1:36503_solr     ] o.a.s.c.c.ZkConfigManager Copying zk node /configs/_default/lang/stopwords_pt.txt to /configs/coll1.AUTOCREATED/lang/stopwords_pt.txt
   [junit4]   2> 244557 INFO  (OverseerThreadFactory-732-thread-2-processing-n:127.0.0.1:36503_solr) [n:127.0.0.1:36503_solr     ] o.a.s.c.c.ZkConfigManager Copying zk node /configs/_default/lang/stopwords_hu.txt to /configs/coll1.AUTOCREATED/lang/stopwords_hu.txt
   [junit4]   2> 244564 INFO  (OverseerThreadFactory-732-thread-2-processing-n:127.0.0.1:36503_solr) [n:127.0.0.1:36503_solr     ] o.a.s.c.c.ZkConfigManager Copying zk node /configs/_default/lang/stopwords_el.txt to /configs/coll1.AUTOCREATED/lang/stopwords_el.txt
   [junit4]   2> 244567 INFO  (OverseerThreadFactory-732-thread-2-processing-n:127.0.0.1:36503_solr) [n:127.0.0.1:36503_solr     ] o.a.s.c.c.ZkConfigManager Copying zk node /configs/_default/lang/stopwords_ru.txt to /configs/coll1.AUTOCREATED/lang/stopwords_ru.txt
   [junit4]   2> 244570 INFO  (OverseerThreadFactory-732-thread-2-processing-n:127.0.0.1:36503_solr) [n:127.0.0.1:36503_solr     ] o.a.s.c.c.ZkConfigManager Copying zk node /configs/_default/lang/stopwords_tr.txt to /configs/coll1.AUTOCREATED/lang/stopwords_tr.txt
   [junit4]   2> 244572 INFO  (OverseerThreadFactory-732-thread-2-processing-n:127.0.0.1:36503_solr) [n:127.0.0.1:36503_solr     ] o.a.s.c.c.ZkConfigManager Copying zk node /configs/_default/lang/stopwords_ar.txt to /configs/coll1.AUTOCREATED/lang/stopwords_ar.txt
   [junit4]   2> 244574 INFO  (OverseerThreadFactory-732-thread-2-processing-n:127.0.0.1:36503_solr) [n:127.0.0.1:36503_solr     ] o.a.s.c.c.ZkConfigManager Copying zk node /configs/_default/lang/userdict_ja.txt to /configs/coll1.AUTOCREATED/lang/userdict_ja.txt
   [junit4]   2> 244577 INFO  (OverseerThreadFactory-732-thread-2-processing-n:127.0.0.1:36503_solr) [n:127.0.0.1:36503_solr     ] o.a.s.c.c.ZkConfigManager Copying zk node /configs/_default/lang/stopwords_it.txt to /configs/coll1.AUTOCREATED/lang/stopwords_it.txt
   [junit4]   2> 244580 INFO  (OverseerThreadFactory-732-thread-2-processing-n:127.0.0.1:36503_solr) [n:127.0.0.1:36503_solr     ] o.a.s.c.c.ZkConfigManager Copying zk node /configs/_default/lang/stopwords_eu.txt to /configs/coll1.AUTOCREATED/lang/stopwords_eu.txt
   [junit4]   2> 244582 INFO  (OverseerThreadFactory-732-thread-2-processing-n:127.0.0.1:36503_solr) [n:127.0.0.1:36503_solr     ] o.a.s.c.c.ZkConfigManager Copying zk node /configs/_default/lang/stopwords_cz.txt to /configs/coll1.AUTOCREATED/lang/stopwords_cz.txt
   [junit4]   2> 244585 INFO  (OverseerThreadFactory-732-thread-2-processing-n:127.0.0.1:36503_solr) [n:127.0.0.1:36503_solr     ] o.a.s.c.c.ZkConfigManager Copying zk node /configs/_default/lang/stoptags_ja.txt to /configs/coll1.AUTOCREATED/lang/stoptags_ja.txt
   [junit4]   2> 244588 INFO  (OverseerThreadFactory-732-thread-2-processing-n:127.0.0.1:36503_solr) [n:127.0.0.1:36503_solr     ] o.a.s.c.c.ZkConfigManager Copying zk node /configs/_default/lang/contractions_fr.txt to /configs/coll1.AUTOCREATED/lang/contractions_fr.txt
   [junit4]   2> 244592 INFO  (OverseerThreadFactory-732-thread-2-processing-n:127.0.0.1:36503_solr) [n:127.0.0.1:36503_solr     ] o.a.s.c.c.ZkConfigManager Copying zk node /configs/_default/lang/stopwords_de.txt to /configs/coll1.AUTOCREATED/lang/stopwords_de.txt
   [junit4]   2> 244594 INFO  (OverseerThreadFactory-732-thread-2-processing-n:127.0.0.1:36503_solr) [n:127.0.0.1:36503_solr     ] o.a.s.c.c.ZkConfigManager Copying zk node /configs/_default/lang/stopwords_fa.txt to /configs/coll1.AUTOCREATED/lang/stopwords_fa.txt
   [junit4]   2> 244597 INFO  (OverseerThreadFactory-732-thread-2-processing-n:127.0.0.1:36503_solr) [n:127.0.0.1:36503_solr     ] o.a.s.c.c.ZkConfigManager Copying zk node /configs/_default/lang/contractions_ga.txt to /configs/coll1.AUTOCREATED/lang/contractions_ga.txt
   [junit4]   2> 244600 INFO  (OverseerThreadFactory-732-thread-2-processing-n:127.0.0.1:36503_solr) [n:127.0.0.1:36503_solr     ] o.a.s.c.c.ZkConfigManager Copying zk node /configs/_default/lang/stopwords_ca.txt to /configs/coll1.AUTOCREATED/lang/stopwords_ca.txt
   [junit4]   2> 244603 INFO  (OverseerThreadFactory-732-thread-2-processing-n:127.0.0.1:36503_solr) [n:127.0.0.1:36503_solr     ] o.a.s.c.c.ZkConfigManager Copying zk node /configs/_default/lang/stopwords_nl.txt to /configs/coll1.AUTOCREATED/lang/stopwords_nl.txt
   [junit4]   2> 244605 INFO  (OverseerThreadFactory-732-thread-2-processing-n:127.0.0.1:36503_solr) [n:127.0.0.1:36503_solr     ] o.a.s.c.c.ZkConfigManager Copying zk node /configs/_default/lang/stopwords_bg.txt to /configs/coll1.AUTOCREATED/lang/stopwords_bg.txt
   [junit4]   2> 244608 INFO  (OverseerThreadFactory-732-thread-2-processing-n:127.0.0.1:36503_solr) [n:127.0.0.1:36503_solr     ] o.a.s.c.c.ZkConfigManager Copying zk node /configs/_default/lang/stopwords_en.txt to /configs/coll1.AUTOCREATED/lang/stopwords_en.txt
   [junit4]   2> 244611 INFO  (OverseerThreadFactory-732-thread-2-processing-n:127.0.0.1:36503_solr) [n:127.0.0.1:36503_solr     ] o.a.s.c.c.ZkConfigManager Copying zk node /configs/_default/lang/stopwords_lv.txt to /configs/coll1.AUTOCREATED/lang/stopwords_lv.txt
   [junit4]   2> 244613 INFO  (OverseerThreadFactory-732-thread-2-processing-n:127.0.0.1:36503_solr) [n:127.0.0.1:36503_solr     ] o.a.s.c.c.ZkConfigManager Copying zk node /configs/_default/lang/stopwords_es.txt to /configs/coll1.AUTOCREATED/lang/stopwords_es.txt
   [junit4]   2> 244616 INFO  (OverseerThreadFactory-732-thread-2-processing-n:127.0.0.1:36503_solr) [n:127.0.0.1:36503_solr     ] o.a.s.c.c.ZkConfigManager Copying zk node /configs/_default/lang/stopwords_th.txt to /configs/coll1.AUTOCREATED/lang/stopwords_th.txt
   [junit4]   2> 244618 INFO  (OverseerThreadFactory-732-thread-2-processing-n:127.0.0.1:36503_solr) [n:127.0.0.1:36503_solr     ] o.a.s.c.c.ZkConfigManager Copying zk node /configs/_default/lang/stopwords_ro.txt to /configs/coll1.AUTOCREATED/lang/stopwords_ro.txt
   [junit4]   2> 244621 INFO  (OverseerThreadFactory-732-thread-2-processing-n:127.0.0.1:36503_solr) [n:127.0.0.1:36503_solr     ] o.a.s.c.c.ZkConfigManager Copying zk node /configs/_default/lang/stopwords_fr.txt to /configs/coll1.AUTOCREATED/lang/stopwords_fr.txt
   [junit4]   2> 244627 INFO  (OverseerThreadFactory-732-thread-2-processing-n:127.0.0.1:36503_solr) [n:127.0.0.1:36503_solr     ] o.a.s.c.c.ZkConfigManager Copying zk node /configs/_default/lang/stopwords_sv.txt to /configs/coll1.AUTOCREATED/lang/stopwords_sv.txt
   [junit4]   2> 244631 INFO  (OverseerThreadFactory-732-thread-2-processing-n:127.0.0.1:36503_solr) [n:127.0.0.1:36503_solr     ] o.a.s.c.c.ZkConfigManager Copying zk node /configs/_default/lang/stopwords_fi.txt to /configs/coll1.AUTOCREATED/lang/stopwords_fi.txt
   [junit4]   2> 244634 INFO  (OverseerThreadFactory-732-thread-2-processing-n:127.0.0.1:36503_solr) [n:127.0.0.1:36503_solr     ] o.a.s.c.c.ZkConfigManager Copying zk node /configs/_default/lang/hyphenations_ga.txt to /configs/coll1.AUTOCREATED/lang/hyphenations_ga.txt
   [junit4]   2> 244637 INFO  (OverseerThreadFactory-732-thread-2-processing-n:127.0.0.1:36503_solr) [n:127.0.0.1:36503_solr     ] o.a.s.c.c.ZkConfigManager Copying zk node /configs/_default/lang/stopwords_gl.txt to /configs/coll1.AUTOCREATED/lang/stopwords_gl.txt
   [junit4]   2> 244853 INFO  (OverseerStateUpdate-72338245826773002-127.0.0.1:36503_solr-n_0000000000) [n:127.0.0.1:36503_solr     ] o.a.s.c.o.SliceMutator createReplica() {
   [junit4]   2>   "operation":"ADDREPLICA",
   [junit4]   2>   "collection":"coll1",
   [junit4]   2>   "shard":"shard1",
   [junit4]   2>   "core":"coll1_shard1_replica_n1",
   [junit4]   2>   "state":"down",
   [junit4]   2>   "base_url":"http://127.0.0.1:37663/solr",
   [junit4]   2>   "type":"NRT",
   [junit4]   2>   "waitForFinalState":"false"}
   [junit4]   2> 245061 INFO  (qtp413562959-1812) [n:127.0.0.1:37663_solr    x:coll1_shard1_replica_n1 ] o.a.s.h.a.CoreAdminOperation core create command qt=/admin/cores&coreNodeName=core_node2&collection.configName=coll1.AUTOCREATED&newCollection=true&name=coll1_shard1_replica_n1&action=CREATE&numShards=1&collection=coll1&shard=shard1&wt=javabin&version=2&replicaType=NRT
   [junit4]   2> 245313 INFO  (qtp553149890-1820) [n:127.0.0.1:36503_solr c:.system s:shard1 r:core_node3 x:.system_shard1_replica_n1 ] o.a.s.c.S.Request [.system_shard1_replica_n1]  webapp=/solr path=/replication params={qt=/replication&wt=javabin&version=2&command=indexversion} status=0 QTime=0
   [junit4]   2> 245314 INFO  (indexFetcher-757-thread-1) [     ] o.a.s.h.IndexFetcher Master's generation: 1
   [junit4]   2> 245314 INFO  (indexFetcher-757-thread-1) [     ] o.a.s.h.IndexFetcher Master's version: 0
   [junit4]   2> 245314 INFO  (indexFetcher-757-thread-1) [     ] o.a.s.h.IndexFetcher Slave's generation: 2
   [junit4]   2> 245314 INFO  (indexFetcher-757-thread-1) [     ] o.a.s.h.IndexFetcher Slave's version: 1567860817443
   [junit4]   2> 245314 INFO  (indexFetcher-757-thread-1) [     ] o.a.s.h.IndexFetcher New index in Master. Deleting mine...
   [junit4]   2> 245314 INFO  (indexFetcher-757-thread-1) [     ] o.a.s.u.DirectUpdateHandler2 start commit{,optimize=false,openSearcher=true,waitSearcher=true,expungeDeletes=false,softCommit=false,prepareCommit=false}
   [junit4]   2> 245314 INFO  (indexFetcher-757-thread-1) [     ] o.a.s.u.SolrIndexWriter Calling setCommitData with IW:org.apache.solr.update.SolrIndexWriter@27193085 commitCommandVersion:0
   [junit4]   2> 245315 INFO  (indexFetcher-757-thread-1) [     ] o.a.s.s.SolrIndexSearcher Opening [Searcher@5da7d5c4[.system_shard1_replica_p4] main]
   [junit4]   2> 245315 INFO  (indexFetcher-757-thread-1) [     ] o.a.s.u.DirectUpdateHandler2 end_commit_flush
   [junit4]   2> 245317 INFO  (searcherExecutor-747-thread-1) [     ] o.a.s.c.SolrCore [.system_shard1_replica_p4] Registered new searcher Searcher@5da7d5c4[.system_shard1_replica_p4] main{ExitableDirectoryReader(UninvertingDirectoryReader())}
   [junit4]   2> 246090 INFO  (qtp413562959-1812) [n:127.0.0.1:37663_solr c:coll1 s:shard1 r:core_node2 x:coll1_shard1_replica_n1 ] o.a.s.c.RequestParams conf resource params.json loaded . version : 0
   [junit4]   2> 246090 INFO  (qtp413562959-1812) [n:127.0.0.1:37663_solr c:coll1 s:shard1 r:core_node2 x:coll1_shard1_replica_n1 ] o.a.s.c.RequestParams request params refreshed to version 0
   [junit4]   2> 246091 WARN  (qtp413562959-1812) [n:127.0.0.1:37663_solr c:coll1 s:shard1 r:core_node2 x:coll1_shard1_replica_n1 ] o.a.s.c.SolrConfig Couldn't add files from /home/jenkins/jenkins-slave/workspace/Lucene-Solr-Tests-master/solr/build/solr-core/test/J1/temp/solr.cloud.autoscaling.sim.TestSnapshotCloudManager_4FD8CBE766421DBB-001/tempDir-001/node3/coll1_shard1_replica_n1/../../../../contrib/extraction/lib filtered by .*\.jar to classpath: /home/jenkins/jenkins-slave/workspace/Lucene-Solr-Tests-master/solr/build/solr-core/test/J1/temp/solr.cloud.autoscaling.sim.TestSnapshotCloudManager_4FD8CBE766421DBB-001/tempDir-001/node3/coll1_shard1_replica_n1/../../../../contrib/extraction/lib
   [junit4]   2> 246091 WARN  (qtp413562959-1812) [n:127.0.0.1:37663_solr c:coll1 s:shard1 r:core_node2 x:coll1_shard1_replica_n1 ] o.a.s.c.SolrConfig Couldn't add files from /home/jenkins/jenkins-slave/workspace/Lucene-Solr-Tests-master/solr/build/solr-core/test/J1/temp/solr.cloud.autoscaling.sim.TestSnapshotCloudManager_4FD8CBE766421DBB-001/tempDir-001/node3/coll1_shard1_replica_n1/../../../../dist filtered by solr-cell-\d.*\.jar to classpath: /home/jenkins/jenkins-slave/workspace/Lucene-Solr-Tests-master/solr/build/solr-core/test/J1/temp/solr.cloud.autoscaling.sim.TestSnapshotCloudManager_4FD8CBE766421DBB-001/tempDir-001/node3/coll1_shard1_replica_n1/../../../../dist
   [junit4]   2> 246091 WARN  (qtp413562959-1812) [n:127.0.0.1:37663_solr c:coll1 s:shard1 r:core_node2 x:coll1_shard1_replica_n1 ] o.a.s.c.SolrConfig Couldn't add files from /home/jenkins/jenkins-slave/workspace/Lucene-Solr-Tests-master/solr/build/solr-core/test/J1/temp/solr.cloud.autoscaling.sim.TestSnapshotCloudManager_4FD8CBE766421DBB-001/tempDir-001/node3/coll1_shard1_replica_n1/../../../../contrib/clustering/lib filtered by .*\.jar to classpath: /home/jenkins/jenkins-slave/workspace/Lucene-Solr-Tests-master/solr/build/solr-core/test/J1/temp/solr.cloud.autoscaling.sim.TestSnapshotCloudManager_4FD8CBE766421DBB-001/tempDir-001/node3/coll1_shard1_replica_n1/../../../../contrib/clustering/lib
   [junit4]   2> 246091 WARN  (qtp413562959-1812) [n:127.0.0.1:37663_solr c:coll1 s:shard1 r:core_node2 x:coll1_shard1_replica_n1 ] o.a.s.c.SolrConfig Couldn't add files from /home/jenkins/jenkins-slave/workspace/Lucene-Solr-Tests-master/solr/build/solr-core/test/J1/temp/solr.cloud.autoscaling.sim.TestSnapshotCloudManager_4FD8CBE766421DBB-001/tempDir-001/node3/coll1_shard1_replica_n1/../../../../dist filtered by solr-clustering-\d.*\.jar to classpath: /home/jenkins/jenkins-slave/workspace/Lucene-Solr-Tests-master/solr/build/solr-core/test/J1/temp/solr.cloud.autoscaling.sim.TestSnapshotCloudManager_4FD8CBE766421DBB-001/tempDir-001/node3/coll1_shard1_replica_n1/../../../../dist
   [junit4]   2> 246092 WARN  (qtp413562959-1812) [n:127.0.0.1:37663_solr c:coll1 s:shard1 r:core_node2 x:coll1_shard1_replica_n1 ] o.a.s.c.SolrConfig Couldn't add files from /home/jenkins/jenkins-slave/workspace/Lucene-Solr-Tests-master/solr/build/solr-core/test/J1/temp/solr.cloud.autoscaling.sim.TestSnapshotCloudManager_4FD8CBE766421DBB-001/tempDir-001/node3/coll1_shard1_replica_n1/../../../../contrib/langid/lib filtered by .*\.jar to classpath: /home/jenkins/jenkins-slave/workspace/Lucene-Solr-Tests-master/solr/build/solr-core/test/J1/temp/solr.cloud.autoscaling.sim.TestSnapshotCloudManager_4FD8CBE766421DBB-001/tempDir-001/node3/coll1_shard1_replica_n1/../../../../contrib/langid/lib
   [junit4]   2> 246092 WARN  (qtp413562959-1812) [n:127.0.0.1:37663_solr c:coll1 s:shard1 r:core_node2 x:coll1_shard1_replica_n1 ] o.a.s.c.SolrConfig Couldn't add files from /home/jenkins/jenkins-slave/workspace/Lucene-Solr-Tests-master/solr/build/solr-core/test/J1/temp/solr.cloud.autoscaling.sim.TestSnapshotCloudManager_4FD8CBE766421DBB-001/tempDir-001/node3/coll1_shard1_replica_n1/../../../../dist filtered by solr-langid-\d.*\.jar to classpath: /home/jenkins/jenkins-slave/workspace/Lucene-Solr-Tests-master/solr/build/solr-core/test/J1/temp/solr.cloud.autoscaling.sim.TestSnapshotCloudManager_4FD8CBE766421DBB-001/tempDir-001/node3/coll1_shard1_replica_n1/../../../../dist
   [junit4]   2> 246092 WARN  (qtp413562959-1812) [n:127.0.0.1:37663_solr c:coll1 s:shard1 r:core_node2 x:coll1_shard1_replica_n1 ] o.a.s.c.SolrConfig Couldn't add files from /home/jenkins/jenkins-slave/workspace/Lucene-Solr-Tests-master/solr/build/solr-core/test/J1/temp/solr.cloud.autoscaling.sim.TestSnapshotCloudManager_4FD8CBE766421DBB-001/tempDir-001/node3/coll1_shard1_replica_n1/../../../../contrib/velocity/lib filtered by .*\.jar to classpath: /home/jenkins/jenkins-slave/workspace/Lucene-Solr-Tests-master/solr/build/solr-core/test/J1/temp/solr.cloud.autoscaling.sim.TestSnapshotCloudManager_4FD8CBE766421DBB-001/tempDir-001/node3/coll1_shard1_replica_n1/../../../../contrib/velocity/lib
   [junit4]   2> 246092 WARN  (qtp413562959-1812) [n:127.0.0.1:37663_solr c:coll1 s:shard1 r:core_node2 x:coll1_shard1_replica_n1 ] o.a.s.c.SolrConfig Couldn't add files from /home/jenkins/jenkins-slave/workspace/Lucene-Solr-Tests-master/solr/build/solr-core/test/J1/temp/solr.cloud.autoscaling.sim.TestSnapshotCloudManager_4FD8CBE766421DBB-001/tempDir-001/node3/coll1_shard1_replica_n1/../../../../dist filtered by solr-velocity-\d.*\.jar to classpath: /home/jenkins/jenkins-slave/workspace/Lucene-Solr-Tests-master/solr/build/solr-core/test/J1/temp/solr.cloud.autoscaling.sim.TestSnapshotCloudManager_4FD8CBE766421DBB-001/tempDir-001/node3/coll1_shard1_replica_n1/../../../../dist
   [junit4]   2> 246093 WARN  (qtp413562959-1812) [n:127.0.0.1:37663_solr c:coll1 s:shard1 r:core_node2 x:coll1_shard1_replica_n1 ] o.a.s.c.SolrConfig Couldn't add files from /home/jenkins/jenkins-slave/workspace/Lucene-Solr-Tests-master/solr/build/solr-core/test/J1/temp/solr.cloud.autoscaling.sim.TestSnapshotCloudManager_4FD8CBE766421DBB-001/tempDir-001/node3/coll1_shard1_replica_n1/../../../../dist filtered by solr-ltr-\d.*\.jar to classpath: /home/jenkins/jenkins-slave/workspace/Lucene-Solr-Tests-master/solr/build/solr-core/test/J1/temp/solr.cloud.autoscaling.sim.TestSnapshotCloudManager_4FD8CBE766421DBB-001/tempDir-001/node3/coll1_shard1_replica_n1/../../../../dist
   [junit4]   2> 246093 INFO  (qtp413562959-1812) [n:127.0.0.1:37663_solr c:coll1 s:shard1 r:core_node2 x:coll1_shard1_replica_n1 ] o.a.s.c.SolrConfig Using Lucene MatchVersion: 9.0.0
   [junit4]   2> 246138 INFO  (qtp413562959-1812) [n:127.0.0.1:37663_solr c:coll1 s:shard1 r:core_node2 x:coll1_shard1_replica_n1 ] o.a.s.s.IndexSchema [coll1_shard1_replica_n1] Schema name=default-config
   [junit4]   2> 246313 INFO  (qtp553149890-1819) [n:127.0.0.1:36503_solr c:.system s:shard1 r:core_node3 x:.system_shard1_replica_n1 ] o.a.s.c.S.Request [.system_shard1_replica_n1]  webapp=/solr path=/replication params={qt=/replication&wt=javabin&version=2&command=indexversion} status=0 QTime=0
   [junit4]   2> 246315 INFO  (indexFetcher-757-thread-1) [     ] o.a.s.h.IndexFetcher Master's generation: 1
   [junit4]   2> 246315 INFO  (indexFetcher-757-thread-1) [     ] o.a.s.h.IndexFetcher Master's version: 0
   [junit4]   2> 246315 INFO  (indexFetcher-757-thread-1) [     ] o.a.s.h.IndexFetcher Slave's generation: 3
   [junit4]   2> 24

[...truncated too long message...]

om ZooKeeper... (2) -> (1)
   [junit4]   2> 252894 INFO  (jetty-closer-664-thread-2) [     ] o.a.s.c.Overseer Overseer (id=72338245826773002-127.0.0.1:36503_solr-n_0000000000) closing
   [junit4]   2> 252996 INFO  (jetty-closer-664-thread-2) [     ] o.e.j.s.AbstractConnector Stopped ServerConnector@2e3f9fad{HTTP/1.1,[http/1.1, h2c]}{127.0.0.1:0}
   [junit4]   2> 252997 INFO  (jetty-closer-664-thread-2) [     ] o.e.j.s.h.ContextHandler Stopped o.e.j.s.ServletContextHandler@4e8d6578{/solr,null,UNAVAILABLE}
   [junit4]   2> 252997 INFO  (jetty-closer-664-thread-2) [     ] o.e.j.s.session node0 Stopped scavenging
   [junit4]   2> 253099 INFO  (jetty-closer-664-thread-1) [     ] o.e.j.s.AbstractConnector Stopped ServerConnector@1661952b{HTTP/1.1,[http/1.1, h2c]}{127.0.0.1:0}
   [junit4]   2> 253100 INFO  (jetty-closer-664-thread-1) [     ] o.e.j.s.h.ContextHandler Stopped o.e.j.s.ServletContextHandler@11e1f048{/solr,null,UNAVAILABLE}
   [junit4]   2> 253100 INFO  (jetty-closer-664-thread-1) [     ] o.e.j.s.session node0 Stopped scavenging
   [junit4]   2> 253162 INFO  (jetty-closer-664-thread-3) [     ] o.e.j.s.AbstractConnector Stopped ServerConnector@2f1a36ec{HTTP/1.1,[http/1.1, h2c]}{127.0.0.1:0}
   [junit4]   2> 253163 INFO  (jetty-closer-664-thread-3) [     ] o.e.j.s.h.ContextHandler Stopped o.e.j.s.ServletContextHandler@12d491fa{/solr,null,UNAVAILABLE}
   [junit4]   2> 253163 INFO  (jetty-closer-664-thread-3) [     ] o.e.j.s.session node0 Stopped scavenging
   [junit4]   2> 253165 INFO  (SUITE-TestSnapshotCloudManager-seed#[4FD8CBE766421DBB]-worker) [     ] o.a.s.c.ZkTestServer Shutting down ZkTestServer.
   [junit4]   2> 253369 WARN  (ZkTestServer Run Thread) [     ] o.a.s.c.ZkTestServer Watch limit violations:
   [junit4]   2> Maximum concurrent create/delete watches above limit:
   [junit4]   2>
   [junit4]   2> 7 /solr/clusterprops.json
   [junit4]   2> 7 /solr/aliases.json
   [junit4]   2> 7 /solr/collections/.system/terms/shard1
   [junit4]   2> 3 /solr/configs/.system
   [junit4]   2> 3 /solr/security.json
   [junit4]   2> 3 /solr/configs/.system/managed-schema
   [junit4]   2> 2 /solr/collections/coll1/terms/shard1
   [junit4]   2> 2 /solr/collections/coll10/terms/shard1
   [junit4]   2>
   [junit4]   2> Maximum concurrent data watches above limit:
   [junit4]   2>
   [junit4]   2> 42 /solr/collections/.system/state.json
   [junit4]   2> 14 /solr/collections/coll1/state.json
   [junit4]   2> 12 /solr/collections/coll10/state.json
   [junit4]   2> 7 /solr/clusterstate.json
   [junit4]   2>
   [junit4]   2> Maximum concurrent children watches above limit:
   [junit4]   2>
   [junit4]   2> 46 /solr/overseer/queue
   [junit4]   2> 28 /solr/collections
   [junit4]   2> 26 /solr/live_nodes
   [junit4]   2> 12 /solr/overseer/collection-queue-work
   [junit4]   2>
   [junit4]   2> 253379 INFO  (SUITE-TestSnapshotCloudManager-seed#[4FD8CBE766421DBB]-worker) [     ] o.a.s.c.ZkTestServer waitForServerDown: 127.0.0.1:38627
   [junit4]   2> 253379 INFO  (SUITE-TestSnapshotCloudManager-seed#[4FD8CBE766421DBB]-worker) [     ] o.a.s.c.ZkTestServer parse host and port list: 127.0.0.1:38627
   [junit4]   2> 253379 INFO  (SUITE-TestSnapshotCloudManager-seed#[4FD8CBE766421DBB]-worker) [     ] o.a.s.c.ZkTestServer connecting to 127.0.0.1 38627
   [junit4]   2> NOTE: leaving temporary files on disk at: /home/jenkins/jenkins-slave/workspace/Lucene-Solr-Tests-master/solr/build/solr-core/test/J1/temp/solr.cloud.autoscaling.sim.TestSnapshotCloudManager_4FD8CBE766421DBB-001
   [junit4]   2> Sep 07, 2019 12:53:46 PM com.carrotsearch.randomizedtesting.ThreadLeakControl checkThreadLeaks
   [junit4]   2> WARNING: Will linger awaiting termination of 1 leaked thread(s).
   [junit4]   2> NOTE: test params are: codec=Asserting(Lucene80): {}, docValues:{}, maxPointsInLeafNode=257, maxMBSortInHeap=5.905387258926502, sim=Asserting(org.apache.lucene.search.similarities.AssertingSimilarity@2ea409e1), locale=sr-CS, timezone=America/Goose_Bay
   [junit4]   2> NOTE: Linux 4.15.0-54-generic amd64/Oracle Corporation 11.0.1 (64-bit)/cpus=4,threads=1,free=305861640,total=526385152
   [junit4]   2> NOTE: All tests run in this JVM: [TestCloudRecovery, SolrLogAuditLoggerPluginTest, SolrIndexConfigTest, MaxSizeAutoCommitTest, CategoryRoutedAliasUpdateProcessorTest, SaslZkACLProviderTest, BlockJoinFacetDistribTest, TestRangeQuery, TestApiFramework, TestSurroundQueryParser, DistributedVersionInfoTest, ConfigureRecoveryStrategyTest, HdfsSyncSliceTest, TestAnalyzedSuggestions, TestPartialUpdateDeduplication, TestRecovery, TestDistributedTracing, ConjunctionSolrSpellCheckerTest, TestMinHashQParser, MetricsHistoryHandlerTest, UUIDFieldTest, TestSnapshotCloudManager]
   [junit4] Completed [103/876 (1!)] on J1 in 13.92s, 5 tests, 1 failure <<< FAILURES!

[...truncated 51892 lines...]
-ecj-javadoc-lint-tests:
    [mkdir] Created dir: /tmp/ecj1547775296
 [ecj-lint] Compiling 48 source files to /tmp/ecj1547775296
 [ecj-lint] invalid Class-Path header in manifest of jar file: /home/jenkins/.ivy2/cache/org.restlet.jee/org.restlet/jars/org.restlet-2.3.0.jar
 [ecj-lint] invalid Class-Path header in manifest of jar file: /home/jenkins/.ivy2/cache/org.restlet.jee/org.restlet.ext.servlet/jars/org.restlet.ext.servlet-2.3.0.jar
 [ecj-lint] ----------
 [ecj-lint] 1. ERROR in /home/jenkins/jenkins-slave/workspace/Lucene-Solr-Tests-master/solr/contrib/dataimporthandler/src/test/org/apache/solr/handler/dataimport/MockInitialContextFactory.java (at line 23)
 [ecj-lint] import javax.naming.NamingException;
 [ecj-lint]       ^^^^^^^^^^^^^^^^^^^^^^^^^^^^
 [ecj-lint] The type javax.naming.NamingException is not accessible
 [ecj-lint] ----------
 [ecj-lint] 2. ERROR in /home/jenkins/jenkins-slave/workspace/Lucene-Solr-Tests-master/solr/contrib/dataimporthandler/src/test/org/apache/solr/handler/dataimport/MockInitialContextFactory.java (at line 28)
 [ecj-lint] public class MockInitialContextFactory implements InitialContextFactory {
 [ecj-lint]             ^^^^^^^^^^^^^^^^^^^^^^^^^
 [ecj-lint] The type MockInitialContextFactory must implement the inherited abstract method InitialContextFactory.getInitialContext(Hashtable<?,?>)
 [ecj-lint] ----------
 [ecj-lint] 3. ERROR in /home/jenkins/jenkins-slave/workspace/Lucene-Solr-Tests-master/solr/contrib/dataimporthandler/src/test/org/apache/solr/handler/dataimport/MockInitialContextFactory.java (at line 30)
 [ecj-lint] private final javax.naming.Context context;
 [ecj-lint]              ^^^^^^^^^^^^^^^^^^^^
 [ecj-lint] The type javax.naming.Context is not accessible
 [ecj-lint] ----------
 [ecj-lint] 4. ERROR in /home/jenkins/jenkins-slave/workspace/Lucene-Solr-Tests-master/solr/contrib/dataimporthandler/src/test/org/apache/solr/handler/dataimport/MockInitialContextFactory.java (at line 33)
 [ecj-lint] context = mock(javax.naming.Context.class);
 [ecj-lint] ^^^^^^^
 [ecj-lint] context cannot be resolved to a variable
 [ecj-lint] ----------
 [ecj-lint] 5. ERROR in /home/jenkins/jenkins-slave/workspace/Lucene-Solr-Tests-master/solr/contrib/dataimporthandler/src/test/org/apache/solr/handler/dataimport/MockInitialContextFactory.java (at line 33)
 [ecj-lint] context = mock(javax.naming.Context.class);
 [ecj-lint]               ^^^^^^^^^^^^^^^^^^^^
 [ecj-lint] The type javax.naming.Context is not accessible
 [ecj-lint] ----------
 [ecj-lint] 6. ERROR in /home/jenkins/jenkins-slave/workspace/Lucene-Solr-Tests-master/solr/contrib/dataimporthandler/src/test/org/apache/solr/handler/dataimport/MockInitialContextFactory.java (at line 36)
 [ecj-lint] when(context.lookup(anyString())).thenAnswer(invocation -> objects.get(invocation.getArgument(0)));
 [ecj-lint]     ^^^^^^^
 [ecj-lint] context cannot be resolved
 [ecj-lint] ----------
 [ecj-lint] 7. ERROR in /home/jenkins/jenkins-slave/workspace/Lucene-Solr-Tests-master/solr/contrib/dataimporthandler/src/test/org/apache/solr/handler/dataimport/MockInitialContextFactory.java (at line 38)
 [ecj-lint] } catch (NamingException e) {
 [ecj-lint]         ^^^^^^^^^^^^^^^
 [ecj-lint] NamingException cannot be resolved to a type
 [ecj-lint] ----------
 [ecj-lint] 8. ERROR in /home/jenkins/jenkins-slave/workspace/Lucene-Solr-Tests-master/solr/contrib/dataimporthandler/src/test/org/apache/solr/handler/dataimport/MockInitialContextFactory.java (at line 45)
 [ecj-lint] public javax.naming.Context getInitialContext(Hashtable env) {
 [ecj-lint]       ^^^^^^^^^^^^^^^^^^^^
 [ecj-lint] The type javax.naming.Context is not accessible
 [ecj-lint] ----------
 [ecj-lint] 9. ERROR in /home/jenkins/jenkins-slave/workspace/Lucene-Solr-Tests-master/solr/contrib/dataimporthandler/src/test/org/apache/solr/handler/dataimport/MockInitialContextFactory.java (at line 46)
 [ecj-lint] return context;
 [ecj-lint]       ^^^^^^^
 [ecj-lint] context cannot be resolved to a variable
 [ecj-lint] ----------
 [ecj-lint] 9 problems (9 errors)

BUILD FAILED
/home/jenkins/jenkins-slave/workspace/Lucene-Solr-Tests-master/build.xml:634: The following error occurred while executing this line:
/home/jenkins/jenkins-slave/workspace/Lucene-Solr-Tests-master/build.xml:101: The following error occurred while executing this line:
/home/jenkins/jenkins-slave/workspace/Lucene-Solr-Tests-master/solr/build.xml:651: The following error occurred while executing this line:
/home/jenkins/jenkins-slave/workspace/Lucene-Solr-Tests-master/solr/common-build.xml:479: The following error occurred while executing this line:
/home/jenkins/jenkins-slave/workspace/Lucene-Solr-Tests-master/lucene/common-build.xml:2015: The following error occurred while executing this line:
/home/jenkins/jenkins-slave/workspace/Lucene-Solr-Tests-master/lucene/common-build.xml:2048: Compile failed; see the compiler error output for details.

Total time: 103 minutes 56 seconds
Build step 'Invoke Ant' marked build as failure
Archiving artifacts
Recording test results
Email was triggered for: Failure - Any
Sending email for trigger: Failure - Any


---------------------------------------------------------------------
To unsubscribe, e-mail: [hidden email]
For additional commands, e-mail: [hidden email]
Reply | Threaded
Open this post in threaded view
|

[JENKINS] Lucene-Solr-Tests-master - Build # 3693 - Unstable

Apache Jenkins Server-2
Build: https://builds.apache.org/job/Lucene-Solr-Tests-master/3693/

1 tests failed.
FAILED:  org.apache.solr.cloud.CloudExitableDirectoryReaderTest.test

Error Message:
Time allowed to handle this request exceeded

Stack Trace:
org.apache.solr.client.solrj.SolrServerException: Time allowed to handle this request exceeded
        at __randomizedtesting.SeedInfo.seed([A714B89C7B9BD09A:2F408746D567BD62]:0)
        at org.apache.solr.client.solrj.impl.LBSolrClient.request(LBSolrClient.java:343)
        at org.apache.solr.client.solrj.impl.BaseCloudSolrClient.sendRequest(BaseCloudSolrClient.java:1128)
        at org.apache.solr.client.solrj.impl.BaseCloudSolrClient.requestWithRetryOnStaleState(BaseCloudSolrClient.java:897)
        at org.apache.solr.client.solrj.impl.BaseCloudSolrClient.request(BaseCloudSolrClient.java:829)
        at org.apache.solr.client.solrj.SolrRequest.process(SolrRequest.java:207)
        at org.apache.solr.client.solrj.SolrClient.query(SolrClient.java:987)
        at org.apache.solr.cloud.CloudExitableDirectoryReaderTest.assertPartialResults(CloudExitableDirectoryReaderTest.java:263)
        at org.apache.solr.cloud.CloudExitableDirectoryReaderTest.assertPartialResults(CloudExitableDirectoryReaderTest.java:259)
        at org.apache.solr.cloud.CloudExitableDirectoryReaderTest.test(CloudExitableDirectoryReaderTest.java:117)
        at java.base/jdk.internal.reflect.NativeMethodAccessorImpl.invoke0(Native Method)
        at java.base/jdk.internal.reflect.NativeMethodAccessorImpl.invoke(NativeMethodAccessorImpl.java:62)
        at java.base/jdk.internal.reflect.DelegatingMethodAccessorImpl.invoke(DelegatingMethodAccessorImpl.java:43)
        at java.base/java.lang.reflect.Method.invoke(Method.java:566)
        at com.carrotsearch.randomizedtesting.RandomizedRunner.invoke(RandomizedRunner.java:1750)
        at com.carrotsearch.randomizedtesting.RandomizedRunner$8.evaluate(RandomizedRunner.java:938)
        at com.carrotsearch.randomizedtesting.RandomizedRunner$9.evaluate(RandomizedRunner.java:974)
        at com.carrotsearch.randomizedtesting.RandomizedRunner$10.evaluate(RandomizedRunner.java:988)
        at com.carrotsearch.randomizedtesting.rules.SystemPropertiesRestoreRule$1.evaluate(SystemPropertiesRestoreRule.java:57)
        at org.apache.lucene.util.TestRuleSetupTeardownChained$1.evaluate(TestRuleSetupTeardownChained.java:49)
        at org.apache.lucene.util.AbstractBeforeAfterRule$1.evaluate(AbstractBeforeAfterRule.java:45)
        at org.apache.lucene.util.TestRuleThreadAndTestName$1.evaluate(TestRuleThreadAndTestName.java:48)
        at org.apache.lucene.util.TestRuleIgnoreAfterMaxFailures$1.evaluate(TestRuleIgnoreAfterMaxFailures.java:64)
        at org.apache.lucene.util.TestRuleMarkFailure$1.evaluate(TestRuleMarkFailure.java:47)
        at com.carrotsearch.randomizedtesting.rules.StatementAdapter.evaluate(StatementAdapter.java:36)
        at com.carrotsearch.randomizedtesting.ThreadLeakControl$StatementRunner.run(ThreadLeakControl.java:368)
        at com.carrotsearch.randomizedtesting.ThreadLeakControl.forkTimeoutingTask(ThreadLeakControl.java:817)
        at com.carrotsearch.randomizedtesting.ThreadLeakControl$3.evaluate(ThreadLeakControl.java:468)
        at com.carrotsearch.randomizedtesting.RandomizedRunner.runSingleTest(RandomizedRunner.java:947)
        at com.carrotsearch.randomizedtesting.RandomizedRunner$5.evaluate(RandomizedRunner.java:832)
        at com.carrotsearch.randomizedtesting.RandomizedRunner$6.evaluate(RandomizedRunner.java:883)
        at com.carrotsearch.randomizedtesting.RandomizedRunner$7.evaluate(RandomizedRunner.java:894)
        at com.carrotsearch.randomizedtesting.rules.StatementAdapter.evaluate(StatementAdapter.java:36)
        at com.carrotsearch.randomizedtesting.rules.SystemPropertiesRestoreRule$1.evaluate(SystemPropertiesRestoreRule.java:57)
        at org.apache.lucene.util.AbstractBeforeAfterRule$1.evaluate(AbstractBeforeAfterRule.java:45)
        at com.carrotsearch.randomizedtesting.rules.StatementAdapter.evaluate(StatementAdapter.java:36)
        at org.apache.lucene.util.TestRuleStoreClassName$1.evaluate(TestRuleStoreClassName.java:41)
        at com.carrotsearch.randomizedtesting.rules.NoShadowingOrOverridesOnMethodsRule$1.evaluate(NoShadowingOrOverridesOnMethodsRule.java:40)
        at com.carrotsearch.randomizedtesting.rules.NoShadowingOrOverridesOnMethodsRule$1.evaluate(NoShadowingOrOverridesOnMethodsRule.java:40)
        at com.carrotsearch.randomizedtesting.rules.StatementAdapter.evaluate(StatementAdapter.java:36)
        at com.carrotsearch.randomizedtesting.rules.StatementAdapter.evaluate(StatementAdapter.java:36)
        at org.apache.lucene.util.TestRuleAssertionsRequired$1.evaluate(TestRuleAssertionsRequired.java:53)
        at org.apache.lucene.util.TestRuleMarkFailure$1.evaluate(TestRuleMarkFailure.java:47)
        at org.apache.lucene.util.TestRuleIgnoreAfterMaxFailures$1.evaluate(TestRuleIgnoreAfterMaxFailures.java:64)
        at org.apache.lucene.util.TestRuleIgnoreTestSuites$1.evaluate(TestRuleIgnoreTestSuites.java:54)
        at com.carrotsearch.randomizedtesting.rules.StatementAdapter.evaluate(StatementAdapter.java:36)
        at com.carrotsearch.randomizedtesting.ThreadLeakControl$StatementRunner.run(ThreadLeakControl.java:368)
        at java.base/java.lang.Thread.run(Thread.java:834)




Build Log:
[...truncated 14340 lines...]
   [junit4] Suite: org.apache.solr.cloud.CloudExitableDirectoryReaderTest
   [junit4]   2> 1693438 INFO  (SUITE-CloudExitableDirectoryReaderTest-seed#[A714B89C7B9BD09A]-worker) [     ] o.a.s.SolrTestCaseJ4 Created dataDir: /home/jenkins/jenkins-slave/workspace/Lucene-Solr-Tests-master/solr/build/solr-core/test/J1/temp/solr.cloud.CloudExitableDirectoryReaderTest_A714B89C7B9BD09A-001/data-dir-129-001
   [junit4]   2> 1693439 WARN  (SUITE-CloudExitableDirectoryReaderTest-seed#[A714B89C7B9BD09A]-worker) [     ] o.a.s.SolrTestCaseJ4 startTrackingSearchers: numOpens=2 numCloses=2
   [junit4]   2> 1693439 INFO  (SUITE-CloudExitableDirectoryReaderTest-seed#[A714B89C7B9BD09A]-worker) [     ] o.a.s.SolrTestCaseJ4 Using PointFields (NUMERIC_POINTS_SYSPROP=true) w/NUMERIC_DOCVALUES_SYSPROP=false
   [junit4]   2> 1693439 INFO  (SUITE-CloudExitableDirectoryReaderTest-seed#[A714B89C7B9BD09A]-worker) [     ] o.a.s.SolrTestCaseJ4 Randomized ssl (false) and clientAuth (false) via: @org.apache.solr.util.RandomizeSSL(reason="", ssl=0.0/0.0, value=0.0/0.0, clientAuth=0.0/0.0)
   [junit4]   2> 1693439 INFO  (SUITE-CloudExitableDirectoryReaderTest-seed#[A714B89C7B9BD09A]-worker) [     ] o.a.s.SolrTestCaseJ4 SecureRandom sanity checks: test.solr.allowed.securerandom=null & java.security.egd=file:/dev/./urandom
   [junit4]   2> 1693440 INFO  (SUITE-CloudExitableDirectoryReaderTest-seed#[A714B89C7B9BD09A]-worker) [     ] o.a.s.c.MiniSolrCloudCluster Starting cluster of 2 servers in /home/jenkins/jenkins-slave/workspace/Lucene-Solr-Tests-master/solr/build/solr-core/test/J1/temp/solr.cloud.CloudExitableDirectoryReaderTest_A714B89C7B9BD09A-001/tempDir-001
   [junit4]   2> 1693440 INFO  (SUITE-CloudExitableDirectoryReaderTest-seed#[A714B89C7B9BD09A]-worker) [     ] o.a.s.c.ZkTestServer STARTING ZK TEST SERVER
   [junit4]   2> 1693441 INFO  (ZkTestServer Run Thread) [     ] o.a.s.c.ZkTestServer client port:0.0.0.0/0.0.0.0:0
   [junit4]   2> 1693441 INFO  (ZkTestServer Run Thread) [     ] o.a.s.c.ZkTestServer Starting server
   [junit4]   2> 1693547 INFO  (SUITE-CloudExitableDirectoryReaderTest-seed#[A714B89C7B9BD09A]-worker) [     ] o.a.s.c.ZkTestServer start zk server on port:38870
   [junit4]   2> 1693547 INFO  (SUITE-CloudExitableDirectoryReaderTest-seed#[A714B89C7B9BD09A]-worker) [     ] o.a.s.c.ZkTestServer waitForServerUp: 127.0.0.1:38870
   [junit4]   2> 1693547 INFO  (SUITE-CloudExitableDirectoryReaderTest-seed#[A714B89C7B9BD09A]-worker) [     ] o.a.s.c.ZkTestServer parse host and port list: 127.0.0.1:38870
   [junit4]   2> 1693547 INFO  (SUITE-CloudExitableDirectoryReaderTest-seed#[A714B89C7B9BD09A]-worker) [     ] o.a.s.c.ZkTestServer connecting to 127.0.0.1 38870
   [junit4]   2> 1693640 INFO  (SUITE-CloudExitableDirectoryReaderTest-seed#[A714B89C7B9BD09A]-worker) [     ] o.a.s.c.c.ConnectionManager Waiting for client to connect to ZooKeeper
   [junit4]   2> 1693782 INFO  (zkConnectionManagerCallback-3765-thread-1) [     ] o.a.s.c.c.ConnectionManager zkClient has connected
   [junit4]   2> 1693782 INFO  (SUITE-CloudExitableDirectoryReaderTest-seed#[A714B89C7B9BD09A]-worker) [     ] o.a.s.c.c.ConnectionManager Client is connected to ZooKeeper
   [junit4]   2> 1693985 INFO  (SUITE-CloudExitableDirectoryReaderTest-seed#[A714B89C7B9BD09A]-worker) [     ] o.a.s.c.c.ConnectionManager Waiting for client to connect to ZooKeeper
   [junit4]   2> 1694001 INFO  (zkConnectionManagerCallback-3767-thread-1) [     ] o.a.s.c.c.ConnectionManager zkClient has connected
   [junit4]   2> 1694001 INFO  (SUITE-CloudExitableDirectoryReaderTest-seed#[A714B89C7B9BD09A]-worker) [     ] o.a.s.c.c.ConnectionManager Client is connected to ZooKeeper
   [junit4]   2> 1694037 INFO  (SUITE-CloudExitableDirectoryReaderTest-seed#[A714B89C7B9BD09A]-worker) [     ] o.a.s.c.c.ConnectionManager Waiting for client to connect to ZooKeeper
   [junit4]   2> 1694074 INFO  (zkConnectionManagerCallback-3769-thread-1) [     ] o.a.s.c.c.ConnectionManager zkClient has connected
   [junit4]   2> 1694074 INFO  (SUITE-CloudExitableDirectoryReaderTest-seed#[A714B89C7B9BD09A]-worker) [     ] o.a.s.c.c.ConnectionManager Client is connected to ZooKeeper
   [junit4]   2> 1694278 WARN  (jetty-launcher-3770-thread-1) [     ] o.e.j.s.AbstractConnector Ignoring deprecated socket close linger time
   [junit4]   2> 1694279 INFO  (jetty-launcher-3770-thread-1) [     ] o.a.s.c.s.e.JettySolrRunner Start Jetty (original configured port=0)
   [junit4]   2> 1694279 INFO  (jetty-launcher-3770-thread-1) [     ] o.a.s.c.s.e.JettySolrRunner Trying to start Jetty on port 0 try number 1 ...
   [junit4]   2> 1694279 INFO  (jetty-launcher-3770-thread-1) [     ] o.e.j.s.Server jetty-9.4.19.v20190610; built: 2019-06-10T16:30:51.723Z; git: afcf563148970e98786327af5e07c261fda175d3; jvm 11.0.1+13-LTS
   [junit4]   2> 1694297 WARN  (jetty-launcher-3770-thread-2) [     ] o.e.j.s.AbstractConnector Ignoring deprecated socket close linger time
   [junit4]   2> 1694297 INFO  (jetty-launcher-3770-thread-2) [     ] o.a.s.c.s.e.JettySolrRunner Start Jetty (original configured port=0)
   [junit4]   2> 1694297 INFO  (jetty-launcher-3770-thread-2) [     ] o.a.s.c.s.e.JettySolrRunner Trying to start Jetty on port 0 try number 1 ...
   [junit4]   2> 1694297 INFO  (jetty-launcher-3770-thread-2) [     ] o.e.j.s.Server jetty-9.4.19.v20190610; built: 2019-06-10T16:30:51.723Z; git: afcf563148970e98786327af5e07c261fda175d3; jvm 11.0.1+13-LTS
   [junit4]   2> 1694345 INFO  (jetty-launcher-3770-thread-1) [     ] o.e.j.s.session DefaultSessionIdManager workerName=node0
   [junit4]   2> 1694345 INFO  (jetty-launcher-3770-thread-1) [     ] o.e.j.s.session No SessionScavenger set, using defaults
   [junit4]   2> 1694346 INFO  (jetty-launcher-3770-thread-1) [     ] o.e.j.s.session node0 Scavenging every 600000ms
   [junit4]   2> 1694346 INFO  (jetty-launcher-3770-thread-1) [     ] o.e.j.s.h.ContextHandler Started o.e.j.s.ServletContextHandler@13d1a8a2{/solr,null,AVAILABLE}
   [junit4]   2> 1694378 INFO  (jetty-launcher-3770-thread-1) [     ] o.e.j.s.AbstractConnector Started ServerConnector@3f801731{HTTP/1.1,[http/1.1, h2c]}{127.0.0.1:38987}
   [junit4]   2> 1694378 INFO  (jetty-launcher-3770-thread-1) [     ] o.e.j.s.Server Started @1694628ms
   [junit4]   2> 1694378 INFO  (jetty-launcher-3770-thread-1) [     ] o.a.s.c.s.e.JettySolrRunner Jetty properties: {hostContext=/solr, hostPort=38987}
   [junit4]   2> 1694378 ERROR (jetty-launcher-3770-thread-1) [     ] o.a.s.u.StartupLoggingUtils Missing Java Option solr.log.dir. Logging may be missing or incomplete.
   [junit4]   2> 1694378 INFO  (jetty-launcher-3770-thread-1) [     ] o.a.s.s.SolrDispatchFilter Using logger factory org.apache.logging.slf4j.Log4jLoggerFactory
   [junit4]   2> 1694378 INFO  (jetty-launcher-3770-thread-1) [     ] o.a.s.s.SolrDispatchFilter  ___      _       Welcome to Apache Solr? version 9.0.0
   [junit4]   2> 1694378 INFO  (jetty-launcher-3770-thread-1) [     ] o.a.s.s.SolrDispatchFilter / __| ___| |_ _   Starting in cloud mode on port null
   [junit4]   2> 1694378 INFO  (jetty-launcher-3770-thread-1) [     ] o.a.s.s.SolrDispatchFilter \__ \/ _ \ | '_|  Install dir: null
   [junit4]   2> 1694378 INFO  (jetty-launcher-3770-thread-1) [     ] o.a.s.s.SolrDispatchFilter |___/\___/_|_|    Start time: 2019-09-07T16:27:27.918758Z
   [junit4]   2> 1694422 INFO  (jetty-launcher-3770-thread-1) [     ] o.a.s.c.c.ConnectionManager Waiting for client to connect to ZooKeeper
   [junit4]   2> 1694475 INFO  (zkConnectionManagerCallback-3772-thread-1) [     ] o.a.s.c.c.ConnectionManager zkClient has connected
   [junit4]   2> 1694476 INFO  (jetty-launcher-3770-thread-1) [     ] o.a.s.c.c.ConnectionManager Client is connected to ZooKeeper
   [junit4]   2> 1694477 INFO  (jetty-launcher-3770-thread-1) [     ] o.a.s.s.SolrDispatchFilter solr.xml found in ZooKeeper. Loading...
   [junit4]   2> 1694479 INFO  (jetty-launcher-3770-thread-2) [     ] o.e.j.s.session DefaultSessionIdManager workerName=node0
   [junit4]   2> 1694479 INFO  (jetty-launcher-3770-thread-2) [     ] o.e.j.s.session No SessionScavenger set, using defaults
   [junit4]   2> 1694479 INFO  (jetty-launcher-3770-thread-2) [     ] o.e.j.s.session node0 Scavenging every 600000ms
   [junit4]   2> 1694593 INFO  (jetty-launcher-3770-thread-2) [     ] o.e.j.s.h.ContextHandler Started o.e.j.s.ServletContextHandler@34dc0e1f{/solr,null,AVAILABLE}
   [junit4]   2> 1694605 INFO  (jetty-launcher-3770-thread-2) [     ] o.e.j.s.AbstractConnector Started ServerConnector@40b6c62e{HTTP/1.1,[http/1.1, h2c]}{127.0.0.1:44495}
   [junit4]   2> 1694605 INFO  (jetty-launcher-3770-thread-2) [     ] o.e.j.s.Server Started @1694855ms
   [junit4]   2> 1694605 INFO  (jetty-launcher-3770-thread-2) [     ] o.a.s.c.s.e.JettySolrRunner Jetty properties: {hostContext=/solr, hostPort=44495}
   [junit4]   2> 1694605 ERROR (jetty-launcher-3770-thread-2) [     ] o.a.s.u.StartupLoggingUtils Missing Java Option solr.log.dir. Logging may be missing or incomplete.
   [junit4]   2> 1694605 INFO  (jetty-launcher-3770-thread-2) [     ] o.a.s.s.SolrDispatchFilter Using logger factory org.apache.logging.slf4j.Log4jLoggerFactory
   [junit4]   2> 1694605 INFO  (jetty-launcher-3770-thread-2) [     ] o.a.s.s.SolrDispatchFilter  ___      _       Welcome to Apache Solr? version 9.0.0
   [junit4]   2> 1694605 INFO  (jetty-launcher-3770-thread-2) [     ] o.a.s.s.SolrDispatchFilter / __| ___| |_ _   Starting in cloud mode on port null
   [junit4]   2> 1694605 INFO  (jetty-launcher-3770-thread-2) [     ] o.a.s.s.SolrDispatchFilter \__ \/ _ \ | '_|  Install dir: null
   [junit4]   2> 1694605 INFO  (jetty-launcher-3770-thread-2) [     ] o.a.s.s.SolrDispatchFilter |___/\___/_|_|    Start time: 2019-09-07T16:27:28.145627Z
   [junit4]   2> 1694657 INFO  (jetty-launcher-3770-thread-2) [     ] o.a.s.c.c.ConnectionManager Waiting for client to connect to ZooKeeper
   [junit4]   2> 1694694 INFO  (zkConnectionManagerCallback-3774-thread-1) [     ] o.a.s.c.c.ConnectionManager zkClient has connected
   [junit4]   2> 1694694 INFO  (jetty-launcher-3770-thread-2) [     ] o.a.s.c.c.ConnectionManager Client is connected to ZooKeeper
   [junit4]   2> 1694714 INFO  (jetty-launcher-3770-thread-2) [     ] o.a.s.s.SolrDispatchFilter solr.xml found in ZooKeeper. Loading...
   [junit4]   2> 1695258 INFO  (jetty-launcher-3770-thread-1) [     ] o.a.s.h.c.HttpShardHandlerFactory Host whitelist initialized: WhitelistHostChecker [whitelistHosts=null, whitelistHostCheckingEnabled=true]
   [junit4]   2> 1695278 WARN  (jetty-launcher-3770-thread-1) [     ] o.e.j.u.s.S.config Trusting all certificates configured for Client@65487d1c[provider=null,keyStore=null,trustStore=null]
   [junit4]   2> 1695278 WARN  (jetty-launcher-3770-thread-1) [     ] o.e.j.u.s.S.config No Client EndPointIdentificationAlgorithm configured for Client@65487d1c[provider=null,keyStore=null,trustStore=null]
   [junit4]   2> 1695281 WARN  (jetty-launcher-3770-thread-1) [     ] o.e.j.u.s.S.config Trusting all certificates configured for Client@2ea0abb3[provider=null,keyStore=null,trustStore=null]
   [junit4]   2> 1695281 WARN  (jetty-launcher-3770-thread-1) [     ] o.e.j.u.s.S.config No Client EndPointIdentificationAlgorithm configured for Client@2ea0abb3[provider=null,keyStore=null,trustStore=null]
   [junit4]   2> 1695296 INFO  (jetty-launcher-3770-thread-1) [     ] o.a.s.c.ZkContainer Zookeeper client=127.0.0.1:38870/solr
   [junit4]   2> 1695348 INFO  (jetty-launcher-3770-thread-2) [     ] o.a.s.h.c.HttpShardHandlerFactory Host whitelist initialized: WhitelistHostChecker [whitelistHosts=null, whitelistHostCheckingEnabled=true]
   [junit4]   2> 1695350 INFO  (jetty-launcher-3770-thread-1) [     ] o.a.s.c.c.ConnectionManager Waiting for client to connect to ZooKeeper
   [junit4]   2> 1695611 WARN  (jetty-launcher-3770-thread-2) [     ] o.e.j.u.s.S.config Trusting all certificates configured for Client@7cf63ebd[provider=null,keyStore=null,trustStore=null]
   [junit4]   2> 1695611 WARN  (jetty-launcher-3770-thread-2) [     ] o.e.j.u.s.S.config No Client EndPointIdentificationAlgorithm configured for Client@7cf63ebd[provider=null,keyStore=null,trustStore=null]
   [junit4]   2> 1695655 WARN  (jetty-launcher-3770-thread-2) [     ] o.e.j.u.s.S.config Trusting all certificates configured for Client@645b2062[provider=null,keyStore=null,trustStore=null]
   [junit4]   2> 1695655 WARN  (jetty-launcher-3770-thread-2) [     ] o.e.j.u.s.S.config No Client EndPointIdentificationAlgorithm configured for Client@645b2062[provider=null,keyStore=null,trustStore=null]
   [junit4]   2> 1695656 INFO  (jetty-launcher-3770-thread-2) [     ] o.a.s.c.ZkContainer Zookeeper client=127.0.0.1:38870/solr
   [junit4]   2> 1695657 INFO  (jetty-launcher-3770-thread-2) [     ] o.a.s.c.c.ConnectionManager Waiting for client to connect to ZooKeeper
   [junit4]   2> 1695666 INFO  (zkConnectionManagerCallback-3782-thread-1) [     ] o.a.s.c.c.ConnectionManager zkClient has connected
   [junit4]   2> 1695666 INFO  (jetty-launcher-3770-thread-1) [     ] o.a.s.c.c.ConnectionManager Client is connected to ZooKeeper
   [junit4]   2> 1695671 INFO  (zkConnectionManagerCallback-3788-thread-1) [     ] o.a.s.c.c.ConnectionManager zkClient has connected
   [junit4]   2> 1695671 INFO  (jetty-launcher-3770-thread-2) [     ] o.a.s.c.c.ConnectionManager Client is connected to ZooKeeper
   [junit4]   2> 1695793 INFO  (jetty-launcher-3770-thread-2) [n:127.0.0.1:44495_solr     ] o.a.s.c.c.ConnectionManager Waiting for client to connect to ZooKeeper
   [junit4]   2> 1695794 INFO  (zkConnectionManagerCallback-3790-thread-1) [     ] o.a.s.c.c.ConnectionManager zkClient has connected
   [junit4]   2> 1695794 INFO  (jetty-launcher-3770-thread-2) [n:127.0.0.1:44495_solr     ] o.a.s.c.c.ConnectionManager Client is connected to ZooKeeper
   [junit4]   2> 1695809 INFO  (jetty-launcher-3770-thread-1) [n:127.0.0.1:38987_solr     ] o.a.s.c.c.ConnectionManager Waiting for client to connect to ZooKeeper
   [junit4]   2> 1695861 INFO  (zkConnectionManagerCallback-3792-thread-1) [     ] o.a.s.c.c.ConnectionManager zkClient has connected
   [junit4]   2> 1695861 INFO  (jetty-launcher-3770-thread-1) [n:127.0.0.1:38987_solr     ] o.a.s.c.c.ConnectionManager Client is connected to ZooKeeper
   [junit4]   2> 1696653 INFO  (jetty-launcher-3770-thread-1) [n:127.0.0.1:38987_solr     ] o.a.s.c.OverseerElectionContext I am going to be the leader 127.0.0.1:38987_solr
   [junit4]   2> 1696654 INFO  (jetty-launcher-3770-thread-1) [n:127.0.0.1:38987_solr     ] o.a.s.c.Overseer Overseer (id=75348225278869512-127.0.0.1:38987_solr-n_0000000000) starting
   [junit4]   2> 1696716 INFO  (jetty-launcher-3770-thread-2) [n:127.0.0.1:44495_solr     ] o.a.s.c.ZkController Register node as live in ZooKeeper:/live_nodes/127.0.0.1:44495_solr
   [junit4]   2> 1696719 INFO  (zkCallback-3791-thread-1) [     ] o.a.s.c.c.ZkStateReader Updated live nodes from ZooKeeper... (0) -> (1)
   [junit4]   2> 1696781 INFO  (jetty-launcher-3770-thread-2) [n:127.0.0.1:44495_solr     ] o.a.s.c.c.ConnectionManager Waiting for client to connect to ZooKeeper
   [junit4]   2> 1696811 INFO  (jetty-launcher-3770-thread-1) [n:127.0.0.1:38987_solr     ] o.a.s.c.c.ConnectionManager Waiting for client to connect to ZooKeeper
   [junit4]   2> 1696825 INFO  (zkCallback-3789-thread-1) [     ] o.a.s.c.c.ZkStateReader Updated live nodes from ZooKeeper... (0) -> (1)
   [junit4]   2> 1696862 INFO  (zkConnectionManagerCallback-3806-thread-1) [     ] o.a.s.c.c.ConnectionManager zkClient has connected
   [junit4]   2> 1696862 INFO  (jetty-launcher-3770-thread-1) [n:127.0.0.1:38987_solr     ] o.a.s.c.c.ConnectionManager Client is connected to ZooKeeper
   [junit4]   2> 1696870 INFO  (zkConnectionManagerCallback-3801-thread-1) [     ] o.a.s.c.c.ConnectionManager zkClient has connected
   [junit4]   2> 1696870 INFO  (jetty-launcher-3770-thread-2) [n:127.0.0.1:44495_solr     ] o.a.s.c.c.ConnectionManager Client is connected to ZooKeeper
   [junit4]   2> 1696891 INFO  (jetty-launcher-3770-thread-2) [n:127.0.0.1:44495_solr     ] o.a.s.c.c.ZkStateReader Updated live nodes from ZooKeeper... (0) -> (1)
   [junit4]   2> 1696892 INFO  (jetty-launcher-3770-thread-2) [n:127.0.0.1:44495_solr     ] o.a.s.c.s.i.ZkClientClusterStateProvider Cluster at 127.0.0.1:38870/solr ready
   [junit4]   2> 1696892 INFO  (jetty-launcher-3770-thread-2) [n:127.0.0.1:44495_solr     ] o.a.s.c.PackageManager clusterprops.json changed , version -1
   [junit4]   2> 1696963 INFO  (jetty-launcher-3770-thread-1) [n:127.0.0.1:38987_solr     ] o.a.s.c.c.ZkStateReader Updated live nodes from ZooKeeper... (0) -> (1)
   [junit4]   2> 1696988 INFO  (jetty-launcher-3770-thread-1) [n:127.0.0.1:38987_solr     ] o.a.s.c.s.i.ZkClientClusterStateProvider Cluster at 127.0.0.1:38870/solr ready
   [junit4]   2> 1696989 INFO  (OverseerStateUpdate-75348225278869512-127.0.0.1:38987_solr-n_0000000000) [n:127.0.0.1:38987_solr     ] o.a.s.c.Overseer Starting to work on the main queue : 127.0.0.1:38987_solr
   [junit4]   2> 1697009 INFO  (jetty-launcher-3770-thread-1) [n:127.0.0.1:38987_solr     ] o.a.s.c.ZkController Publish node=127.0.0.1:38987_solr as DOWN
   [junit4]   2> 1697011 INFO  (jetty-launcher-3770-thread-1) [n:127.0.0.1:38987_solr     ] o.a.s.c.TransientSolrCoreCacheDefault Allocating transient cache for 2147483647 transient cores
   [junit4]   2> 1697011 INFO  (jetty-launcher-3770-thread-1) [n:127.0.0.1:38987_solr     ] o.a.s.c.ZkController Register node as live in ZooKeeper:/live_nodes/127.0.0.1:38987_solr
   [junit4]   2> 1697029 INFO  (zkCallback-3791-thread-1) [     ] o.a.s.c.c.ZkStateReader Updated live nodes from ZooKeeper... (1) -> (2)
   [junit4]   2> 1697030 INFO  (jetty-launcher-3770-thread-1) [n:127.0.0.1:38987_solr     ] o.a.s.c.PackageManager clusterprops.json changed , version -1
   [junit4]   2> 1697031 INFO  (zkCallback-3805-thread-1) [     ] o.a.s.c.c.ZkStateReader Updated live nodes from ZooKeeper... (1) -> (2)
   [junit4]   2> 1697044 INFO  (zkCallback-3800-thread-1) [     ] o.a.s.c.c.ZkStateReader Updated live nodes from ZooKeeper... (1) -> (2)
   [junit4]   2> 1697045 INFO  (zkCallback-3789-thread-1) [     ] o.a.s.c.c.ZkStateReader Updated live nodes from ZooKeeper... (1) -> (2)
   [junit4]   2> 1697090 INFO  (jetty-launcher-3770-thread-2) [n:127.0.0.1:44495_solr     ] o.a.s.h.a.MetricsHistoryHandler No .system collection, keeping metrics history in memory.
   [junit4]   2> 1697277 INFO  (jetty-launcher-3770-thread-1) [n:127.0.0.1:38987_solr     ] o.a.s.h.a.MetricsHistoryHandler No .system collection, keeping metrics history in memory.
   [junit4]   2> 1697310 INFO  (jetty-launcher-3770-thread-2) [n:127.0.0.1:44495_solr     ] o.a.s.m.r.SolrJmxReporter JMX monitoring for 'solr_44495.solr.node' (registry 'solr.node') enabled at server: com.sun.jmx.mbeanserver.JmxMBeanServer@3b30ab1f
   [junit4]   2> 1697480 INFO  (jetty-launcher-3770-thread-2) [n:127.0.0.1:44495_solr     ] o.a.s.m.r.SolrJmxReporter JMX monitoring for 'solr_44495.solr.jvm' (registry 'solr.jvm') enabled at server: com.sun.jmx.mbeanserver.JmxMBeanServer@3b30ab1f
   [junit4]   2> 1697480 INFO  (jetty-launcher-3770-thread-2) [n:127.0.0.1:44495_solr     ] o.a.s.m.r.SolrJmxReporter JMX monitoring for 'solr_44495.solr.jetty' (registry 'solr.jetty') enabled at server: com.sun.jmx.mbeanserver.JmxMBeanServer@3b30ab1f
   [junit4]   2> 1697481 INFO  (jetty-launcher-3770-thread-2) [n:127.0.0.1:44495_solr     ] o.a.s.c.CorePropertiesLocator Found 0 core definitions underneath /home/jenkins/jenkins-slave/workspace/Lucene-Solr-Tests-master/solr/build/solr-core/test/J1/temp/solr.cloud.CloudExitableDirectoryReaderTest_A714B89C7B9BD09A-001/tempDir-001/node2/.
   [junit4]   2> 1697682 INFO  (jetty-launcher-3770-thread-1) [n:127.0.0.1:38987_solr     ] o.a.s.m.r.SolrJmxReporter JMX monitoring for 'solr_38987.solr.node' (registry 'solr.node') enabled at server: com.sun.jmx.mbeanserver.JmxMBeanServer@3b30ab1f
   [junit4]   2> 1697756 INFO  (jetty-launcher-3770-thread-1) [n:127.0.0.1:38987_solr     ] o.a.s.m.r.SolrJmxReporter JMX monitoring for 'solr_38987.solr.jvm' (registry 'solr.jvm') enabled at server: com.sun.jmx.mbeanserver.JmxMBeanServer@3b30ab1f
   [junit4]   2> 1697756 INFO  (jetty-launcher-3770-thread-1) [n:127.0.0.1:38987_solr     ] o.a.s.m.r.SolrJmxReporter JMX monitoring for 'solr_38987.solr.jetty' (registry 'solr.jetty') enabled at server: com.sun.jmx.mbeanserver.JmxMBeanServer@3b30ab1f
   [junit4]   2> 1697771 INFO  (jetty-launcher-3770-thread-1) [n:127.0.0.1:38987_solr     ] o.a.s.c.CorePropertiesLocator Found 0 core definitions underneath /home/jenkins/jenkins-slave/workspace/Lucene-Solr-Tests-master/solr/build/solr-core/test/J1/temp/solr.cloud.CloudExitableDirectoryReaderTest_A714B89C7B9BD09A-001/tempDir-001/node1/.
   [junit4]   2> 1697980 INFO  (SUITE-CloudExitableDirectoryReaderTest-seed#[A714B89C7B9BD09A]-worker) [     ] o.a.s.c.MiniSolrCloudCluster waitForAllNodes: numServers=2
   [junit4]   2> 1698000 INFO  (SUITE-CloudExitableDirectoryReaderTest-seed#[A714B89C7B9BD09A]-worker) [     ] o.a.s.c.c.ConnectionManager Waiting for client to connect to ZooKeeper
   [junit4]   2> 1698004 INFO  (zkConnectionManagerCallback-3813-thread-1) [     ] o.a.s.c.c.ConnectionManager zkClient has connected
   [junit4]   2> 1698004 INFO  (SUITE-CloudExitableDirectoryReaderTest-seed#[A714B89C7B9BD09A]-worker) [     ] o.a.s.c.c.ConnectionManager Client is connected to ZooKeeper
   [junit4]   2> 1698017 INFO  (SUITE-CloudExitableDirectoryReaderTest-seed#[A714B89C7B9BD09A]-worker) [     ] o.a.s.c.c.ZkStateReader Updated live nodes from ZooKeeper... (0) -> (2)
   [junit4]   2> 1698018 INFO  (SUITE-CloudExitableDirectoryReaderTest-seed#[A714B89C7B9BD09A]-worker) [     ] o.a.s.c.s.i.ZkClientClusterStateProvider Cluster at 127.0.0.1:38870/solr ready
   [junit4]   2> 1698056 INFO  (qtp1316037008-10656) [n:127.0.0.1:44495_solr     ] o.a.s.h.a.CollectionsHandler Invoked Collection Action :create with params async=502d77f9-cb02-4527-8b4e-5d526915aa17&collection.configName=conf&name=exitable&nrtReplicas=1&action=CREATE&numShards=2&wt=javabin&version=2 and sendToOCPQueue=true
   [junit4]   2> 1698092 INFO  (OverseerThreadFactory-3825-thread-1-processing-n:127.0.0.1:38987_solr) [n:127.0.0.1:38987_solr     ] o.a.s.c.a.c.CreateCollectionCmd Create collection exitable
   [junit4]   2> 1698110 INFO  (qtp1316037008-10656) [n:127.0.0.1:44495_solr     ] o.a.s.s.HttpSolrCall [admin] webapp=null path=/admin/collections params={async=502d77f9-cb02-4527-8b4e-5d526915aa17&collection.configName=conf&name=exitable&nrtReplicas=1&action=CREATE&numShards=2&wt=javabin&version=2} status=0 QTime=53
   [junit4]   2> 1698113 INFO  (qtp1316037008-10657) [n:127.0.0.1:44495_solr     ] o.a.s.h.a.CollectionsHandler Invoked Collection Action :requeststatus with params requestid=502d77f9-cb02-4527-8b4e-5d526915aa17&action=REQUESTSTATUS&wt=javabin&version=2 and sendToOCPQueue=true
   [junit4]   2> 1698162 INFO  (qtp1316037008-10657) [n:127.0.0.1:44495_solr     ] o.a.s.s.HttpSolrCall [admin] webapp=null path=/admin/collections params={requestid=502d77f9-cb02-4527-8b4e-5d526915aa17&action=REQUESTSTATUS&wt=javabin&version=2} status=0 QTime=49
   [junit4]   2> 1698268 INFO  (OverseerStateUpdate-75348225278869512-127.0.0.1:38987_solr-n_0000000000) [n:127.0.0.1:38987_solr     ] o.a.s.c.o.SliceMutator createReplica() {
   [junit4]   2>   "operation":"ADDREPLICA",
   [junit4]   2>   "collection":"exitable",
   [junit4]   2>   "shard":"shard1",
   [junit4]   2>   "core":"exitable_shard1_replica_n1",
   [junit4]   2>   "state":"down",
   [junit4]   2>   "base_url":"http://127.0.0.1:44495/solr",
   [junit4]   2>   "type":"NRT",
   [junit4]   2>   "waitForFinalState":"false"}
   [junit4]   2> 1698270 INFO  (OverseerStateUpdate-75348225278869512-127.0.0.1:38987_solr-n_0000000000) [n:127.0.0.1:38987_solr     ] o.a.s.c.o.SliceMutator createReplica() {
   [junit4]   2>   "operation":"ADDREPLICA",
   [junit4]   2>   "collection":"exitable",
   [junit4]   2>   "shard":"shard2",
   [junit4]   2>   "core":"exitable_shard2_replica_n2",
   [junit4]   2>   "state":"down",
   [junit4]   2>   "base_url":"http://127.0.0.1:38987/solr",
   [junit4]   2>   "type":"NRT",
   [junit4]   2>   "waitForFinalState":"false"}
   [junit4]   2> 1698474 INFO  (qtp533524654-10645) [n:127.0.0.1:38987_solr    x:exitable_shard2_replica_n2 ] o.a.s.s.HttpSolrCall [admin] webapp=null path=/admin/cores params={qt=/admin/cores&collection.configName=conf&newCollection=true&collection=exitable&version=2&replicaType=NRT&async=502d77f9-cb02-4527-8b4e-5d526915aa1750211052747370385&coreNodeName=core_node4&name=exitable_shard2_replica_n2&action=CREATE&numShards=2&shard=shard2&wt=javabin} status=0 QTime=0
   [junit4]   2> 1698474 INFO  (parallelCoreAdminExecutor-3829-thread-1-processing-n:127.0.0.1:38987_solr x:exitable_shard2_replica_n2 502d77f9-cb02-4527-8b4e-5d526915aa1750211052747370385 CREATE) [n:127.0.0.1:38987_solr    x:exitable_shard2_replica_n2 ] o.a.s.h.a.CoreAdminOperation core create command qt=/admin/cores&collection.configName=conf&newCollection=true&collection=exitable&version=2&replicaType=NRT&async=502d77f9-cb02-4527-8b4e-5d526915aa1750211052747370385&coreNodeName=core_node4&name=exitable_shard2_replica_n2&action=CREATE&numShards=2&shard=shard2&wt=javabin
   [junit4]   2> 1698491 INFO  (qtp1316037008-10659) [n:127.0.0.1:44495_solr    x:exitable_shard1_replica_n1 ] o.a.s.s.HttpSolrCall [admin] webapp=null path=/admin/cores params={qt=/admin/cores&collection.configName=conf&newCollection=true&collection=exitable&version=2&replicaType=NRT&async=502d77f9-cb02-4527-8b4e-5d526915aa1750211052744998770&coreNodeName=core_node3&name=exitable_shard1_replica_n1&action=CREATE&numShards=2&shard=shard1&wt=javabin} status=0 QTime=0
   [junit4]   2> 1698491 INFO  (parallelCoreAdminExecutor-3826-thread-1-processing-n:127.0.0.1:44495_solr x:exitable_shard1_replica_n1 502d77f9-cb02-4527-8b4e-5d526915aa1750211052744998770 CREATE) [n:127.0.0.1:44495_solr    x:exitable_shard1_replica_n1 ] o.a.s.h.a.CoreAdminOperation core create command qt=/admin/cores&collection.configName=conf&newCollection=true&collection=exitable&version=2&replicaType=NRT&async=502d77f9-cb02-4527-8b4e-5d526915aa1750211052744998770&coreNodeName=core_node3&name=exitable_shard1_replica_n1&action=CREATE&numShards=2&shard=shard1&wt=javabin
   [junit4]   2> 1698491 INFO  (parallelCoreAdminExecutor-3826-thread-1-processing-n:127.0.0.1:44495_solr x:exitable_shard1_replica_n1 502d77f9-cb02-4527-8b4e-5d526915aa1750211052744998770 CREATE) [n:127.0.0.1:44495_solr    x:exitable_shard1_replica_n1 ] o.a.s.c.TransientSolrCoreCacheDefault Allocating transient cache for 2147483647 transient cores
   [junit4]   2> 1698494 INFO  (qtp1316037008-10657) [n:127.0.0.1:44495_solr     ] o.a.s.h.a.CoreAdminOperation Checking request status for : 502d77f9-cb02-4527-8b4e-5d526915aa1750211052744998770
   [junit4]   2> 1698494 INFO  (qtp1316037008-10657) [n:127.0.0.1:44495_solr     ] o.a.s.s.HttpSolrCall [admin] webapp=null path=/admin/cores params={qt=/admin/cores&requestid=502d77f9-cb02-4527-8b4e-5d526915aa1750211052744998770&action=REQUESTSTATUS&wt=javabin&version=2} status=0 QTime=0
   [junit4]   2> 1699192 INFO  (qtp1316037008-10658) [n:127.0.0.1:44495_solr     ] o.a.s.h.a.CollectionsHandler Invoked Collection Action :requeststatus with params requestid=502d77f9-cb02-4527-8b4e-5d526915aa17&action=REQUESTSTATUS&wt=javabin&version=2 and sendToOCPQueue=true
   [junit4]   2> 1699248 INFO  (qtp1316037008-10658) [n:127.0.0.1:44495_solr     ] o.a.s.s.HttpSolrCall [admin] webapp=null path=/admin/collections params={requestid=502d77f9-cb02-4527-8b4e-5d526915aa17&action=REQUESTSTATUS&wt=javabin&version=2} status=0 QTime=56
   [junit4]   2> 1699524 INFO  (qtp1316037008-10659) [n:127.0.0.1:44495_solr     ] o.a.s.h.a.CoreAdminOperation Checking request status for : 502d77f9-cb02-4527-8b4e-5d526915aa1750211052744998770
   [junit4]   2> 1699524 INFO  (qtp1316037008-10659) [n:127.0.0.1:44495_solr     ] o.a.s.s.HttpSolrCall [admin] webapp=null path=/admin/cores params={qt=/admin/cores&requestid=502d77f9-cb02-4527-8b4e-5d526915aa1750211052744998770&action=REQUESTSTATUS&wt=javabin&version=2} status=0 QTime=0
   [junit4]   2> 1699779 INFO  (parallelCoreAdminExecutor-3826-thread-1-processing-n:127.0.0.1:44495_solr x:exitable_shard1_replica_n1 502d77f9-cb02-4527-8b4e-5d526915aa1750211052744998770 CREATE) [n:127.0.0.1:44495_solr c:exitable s:shard1 r:core_node3 x:exitable_shard1_replica_n1 ] o.a.s.c.SolrConfig Using Lucene MatchVersion: 9.0.0
   [junit4]   2> 1699959 INFO  (parallelCoreAdminExecutor-3826-thread-1-processing-n:127.0.0.1:44495_solr x:exitable_shard1_replica_n1 502d77f9-cb02-4527-8b4e-5d526915aa1750211052744998770 CREATE) [n:127.0.0.1:44495_solr c:exitable s:shard1 r:core_node3 x:exitable_shard1_replica_n1 ] o.a.s.s.IndexSchema [exitable_shard1_replica_n1] Schema name=minimal
   [junit4]   2> 1699960 INFO  (parallelCoreAdminExecutor-3826-thread-1-processing-n:127.0.0.1:44495_solr x:exitable_shard1_replica_n1 502d77f9-cb02-4527-8b4e-5d526915aa1750211052744998770 CREATE) [n:127.0.0.1:44495_solr c:exitable s:shard1 r:core_node3 x:exitable_shard1_replica_n1 ] o.a.s.s.IndexSchema Loaded schema minimal/1.1 with uniqueid field id
   [junit4]   2> 1699961 INFO  (parallelCoreAdminExecutor-3826-thread-1-processing-n:127.0.0.1:44495_solr x:exitable_shard1_replica_n1 502d77f9-cb02-4527-8b4e-5d526915aa1750211052744998770 CREATE) [n:127.0.0.1:44495_solr c:exitable s:shard1 r:core_node3 x:exitable_shard1_replica_n1 ] o.a.s.c.CoreContainer Creating SolrCore 'exitable_shard1_replica_n1' using configuration from collection exitable, trusted=true
   [junit4]   2> 1699997 INFO  (parallelCoreAdminExecutor-3826-thread-1-processing-n:127.0.0.1:44495_solr x:exitable_shard1_replica_n1 502d77f9-cb02-4527-8b4e-5d526915aa1750211052744998770 CREATE) [n:127.0.0.1:44495_solr c:exitable s:shard1 r:core_node3 x:exitable_shard1_replica_n1 ] o.a.s.m.r.SolrJmxReporter JMX monitoring for 'solr_44495.solr.core.exitable.shard1.replica_n1' (registry 'solr.core.exitable.shard1.replica_n1') enabled at server: com.sun.jmx.mbeanserver.JmxMBeanServer@3b30ab1f
   [junit4]   2> 1699998 INFO  (parallelCoreAdminExecutor-3826-thread-1-processing-n:127.0.0.1:44495_solr x:exitable_shard1_replica_n1 502d77f9-cb02-4527-8b4e-5d526915aa1750211052744998770 CREATE) [n:127.0.0.1:44495_solr c:exitable s:shard1 r:core_node3 x:exitable_shard1_replica_n1 ] o.a.s.c.SolrCore [[exitable_shard1_replica_n1] ] Opening new SolrCore at [/home/jenkins/jenkins-slave/workspace/Lucene-Solr-Tests-master/solr/build/solr-core/test/J1/temp/solr.cloud.CloudExitableDirectoryReaderTest_A714B89C7B9BD09A-001/tempDir-001/node2/exitable_shard1_replica_n1], dataDir=[/home/jenkins/jenkins-slave/workspace/Lucene-Solr-Tests-master/solr/build/solr-core/test/J1/temp/solr.cloud.CloudExitableDirectoryReaderTest_A714B89C7B9BD09A-001/tempDir-001/node2/./exitable_shard1_replica_n1/data/]
   [junit4]   2> 1700031 INFO  (parallelCoreAdminExecutor-3829-thread-1-processing-n:127.0.0.1:38987_solr x:exitable_shard2_replica_n2 502d77f9-cb02-4527-8b4e-5d526915aa1750211052747370385 CREATE) [n:127.0.0.1:38987_solr c:exitable s:shard2 r:core_node4 x:exitable_shard2_replica_n2 ] o.a.s.c.SolrConfig Using Lucene MatchVersion: 9.0.0
   [junit4]   2> 1700141 INFO  (parallelCoreAdminExecutor-3829-thread-1-processing-n:127.0.0.1:38987_solr x:exitable_shard2_replica_n2 502d77f9-cb02-4527-8b4e-5d526915aa1750211052747370385 CREATE) [n:127.0.0.1:38987_solr c:exitable s:shard2 r:core_node4 x:exitable_shard2_replica_n2 ] o.a.s.s.IndexSchema [exitable_shard2_replica_n2] Schema name=minimal
   [junit4]   2> 1700142 INFO  (parallelCoreAdminExecutor-3829-thread-1-processing-n:127.0.0.1:38987_solr x:exitable_shard2_replica_n2 502d77f9-cb02-4527-8b4e-5d526915aa1750211052747370385 CREATE) [n:127.0.0.1:38987_solr c:exitable s:shard2 r:core_node4 x:exitable_shard2_replica_n2 ] o.a.s.s.IndexSchema Loaded schema minimal/1.1 with uniqueid field id
   [junit4]   2> 1700142 INFO  (parallelCoreAdminExecutor-3829-thread-1-processing-n:127.0.0.1:38987_solr x:exitable_shard2_replica_n2 502d77f9-cb02-4527-8b4e-5d526915aa1750211052747370385 CREATE) [n:127.0.0.1:38987_solr c:exitable s:shard2 r:core_node4 x:exitable_shard2_replica_n2 ] o.a.s.c.CoreContainer Creating SolrCore 'exitable_shard2_replica_n2' using configuration from collection exitable, trusted=true
   [junit4]   2> 1700143 INFO  (parallelCoreAdminExecutor-3829-thread-1-processing-n:127.0.0.1:38987_solr x:exitable_shard2_replica_n2 502d77f9-cb02-4527-8b4e-5d526915aa1750211052747370385 CREATE) [n:127.0.0.1:38987_solr c:exitable s:shard2 r:core_node4 x:exitable_shard2_replica_n2 ] o.a.s.m.r.SolrJmxReporter JMX monitoring for 'solr_38987.solr.core.exitable.shard2.replica_n2' (registry 'solr.core.exitable.shard2.replica_n2') enabled at server: com.sun.jmx.mbeanserver.JmxMBeanServer@3b30ab1f
   [junit4]   2> 1700177 INFO  (parallelCoreAdminExecutor-3829-thread-1-processing-n:127.0.0.1:38987_solr x:exitable_shard2_replica_n2 502d77f9-cb02-4527-8b4e-5d526915aa1750211052747370385 CREATE) [n:127.0.0.1:38987_solr c:exitable s:shard2 r:core_node4 x:exitable_shard2_replica_n2 ] o.a.s.c.SolrCore [[exitable_shard2_replica_n2] ] Opening new SolrCore at [/home/jenkins/jenkins-slave/workspace/Lucene-Solr-Tests-master/solr/build/solr-core/test/J1/temp/solr.cloud.CloudExitableDirectoryReaderTest_A714B89C7B9BD09A-001/tempDir-001/node1/exitable_shard2_replica_n2], dataDir=[/home/jenkins/jenkins-slave/workspace/Lucene-Solr-Tests-master/solr/build/solr-core/test/J1/temp/solr.cloud.CloudExitableDirectoryReaderTest_A714B89C7B9BD09A-001/tempDir-001/node1/./exitable_shard2_replica_n2/data/]
   [junit4]   2> 1700249 INFO  (qtp1316037008-10655) [n:127.0.0.1:44495_solr     ] o.a.s.h.a.CollectionsHandler Invoked Collection Action :requeststatus with params requestid=502d77f9-cb02-4527-8b4e-5d526915aa17&action=REQUESTSTATUS&wt=javabin&version=2 and sendToOCPQueue=true
   [junit4]   2> 1700321 INFO  (qtp1316037008-10655) [n:127.0.0.1:44495_solr     ] o.a.s.s.HttpSolrCall [admin] webapp=null path=/admin/collections params={requestid=502d77f9-cb02-4527-8b4e-5d526915aa17&action=REQUESTSTATUS&wt=javabin&version=2} status=0 QTime=72
   [junit4]   2> 1700542 INFO  (qtp1316037008-10656) [n:127.0.0.1:44495_solr     ] o.a.s.h.a.CoreAdminOperation Checking request status for : 502d77f9-cb02-4527-8b4e-5d526915aa1750211052744998770
   [junit4]   2> 1700542 INFO  (qtp1316037008-10656) [n:127.0.0.1:44495_solr     ] o.a.s.s.HttpSolrCall [admin] webapp=null path=/admin/cores params={qt=/admin/cores&requestid=502d77f9-cb02-4527-8b4e-5d526915aa1750211052744998770&action=REQUESTSTATUS&wt=javabin&version=2} status=0 QTime=0
   [junit4]   2> 1700609 INFO  (parallelCoreAdminExecutor-3826-thread-1-processing-n:127.0.0.1:44495_solr x:exitable_shard1_replica_n1 502d77f9-cb02-4527-8b4e-5d526915aa1750211052744998770 CREATE) [n:127.0.0.1:44495_solr c:exitable s:shard1 r:core_node3 x:exitable_shard1_replica_n1 ] o.a.s.u.UpdateHandler Using UpdateLog implementation: org.apache.solr.update.UpdateLog
   [junit4]   2> 1700609 INFO  (parallelCoreAdminExecutor-3826-thread-1-processing-n:127.0.0.1:44495_solr x:exitable_shard1_replica_n1 502d77f9-cb02-4527-8b4e-5d526915aa1750211052744998770 CREATE) [n:127.0.0.1:44495_solr c:exitable s:shard1 r:core_node3 x:exitable_shard1_replica_n1 ] o.a.s.u.UpdateLog Initializing UpdateLog: dataDir= defaultSyncLevel=FLUSH numRecordsToKeep=100 maxNumLogsToKeep=10 numVersionBuckets=65536
   [junit4]   2> 1700610 INFO  (parallelCoreAdminExecutor-3826-thread-1-processing-n:127.0.0.1:44495_solr x:exitable_shard1_replica_n1 502d77f9-cb02-4527-8b4e-5d526915aa1750211052744998770 CREATE) [n:127.0.0.1:44495_solr c:exitable s:shard1 r:core_node3 x:exitable_shard1_replica_n1 ] o.a.s.u.CommitTracker Hard AutoCommit: disabled
   [junit4]   2> 1700610 INFO  (parallelCoreAdminExecutor-3826-thread-1-processing-n:127.0.0.1:44495_solr x:exitable_shard1_replica_n1 502d77f9-cb02-4527-8b4e-5d526915aa1750211052744998770 CREATE) [n:127.0.0.1:44495_solr c:exitable s:shard1 r:core_node3 x:exitable_shard1_replica_n1 ] o.a.s.u.CommitTracker Soft AutoCommit: disabled
   [junit4]   2> 1700612 INFO  (parallelCoreAdminExecutor-3826-thread-1-processing-n:127.0.0.1:44495_solr x:exitable_shard1_replica_n1 502d77f9-cb02-4527-8b4e-5d526915aa1750211052744998770 CREATE) [n:127.0.0.1:44495_solr c:exitable s:shard1 r:core_node3 x:exitable_shard1_replica_n1 ] o.a.s.s.SolrIndexSearcher Opening [Searcher@483fddf7[exitable_shard1_replica_n1] main]
   [junit4]   2> 1700639 INFO  (parallelCoreAdminExecutor-3826-thread-1-processing-n:127.0.0.1:44495_solr x:exitable_shard1_replica_n1 502d77f9-cb02-4527-8b4e-5d526915aa1750211052744998770 CREATE) [n:127.0.0.1:44495_solr c:exitable s:shard1 r:core_node3 x:exitable_shard1_replica_n1 ] o.a.s.r.ManagedResourceStorage Configured ZooKeeperStorageIO with znodeBase: /configs/conf
   [junit4]   2> 1700639 INFO  (parallelCoreAdminExecutor-3826-thread-1-processing-n:127.0.0.1:44495_solr x:exitable_shard1_replica_n1 502d77f9-cb02-4527-8b4e-5d526915aa1750211052744998770 CREATE) [n:127.0.0.1:44495_solr c:exitable s:shard1 r:core_node3 x:exitable_shard1_replica_n1 ] o.a.s.r.ManagedResourceStorage Loaded null at path _rest_managed.json using ZooKeeperStorageIO:path=/configs/conf
   [junit4]   2> 1700640 INFO  (parallelCoreAdminExecutor-3826-thread-1-processing-n:127.0.0.1:44495_solr x:exitable_shard1_replica_n1 502d77f9-cb02-4527-8b4e-5d526915aa1750211052744998770 CREATE) [n:127.0.0.1:44495_solr c:exitable s:shard1 r:core_node3 x:exitable_shard1_replica_n1 ] o.a.s.h.ReplicationHandler Commits will be reserved for 10000ms.
   [junit4]   2> 1700640 INFO  (parallelCoreAdminExecutor-3826-thread-1-processing-n:127.0.0.1:44495_solr x:exitable_shard1_replica_n1 502d77f9-cb02-4527-8b4e-5d526915aa1750211052744998770 CREATE) [n:127.0.0.1:44495_solr c:exitable s:shard1 r:core_node3 x:exitable_shard1_replica_n1 ] o.a.s.u.UpdateLog Could not find max version in index or recent updates, using new clock 1644034684805447680
   [junit4]   2> 1700677 INFO  (searcherExecutor-3834-thread-1-processing-x:exitable_shard1_replica_n1 502d77f9-cb02-4527-8b4e-5d526915aa1750211052744998770 r:core_node3 CREATE n:127.0.0.1:44495_solr c:exitable s:shard1) [n:127.0.0.1:44495_solr c:exitable s:shard1 r:core_node3 x:exitable_shard1_replica_n1 ] o.a.s.c.SolrCore [exitable_shard1_replica_n1] Registered new searcher Searcher@483fddf7[exitable_shard1_replica_n1] main{ExitableDirectoryReader(UninvertingDirectoryReader())}
   [junit4]   2> 1700712 INFO  (parallelCoreAdminExecutor-3826-thread-1-processing-n:127.0.0.1:44495_solr x:exitable_shard1_replica_n1 502d77f9-cb02-4527-8b4e-5d526915aa1750211052744998770 CREATE) [n:127.0.0.1:44495_solr c:exitable s:shard1 r:core_node3 x:exitable_shard1_replica_n1 ] o.a.s.c.ZkShardTerms Successful update of terms at /collections/exitable/terms/shard1 to Terms{values={core_node3=0}, version=0}
   [junit4]   2> 1700712 INFO  (parallelCoreAdminExecutor-3826-thread-1-processing-n:127.0.0.1:44495_solr x:exitable_shard1_replica_n1 502d77f9-cb02-4527-8b4e-5d526915aa1750211052744998770 CREATE) [n:127.0.0.1:44495_solr c:exitable s:shard1 r:core_node3 x:exitable_shard1_replica_n1 ] o.a.s.c.ShardLeaderElectionContextBase make sure parent is created /collections/exitable/leaders/shard1
   [junit4]   2> 1700748 INFO  (parallelCoreAdminExecutor-3826-thread-1-processing-n:127.0.0.1:44495_solr x:exitable_shard1_replica_n1 502d77f9-cb02-4527-8b4e-5d526915aa1750211052744998770 CREATE) [n:127.0.0.1:44495_solr c:exitable s:shard1 r:core_node3 x:exitable_shard1_replica_n1 ] o.a.s.c.ShardLeaderElectionContext Enough replicas found to continue.
   [junit4]   2> 1700748 INFO  (parallelCoreAdminExecutor-3826-thread-1-processing-n:127.0.0.1:44495_solr x:exitable_shard1_replica_n1 502d77f9-cb02-4527-8b4e-5d526915aa1750211052744998770 CREATE) [n:127.0.0.1:44495_solr c:exitable s:shard1 r:core_node3 x:exitable_shard1_replica_n1 ] o.a.s.c.ShardLeaderElectionContext I may be the new leader - try and sync
   [junit4]   2> 1700748 INFO  (parallelCoreAdminExecutor-3826-thread-1-processing-n:127.0.0.1:44495_solr x:exitable_shard1_replica_n1 502d77f9-cb02-4527-8b4e-5d526915aa1750211052744998770 CREATE) [n:127.0.0.1:44495_solr c:exitable s:shard1 r:core_node3 x:exitable_shard1_replica_n1 ] o.a.s.c.SyncStrategy Sync replicas to http://127.0.0.1:44495/solr/exitable_shard1_replica_n1/
   [junit4]   2> 1700748 INFO  (parallelCoreAdminExecutor-3826-thread-1-processing-n:127.0.0.1:44495_solr x:exitable_shard1_replica_n1 502d77f9-cb02-4527-8b4e-5d526915aa1750211052744998770 CREATE) [n:127.0.0.1:44495_solr c:exitable s:shard1 r:core_node3 x:exitable_shard1_replica_n1 ] o.a.s.c.SyncStrategy Sync Success - now sync replicas to me
   [junit4]   2> 1700748 INFO  (parallelCoreAdminExecutor-3826-thread-1-processing-n:127.0.0.1:44495_solr x:exitable_shard1_replica_n1 502d77f9-cb02-4527-8b4e-5d526915aa1750211052744998770 CREATE) [n:127.0.0.1:44495_solr c:exitable s:shard1 r:core_node3 x:exitable_shard1_replica_n1 ] o.a.s.c.SyncStrategy http://127.0.0.1:44495/solr/exitable_shard1_replica_n1/ has no replicas
   [junit4]   2> 1700748 INFO  (parallelCoreAdminExecutor-3826-thread-1-processing-n:127.0.0.1:44495_solr x:exitable_shard1_replica_n1 502d77f9-cb02-4527-8b4e-5d526915aa1750211052744998770 CREATE) [n:127.0.0.1:44495_solr c:exitable s:shard1 r:core_node3 x:exitable_shard1_replica_n1 ] o.a.s.c.ShardLeaderElectionContextBase Creating leader registration node /collections/exitable/leaders/shard1/leader after winning as /collections/exitable/leader_elect/shard1/election/75348225278869511-core_node3-n_0000000000
   [junit4]   2> 1700767 INFO  (parallelCoreAdminExecutor-3826-thread-1-processing-n:127.0.0.1:44495_solr x:exitable_shard1_replica_n1 502d77f9-cb02-4527-8b4e-5d526915aa1750211052744998770 CREATE) [n:127.0.0.1:44495_solr c:exitable s:shard1 r:core_node3 x:exitable_shard1_replica_n1 ] o.a.s.c.ShardLeaderElectionContext I am the new leader: http://127.0.0.1:44495/solr/exitable_shard1_replica_n1/ shard1
   [junit4]   2> 1700784 INFO  (zkCallback-3789-thread-1) [     ] o.a.s.c.c.ZkStateReader A cluster state change: [WatchedEvent state:SyncConnected type:NodeDataChanged path:/collections/exitable/state.json] for collection [exitable] has occurred - updating... (live nodes size: [2])
   [junit4]   2> 1700786 INFO  (parallelCoreAdminExecutor-3826-thread-1-processing-n:127.0.0.1:44495_solr x:exitable_shard1_replica_n1 502d77f9-cb02-4527-8b4e-5d526915aa1750211052744998770 CREATE) [n:127.0.0.1:44495_solr c:exitable s:shard1 r:core_node3 x:exitable_shard1_replica_n1 ] o.a.s.c.ZkController I am the leader, no recovery necessary
   [junit4]   2> 1700965 INFO  (zkCallback-3789-thread-2) [     ] o.a.s.c.c.ZkStateReader A cluster state change: [WatchedEvent state:SyncConnected type:NodeDataChanged path:/collections/exitable/state.json] for collection [exitable] has occurred - updating... (live nodes size: [2])
   [junit4]   2> 1700965 INFO  (zkCallback-3789-thread-1) [     ] o.a.s.c.c.ZkStateReader A cluster state change: [WatchedEvent state:SyncConnected type:NodeDataChanged path:/collections/exitable/state.json] for collection [exitable] has occurred - updating... (live nodes size: [2])
   [junit4]   2> 1700983 INFO  (parallelCoreAdminExecutor-3829-thread-1-processing-n:127.0.0.1:38987_solr x:exitable_shard2_replica_n2 502d77f9-cb02-4527-8b4e-5d526915aa1750211052747370385 CREATE) [n:127.0.0.1:38987_solr c:exitable s:shard2 r:core_node4 x:exitable_shard2_replica_n2 ] o.a.s.u.UpdateHandler Using UpdateLog implementation: org.apache.solr.update.UpdateLog
   [junit4]   2> 1700983 INFO  (parallelCoreAdminExecutor-3829-thread-1-processing-n:127.0.0.1:38987_solr x:exitable_shard2_replica_n2 502d77f9-cb02-4527-8b4e-5d526915aa1750211052747370385 CREATE) [n:127.0.0.1:38987_solr c:exitable s:shard2 r:core_node4 x:exitable_shard2_replica_n2 ] o.a.s.u.UpdateLog Initializing UpdateLog: dataDir= defaultSyncLevel=FLUSH numRecordsToKeep=100 maxNumLogsToKeep=10 numVersionBuckets=65536
   [junit4]   2> 1701326 INFO  (parallelCoreAdminExecutor-3829-thread-1-processing-n:127.0.0.1:38987_solr x:exitable_shard2_replica_n2 502d77f9-cb02-4527-8b4e-5d526915aa1750211052747370385 CREATE) [n:127.0.0.1:38987_solr c:exitable s:shard2 r:core_node4 x:exitable_shard2_replica_n2 ] o.a.s.u.CommitTracker Hard AutoCommit: disabled
   [junit4]   2> 1701326 INFO  (parallelCoreAdminExecutor-3829-thread-1-processing-n:127.0.0.1:38987_solr x:exitable_shard2_replica_n2 502d77f9-cb02-4527-8b4e-5d526915aa1750211052747370385 CREATE) [n:127.0.0.1:38987_solr c:exitable s:shard2 r:core_node4 x:exitable_shard2_replica_n2 ] o.a.s.u.CommitTracker Soft AutoCommit: disabled
   [junit4]   2> 1701340 INFO  (parallelCoreAdminExecutor-3829-thread-1-processing-n:127.0.0.1:38987_solr x:exitable_shard2_replica_n2 502d77f9-cb02-4527-8b4e-5d526915aa1750211052747370385 CREATE) [n:127.0.0.1:38987_solr c:exitable s:shard2 r:core_node4 x:exitable_shard2_replica_n2 ] o.a.s.s.SolrIndexSearcher Opening [Searcher@3afd39a5[exitable_shard2_replica_n2] main]
   [junit4]   2> 1701341 INFO  (qtp1316037008-10657) [n:127.0.0.1:44495_solr     ] o.a.s.h.a.CollectionsHandler Invoked Collection Action :requeststatus with params requestid=502d77f9-cb02-4527-8b4e-5d526915aa17&action=REQUESTSTATUS&wt=javabin&version=2 and sendToOCPQueue=true
   [junit4]   2> 1701355 INFO  (parallelCoreAdminExecutor-3829-thread-1-processing-n:127.0.0.1:38987_solr x:exitable_shard2_replica_n2 502d77f9-cb02-4527-8b4e-5d526915aa1750211052747370385 CREATE) [n:127.0.0.1:38987_solr c:exitable s:shard2 r:core_node4 x:exitable_shard2_replica_n2 ] o.a.s.r.ManagedResourceStorage Configured ZooKeeperStorageIO with znodeBase: /configs/conf
   [junit4]   2> 1701356 INFO  (parallelCoreAdminExecutor-3829-thread-1-processing-n:127.0.0.1:38987_solr x:exitable_shard2_replica_n2 502d77f9-cb02-4527-8b4e-5d526915aa1750211052747370385 CREATE) [n:127.0.0.1:38987_solr c:exitable s:shard2 r:core_node4 x:exitable_shard2_replica_n2 ] o.a.s.r.ManagedResourceStorage Loaded null at path _rest_managed.json using ZooKeeperStorageIO:path=/configs/conf
   [junit4]   2> 1701356 INFO  (parallelCoreAdminExecutor-3829-thread-1-processing-n:127.0.0.1:38987_solr x:exitable_shard2_replica_n2 502d77f9-cb02-4527-8b4e-5d526915aa1750211052747370385 CREATE) [n:127.0.0.1:38987_solr c:exitable s:shard2 r:core_node4 x:exitable_shard2_replica_n2 ] o.a.s.h.ReplicationHandler Commits will be reserved for 10000ms.
   [junit4]   2> 1701356 INFO  (parallelCoreAdminExecutor-3829-thread-1-processing-n:127.0.0.1:38987_solr x:exitable_shard2_replica_n2 502d77f9-cb02-4527-8b4e-5d526915aa1750211052747370385 CREATE) [n:127.0.0.1:38987_solr c:exitable s:shard2 r:core_node4 x:exitable_shard2_replica_n2 ] o.a.s.u.UpdateLog Could not find max version in index or recent updates, using new clock 1644034685556228096
   [junit4]   2> 1701376 INFO  (searcherExecutor-3835-thread-1-processing-x:exitable_shard2_replica_n2 502d77f9-cb02-4527-8b4e-5d526915aa1750211052747370385 r:core_node4 CREATE n:127.0.0.1:38987_solr c:exitable s:shard2) [n:127.0.0.1:38987_solr c:exitable s:shard2 r:core_node4 x:exitable_shard2_replica_n2 ] o.a.s.c.SolrCore [exitable_shard2_replica_n2] Registered new searcher Searcher@3afd39a5[exitable_shard2_replica_n2] main{ExitableDirectoryReader(UninvertingDirectoryReader())}
   [junit4]   2> 1701376 INFO  (qtp1316037008-10657) [n:127.0.0.1:44495_solr     ] o.a.s.s.HttpSolrCall [admin] webapp=null path=/admin/collections params={requestid=502d77f9-cb02-4527-8b4e-5d526915aa17&action=REQUESTSTATUS&wt=javabin&version=2} status=0 QTime=35
   [junit4]   2> 1701392 INFO  (parallelCoreAdminExecutor-3829-thread-1-processing-n:127.0.0.1:38987_solr x:exitable_shard2_replica_n2 502d77f9-cb02-4527-8b4e-5d526915aa1750211052747370385 CREATE) [n:127.0.0.1:38987_solr c:exitable s:shard2 r:core_node4 x:exitable_shard2_replica_n2 ] o.a.s.c.ZkShardTerms Successful update of terms at /collections/exitable/terms/shard2 to Terms{values={core_node4=0}, version=0}
   [junit4]   2> 1701392 INFO  (parallelCoreAdminExecutor-3829-thread-1-processing-n:127.0.0.1:38987_solr x:exitable_shard2_replica_n2 502d77f9-cb02-4527-8b4e-5d526915aa1750211052747370385 CREATE) [n:127.0.0.1:38987_solr c:exitable s:shard2 r:core_node4 x:exitable_shard2_replica_n2 ] o.a.s.c.ShardLeaderElectionContextBase make sure parent is created /collections/exitable/leaders/shard2
   [junit4]   2> 1701395 INFO  (parallelCoreAdminExecutor-3829-thread-1-processing-n:127.0.0.1:38987_solr x:exitable_shard2_replica_n2 502d77f9-cb02-4527-8b4e-5d526915aa1750211052747370385 CREATE) [n:127.0.0.1:38987_solr c:exitable s:shard2 r:core_node4 x:exitable_shard2_replica_n2 ] o.a.s.c.ShardLeaderElectionContext Enough replicas found to continue.
   [junit4]   2> 1701395 INFO  (parallelCoreAdminExecutor-3829-thread-1-processing-n:127.0.0.1:38987_solr x:exitable_shard2_replica_n2 502d77f9-cb02-4527-8b4e-5d526915aa1750211052747370385 CREATE) [n:127.0.0.1:38987_solr c:exitable s:shard2 r:core_node4 x:exitable_shard2_replica_n2 ] o.a.s.c.ShardLeaderElectionContext I may be the new leader - try and sync
   [junit4]   2> 1701411 INFO  (parallelCoreAdminExecutor-3829-thread-1-processing-n:127.0.0.1:38987_solr x:exitable_shard2_replica_n2 502d77f9-cb02-4527-8b4e-5d526915aa1750211052747370385 CREATE) [n:127.0.0.1:38987_solr c:exitable s:shard2 r:core_node4 x:exitable_shard2_replica_n2 ] o.a.s.c.SyncStrategy Sync replicas to http://127.0.0.1:38987/solr/exitable_shard2_replica_n2/
   [junit4]   2> 1701411 INFO  (parallelCoreAdminExecutor-3829-thread-1-processing-n:127.0.0.1:38987_solr x:exitable_shard2_replica_n2 502d77f9-cb02-4527-8b4e-5d526915aa1750211052747370385 CREATE) [n:127.0.0.1:38987_solr c:exitable s:shard2 r:core_node4 x:exitable_shard2_replica_n2 ] o.a.s.c.SyncStrategy Sync Success - now sync replicas to me
   [junit4]   2> 1701412 INFO  (parallelCoreAdminExecutor-3829-thread-1-processing-n:127.0.0.1:38987_solr x:exitable_shard2_replica_n2 502d77f9-cb02-4527-8b4e-5d526915aa1750211052747370385 CREATE) [n:127.0.0.1:38987_solr c:exitable s:shard2 r:core_node4 x:exitable_shard2_replica_n2 ] o.a.s.c.SyncStrategy http://127.0.0.1:38987/solr/exitable_shard2_replica_n2/ has no replicas
   [junit4]   2> 1701412 INFO  (parallelCoreAdminExecutor-3829-thread-1-processing-n:127.0.0.1:38987_solr x:exitable_shard2_replica_n2 502d77f9-cb02-4527-8b4e-5d526915aa1750211052747370385 CREATE) [n:127.0.0.1:38987_solr c:exitable s:shard2 r:core_node4 x:exitable_shard2_replica_n2 ] o.a.s.c.ShardLeaderElectionContextBase Creating leader registration node /collections/exitable/leaders/shard2/leader after winning as /collections/exitable/leader_elect/shard2/election/75348225278869512-core_node4-n_0000000000
   [junit4]   2> 1701413 INFO  (parallelCoreAdminExecutor-3829-thread-1-processing-n:127.0.0.1:38987_solr x:exitable_shard2_replica_n2 502d77f9-cb02-4527-8b4e-5d526915aa1750211052747370385 CREATE) [n:127.0.0.1:38987_solr c:exitable s:shard2 r:core_node4 x:exitable_shard2_replica_n2 ] o.a.s.c.ShardLeaderElectionContext I am the new leader: http://127.0.0.1:38987/solr/exitable_shard2_replica_n2/ shard2
   [junit4]   2> 1701522 INFO  (zkCallback-3791-thread-1) [     ] o.a.s.c.c.ZkStateReader A cluster state change: [WatchedEvent state:SyncConnected type:NodeDataChanged path:/collections/exitable/state.json] for collection [exitable] has occurred - updating... (live nodes size: [2])
   [junit4]   2> 1701523 INFO  (parallelCoreAdminExecutor-3829-thread-1-processing-n:127.0.0.1:38987_solr x:exitable_shard2_replica_n2 502d77f9-cb02-4527-8b4e-5d526915aa1750211052747370385 CREATE) [n:127.0.0.1:38987_solr c:exitable s:shard2 r:core_node4 x:exitable_shard2_replica_n2 ] o.a.s.c.ZkController I am the leader, no recovery necessary
   [junit4]   2> 1701525 INFO  (zkCallback-3789-thread-1) [     ] o.a.s.c.c.ZkStateReader A cluster state change: [WatchedEvent state:SyncConnected type:NodeDataChanged path:/collections/exitable/state.json] for collection [exitable] has occurred - updating... (live nodes size: [2])
   [junit4]   2> 1701525 INFO  (zkCallback-3789-thread-2) [     ] o.a.s.c.c.ZkStateReader A cluster state change: [WatchedEvent state:SyncConnected type:NodeDataChanged path:/collections/exitable/state.json] for collection [exitable] has occurred - updating... (live nodes size: [2])
   [junit4]   2> 1701594 INFO  (zkCallback-3791-thread-2) [     ] o.a.s.c.c.ZkStateReader A cluster state change: [WatchedEvent state:SyncConnected type:NodeDataChanged path:/collections/exitable/state.json] for collection [exitable] has occurred - updating... (live nodes size: [2])
   [junit4]   2> 1701595 INFO  (qtp1316037008-10658) [n:127.0.0.1:44495_solr     ] o.a.s.h.a.CoreAdminOperation Checking request status for : 502d77f9-cb02-4527-8b4e-5d526915aa1750211052744998770
   [junit4]   2> 1701595 INFO  (qtp1316037008-10658) [n:127.0.0.1:44495_solr     ] o.a.s.s.HttpSolrCall [admin] webapp=null path=/admin/cores params={qt=/admin/cores&requestid=502d77f9-cb02-4527-8b4e-5d526915aa1750211052744998770&action=REQUESTSTATUS&wt=javabin&version=2} status=0 QTime=0
   [junit4]   2> 1701687 INFO  (qtp533524654-10640) [n:127.0.0.1:38987_solr     ] o.a.s.h.a.CoreAdminOperation Checking request status for : 502d77f9-cb02-4527-8b4e-5d526915aa1750211052747370385
   [junit4]   2> 1701687 INFO  (qtp533524654-10640) [n:127.0.0.1:38987_solr     ] o.a.s.s.HttpSolrCall [admin] webapp=null path=/admin/cores params={qt=/admin/cores&requestid=502d77f9-cb02-4527-8b4e-5d526915aa1750211052747370385&action=REQUESTSTATUS&wt=javabin&version=2} status=0 QTime=0
   [junit4]   2> 1701704 INFO  (zkCallback-3791-thread-2) [     ] o.a.s.c.c.ZkStateReader A cluster state change: [WatchedEvent state:SyncConnected type:NodeDataChanged path:/collections/exitable/state.json] for collection [exitable] has occurred - updating... (live nodes size: [2])
   [junit4]   2> 1701705 INFO  (zkCallback-3791-thread-1) [     ] o.a.s.c.c.ZkStateReader A cluster state change: [WatchedEvent state:SyncConnected type:NodeDataChanged path:/collections/exitable/state.json] for collection [exitable] has occurred - updating... (live nodes size: [2])
   [junit4]   2> 1701707 INFO  (zkCallback-3789-thread-1) [     ] o.a.s.c.c.ZkStateReader A cluster state change: [WatchedEvent state:SyncConnected type:NodeDataChanged path:/collections/exitable/state.json] for collection [exitable] has occurred - updating... (live nodes size: [2])
   [junit4]   2> 1701707 INFO  (zkCallback-3789-thread-2) [     ] o.a.s.c.c.ZkStateReader A cluster state change: [WatchedEvent state:SyncConnected type:NodeDataChanged path:/collections/exitable/state.json] for collection [exitable] has occurred - updating... (live nodes size: [2])
   [junit4]   2> 1701739 INFO  (zkCallback-3791-thread-3) [     ] o.a.s.c.c.ZkStateReader A cluster state change: [WatchedEvent state:SyncConnected type:NodeDataChanged path:/collections/exitable/state.json] for collection [exitable] has occurred - updating... (live nodes size: [2])
   [junit4]   2> 1701757 INFO  (OverseerThreadFactory-3825-thread-1-processing-n:127.0.0.1:38987_solr) [n:127.0.0.1:38987_solr     ] o.a.s.c.OverseerTaskQueue Response ZK path: /overseer/collection-queue-work/qnr-0000000000 doesn't exist.  Requestor may have disconnected from ZooKeeper
   [junit4]   2> 1702161 INFO  (OverseerCollectionConfigSetProcessor-75348225278869512-127.0.0.1:38987_solr-n_0000000000) [n:127.0.0.1:38987_solr     ] o.a.s.c.OverseerTaskQueue Response ZK path: /overseer/collection-queue-work/qnr-0000000000 doesn't exist.  Requestor may have disconnected from ZooKeeper
   [junit4]   2> 1702393 INFO  (qtp1316037008-10659) [n:127.0.0.1:44495_solr     ] o.a.s.h.a.CollectionsHandler Invoked Collection Action :requeststatus with params requestid=502d77f9-cb02-4527-8b4e-5d526915aa17&action=REQUESTSTATUS&wt=javabin&version=2 and sendToOCPQueue=true
   [junit4]   2> 1702445 INFO  (qtp1316037008-10659) [n:127.0.0.1:44495_solr     ] o.a.s.s.HttpSolrCall [admin] webapp=null path=/admin/collections params={requestid=502d77f9-cb02-4527-8b4e-5d526915aa17&action=REQUESTSTATUS&wt=javabin&version=2} status=0 QTime=52
   [junit4]   2> 1702446 INFO  (qtp1316037008-10655) [n:127.0.0.1:44495_solr     ] o.a.s.h.a.CollectionsHandler Invoked Collection Action :deletestatus with params requestid=502d77f9-cb02-4527-8b4e-5d526915aa17&action=DELETESTATUS&wt=javabin&version=2 and sendToOCPQueue=true
   [junit4]   2> 1702501 INFO  (qtp1316037008-10655) [n:127.0.0.1:44495_solr     ] o.a.s.s.HttpSolrCall [admin] webapp=null path=/admin/collections params={requestid=502d77f9-cb02-4527-8b4e-5d526915aa17&action=DELETESTATUS&wt=javabin&version=2} status=0 QTime=55
   [junit4]   2> 1702761 INFO  (qtp533524654-10645) [n:127.0.0.1:38987_solr c:exitable s:shard2 r:core_node4 x:exitable_shard2_replica_n2 ] o.a.s.c.ZkShardTerms Successful update of terms at /collections/exitable/terms/shard2 to Terms{values={core_node4=1}, version=1}
   [junit4]   2> 1702761 INFO  (qtp533524654-10645) [n:127.0.0.1:38987_solr c:exitable s:shard2 r:core_node4 x:exitable_shard2_replica_n2 ] o.a.s.u.p.LogUpdateProcessorFactory [exitable_shard2_replica_n2]  webapp=/solr path=/update params={_stateVer_=exitable:6&wt=javabin&version=2}{add=[2 (1644034686952931328), 3 (1644034686991728640), 5 (1644034686991728641), 6 (1644034686991728642), 7 (1644034686991728643), 9 (1644034686991728644), 17 (1644034686991728645), 18 (1644034686992777216), 19 (1644034686992777217), 21 (1644034686992777218), ... (24 adds)]} 0 88
   [junit4]   2> 1702870 INFO  (qtp1316037008-10656) [n:127.0.0.1:44495_solr c:exitable s:shard1 r:core_node3 x:exitable_shard1_replica_n1 ] o.a.s.c.ZkShardTerms Successful update of terms at /collections/exitable/terms/shard1 to Terms{values={core_node3=1}, version=1}
   [junit4]   2> 1702870 INFO  (qtp1316037008-10656) [n:127.0.0.1:44495_solr c:exitable s:shard1 r:core_node3 x:exitable_shard1_replica_n1 ] o.a.s.u.p.LogUpdateProcessorFactory [exitable_shard1_replica_n1]  webapp=/solr path=/update params={_stateVer_=exitable:6&wt=javabin&version=2}{add=[1 (1644034687029477376), 4 (1644034687031574528), 8 (1644034687031574529), 10 (1644034687031574530), 11 (1644034687031574531), 12 (1644034687031574532), 13 (1644034687031574533), 14 (1644034687031574534), 15 (1644034687031574535), 16 (1644034687031574536), ... (33 adds)]} 0 206
   [junit4]   2> 1702980 INFO  (qtp1316037008-10659) [n:127.0.0.1:44495_solr c:exitable s:shard1 r:core_node3 x:exitable_shard1_replica_n1 ] o.a.s.u.DirectUpdateHandler2 start commit{_version_=1644034687259115520,optimize=false,openSearcher=true,waitSearcher=true,expungeDeletes=false,softCommit=false,prepareCommit=false}
   [junit4]   2> 1702980 INFO  (qtp1316037008-10659) [n:127.0.0.1:44495_solr c:exitable s:shard1 r:core_node3 x:exitable_shard1_replica_n1 ] o.a.s.u.SolrIndexWriter Calling setCommitData with IW:org.apache.solr.update.SolrIndexWriter@695710c5 commitCommandVersion:1644034687259115520
   [junit4]   2> 1703035 INFO  (qtp1316037008-10659) [n:127.0.0.1:44495_solr c:exitable s:shard1 r:core_node3 x:exitable_shard1_replica_n1 ] o.a.s.s.SolrIndexSearcher Opening [Searcher@34113df5[exitable_shard1_replica_n1] main]
   [junit4]   2> 1703090 INFO  (searcherExecutor-3834-thread-1-processing-n:127.0.0.1:44495_solr x:exitable_shard1_replica_n1 c:exitable s:shard1 r:core_node3) [n:127.0.0.1:44495_solr c:exitable s:shard1 r:core_node3 x:exitable_shard1_replica_n1 ] o.a.s.c.SolrCore [exitable_shard1_replica_n1] Registered new searcher Searcher@34113df5[exitable_shard1_replica_n1] main{ExitableDirectoryReader(UninvertingDirectoryReader(Uninverting(FilterLeafReader(_0(9.0.0):C33:[diagnostics={source=flush, os.arch=amd64, java.runtime.version=11.0.1+13-LTS, os.version=4.4.0-112-generic, os=Linux, java.vendor=Oracle Corporation, timestamp=1567873656573, java.version=11.0.1, java.vm.version=11.0.1+13-LTS, lucene.version=9.0.0}]:[attributes={Lucene50StoredFieldsFormat.mode=BEST_SPEED}]))))}
   [junit4]   2> 1703091 INFO  (qtp1316037008-10659) [n:127.0.0.1:44495_solr c:exitable s:shard1 r:core_node3 x:exitable_shard1_replica_n1 ] o.a.s.u.DirectUpdateHandler2 end_commit_flush
   [junit4]   2> 1703091 INFO  (qtp1316037008-10659) [n:127.0.0.1:44495_solr c:exitable s:shard1 r:core_node3 x:exitable_shard1_replica_n1 ] o.a.s.u.p.LogUpdateProcessorFactory [exitable_shard1_replica_n1]  webapp=/solr path=/update params={update.distrib=TOLEADER&waitSearcher=true&openSearcher=true&commit=true&softCommit=false&distrib.from=http://127.0.0.1:38987/solr/exitable_shard2_replica_n2/&commit_end_point=leaders&wt=javabin&version=2&expungeDeletes=false}{commit=} 0 111
   [junit4]   2> 1703092 INFO  (qtp533524654-10646) [n:127.0.0.1:38987_solr c:exitable s:shard2 r:core_node4 x:exitable_shard2_replica_n2 ] o.a.s.u.DirectUpdateHandler2 start commit{_version_=1644034687376556032,optimize=false,openSearcher=true,waitSearcher=true,expungeDeletes=false,softCommit=false,prepareCommit=false}
   [junit4]   2> 1703092 INFO  (qtp533524654-10646) [n:127.0.0.1:38987_solr c:exitable s:shard2 r:core_node4 x:exitable_shard2_replica_n2 ] o.a.s.u.SolrIndexWriter Calling setCommitData with IW:org.apache.solr.update.SolrIndexWriter@718e730e commitCommandVersion:1644034687376556032
   [junit4]   2> 1703178 INFO  (qtp533524654-10646) [n:127.0.0.1:38987_solr c:exitable s:shard2 r:core_node4 x:exitable_shard2_replica_n2 ] o.a.s.s.SolrIndexSearcher Opening [Searcher@287bd2da[exitable_shard2_replica_n2] main]
   [junit4]   2> 1703181 INFO  (searcherExecutor-3835-thread-1-processing-n:127.0.0.1:38987_solr x:exitable_shard2_replica_n2 c:exitable s:shard2 r:core_node4) [n:127.0.0.1:38987_solr c:exitable s:shard2 r:core_node4 x:exitable_shard2_replica_n2 ] o.a.s.c.SolrCore [exitable_shard2_replica_n2] Registered new searcher Searcher@287bd2da[exitable_shard2_replica_n2] main{ExitableDirectoryReader(UninvertingDirectoryReader(Uninverting(FilterLeafReader(_0(9.0.0):C24:[diagnostics={source=flush, os.arch=amd64, java.runtime.version=11.0.1+13-LTS, os.version=4.4.0-112-generic, os=Linux, java.vendor=Oracle Corporation, timestamp=1567873656647, java.version=11.0.1, java.vm.version=11.0.1+13-LTS, lucene.version=9.0.0}]:[attributes={Lucene50StoredFieldsFormat.mode=BEST_SPEED}]))))}
   [junit4]   2> 1703181 INFO  (qtp533524654-10646) [n:127.0.0.1:38987_solr c:exitable s:shard2 r:core_node4 x:exitable_shard2_replica_n2 ] o.a.s.u.DirectUpdateHandler2 end_commit_flush
   [junit4]   2> 1703181 INFO  (qtp533524654-10646) [n:127.0.0.1:38987_solr c:exitable s:shard2 r:core_node4 x:exitable_shard2_replica_n2 ] o.a.s.u.p.LogUpdateProcessorFactory [exitable_shard2_replica_n2]  webapp=/solr path=/update params={_stateVer_=exitable:6&commit=true&wt=javabin&version=2}{commit=} 0 298
   [junit4]   2> 1703698 INFO  (TEST-CloudExitableDirectoryReaderTest.testWhitebox-seed#[A714B89C7B9BD09A]) [     ] o.a.s.SolrTestCaseJ4 ###Starting testWhitebox
   [junit4]   2> 1704089 INFO  (qtp1316037008-10658) [n:127.0.0.1:44495_solr c:exitable s:shard1 r:core_node3 x:exitable_shard1_replica_n1 ] o.a.s.c.S.Request [exitable_shard1_replica_n1]  webapp=/solr path=/select params={distrib=false&_stateVer_=exitable:6&fl=id&shards.purpose=4&start=0&fsv=true&sort=query($q,1)+asc&shard.url=http://127.0.0.1:44495/solr/exitable_shard1_replica_n1/&rows=10&version=2&q={!cache%3Dfalse}name:a*&omitHeader=false&NOW=1567873657277&isShard=true&wt=javabin} hits=10 status=0 QTime=279
   [junit4]   2> 1704093 INFO  (qtp533524654-10644) [n:127.0.0.1:38987_solr c:exitable s:shard2 r:core_node4 x:exitable_shard2_replica_n2 ] o.a.s.c.S.Request [exitable_shard2_replica_n2]  webapp=/solr path=/select params={distrib=false&_stateVer_=exitable:6&fl=id&shards.purpose=4&start=0&fsv=true&sort=query($q,1)+asc&shard.url=http://127.0.0.1:38987/solr/exitable_shard2_replica_n2/&rows=10&version=2&q={!cache%3Dfalse}name:a*&omitHeader=false&NOW=1567873657277&isShard=true&wt=javabin} hits=9 status=0 QTime=253
   [junit4]   2> 1704197 WARN  (qtp1316037008-10658) [n:127.0.0.1:44495_solr c:exitable s:shard1 r:core_node3 x:exitable_shard1_replica_n1 ] o.a.s.h.c.SearchHandler Query: q={!cache%3Dfalse}name:a*&distrib=false&_stateVer_=exitable:6&omitHeader=false&shards.purpose=64&NOW=1567873657277&ids=1&isShard=true&shard.url=http://127.0.0.1:44495/solr/exitable_shard1_replica_n1/&wt=javabin&version=2; The request took too long to iterate over terms. Timeout: hunting for doProcessSearchByIds(), TermsEnum=OrdsSegmentTermsEnum(seg=OrdsBlockTreeTermsReader(fields=2,delegate=Lucene50PostingsReader(positions=true,payloads=false)))
   [junit4]   2> 1704197 INFO  (qtp1316037008-10658) [n:127.0.0.1:44495_solr c:exitable s:shard1 r:core_node3 x:exitable_shard1_replica_n1 ] o.a.s.c.S.Request [exitable_shard1_replica_n1]  webapp=/solr path=/select params={q={!cache%3Dfalse}name:a*&distrib=false&_stateVer_=exitable:6&omitHeader=false&shards.purpose=64&NOW=1567873657277&ids=1&isShard=true&shard.url=http://127.0.0.1:44495/solr/exitable_shard1_replica_n1/&wt=javabin&version=2} status=0 QTime=57
   [junit4]   2> 1704203 WARN  (qtp533524654-10645) [n:127.0.0.1:38987_solr c:exitable s:shard2 r:core_node4 x:exitable_shard2_replica_n2 ] o.a.s.h.c.SearchHandler Query: q={!cache%3Dfalse}name:a*&distrib=false&_stateVer_=exitable:6&omitHeader=false&shards.purpose=64&NOW=1567873657277&ids=2,3,5,17,6,18,7,19,9&isShard=true&shard.url=http://127.0.0.1:38987/solr/exitable_shard2_replica_n2/&wt=javabin&version=2; The request took too long to iterate over terms. Timeout: hunting for doProcessSearchByIds(), TermsEnum=OrdsSegmentTermsEnum(seg=OrdsBlockTreeTermsReader(fields=2,delegate=Lucene50PostingsReader(positions=true,payloads=false)))
   [junit4]   2> 1704203 INFO  (qtp533524654-10645) [n:127.0.0.1:38987_solr c:exitable s:shard2 r:core_node4 x:exitable_shard2_replica_n2 ] o.a.s.c.S.Request [exitable_shard2_replica_n2]  webapp=/solr path=/select params={q={!cache%3Dfalse}name:a*&distrib=false&_stateVer_=exitable:6&omitHeader=false&shards.purpose=64&NOW=1567873657277&ids=2,3,5,17,6,18,7,19,9&isShard=true&shard.url=http://127.0.0.1:38987/solr/exitable_shard2_replica_n2/&wt=javabin&version=2} status=0 QTime=56
   [junit4]   2> 1704211 INFO  (qtp1316037008-10655) [n:127.0.0.1:44495_solr c:exitable s:shard1 r:core_node3 x:exitable_shard1_replica_n1 ] o.a.s.c.S.Request [exitable_shard1_replica_n1]  webapp=/solr path=/select params={q={!cache%3Dfalse}name:a*&_stateVer_=exitable:6&sort=query($q,1)+asc&wt=javabin&version=2} hits=19 status=0 QTime=478
   [junit4]   2> 1704354 WARN  (qtp1316037008-10656) [n:127.0.0.1:44495_solr c:exitable s:shard1 r:core_node3 x:exitable_shard1_replica_n1 ] o.a.s.h.c.SearchHandler Query: distrib=false&_stateVer_=exitable:6&fl=id&shards.purpose=4&start=0&fsv=true&sort=query($q,1)+asc&shard.url=http://127.0.0.1:44495/solr/exitable_shard1_replica_n1/&rows=10&version=2&q={!cache%3Dfalse}name:a*&omitHeader=false&NOW=1567873657759&isShard=true&wt=javabin; The request took too long to iterate over terms. Timeout: hunting for doFieldSortValues(), TermsEnum=org.apache.lucene.codecs.blocktreeords.OrdsIntersectTermsEnum@5f0c3300
   [junit4]   2> 1704354 INFO  (qtp1316037008-10656) [n:127.0.0.1:44495_solr c:exitable s:shard1 r:core_node3 x:exitable_shard1_replica_n1 ] o.a.s.c.S.Request [exitable_shard1_replica_n1]  webapp=/solr path=/select params={distrib=false&_stateVer_=exitable:6&fl=id&shards.purpose=4&start=0&fsv=true&sort=query($q,1)+asc&shard.url=http://127.0.0.1:44495/solr/exitable_shard1_replica_n1/&rows=10&version=2&q={!cache%3Dfalse}name:a*&omitHeader=false&NOW=1567873657759&isShard=true&wt=javabin} hits=10 status=0 QTime=86
   [junit4]   2> 1704381 WARN  (qtp533524654-10647) [n:127.0.0.1:38987_solr c:exitable s:shard2 r:core_node4 x:exitable_shard2_replica_n2 ] o.a.s.h.c.SearchHandler Query: distrib=false&_stateVer_=exitable:6&fl=id&shards.purpose=4&start=0&fsv=true&sort=query($q,1)+asc&shard.url=http://127.0.0.1:38987/solr/exitable_shard2_replica_n2/&rows=10&version=2&q={!cache%3Dfalse}name:a*&omitHeader=false&NOW=1567873657759&isShard=true&wt=javabin; The request took too long to iterate over terms. Timeout: hunting for doFieldSortValues(), TermsEnum=org.apache.lucene.codecs.blocktreeords.OrdsIntersectTermsEnum@6ca408f9
   [junit4]   2> 1704381 INFO  (qtp533524654-10647) [n:127.0.0.1:38987_solr c:exitable s:shard2 r:core_node4 x:exitable_shard2_replica_n2 ] o.a.s.c.S.Request [exitable_shard2_replica_n2]  webapp=/solr path=/select params={distrib=false&_stateVer_=exitable:6&fl=id&shards.purpose=4&start=0&fsv=true&sort=query($q,1)+asc&shard.url=http://127.0.0.1:38987/solr/exitable_shard2_replica_n2/&rows=10&version=2&q={!cache%3Dfalse}name:a*&omitHeader=false&NOW=1567873657759&isShard=true&wt=javabin} hits=9 status=0 QTime=149
   [junit4]   2> 1704438 INFO  (qtp533524654-10646) [n:127.0.0.1:38987_solr c:exitable s:shard2 r:core_node4 x:exitable_shard2_replica_n2 ] o.a.s.c.S.Request [exitable_shard2_replica_n2]  webapp=/solr path=/select params={q={!cache%3Dfalse}name:a*&_stateVer_=exitable:6&sort=query($q,1)+asc&wt=javabin&version=2} hits=19 status=0 QTime=218
   [junit4]   2> 1704459 WARN  (qtp533524654-10644) [n:127.0.0.1:38987_solr c:exitable s:shard2 r:core_node4 x:exitable_shard2_replica_n2 ] o.a.s.s.SolrIndexSearcher Query: [name:a*]; The request took too long to iterate over terms. Timeout: className contains QueryComponent, TermsEnum=org.apache.lucene.codecs.blocktreeords.OrdsIntersectTermsEnum@70942fff
   [junit4]   2> 1704460 WARN  (qtp1316037008-10657) [n:127.0.0.1:44495_solr c:exitable s:shard1 r:core_node3 x:exitable_shard1_replica_n1 ] o.a.s.s.SolrIndexSearcher Query: [name:a*]; The request took too long to iterate over terms. Timeout: className contains QueryComponent, TermsEnum=org.apache.lucene.codecs.blocktreeords.OrdsIntersectTermsEnum@79ea3be0
   [junit4]   2> 1704460 INFO  (qtp1316037008-10657) [n:127.0.0.1:44495_solr c:exitable s:shard1 r:core_node3 x:exitable_shard1_replica_n1 ] o.a.s.c.S.Request [exitable_shard1_replica_n1]  webapp=/solr path=/select params={distrib=false&_stateVer_=exitable:6&fl=id&fl=score&shards.purpose=4&start=0&fsv=true&shard.url=http://127.0.0.1:44495/solr/exitable_shard1_replica_n1/&rows=10&version=2&q={!cache%3Dfalse}name:a*&omitHeader=false&NOW=1567873657980&isShard=true&wt=javabin} hits=0 status=0 QTime=19
   [junit4]   2> 1704461 INFO  (qtp533524654-10644) [n:127.0.0.1:38987_solr c:exitable s:shard2 r:core_node4 x:exitable_shard2_replica_n2 ] o.a.s.c.S.Request [exitable_shard2_replica_n2]  webapp=/solr path=/select params={distrib=false&_stateVer_=exitable:6&fl=id&fl=score&shards.purpose=4&start=0&fsv=true&shard.url=http://127.0.0.1:38987/solr/exitable_shard2_replica_n2/&rows=10&version=2&q={!cache%3Dfalse}name:a*&omitHeader=false&NOW=1567873657980&isShard=true&wt=javabin} hits=0 status=0 QTime=19
   [junit4]   2> 1704462 INFO  (qtp533524654-10640) [n:127.0.0.1:38987_solr c:exitable s:shard2 r:core_node4 x:exitable_shard2_replica_n2 ] o.a.s.c.S.Request [exitable_shard2_replica_n2]  webapp=/solr path=/select params={q={!cache%3Dfalse}name:a*&_stateVer_=exitable:6&wt=javabin&version=2} hits=0 status=0 QTime=21
   [junit4]   2> 1704621 WARN  (qtp533524654-10647) [n:127.0.0.1:38987_solr c:exitable s:shard2 r:core_node4 x:exitable_shard2_replica_n2 ] o.a.s.h.c.SearchHandler Query: facet.field=id&distrib=false&_stateVer_=exitable:6&f.id.facet.mincount=0&fl=id&fl=score&shards.purpose=20&start=0&fsv=true&f.id.facet.limit=160&shard.url=http://127.0.0.1:38987/solr/exitable_shard2_replica_n2/&rows=10&version=2&q={!cache%3Dfalse}name:a*&omitHeader=false&NOW=1567873658016&isShard=true&facet.method=enum&facet=true&wt=javabin; The request took too long to iterate over terms. Timeout: className contains FacetComponent, TermsEnum=OrdsSegmentTermsEnum(seg=OrdsBlockTreeTermsReader(fields=2,delegate=Lucene50PostingsReader(positions=true,payloads=false)))
   [junit4]   2> 1704621 INFO  (qtp533524654-10647) [n:127.0.0.1:38987_solr c:exitable s:shard2 r:core_node4 x:exitable_shard2_replica_n2 ] o.a.s.c.S.Request [exitable_shard2_replica_n2]  webapp=/solr path=/select params={facet.field=id&distrib=false&_stateVer_=exitable:6&f.id.facet.mincount=0&fl=id&fl=score&shards.purpose=20&start=0&fsv=true&f.id.facet.limit=160&shard.url=http://127.0.0.1:38987/solr/exitable_shard2_replica_n2/&rows=10&version=2&q={!cache%3Dfalse}name:a*&omitHeader=false&NOW=1567873658016&isShard=true&facet.method=enum&facet=true&wt=javabin} hits=9 status=0 QTime=144
   [junit4]   2> 1704623 WARN  (qtp1316037008-10659) [n:127.0.0.1:44495_solr c:exitable s:shard1 r:core_node3 x:exitable_shard1_replica_n1 ] o.a.s.h.c.SearchHandler Query: facet.field=id&distrib=false&_stateVer_=exitable:6&f.id.facet.mincount=0&fl=id&fl=score&shards.purpose=20&start=0&fsv=true&f.id.facet.limit=160&shard.url=http://127.0.0.1:44495/solr/exitable_shard1_replica_n1/&rows=10&version=2&q={!cache%3Dfalse}name:a*&omitHeader=false&NOW=1567873658016&isShard=true&facet.method=enum&facet=true&wt=javabin; The request took too long to iterate over terms. Timeout: className contains FacetComponent, TermsEnum=OrdsSegmentTermsEnum(seg=OrdsBlockTreeTermsReader(fields=2,delegate=Lucene50PostingsReader(positions=true,payloads=false)))
   [junit4]   2> 1704623 INFO  (qtp1316037008-10659) [n:127.0.0.1:44495_solr c:exitable s:shard1 r:core_node3 x:exitable_shard1_replica_n1 ] o.a.s.c.S.Request [exitable_shard1_replica_n1]  webapp=/solr path=/select params={facet.field=id&distrib=false&_stateVer_=exitable:6&f.id.facet.mincount=0&fl=id&fl=score&shards.purpose=20&start=0&fsv=true&f.id.facet.limit=160&shard.url=http://127.0.0.1:44495/solr/exitable_shard1_replica_n1/&rows=10&version=2&q={!cache%3Dfalse}name:a*&omitHeader=false&NOW=1567873658016&isShard=true&facet.method=enum&facet=true&wt=javabin} hits=10 status=0 QTime=132
   [junit4]   2> 1704623 INFO  (qtp533524654-10645) [n:127.0.0.1:38987_solr c:exitable s:shard2 r:core_node4 x:exitable_shard2_replica_n2 ] o.a.s.c.S.Request [exitable_shard2_replica_n2]  webapp=/solr path=/select params={q={!cache%3Dfalse}name:a*&facet.field=id&_stateVer_=exitable:6&facet.method=enum&facet=true&wt=javabin&version=2} hits=19 status=0 QTime=147
   [junit4]   2> 1704757 WARN  (qtp1316037008-10655) [n:127.0.0.1:44495_solr c:exitable s:shard1 r:core_node3 x:exitable_shard1_replica_n1 ] o.a.s.h.c.SearchHandler Query: distrib=false&_stateVer_=exitable:6&_facet_={}&fl=id&fl=score&shards.purpose=1048580&start=0&fsv=true&shard.url=http://127.0.0.1:44495/solr/exitable_shard1_replica_n1/&rows=10&version=2&q={!cache%3Dfalse}name:a*&json.facet={+ids:+{+type:+range,+field+:+num,+start+:+0,+end+:+100,+gap+:+10+}}&omitHeader=false&NOW=1567873658197&isShard=true&wt=javabin; The request took too long to iterate over point values. Timeout: className contains FacetModule, PointValues=org.apache.lucene.index.AssertingLeafReader$AssertingPointValues@38d14f21
   [junit4]   2> 1704757 INFO  (qtp1316037008-10655) [n:127.0.0.1:44495_solr c:exitable s:shard1 r:core_node3 x:exitable_shard1_replica_n1 ] o.a.s.c.S.Request [exitable_shard1_replica_n1]  webapp=/solr path=/select params={distrib=false&_stateVer_=exitable:6&_facet_={}&fl=id&fl=score&shards.purpose=1048580&start=0&fsv=true&shard.url=http://127.0.0.1:44495/solr/exitable_shard1_replica_n1/&rows=10&version=2&q={!cache%3Dfalse}name:a*&json.facet={+ids:+{+type:+range,+field+:+num,+start+:+0,+end+:+100,+gap+:+10+}}&omitHeader=false&NOW=1567873658197&isShard=true&wt=javabin} hits=10 status=0 QTime=98
   [junit4]   2> 1704803 WARN  (qtp533524654-10646) [n:127.0.0.1:38987_solr c:exitable s:shard2 r:core_node4 x:exitable_shard2_replica_n2 ] o.a.s.h.c.SearchHandler Query: distrib=false&_stateVer_=exitable:6&_facet_={}&fl=id&fl=score&shards.purpose=1048580&start=0&fsv=true&shard.url=http://127.0.0.1:38987/solr/exitable_shard2_replica_n2/&rows=10&version=2&q={!cache%3Dfalse}name:a*&json.facet={+ids:+{+type:+range,+field+:+num,+start+:+0,+end+:+100,+gap+:+10+}}&omitHeader=false&NOW=1567873658197&isShard=true&wt=javabin; The request took too long to iterate over point values. Timeout: className contains FacetModule, PointValues=org.apache.lucene.index.AssertingLeafReader$AssertingPointValues@64b6ffea
   [junit4]   2> 1704803 INFO  (qtp533524654-10646) [n:127.0.0.1:38987_solr c:exitable s:shard2 r:core_node4 x:exitable_shard2_replica_n2 ] o.a.s.c.S.Request [exitable_shard2_replica_n2]  webapp=/solr path=/select params={distrib=false&_stateVer_=exitable:6&_facet_={}&fl=id&fl=score&shards.purpose=1048580&start=0&fsv=true&shard.url=http://127.0.0.1:38987/solr/exitable_shard2_replica_n2/&rows=10&version=2&q={!cache%3Dfalse}name:a*&json.facet={+ids:+{+type:+range,+field+:+num,+start+:+0,+end+:+100,+gap+:+10+}}&omitHeader=false&NOW=1567873658197&isShard=true&wt=javabin} hits=9 status=0 QTime=129
   [junit4]   2> 1704807 INFO  (qtp1316037008-10658) [n:127.0.0.1:44495_solr c:exitable s:shard1 r:core_node3 x:exitable_shard1_replica_n1 ] o.a.s.c.S.Request [exitable_shard1_replica_n1]  webapp=/solr path=/select params={q={!cache%3Dfalse}name:a*&json.facet={+ids:+{+type:+range,+field+:+num,+start+:+0,+end+:+100,+gap+:+10+}}&_stateVer_=exitable:6&wt=javabin&version=2} hits=19 status=0 QTime=149
   [junit4]   2> 1704824 INFO  (TEST-CloudExitableDirectoryReaderTest.testWhitebox-seed#[A714B89C7B9BD09A]) [     ] o.a.s.SolrTestCaseJ4 ###Ending testWhitebox
   [junit4]   2> 1705961 INFO  (TEST-CloudExitableDirectoryReaderTest.testCreepThenBite-seed#[A714B89C7B9BD09A]) [     ] o.a.s.SolrTestCaseJ4 ###Starting testCreepThenBite {seed=[A714B89C7B9BD09A:70DCE4835019BD3B]}
   [junit4]   2> 1706012 WARN  (qtp1316037008-10656) [n:127.0.0.1:44495_solr c:exitable s:shard1 r:core_node3 x:exitable_shard1_replica_n1 ] o.a.s.h.c.SearchHandler Query: boundary=100&distrib=false&_stateVer_=exitable:6&fl=id&shards.purpose=4&start=0&fsv=true&sort=query($q,1)+asc&shard.url=http://127.0.0.1:44495/solr/exitable_shard1_replica_n1/&rows=10&version=2&q={!cache%3Dfalse}name:a*&omitHeader=false&NOW=1567873659502&isShard=true&wt=javabin; The request took too long to iterate over terms. Timeout: 100th tick of 100 allowed, TermsEnum=OrdsSegmentTermsEnum(seg=OrdsBlockTreeTermsReader(fields=2,delegate=Lucene50PostingsReader(positions=true,payloads=false)))
   [junit4]   2> 1706012 INFO  (qtp1316037008-10656) [n:127.0.0.1:44495_solr c:exitable s:shard1 r:core_node3 x:exitable_shard1_replica_n1 ] o.a.s.c.S.Request [exitable_shard1_replica_n1]  webapp=/solr path=/select params={boundary=100&distrib=false&_stateVer_=exitable:6&fl=id&shards.purpose=4&start=0&fsv=true&sort=query($q,1)+asc&shard.url=http://127.0.0.1:44495/solr/exitable_shard1_replica_n1/&rows=10&version=2&q={!cache%3Dfalse}name:a*&omitHeader=false&NOW=1567873659502&isShard=true&wt=javabin} hits=10 status=0 QTime=34
   [junit4]   2> 1706013 INFO  (qtp533524654-10644) [n:127.0.0.1:38987_solr c:exitable s:shard2 r:core_node4 x:exitable_shard2_replica_n2 ] o.a.s.c.S.Request [exitable_shard2_replica_n2]  webapp=/solr path=/select params={boundary=100&distrib=false&_stateVer_=exitable:6&fl=id&shards.purpose=4&start=0&fsv=true&sort=query($q,1)+asc&shard.url=http://127.0.0.1:38987/solr/exitable_shard2_replica_n2/&rows=10&version=2&q={!cache%3Dfalse}name:a*&omitHeader=false&NOW=1567873659502&isShard=true&wt=javabin} hits=9 status=0 QTime=49
   [junit4]   2> 1706079 INFO  (qtp533524654-10647) [n:127.0.0.1:38987_solr c:exitable s:shard2 r:core_node4 x:exitable_shard2_replica_n2 ] o.a.s.c.S.Request [exitable_shard2_replica_n2]  webapp=/solr path=/select params={boundary=100&q={!cache%3Dfalse}name:a*&distrib=false&_stateVer_=exitable:6&omitHeader=false&shards.purpose=64&NOW=1567873659502&ids=2,3,5,17,6,18,7,19,9&isShard=true&shard.url=http://127.0.0.1:38987/solr/exitable_shard2_replica_n2/&wt=javabin&version=2} status=0 QTime=11
   [junit4]   2> 1706080 INFO  (qtp533524654-10640) [n:127.0.0.1:38987_solr c:exitable s:shard2 r:core_node4 x:exitable_shard2_replica_n2 ] o.a.s.c.S.Request [exitable_shard2_replica_n2]  webapp=/solr path=/select params={boundary=100&q={!cache%3Dfalse}name:a*&_stateVer_=exitable:6&sort=query($q,1)+asc&wt=javabin&version=2} hits=19 status=0 QTime=117
   [junit4]   2> 1706101 INFO  (qtp533524654-10646) [n:127.0.0.1:38987_solr c:exitable s:shard2 r:core_node4 x:exitable_shard2_replica_n2 ] o.a.s.c.S.Request [exitable_shard2_replica_n2]  webapp=/solr path=/select params={boundary=150&distrib=false&_stateVer_=exitable:6&fl=id&shards.purpose=4&start=0&fsv=true&sort=query($q,1)+asc&shard.url=http://127.0.0.1:38987/solr/exitable_shard2_replica_n2/&rows=10&version=2&q={!cache%3Dfalse}name:a*&omitHeader=false&NOW=1567873659621&isShard=true&wt=javabin} hits=9 status=0 QTime=19
   [junit4]   2> 1706266 INFO  (qtp1316037008-10657) [n:127.0.0.1:44495_solr c:exitable s:shard1 r:core_node3 x:exitable_shard1_replica_n1 ] o.a.s.c.S.Request [exitable_shard1_replica_n1]  webapp=/solr path=/select params={boundary=150&distrib=false&_stateVer_=exitable:6&fl=id&shards.purpose=4&start=0&fsv=true&sort=query($q,1)+asc&shard.url=http://127.0.0.1:44495/solr/exitable_shard1_replica_n1/&rows=10&version=2&q={!cache%3Dfalse}name:a*&omitHeader=false&NOW=1567873659621&isShard=true&wt=javabin} hits=10 status=0 QTime=73
   [junit4]   2> 1706338 INFO  (qtp533524654-10644) [n:127.0.0.1:38987_solr c:exitable s:shard2 r:core_node4 x:exitable_shard2_replica_n2 ] o.a.s.c.S.Request [exitable_shard2_replica_n2]  webapp=/solr path=/select params={boundary=150&q={!cache%3Dfalse}name:a*&distrib=false&_stateVer_=exitable:6&omitHeader=false&shards.purpose=64&NOW=1567873659621&ids=2,3,5,17,6,18,7,19,9&isShard=true&shard.url=http://127.0.0.1:38987/solr/exitable_shard2_replica_n2/&wt=javabin&version=2} status=0 QTime=17
   [junit4]   2> 1706339 INFO  (qtp1316037008-10659) [n:127.0.0.1:44495_solr c:exitable s:shard1 r:core_node3 x:exitable_shard1_replica_n1 ] o.a.s.c.S.Request [exitable_shard1_replica_n1]  webapp=/solr path=/select params={boundary=150&q={!cache%3Dfalse}name:a*&distrib=false&_stateVer_=exitable:6&omitHeader=false&shards.purpose=64&NOW=1567873659621&ids=1&isShard=true&shard.url=http://127.0.0.1:44495/solr/exitable_shard1_replica_n1/&wt=javabin&version=2} status=0 QTime=18
   [junit4]   2> 1706339 INFO  (qtp533524654-10645) [n:127.0.0.1:38987_solr c:exitable s:shard2 r:core_node4 x:exitable_shard2_replica_n2 ] o.a.s.c.S.Request [exitable_shard2_replica_n2]  webapp=/solr path=/select params={boundary=150&q={!cache%3Dfalse}name:a*&_stateVer_=exitable:6&sort=query($q,1)+asc&wt=javabin&version=2} hits=19 status=0 QTime=258
   [junit4]   2> 1706360 WARN  (qtp1316037008-10658) [n:127.0.0.1:44495_solr c:exitable s:shard1 r:core_node3 x:exitable_shard1_replica_n1 ] o.a.s.s.SolrIndexSearcher Query: [name:a*]; The request took too long to iterate over terms. Timeout: 40th tick of 40 allowed, TermsEnum=OrdsSegmentTermsEnum(seg=OrdsBlockTreeTermsReader(fields=2,delegate=Lucene50PostingsReader(positions=true,payloads=false)))
   [junit4]   2> 1706360 INFO  (qtp1316037008-10658) [n:127.0.0.1:44495_solr c:exitable s:shard1 r:core_node3 x:exitable_shard1_replica_n1 ] o.a.s.c.S.Request [exitable_shard1_replica_n1]  webapp=/solr path=/select params={boundary=40&distrib=false&_stateVer_=exitable:6&fl=id&shards.purpose=4&start=0&fsv=true&sort=query($q,1)+asc&shard.url=http://127.0.0.1:44495/solr/exitable_shard1_replica_n1/&rows=10&version=2&q={!cache%3Dfalse}name:a*&omitHeader=false&NOW=1567873659880&isShard=true&wt=javabin} hits=0 status=0 QTime=1
   [junit4]   2> 1706396 INFO  (qtp533524654-10647) [n:127.0.0.1:38987_solr c:exitable s:shard2 r:core_node4 x:exitable_shard2_replica_n2 ] o.a.s.c.S.Request [exitable_shard2_replica_n2]  webapp=/solr path=/select params={boundary=40&distrib=false&_stateVer_=exitable:6&fl=id&shards.purpose=4&start=0&fsv=true&sort=query($q,1)+asc&shard.url=http://127.0.0.1:38987/solr/exitable_shard2_replica_n2/&rows=10&version=2&q={!cache%3Dfalse}name:a*&omitHeader=false&NOW=1567873659880&isShard=true&wt=javabin} hits=9 status=0 QTime=54
   [junit4]   2> 1706412 INFO  (qtp533524654-10647) [n:127.0.0.1:38987_solr c:exitable s:shard2 r:core_node4 x:exitable_shard2_replica_n2 ] o.a.s.c.S.Request [exitable_shard2_replica_n2]  webapp=/solr path=/select params={boundary=40&q={!cache%3Dfalse}name:a*&distrib=false&_stateVer_=exitable:6&omitHeader=false&shards.purpose=64&NOW=1567873659880&ids=2,3,5,17,6,18,7,19,9&isShard=true&shard.url=http://127.0.0.1:38987/solr/exitable_shard2_replica_n2/&wt=javabin&version=2} status=0 QTime=1
   [junit4]   2> 1706412 INFO  (qtp1316037008-10655) [n:127.0.0.1:44495_solr c:exitable s:shard1 r:core_node3 x:exitable_shard1_replica_n1 ] o.a.s.c.S.Request [exitable_shard1_replica_n1]  webapp=/solr path=/select params={boundary=40&q={!cache%3Dfalse}name:a*&_stateVer_=exitable:6&omitHeader=true&sort=query($q,1)+asc&wt=javabin&version=2} hits=9 status=0 QTime=72
   [junit4]  

[...truncated too long message...]

/Lucene-Solr-Tests-master/lucene/top-level-ivy-settings.xml

resolve:

ivy-availability-check:
[loadresource] Do not set property disallowed.ivy.jars.list as its length is 0.

-ivy-fail-disallowed-ivy-version:

ivy-fail:

ivy-configure:
[ivy:configure] :: loading settings :: file = /home/jenkins/jenkins-slave/workspace/Lucene-Solr-Tests-master/lucene/top-level-ivy-settings.xml

resolve:

ivy-availability-check:
[loadresource] Do not set property disallowed.ivy.jars.list as its length is 0.

-ivy-fail-disallowed-ivy-version:

ivy-fail:

ivy-fail:

ivy-configure:
[ivy:configure] :: loading settings :: file = /home/jenkins/jenkins-slave/workspace/Lucene-Solr-Tests-master/lucene/top-level-ivy-settings.xml

resolve:

ivy-availability-check:
[loadresource] Do not set property disallowed.ivy.jars.list as its length is 0.

-ivy-fail-disallowed-ivy-version:

ivy-fail:

ivy-configure:
[ivy:configure] :: loading settings :: file = /home/jenkins/jenkins-slave/workspace/Lucene-Solr-Tests-master/lucene/top-level-ivy-settings.xml

resolve:

ivy-availability-check:
[loadresource] Do not set property disallowed.ivy.jars.list as its length is 0.

-ivy-fail-disallowed-ivy-version:

ivy-fail:

ivy-fail:

ivy-configure:
[ivy:configure] :: loading settings :: file = /home/jenkins/jenkins-slave/workspace/Lucene-Solr-Tests-master/lucene/top-level-ivy-settings.xml

resolve:

ivy-availability-check:
[loadresource] Do not set property disallowed.ivy.jars.list as its length is 0.

-ivy-fail-disallowed-ivy-version:

ivy-fail:

ivy-fail:

ivy-configure:
[ivy:configure] :: loading settings :: file = /home/jenkins/jenkins-slave/workspace/Lucene-Solr-Tests-master/lucene/top-level-ivy-settings.xml

resolve:

ivy-availability-check:
[loadresource] Do not set property disallowed.ivy.jars.list as its length is 0.

-ivy-fail-disallowed-ivy-version:

ivy-fail:

ivy-fail:

ivy-configure:
[ivy:configure] :: loading settings :: file = /home/jenkins/jenkins-slave/workspace/Lucene-Solr-Tests-master/lucene/top-level-ivy-settings.xml

resolve:

ivy-availability-check:
[loadresource] Do not set property disallowed.ivy.jars.list as its length is 0.

-ivy-fail-disallowed-ivy-version:

ivy-fail:

ivy-fail:

ivy-configure:
[ivy:configure] :: loading settings :: file = /home/jenkins/jenkins-slave/workspace/Lucene-Solr-Tests-master/lucene/top-level-ivy-settings.xml

resolve:

ivy-availability-check:
[loadresource] Do not set property disallowed.ivy.jars.list as its length is 0.

-ivy-fail-disallowed-ivy-version:

ivy-fail:

ivy-fail:

ivy-configure:
[ivy:configure] :: loading settings :: file = /home/jenkins/jenkins-slave/workspace/Lucene-Solr-Tests-master/lucene/top-level-ivy-settings.xml

resolve:

ivy-availability-check:
[loadresource] Do not set property disallowed.ivy.jars.list as its length is 0.

-ivy-fail-disallowed-ivy-version:

ivy-fail:

ivy-fail:

ivy-configure:
[ivy:configure] :: loading settings :: file = /home/jenkins/jenkins-slave/workspace/Lucene-Solr-Tests-master/lucene/top-level-ivy-settings.xml

resolve:

ivy-availability-check:
[loadresource] Do not set property disallowed.ivy.jars.list as its length is 0.

-ivy-fail-disallowed-ivy-version:

ivy-fail:

ivy-fail:

ivy-configure:
[ivy:configure] :: loading settings :: file = /home/jenkins/jenkins-slave/workspace/Lucene-Solr-Tests-master/lucene/top-level-ivy-settings.xml

resolve:

ivy-availability-check:
[loadresource] Do not set property disallowed.ivy.jars.list as its length is 0.

-ivy-fail-disallowed-ivy-version:

ivy-fail:

ivy-fail:

ivy-configure:
[ivy:configure] :: loading settings :: file = /home/jenkins/jenkins-slave/workspace/Lucene-Solr-Tests-master/lucene/top-level-ivy-settings.xml

resolve:

ivy-availability-check:
[loadresource] Do not set property disallowed.ivy.jars.list as its length is 0.

-ivy-fail-disallowed-ivy-version:

ivy-fail:

ivy-fail:

ivy-configure:
[ivy:configure] :: loading settings :: file = /home/jenkins/jenkins-slave/workspace/Lucene-Solr-Tests-master/lucene/top-level-ivy-settings.xml

resolve:

ivy-availability-check:
[loadresource] Do not set property disallowed.ivy.jars.list as its length is 0.

-ivy-fail-disallowed-ivy-version:

ivy-fail:

ivy-fail:

ivy-configure:
[ivy:configure] :: loading settings :: file = /home/jenkins/jenkins-slave/workspace/Lucene-Solr-Tests-master/lucene/top-level-ivy-settings.xml

resolve:

ivy-availability-check:
[loadresource] Do not set property disallowed.ivy.jars.list as its length is 0.

-ivy-fail-disallowed-ivy-version:

ivy-fail:

ivy-fail:

ivy-configure:
[ivy:configure] :: loading settings :: file = /home/jenkins/jenkins-slave/workspace/Lucene-Solr-Tests-master/lucene/top-level-ivy-settings.xml

resolve:

jar-checksums:
    [mkdir] Created dir: /home/jenkins/jenkins-slave/workspace/Lucene-Solr-Tests-master/solr/null909793937
     [copy] Copying 249 files to /home/jenkins/jenkins-slave/workspace/Lucene-Solr-Tests-master/solr/null909793937
   [delete] Deleting directory /home/jenkins/jenkins-slave/workspace/Lucene-Solr-Tests-master/solr/null909793937

check-working-copy:
[ivy:cachepath] :: resolving dependencies :: #;[hidden email]
[ivy:cachepath] confs: [default]
[ivy:cachepath] found org.eclipse.jgit#org.eclipse.jgit;5.3.0.201903130848-r in public
[ivy:cachepath] found com.jcraft#jsch;0.1.54 in public
[ivy:cachepath] found com.jcraft#jzlib;1.1.1 in public
[ivy:cachepath] found com.googlecode.javaewah#JavaEWAH;1.1.6 in public
[ivy:cachepath] found org.slf4j#slf4j-api;1.7.2 in public
[ivy:cachepath] found org.bouncycastle#bcpg-jdk15on;1.60 in public
[ivy:cachepath] found org.bouncycastle#bcprov-jdk15on;1.60 in public
[ivy:cachepath] found org.bouncycastle#bcpkix-jdk15on;1.60 in public
[ivy:cachepath] found org.slf4j#slf4j-nop;1.7.2 in public
[ivy:cachepath] :: resolution report :: resolve 35ms :: artifacts dl 4ms
        ---------------------------------------------------------------------
        |                  |            modules            ||   artifacts   |
        |       conf       | number| search|dwnlded|evicted|| number|dwnlded|
        ---------------------------------------------------------------------
        |      default     |   9   |   0   |   0   |   0   ||   9   |   0   |
        ---------------------------------------------------------------------
[wc-checker] Initializing working copy...
[wc-checker] Checking working copy status...

-jenkins-base:

BUILD SUCCESSFUL
Total time: 185 minutes 7 seconds
Archiving artifacts
java.lang.InterruptedException: no matches found within 10000
        at hudson.FilePath$ValidateAntFileMask.hasMatch(FilePath.java:2847)
        at hudson.FilePath$ValidateAntFileMask.invoke(FilePath.java:2726)
        at hudson.FilePath$ValidateAntFileMask.invoke(FilePath.java:2707)
        at hudson.FilePath$FileCallableWrapper.call(FilePath.java:3086)
Also:   hudson.remoting.Channel$CallSiteStackTrace: Remote call to lucene2
                at hudson.remoting.Channel.attachCallSiteStackTrace(Channel.java:1741)
                at hudson.remoting.UserRequest$ExceptionResponse.retrieve(UserRequest.java:357)
                at hudson.remoting.Channel.call(Channel.java:955)
                at hudson.FilePath.act(FilePath.java:1072)
                at hudson.FilePath.act(FilePath.java:1061)
                at hudson.FilePath.validateAntFileMask(FilePath.java:2705)
                at hudson.tasks.ArtifactArchiver.perform(ArtifactArchiver.java:243)
                at hudson.tasks.BuildStepCompatibilityLayer.perform(BuildStepCompatibilityLayer.java:81)
                at hudson.tasks.BuildStepMonitor$1.perform(BuildStepMonitor.java:20)
                at hudson.model.AbstractBuild$AbstractBuildExecution.perform(AbstractBuild.java:744)
                at hudson.model.AbstractBuild$AbstractBuildExecution.performAllBuildSteps(AbstractBuild.java:690)
                at hudson.model.Build$BuildExecution.post2(Build.java:186)
                at hudson.model.AbstractBuild$AbstractBuildExecution.post(AbstractBuild.java:635)
                at hudson.model.Run.execute(Run.java:1835)
                at hudson.model.FreeStyleBuild.run(FreeStyleBuild.java:43)
                at hudson.model.ResourceController.execute(ResourceController.java:97)
                at hudson.model.Executor.run(Executor.java:429)
Caused: hudson.FilePath$TunneledInterruptedException
        at hudson.FilePath$FileCallableWrapper.call(FilePath.java:3088)
        at hudson.remoting.UserRequest.perform(UserRequest.java:212)
        at hudson.remoting.UserRequest.perform(UserRequest.java:54)
        at hudson.remoting.Request$2.run(Request.java:369)
        at hudson.remoting.InterceptingExecutorService$1.call(InterceptingExecutorService.java:72)
        at java.util.concurrent.FutureTask.run(FutureTask.java:266)
        at java.util.concurrent.ThreadPoolExecutor.runWorker(ThreadPoolExecutor.java:1142)
        at java.util.concurrent.ThreadPoolExecutor$Worker.run(ThreadPoolExecutor.java:617)
        at java.lang.Thread.run(Thread.java:748)
Caused: java.lang.InterruptedException: java.lang.InterruptedException: no matches found within 10000
        at hudson.FilePath.act(FilePath.java:1074)
        at hudson.FilePath.act(FilePath.java:1061)
        at hudson.FilePath.validateAntFileMask(FilePath.java:2705)
        at hudson.tasks.ArtifactArchiver.perform(ArtifactArchiver.java:243)
        at hudson.tasks.BuildStepCompatibilityLayer.perform(BuildStepCompatibilityLayer.java:81)
        at hudson.tasks.BuildStepMonitor$1.perform(BuildStepMonitor.java:20)
        at hudson.model.AbstractBuild$AbstractBuildExecution.perform(AbstractBuild.java:744)
        at hudson.model.AbstractBuild$AbstractBuildExecution.performAllBuildSteps(AbstractBuild.java:690)
        at hudson.model.Build$BuildExecution.post2(Build.java:186)
        at hudson.model.AbstractBuild$AbstractBuildExecution.post(AbstractBuild.java:635)
        at hudson.model.Run.execute(Run.java:1835)
        at hudson.model.FreeStyleBuild.run(FreeStyleBuild.java:43)
        at hudson.model.ResourceController.execute(ResourceController.java:97)
        at hudson.model.Executor.run(Executor.java:429)
No artifacts found that match the file pattern "**/*.events,heapdumps/**,**/hs_err_pid*". Configuration error?
Recording test results
Build step 'Publish JUnit test result report' changed build result to UNSTABLE
Email was triggered for: Unstable (Test Failures)
Sending email for trigger: Unstable (Test Failures)


---------------------------------------------------------------------
To unsubscribe, e-mail: [hidden email]
For additional commands, e-mail: [hidden email]