[JENKINS] Lucene-Solr-Tests-master - Build # 3697 - Unstable

classic Classic list List threaded Threaded
1 message Options
Reply | Threaded
Open this post in threaded view
|

[JENKINS] Lucene-Solr-Tests-master - Build # 3697 - Unstable

Apache Jenkins Server-2
Build: https://builds.apache.org/job/Lucene-Solr-Tests-master/3697/

1 tests failed.
FAILED:  org.apache.solr.search.facet.TestCloudJSONFacetSKG.testRandom

Error Message:
No live SolrServers available to handle this request:[http://127.0.0.1:44819/solr/org.apache.solr.search.facet.TestCloudJSONFacetSKG_collection]

Stack Trace:
org.apache.solr.client.solrj.SolrServerException: No live SolrServers available to handle this request:[http://127.0.0.1:44819/solr/org.apache.solr.search.facet.TestCloudJSONFacetSKG_collection]
        at __randomizedtesting.SeedInfo.seed([71703D6A1E770DC3:33C1865AF17BBB0]:0)
        at org.apache.solr.client.solrj.impl.LBSolrClient.request(LBSolrClient.java:345)
        at org.apache.solr.client.solrj.impl.BaseCloudSolrClient.sendRequest(BaseCloudSolrClient.java:1128)
        at org.apache.solr.client.solrj.impl.BaseCloudSolrClient.requestWithRetryOnStaleState(BaseCloudSolrClient.java:897)
        at org.apache.solr.client.solrj.impl.BaseCloudSolrClient.request(BaseCloudSolrClient.java:829)
        at org.apache.solr.client.solrj.SolrRequest.process(SolrRequest.java:207)
        at org.apache.solr.client.solrj.SolrClient.query(SolrClient.java:987)
        at org.apache.solr.client.solrj.SolrClient.query(SolrClient.java:1002)
        at org.apache.solr.search.facet.TestCloudJSONFacetSKG.getNumFound(TestCloudJSONFacetSKG.java:669)
        at org.apache.solr.search.facet.TestCloudJSONFacetSKG.verifySKGResults(TestCloudJSONFacetSKG.java:446)
        at org.apache.solr.search.facet.TestCloudJSONFacetSKG.assertFacetSKGsAreCorrect(TestCloudJSONFacetSKG.java:392)
        at org.apache.solr.search.facet.TestCloudJSONFacetSKG.assertFacetSKGsAreCorrect(TestCloudJSONFacetSKG.java:402)
        at org.apache.solr.search.facet.TestCloudJSONFacetSKG.assertFacetSKGsAreCorrect(TestCloudJSONFacetSKG.java:349)
        at org.apache.solr.search.facet.TestCloudJSONFacetSKG.testRandom(TestCloudJSONFacetSKG.java:274)
        at java.base/jdk.internal.reflect.NativeMethodAccessorImpl.invoke0(Native Method)
        at java.base/jdk.internal.reflect.NativeMethodAccessorImpl.invoke(NativeMethodAccessorImpl.java:62)
        at java.base/jdk.internal.reflect.DelegatingMethodAccessorImpl.invoke(DelegatingMethodAccessorImpl.java:43)
        at java.base/java.lang.reflect.Method.invoke(Method.java:566)
        at com.carrotsearch.randomizedtesting.RandomizedRunner.invoke(RandomizedRunner.java:1750)
        at com.carrotsearch.randomizedtesting.RandomizedRunner$8.evaluate(RandomizedRunner.java:938)
        at com.carrotsearch.randomizedtesting.RandomizedRunner$9.evaluate(RandomizedRunner.java:974)
        at com.carrotsearch.randomizedtesting.RandomizedRunner$10.evaluate(RandomizedRunner.java:988)
        at com.carrotsearch.randomizedtesting.rules.SystemPropertiesRestoreRule$1.evaluate(SystemPropertiesRestoreRule.java:57)
        at org.apache.lucene.util.TestRuleSetupTeardownChained$1.evaluate(TestRuleSetupTeardownChained.java:49)
        at org.apache.lucene.util.AbstractBeforeAfterRule$1.evaluate(AbstractBeforeAfterRule.java:45)
        at org.apache.lucene.util.TestRuleThreadAndTestName$1.evaluate(TestRuleThreadAndTestName.java:48)
        at org.apache.lucene.util.TestRuleIgnoreAfterMaxFailures$1.evaluate(TestRuleIgnoreAfterMaxFailures.java:64)
        at org.apache.lucene.util.TestRuleMarkFailure$1.evaluate(TestRuleMarkFailure.java:47)
        at com.carrotsearch.randomizedtesting.rules.StatementAdapter.evaluate(StatementAdapter.java:36)
        at com.carrotsearch.randomizedtesting.ThreadLeakControl$StatementRunner.run(ThreadLeakControl.java:368)
        at com.carrotsearch.randomizedtesting.ThreadLeakControl.forkTimeoutingTask(ThreadLeakControl.java:817)
        at com.carrotsearch.randomizedtesting.ThreadLeakControl$3.evaluate(ThreadLeakControl.java:468)
        at com.carrotsearch.randomizedtesting.RandomizedRunner.runSingleTest(RandomizedRunner.java:947)
        at com.carrotsearch.randomizedtesting.RandomizedRunner$5.evaluate(RandomizedRunner.java:832)
        at com.carrotsearch.randomizedtesting.RandomizedRunner$6.evaluate(RandomizedRunner.java:883)
        at com.carrotsearch.randomizedtesting.RandomizedRunner$7.evaluate(RandomizedRunner.java:894)
        at com.carrotsearch.randomizedtesting.rules.StatementAdapter.evaluate(StatementAdapter.java:36)
        at com.carrotsearch.randomizedtesting.rules.SystemPropertiesRestoreRule$1.evaluate(SystemPropertiesRestoreRule.java:57)
        at org.apache.lucene.util.AbstractBeforeAfterRule$1.evaluate(AbstractBeforeAfterRule.java:45)
        at com.carrotsearch.randomizedtesting.rules.StatementAdapter.evaluate(StatementAdapter.java:36)
        at org.apache.lucene.util.TestRuleStoreClassName$1.evaluate(TestRuleStoreClassName.java:41)
        at com.carrotsearch.randomizedtesting.rules.NoShadowingOrOverridesOnMethodsRule$1.evaluate(NoShadowingOrOverridesOnMethodsRule.java:40)
        at com.carrotsearch.randomizedtesting.rules.NoShadowingOrOverridesOnMethodsRule$1.evaluate(NoShadowingOrOverridesOnMethodsRule.java:40)
        at com.carrotsearch.randomizedtesting.rules.StatementAdapter.evaluate(StatementAdapter.java:36)
        at com.carrotsearch.randomizedtesting.rules.StatementAdapter.evaluate(StatementAdapter.java:36)
        at org.apache.lucene.util.TestRuleAssertionsRequired$1.evaluate(TestRuleAssertionsRequired.java:53)
        at org.apache.lucene.util.TestRuleMarkFailure$1.evaluate(TestRuleMarkFailure.java:47)
        at org.apache.lucene.util.TestRuleIgnoreAfterMaxFailures$1.evaluate(TestRuleIgnoreAfterMaxFailures.java:64)
        at org.apache.lucene.util.TestRuleIgnoreTestSuites$1.evaluate(TestRuleIgnoreTestSuites.java:54)
        at com.carrotsearch.randomizedtesting.rules.StatementAdapter.evaluate(StatementAdapter.java:36)
        at com.carrotsearch.randomizedtesting.ThreadLeakControl$StatementRunner.run(ThreadLeakControl.java:368)
        at java.base/java.lang.Thread.run(Thread.java:834)
Caused by: org.apache.solr.client.solrj.impl.HttpSolrClient$RemoteSolrException: Error from server at http://127.0.0.1:44819/solr/org.apache.solr.search.facet.TestCloudJSONFacetSKG_collection: Expected mime type application/octet-stream but got text/html. <html>
<head>
<meta http-equiv="Content-Type" content="text/html;charset=utf-8"/>
<title>Error 500 Server Error</title>
</head>
<body><h2>HTTP ERROR 500</h2>
<p>Problem accessing /solr/org.apache.solr.search.facet.TestCloudJSONFacetSKG_collection/select. Reason:
<pre>    Server Error</pre></p><h3>Caused by:</h3><pre>java.lang.AssertionError
        at java.base/java.util.HashMap$TreeNode.moveRootToFront(HashMap.java:1896)
        at java.base/java.util.HashMap$TreeNode.putTreeVal(HashMap.java:2061)
        at java.base/java.util.HashMap.putVal(HashMap.java:633)
        at java.base/java.util.HashMap.put(HashMap.java:607)
        at org.apache.solr.search.LRUCache.put(LRUCache.java:197)
        at org.apache.solr.search.SolrCacheHolder.put(SolrCacheHolder.java:88)
        at org.apache.solr.search.SolrIndexSearcher.getDocListC(SolrIndexSearcher.java:1449)
        at org.apache.solr.search.SolrIndexSearcher.search(SolrIndexSearcher.java:568)
        at org.apache.solr.handler.component.QueryComponent.doProcessUngroupedSearch(QueryComponent.java:1484)
        at org.apache.solr.handler.component.QueryComponent.process(QueryComponent.java:398)
        at org.apache.solr.handler.component.SearchHandler.handleRequestBody(SearchHandler.java:305)
        at org.apache.solr.handler.RequestHandlerBase.handleRequest(RequestHandlerBase.java:200)
        at org.apache.solr.core.SolrCore.execute(SolrCore.java:2598)
        at org.apache.solr.servlet.HttpSolrCall.execute(HttpSolrCall.java:780)
        at org.apache.solr.servlet.HttpSolrCall.call(HttpSolrCall.java:566)
        at org.apache.solr.servlet.SolrDispatchFilter.doFilter(SolrDispatchFilter.java:424)
        at org.apache.solr.servlet.SolrDispatchFilter.doFilter(SolrDispatchFilter.java:351)
        at org.eclipse.jetty.servlet.ServletHandler$CachedChain.doFilter(ServletHandler.java:1610)
        at org.apache.solr.client.solrj.embedded.JettySolrRunner$DebugFilter.doFilter(JettySolrRunner.java:167)
        at org.eclipse.jetty.servlet.ServletHandler$CachedChain.doFilter(ServletHandler.java:1610)
        at org.eclipse.jetty.servlet.ServletHandler.doHandle(ServletHandler.java:540)
        at org.eclipse.jetty.server.handler.ScopedHandler.nextHandle(ScopedHandler.java:255)
        at org.eclipse.jetty.server.session.SessionHandler.doHandle(SessionHandler.java:1711)
        at org.eclipse.jetty.server.handler.ScopedHandler.nextHandle(ScopedHandler.java:255)
        at org.eclipse.jetty.server.handler.ContextHandler.doHandle(ContextHandler.java:1347)
        at org.eclipse.jetty.server.handler.ScopedHandler.nextScope(ScopedHandler.java:203)
        at org.eclipse.jetty.servlet.ServletHandler.doScope(ServletHandler.java:480)
        at org.eclipse.jetty.server.session.SessionHandler.doScope(SessionHandler.java:1678)
        at org.eclipse.jetty.server.handler.ScopedHandler.nextScope(ScopedHandler.java:201)
        at org.eclipse.jetty.server.handler.ContextHandler.doScope(ContextHandler.java:1249)
        at org.eclipse.jetty.server.handler.ScopedHandler.handle(ScopedHandler.java:144)
        at org.eclipse.jetty.server.handler.HandlerWrapper.handle(HandlerWrapper.java:132)
        at org.eclipse.jetty.rewrite.handler.RewriteHandler.handle(RewriteHandler.java:335)
        at org.eclipse.jetty.server.handler.gzip.GzipHandler.handle(GzipHandler.java:753)
        at org.eclipse.jetty.server.handler.HandlerWrapper.handle(HandlerWrapper.java:132)
        at org.eclipse.jetty.server.Server.handle(Server.java:505)
        at org.eclipse.jetty.server.HttpChannel.handle(HttpChannel.java:370)
        at org.eclipse.jetty.server.HttpConnection.onFillable(HttpConnection.java:267)
        at org.eclipse.jetty.io.AbstractConnection$ReadCallback.succeeded(AbstractConnection.java:305)
        at org.eclipse.jetty.io.FillInterest.fillable(FillInterest.java:103)
        at org.eclipse.jetty.io.ChannelEndPoint$2.run(ChannelEndPoint.java:117)
        at org.eclipse.jetty.util.thread.QueuedThreadPool.runJob(QueuedThreadPool.java:781)
        at org.eclipse.jetty.util.thread.QueuedThreadPool$Runner.run(QueuedThreadPool.java:917)
        at java.base/java.lang.Thread.run(Thread.java:834)
</pre>
<hr><a href="http://eclipse.org/jetty">Powered by Jetty:// 9.4.19.v20190610</a><hr/>

</body>
</html>

        at org.apache.solr.client.solrj.impl.HttpSolrClient.executeMethod(HttpSolrClient.java:629)
        at org.apache.solr.client.solrj.impl.HttpSolrClient.request(HttpSolrClient.java:265)
        at org.apache.solr.client.solrj.impl.HttpSolrClient.request(HttpSolrClient.java:248)
        at org.apache.solr.client.solrj.impl.LBSolrClient.doRequest(LBSolrClient.java:368)
        at org.apache.solr.client.solrj.impl.LBSolrClient.request(LBSolrClient.java:296)
        ... 50 more




Build Log:
[...truncated 14099 lines...]
   [junit4] Suite: org.apache.solr.search.facet.TestCloudJSONFacetSKG
   [junit4]   2> 1608254 INFO  (SUITE-TestCloudJSONFacetSKG-seed#[71703D6A1E770DC3]-worker) [     ] o.a.s.SolrTestCaseJ4 Created dataDir: /home/jenkins/jenkins-slave/workspace/Lucene-Solr-Tests-master/solr/build/solr-core/test/J1/temp/solr.search.facet.TestCloudJSONFacetSKG_71703D6A1E770DC3-001/data-dir-94-001
   [junit4]   2> 1608254 WARN  (SUITE-TestCloudJSONFacetSKG-seed#[71703D6A1E770DC3]-worker) [     ] o.a.s.SolrTestCaseJ4 startTrackingSearchers: numOpens=135 numCloses=135
   [junit4]   2> 1608254 INFO  (SUITE-TestCloudJSONFacetSKG-seed#[71703D6A1E770DC3]-worker) [     ] o.a.s.SolrTestCaseJ4 Using PointFields (NUMERIC_POINTS_SYSPROP=true) w/NUMERIC_DOCVALUES_SYSPROP=true
   [junit4]   2> 1608255 INFO  (SUITE-TestCloudJSONFacetSKG-seed#[71703D6A1E770DC3]-worker) [     ] o.a.s.SolrTestCaseJ4 Randomized ssl (false) and clientAuth (false) via: @org.apache.solr.util.RandomizeSSL(reason="", ssl=0.0/0.0, value=0.0/0.0, clientAuth=0.0/0.0)
   [junit4]   2> 1608255 INFO  (SUITE-TestCloudJSONFacetSKG-seed#[71703D6A1E770DC3]-worker) [     ] o.a.s.SolrTestCaseJ4 SecureRandom sanity checks: test.solr.allowed.securerandom=null & java.security.egd=file:/dev/./urandom
   [junit4]   2> 1608257 INFO  (SUITE-TestCloudJSONFacetSKG-seed#[71703D6A1E770DC3]-worker) [     ] o.a.s.c.MiniSolrCloudCluster Starting cluster of 1 servers in /home/jenkins/jenkins-slave/workspace/Lucene-Solr-Tests-master/solr/build/solr-core/test/J1/temp/solr.search.facet.TestCloudJSONFacetSKG_71703D6A1E770DC3-001/tempDir-001
   [junit4]   2> 1608273 INFO  (SUITE-TestCloudJSONFacetSKG-seed#[71703D6A1E770DC3]-worker) [     ] o.a.s.c.ZkTestServer STARTING ZK TEST SERVER
   [junit4]   2> 1608274 INFO  (ZkTestServer Run Thread) [     ] o.a.s.c.ZkTestServer client port:0.0.0.0/0.0.0.0:0
   [junit4]   2> 1608274 INFO  (ZkTestServer Run Thread) [     ] o.a.s.c.ZkTestServer Starting server
   [junit4]   2> 1608374 INFO  (SUITE-TestCloudJSONFacetSKG-seed#[71703D6A1E770DC3]-worker) [     ] o.a.s.c.ZkTestServer start zk server on port:32795
   [junit4]   2> 1608374 INFO  (SUITE-TestCloudJSONFacetSKG-seed#[71703D6A1E770DC3]-worker) [     ] o.a.s.c.ZkTestServer waitForServerUp: 127.0.0.1:32795
   [junit4]   2> 1608374 INFO  (SUITE-TestCloudJSONFacetSKG-seed#[71703D6A1E770DC3]-worker) [     ] o.a.s.c.ZkTestServer parse host and port list: 127.0.0.1:32795
   [junit4]   2> 1608374 INFO  (SUITE-TestCloudJSONFacetSKG-seed#[71703D6A1E770DC3]-worker) [     ] o.a.s.c.ZkTestServer connecting to 127.0.0.1 32795
   [junit4]   2> 1608376 INFO  (SUITE-TestCloudJSONFacetSKG-seed#[71703D6A1E770DC3]-worker) [     ] o.a.s.c.c.ConnectionManager Waiting for client to connect to ZooKeeper
   [junit4]   2> 1608378 INFO  (zkConnectionManagerCallback-5433-thread-1) [     ] o.a.s.c.c.ConnectionManager zkClient has connected
   [junit4]   2> 1608379 INFO  (SUITE-TestCloudJSONFacetSKG-seed#[71703D6A1E770DC3]-worker) [     ] o.a.s.c.c.ConnectionManager Client is connected to ZooKeeper
   [junit4]   2> 1608392 INFO  (SUITE-TestCloudJSONFacetSKG-seed#[71703D6A1E770DC3]-worker) [     ] o.a.s.c.c.ConnectionManager Waiting for client to connect to ZooKeeper
   [junit4]   2> 1608393 INFO  (zkConnectionManagerCallback-5435-thread-1) [     ] o.a.s.c.c.ConnectionManager zkClient has connected
   [junit4]   2> 1608393 INFO  (SUITE-TestCloudJSONFacetSKG-seed#[71703D6A1E770DC3]-worker) [     ] o.a.s.c.c.ConnectionManager Client is connected to ZooKeeper
   [junit4]   2> 1608393 INFO  (SUITE-TestCloudJSONFacetSKG-seed#[71703D6A1E770DC3]-worker) [     ] o.a.s.c.c.ConnectionManager Waiting for client to connect to ZooKeeper
   [junit4]   2> 1608397 INFO  (zkConnectionManagerCallback-5437-thread-1) [     ] o.a.s.c.c.ConnectionManager zkClient has connected
   [junit4]   2> 1608397 INFO  (SUITE-TestCloudJSONFacetSKG-seed#[71703D6A1E770DC3]-worker) [     ] o.a.s.c.c.ConnectionManager Client is connected to ZooKeeper
   [junit4]   2> 1608538 WARN  (jetty-launcher-5438-thread-1) [     ] o.e.j.s.AbstractConnector Ignoring deprecated socket close linger time
   [junit4]   2> 1608538 INFO  (jetty-launcher-5438-thread-1) [     ] o.a.s.c.s.e.JettySolrRunner Start Jetty (original configured port=0)
   [junit4]   2> 1608538 INFO  (jetty-launcher-5438-thread-1) [     ] o.a.s.c.s.e.JettySolrRunner Trying to start Jetty on port 0 try number 1 ...
   [junit4]   2> 1608538 INFO  (jetty-launcher-5438-thread-1) [     ] o.e.j.s.Server jetty-9.4.19.v20190610; built: 2019-06-10T16:30:51.723Z; git: afcf563148970e98786327af5e07c261fda175d3; jvm 11.0.1+13-LTS
   [junit4]   2> 1608540 INFO  (jetty-launcher-5438-thread-1) [     ] o.e.j.s.session DefaultSessionIdManager workerName=node0
   [junit4]   2> 1608540 INFO  (jetty-launcher-5438-thread-1) [     ] o.e.j.s.session No SessionScavenger set, using defaults
   [junit4]   2> 1608540 INFO  (jetty-launcher-5438-thread-1) [     ] o.e.j.s.session node0 Scavenging every 660000ms
   [junit4]   2> 1608541 INFO  (jetty-launcher-5438-thread-1) [     ] o.e.j.s.h.ContextHandler Started o.e.j.s.ServletContextHandler@36243570{/solr,null,AVAILABLE}
   [junit4]   2> 1608541 INFO  (jetty-launcher-5438-thread-1) [     ] o.e.j.s.AbstractConnector Started ServerConnector@65db1be4{HTTP/1.1,[http/1.1, h2c]}{127.0.0.1:44819}
   [junit4]   2> 1608541 INFO  (jetty-launcher-5438-thread-1) [     ] o.e.j.s.Server Started @1608632ms
   [junit4]   2> 1608541 INFO  (jetty-launcher-5438-thread-1) [     ] o.a.s.c.s.e.JettySolrRunner Jetty properties: {hostContext=/solr, hostPort=44819}
   [junit4]   2> 1608541 ERROR (jetty-launcher-5438-thread-1) [     ] o.a.s.u.StartupLoggingUtils Missing Java Option solr.log.dir. Logging may be missing or incomplete.
   [junit4]   2> 1608541 INFO  (jetty-launcher-5438-thread-1) [     ] o.a.s.s.SolrDispatchFilter Using logger factory org.apache.logging.slf4j.Log4jLoggerFactory
   [junit4]   2> 1608541 INFO  (jetty-launcher-5438-thread-1) [     ] o.a.s.s.SolrDispatchFilter  ___      _       Welcome to Apache Solr? version 9.0.0
   [junit4]   2> 1608541 INFO  (jetty-launcher-5438-thread-1) [     ] o.a.s.s.SolrDispatchFilter / __| ___| |_ _   Starting in cloud mode on port null
   [junit4]   2> 1608541 INFO  (jetty-launcher-5438-thread-1) [     ] o.a.s.s.SolrDispatchFilter \__ \/ _ \ | '_|  Install dir: null
   [junit4]   2> 1608541 INFO  (jetty-launcher-5438-thread-1) [     ] o.a.s.s.SolrDispatchFilter |___/\___/_|_|    Start time: 2019-09-08T14:47:08.315924Z
   [junit4]   2> 1608542 INFO  (jetty-launcher-5438-thread-1) [     ] o.a.s.c.c.ConnectionManager Waiting for client to connect to ZooKeeper
   [junit4]   2> 1608543 INFO  (zkConnectionManagerCallback-5440-thread-1) [     ] o.a.s.c.c.ConnectionManager zkClient has connected
   [junit4]   2> 1608543 INFO  (jetty-launcher-5438-thread-1) [     ] o.a.s.c.c.ConnectionManager Client is connected to ZooKeeper
   [junit4]   2> 1608544 INFO  (jetty-launcher-5438-thread-1) [     ] o.a.s.s.SolrDispatchFilter solr.xml found in ZooKeeper. Loading...
   [junit4]   2> 1608805 INFO  (jetty-launcher-5438-thread-1) [     ] o.a.s.h.c.HttpShardHandlerFactory Host whitelist initialized: WhitelistHostChecker [whitelistHosts=null, whitelistHostCheckingEnabled=true]
   [junit4]   2> 1608806 WARN  (jetty-launcher-5438-thread-1) [     ] o.e.j.u.s.S.config Trusting all certificates configured for Client@1b1d7266[provider=null,keyStore=null,trustStore=null]
   [junit4]   2> 1608806 WARN  (jetty-launcher-5438-thread-1) [     ] o.e.j.u.s.S.config No Client EndPointIdentificationAlgorithm configured for Client@1b1d7266[provider=null,keyStore=null,trustStore=null]
   [junit4]   2> 1608808 WARN  (jetty-launcher-5438-thread-1) [     ] o.e.j.u.s.S.config Trusting all certificates configured for Client@314d09c7[provider=null,keyStore=null,trustStore=null]
   [junit4]   2> 1608808 WARN  (jetty-launcher-5438-thread-1) [     ] o.e.j.u.s.S.config No Client EndPointIdentificationAlgorithm configured for Client@314d09c7[provider=null,keyStore=null,trustStore=null]
   [junit4]   2> 1608809 INFO  (jetty-launcher-5438-thread-1) [     ] o.a.s.c.ZkContainer Zookeeper client=127.0.0.1:32795/solr
   [junit4]   2> 1608816 INFO  (jetty-launcher-5438-thread-1) [     ] o.a.s.c.c.ConnectionManager Waiting for client to connect to ZooKeeper
   [junit4]   2> 1608817 INFO  (zkConnectionManagerCallback-5447-thread-1) [     ] o.a.s.c.c.ConnectionManager zkClient has connected
   [junit4]   2> 1608817 INFO  (jetty-launcher-5438-thread-1) [     ] o.a.s.c.c.ConnectionManager Client is connected to ZooKeeper
   [junit4]   2> 1608927 INFO  (jetty-launcher-5438-thread-1) [n:127.0.0.1:44819_solr     ] o.a.s.c.c.ConnectionManager Waiting for client to connect to ZooKeeper
   [junit4]   2> 1608943 INFO  (zkConnectionManagerCallback-5449-thread-1) [     ] o.a.s.c.c.ConnectionManager zkClient has connected
   [junit4]   2> 1608943 INFO  (jetty-launcher-5438-thread-1) [n:127.0.0.1:44819_solr     ] o.a.s.c.c.ConnectionManager Client is connected to ZooKeeper
   [junit4]   2> 1609189 INFO  (jetty-launcher-5438-thread-1) [n:127.0.0.1:44819_solr     ] o.a.s.c.OverseerElectionContext I am going to be the leader 127.0.0.1:44819_solr
   [junit4]   2> 1609198 INFO  (jetty-launcher-5438-thread-1) [n:127.0.0.1:44819_solr     ] o.a.s.c.Overseer Overseer (id=75353493128019973-127.0.0.1:44819_solr-n_0000000000) starting
   [junit4]   2> 1609243 INFO  (jetty-launcher-5438-thread-1) [n:127.0.0.1:44819_solr     ] o.a.s.c.c.ConnectionManager Waiting for client to connect to ZooKeeper
   [junit4]   2> 1609243 INFO  (zkConnectionManagerCallback-5456-thread-1) [     ] o.a.s.c.c.ConnectionManager zkClient has connected
   [junit4]   2> 1609243 INFO  (jetty-launcher-5438-thread-1) [n:127.0.0.1:44819_solr     ] o.a.s.c.c.ConnectionManager Client is connected to ZooKeeper
   [junit4]   2> 1609263 INFO  (jetty-launcher-5438-thread-1) [n:127.0.0.1:44819_solr     ] o.a.s.c.s.i.ZkClientClusterStateProvider Cluster at 127.0.0.1:32795/solr ready
   [junit4]   2> 1609264 INFO  (OverseerStateUpdate-75353493128019973-127.0.0.1:44819_solr-n_0000000000) [n:127.0.0.1:44819_solr     ] o.a.s.c.Overseer Starting to work on the main queue : 127.0.0.1:44819_solr
   [junit4]   2> 1609265 INFO  (jetty-launcher-5438-thread-1) [n:127.0.0.1:44819_solr     ] o.a.s.c.ZkController Register node as live in ZooKeeper:/live_nodes/127.0.0.1:44819_solr
   [junit4]   2> 1609281 INFO  (jetty-launcher-5438-thread-1) [n:127.0.0.1:44819_solr     ] o.a.s.c.PackageManager clusterprops.json changed , version -1
   [junit4]   2> 1609281 INFO  (zkCallback-5455-thread-1) [     ] o.a.s.c.c.ZkStateReader Updated live nodes from ZooKeeper... (0) -> (1)
   [junit4]   2> 1609281 INFO  (zkCallback-5448-thread-1) [     ] o.a.s.c.c.ZkStateReader Updated live nodes from ZooKeeper... (0) -> (1)
   [junit4]   2> 1609341 INFO  (jetty-launcher-5438-thread-1) [n:127.0.0.1:44819_solr     ] o.a.s.h.a.MetricsHistoryHandler No .system collection, keeping metrics history in memory.
   [junit4]   2> 1609412 INFO  (jetty-launcher-5438-thread-1) [n:127.0.0.1:44819_solr     ] o.a.s.m.r.SolrJmxReporter JMX monitoring for 'solr_44819.solr.node' (registry 'solr.node') enabled at server: com.sun.jmx.mbeanserver.JmxMBeanServer@522bb8ad
   [junit4]   2> 1609429 INFO  (jetty-launcher-5438-thread-1) [n:127.0.0.1:44819_solr     ] o.a.s.m.r.SolrJmxReporter JMX monitoring for 'solr_44819.solr.jvm' (registry 'solr.jvm') enabled at server: com.sun.jmx.mbeanserver.JmxMBeanServer@522bb8ad
   [junit4]   2> 1609429 INFO  (jetty-launcher-5438-thread-1) [n:127.0.0.1:44819_solr     ] o.a.s.m.r.SolrJmxReporter JMX monitoring for 'solr_44819.solr.jetty' (registry 'solr.jetty') enabled at server: com.sun.jmx.mbeanserver.JmxMBeanServer@522bb8ad
   [junit4]   2> 1609430 INFO  (jetty-launcher-5438-thread-1) [n:127.0.0.1:44819_solr     ] o.a.s.c.CorePropertiesLocator Found 0 core definitions underneath /home/jenkins/jenkins-slave/workspace/Lucene-Solr-Tests-master/solr/build/solr-core/test/J1/temp/solr.search.facet.TestCloudJSONFacetSKG_71703D6A1E770DC3-001/tempDir-001/node1/.
   [junit4]   2> 1609464 INFO  (SUITE-TestCloudJSONFacetSKG-seed#[71703D6A1E770DC3]-worker) [     ] o.a.s.c.MiniSolrCloudCluster waitForAllNodes: numServers=1
   [junit4]   2> 1609473 INFO  (SUITE-TestCloudJSONFacetSKG-seed#[71703D6A1E770DC3]-worker) [     ] o.a.s.c.c.ConnectionManager Waiting for client to connect to ZooKeeper
   [junit4]   2> 1609473 INFO  (zkConnectionManagerCallback-5462-thread-1) [     ] o.a.s.c.c.ConnectionManager zkClient has connected
   [junit4]   2> 1609473 INFO  (SUITE-TestCloudJSONFacetSKG-seed#[71703D6A1E770DC3]-worker) [     ] o.a.s.c.c.ConnectionManager Client is connected to ZooKeeper
   [junit4]   2> 1609474 INFO  (SUITE-TestCloudJSONFacetSKG-seed#[71703D6A1E770DC3]-worker) [     ] o.a.s.c.c.ZkStateReader Updated live nodes from ZooKeeper... (0) -> (1)
   [junit4]   2> 1609475 INFO  (SUITE-TestCloudJSONFacetSKG-seed#[71703D6A1E770DC3]-worker) [     ] o.a.s.c.s.i.ZkClientClusterStateProvider Cluster at 127.0.0.1:32795/solr ready
   [junit4]   2> 1610293 INFO  (qtp1797060855-13928) [n:127.0.0.1:44819_solr     ] o.a.s.h.a.CollectionsHandler Invoked Collection Action :create with params property.schema=schema_latest.xml&property.config=solrconfig-tlog.xml&collection.configName=org.apache.solr.search.facet.TestCloudJSONFacetSKG_config-set&name=org.apache.solr.search.facet.TestCloudJSONFacetSKG_collection&nrtReplicas=1&action=CREATE&numShards=1&wt=javabin&version=2 and sendToOCPQueue=true
   [junit4]   2> 1610305 INFO  (OverseerThreadFactory-4192-thread-1-processing-n:127.0.0.1:44819_solr) [n:127.0.0.1:44819_solr     ] o.a.s.c.a.c.CreateCollectionCmd Create collection org.apache.solr.search.facet.TestCloudJSONFacetSKG_collection
   [junit4]   2> 1610429 INFO  (OverseerStateUpdate-75353493128019973-127.0.0.1:44819_solr-n_0000000000) [n:127.0.0.1:44819_solr     ] o.a.s.c.o.SliceMutator createReplica() {
   [junit4]   2>   "operation":"ADDREPLICA",
   [junit4]   2>   "collection":"org.apache.solr.search.facet.TestCloudJSONFacetSKG_collection",
   [junit4]   2>   "shard":"shard1",
   [junit4]   2>   "core":"org.apache.solr.search.facet.TestCloudJSONFacetSKG_collection_shard1_replica_n1",
   [junit4]   2>   "state":"down",
   [junit4]   2>   "base_url":"http://127.0.0.1:44819/solr",
   [junit4]   2>   "type":"NRT",
   [junit4]   2>   "waitForFinalState":"false"}
   [junit4]   2> 1610724 INFO  (qtp1797060855-13930) [n:127.0.0.1:44819_solr    x:org.apache.solr.search.facet.TestCloudJSONFacetSKG_collection_shard1_replica_n1 ] o.a.s.h.a.CoreAdminOperation core create command qt=/admin/cores&collection.configName=org.apache.solr.search.facet.TestCloudJSONFacetSKG_config-set&newCollection=true&collection=org.apache.solr.search.facet.TestCloudJSONFacetSKG_collection&version=2&replicaType=NRT&property.schema=schema_latest.xml&property.config=solrconfig-tlog.xml&coreNodeName=core_node2&name=org.apache.solr.search.facet.TestCloudJSONFacetSKG_collection_shard1_replica_n1&action=CREATE&numShards=1&shard=shard1&wt=javabin
   [junit4]   2> 1610724 INFO  (qtp1797060855-13930) [n:127.0.0.1:44819_solr    x:org.apache.solr.search.facet.TestCloudJSONFacetSKG_collection_shard1_replica_n1 ] o.a.s.c.TransientSolrCoreCacheDefault Allocating transient cache for 2147483647 transient cores
   [junit4]   2> 1611823 INFO  (qtp1797060855-13930) [n:127.0.0.1:44819_solr c:org.apache.solr.search.facet.TestCloudJSONFacetSKG_collection s:shard1 r:core_node2 x:org.apache.solr.search.facet.TestCloudJSONFacetSKG_collection_shard1_replica_n1 ] o.a.s.c.SolrConfig Using Lucene MatchVersion: 9.0.0
   [junit4]   2> 1611916 INFO  (qtp1797060855-13930) [n:127.0.0.1:44819_solr c:org.apache.solr.search.facet.TestCloudJSONFacetSKG_collection s:shard1 r:core_node2 x:org.apache.solr.search.facet.TestCloudJSONFacetSKG_collection_shard1_replica_n1 ] o.a.s.s.IndexSchema [org.apache.solr.search.facet.TestCloudJSONFacetSKG_collection_shard1_replica_n1] Schema name=example
   [junit4]   2> 1612231 INFO  (qtp1797060855-13930) [n:127.0.0.1:44819_solr c:org.apache.solr.search.facet.TestCloudJSONFacetSKG_collection s:shard1 r:core_node2 x:org.apache.solr.search.facet.TestCloudJSONFacetSKG_collection_shard1_replica_n1 ] o.a.s.s.IndexSchema Loaded schema example/1.6 with uniqueid field id
   [junit4]   2> 1612353 INFO  (qtp1797060855-13930) [n:127.0.0.1:44819_solr c:org.apache.solr.search.facet.TestCloudJSONFacetSKG_collection s:shard1 r:core_node2 x:org.apache.solr.search.facet.TestCloudJSONFacetSKG_collection_shard1_replica_n1 ] o.a.s.c.CoreContainer Creating SolrCore 'org.apache.solr.search.facet.TestCloudJSONFacetSKG_collection_shard1_replica_n1' using configuration from collection org.apache.solr.search.facet.TestCloudJSONFacetSKG_collection, trusted=true
   [junit4]   2> 1612390 INFO  (qtp1797060855-13930) [n:127.0.0.1:44819_solr c:org.apache.solr.search.facet.TestCloudJSONFacetSKG_collection s:shard1 r:core_node2 x:org.apache.solr.search.facet.TestCloudJSONFacetSKG_collection_shard1_replica_n1 ] o.a.s.m.r.SolrJmxReporter JMX monitoring for 'solr_44819.solr.core.org.apache.solr.search.facet.TestCloudJSONFacetSKG_collection.shard1.replica_n1' (registry 'solr.core.org.apache.solr.search.facet.TestCloudJSONFacetSKG_collection.shard1.replica_n1') enabled at server: com.sun.jmx.mbeanserver.JmxMBeanServer@522bb8ad
   [junit4]   2> 1612391 INFO  (qtp1797060855-13930) [n:127.0.0.1:44819_solr c:org.apache.solr.search.facet.TestCloudJSONFacetSKG_collection s:shard1 r:core_node2 x:org.apache.solr.search.facet.TestCloudJSONFacetSKG_collection_shard1_replica_n1 ] o.a.s.c.SolrCore [[org.apache.solr.search.facet.TestCloudJSONFacetSKG_collection_shard1_replica_n1] ] Opening new SolrCore at [/home/jenkins/jenkins-slave/workspace/Lucene-Solr-Tests-master/solr/build/solr-core/test/J1/temp/solr.search.facet.TestCloudJSONFacetSKG_71703D6A1E770DC3-001/tempDir-001/node1/org.apache.solr.search.facet.TestCloudJSONFacetSKG_collection_shard1_replica_n1], dataDir=[/home/jenkins/jenkins-slave/workspace/Lucene-Solr-Tests-master/solr/build/solr-core/test/J1/temp/solr.search.facet.TestCloudJSONFacetSKG_71703D6A1E770DC3-001/tempDir-001/node1/./org.apache.solr.search.facet.TestCloudJSONFacetSKG_collection_shard1_replica_n1/data/]
   [junit4]   2> 1612481 INFO  (qtp1797060855-13930) [n:127.0.0.1:44819_solr c:org.apache.solr.search.facet.TestCloudJSONFacetSKG_collection s:shard1 r:core_node2 x:org.apache.solr.search.facet.TestCloudJSONFacetSKG_collection_shard1_replica_n1 ] o.a.s.u.RandomMergePolicy RandomMergePolicy wrapping class org.apache.lucene.index.TieredMergePolicy: [TieredMergePolicy: maxMergeAtOnce=23, maxMergeAtOnceExplicit=13, maxMergedSegmentMB=10.9111328125, floorSegmentMB=1.4775390625, forceMergeDeletesPctAllowed=24.331193466125914, segmentsPerTier=30.0, maxCFSSegmentSizeMB=8.796093022207999E12, noCFSRatio=1.0, deletesPctAllowed=36.32274267395283
   [junit4]   2> 1612514 WARN  (qtp1797060855-13930) [n:127.0.0.1:44819_solr c:org.apache.solr.search.facet.TestCloudJSONFacetSKG_collection s:shard1 r:core_node2 x:org.apache.solr.search.facet.TestCloudJSONFacetSKG_collection_shard1_replica_n1 ] o.a.s.c.RequestHandlers INVALID paramSet a in requestHandler {type = requestHandler,name = /dump,class = DumpRequestHandler,attributes = {initParams=a, name=/dump, class=DumpRequestHandler},args = {defaults={a=A,b=B}}}
   [junit4]   2> 1613016 INFO  (qtp1797060855-13930) [n:127.0.0.1:44819_solr c:org.apache.solr.search.facet.TestCloudJSONFacetSKG_collection s:shard1 r:core_node2 x:org.apache.solr.search.facet.TestCloudJSONFacetSKG_collection_shard1_replica_n1 ] o.a.s.u.UpdateHandler Using UpdateLog implementation: org.apache.solr.update.UpdateLog
   [junit4]   2> 1613016 INFO  (qtp1797060855-13930) [n:127.0.0.1:44819_solr c:org.apache.solr.search.facet.TestCloudJSONFacetSKG_collection s:shard1 r:core_node2 x:org.apache.solr.search.facet.TestCloudJSONFacetSKG_collection_shard1_replica_n1 ] o.a.s.u.UpdateLog Initializing UpdateLog: dataDir= defaultSyncLevel=FLUSH numRecordsToKeep=100 maxNumLogsToKeep=10 numVersionBuckets=65536
   [junit4]   2> 1613018 INFO  (qtp1797060855-13930) [n:127.0.0.1:44819_solr c:org.apache.solr.search.facet.TestCloudJSONFacetSKG_collection s:shard1 r:core_node2 x:org.apache.solr.search.facet.TestCloudJSONFacetSKG_collection_shard1_replica_n1 ] o.a.s.u.CommitTracker Hard AutoCommit: disabled
   [junit4]   2> 1613018 INFO  (qtp1797060855-13930) [n:127.0.0.1:44819_solr c:org.apache.solr.search.facet.TestCloudJSONFacetSKG_collection s:shard1 r:core_node2 x:org.apache.solr.search.facet.TestCloudJSONFacetSKG_collection_shard1_replica_n1 ] o.a.s.u.CommitTracker Soft AutoCommit: disabled
   [junit4]   2> 1613035 INFO  (qtp1797060855-13930) [n:127.0.0.1:44819_solr c:org.apache.solr.search.facet.TestCloudJSONFacetSKG_collection s:shard1 r:core_node2 x:org.apache.solr.search.facet.TestCloudJSONFacetSKG_collection_shard1_replica_n1 ] o.a.s.u.RandomMergePolicy RandomMergePolicy wrapping class org.apache.lucene.index.TieredMergePolicy: [TieredMergePolicy: maxMergeAtOnce=23, maxMergeAtOnceExplicit=42, maxMergedSegmentMB=99.7099609375, floorSegmentMB=1.7353515625, forceMergeDeletesPctAllowed=10.56463351802041, segmentsPerTier=21.0, maxCFSSegmentSizeMB=8.796093022207999E12, noCFSRatio=1.0, deletesPctAllowed=37.74039752975844
   [junit4]   2> 1613036 INFO  (qtp1797060855-13930) [n:127.0.0.1:44819_solr c:org.apache.solr.search.facet.TestCloudJSONFacetSKG_collection s:shard1 r:core_node2 x:org.apache.solr.search.facet.TestCloudJSONFacetSKG_collection_shard1_replica_n1 ] o.a.s.s.SolrIndexSearcher Opening [Searcher@62d8efa6[org.apache.solr.search.facet.TestCloudJSONFacetSKG_collection_shard1_replica_n1] main]
   [junit4]   2> 1613037 INFO  (qtp1797060855-13930) [n:127.0.0.1:44819_solr c:org.apache.solr.search.facet.TestCloudJSONFacetSKG_collection s:shard1 r:core_node2 x:org.apache.solr.search.facet.TestCloudJSONFacetSKG_collection_shard1_replica_n1 ] o.a.s.r.ManagedResourceStorage Configured ZooKeeperStorageIO with znodeBase: /configs/org.apache.solr.search.facet.TestCloudJSONFacetSKG_config-set
   [junit4]   2> 1613038 INFO  (qtp1797060855-13930) [n:127.0.0.1:44819_solr c:org.apache.solr.search.facet.TestCloudJSONFacetSKG_collection s:shard1 r:core_node2 x:org.apache.solr.search.facet.TestCloudJSONFacetSKG_collection_shard1_replica_n1 ] o.a.s.r.ManagedResourceStorage Loaded null at path _rest_managed.json using ZooKeeperStorageIO:path=/configs/org.apache.solr.search.facet.TestCloudJSONFacetSKG_config-set
   [junit4]   2> 1613038 INFO  (qtp1797060855-13930) [n:127.0.0.1:44819_solr c:org.apache.solr.search.facet.TestCloudJSONFacetSKG_collection s:shard1 r:core_node2 x:org.apache.solr.search.facet.TestCloudJSONFacetSKG_collection_shard1_replica_n1 ] o.a.s.h.ReplicationHandler Commits will be reserved for 10000ms.
   [junit4]   2> 1613038 INFO  (qtp1797060855-13930) [n:127.0.0.1:44819_solr c:org.apache.solr.search.facet.TestCloudJSONFacetSKG_collection s:shard1 r:core_node2 x:org.apache.solr.search.facet.TestCloudJSONFacetSKG_collection_shard1_replica_n1 ] o.a.s.u.UpdateLog Could not find max version in index or recent updates, using new clock 1644118967909875712
   [junit4]   2> 1613069 INFO  (searcherExecutor-4197-thread-1-processing-n:127.0.0.1:44819_solr x:org.apache.solr.search.facet.TestCloudJSONFacetSKG_collection_shard1_replica_n1 c:org.apache.solr.search.facet.TestCloudJSONFacetSKG_collection s:shard1 r:core_node2) [n:127.0.0.1:44819_solr c:org.apache.solr.search.facet.TestCloudJSONFacetSKG_collection s:shard1 r:core_node2 x:org.apache.solr.search.facet.TestCloudJSONFacetSKG_collection_shard1_replica_n1 ] o.a.s.c.SolrCore [org.apache.solr.search.facet.TestCloudJSONFacetSKG_collection_shard1_replica_n1] Registered new searcher Searcher@62d8efa6[org.apache.solr.search.facet.TestCloudJSONFacetSKG_collection_shard1_replica_n1] main{ExitableDirectoryReader(UninvertingDirectoryReader())}
   [junit4]   2> 1613110 INFO  (qtp1797060855-13930) [n:127.0.0.1:44819_solr c:org.apache.solr.search.facet.TestCloudJSONFacetSKG_collection s:shard1 r:core_node2 x:org.apache.solr.search.facet.TestCloudJSONFacetSKG_collection_shard1_replica_n1 ] o.a.s.c.ZkShardTerms Successful update of terms at /collections/org.apache.solr.search.facet.TestCloudJSONFacetSKG_collection/terms/shard1 to Terms{values={core_node2=0}, version=0}
   [junit4]   2> 1613110 INFO  (qtp1797060855-13930) [n:127.0.0.1:44819_solr c:org.apache.solr.search.facet.TestCloudJSONFacetSKG_collection s:shard1 r:core_node2 x:org.apache.solr.search.facet.TestCloudJSONFacetSKG_collection_shard1_replica_n1 ] o.a.s.c.ShardLeaderElectionContextBase make sure parent is created /collections/org.apache.solr.search.facet.TestCloudJSONFacetSKG_collection/leaders/shard1
   [junit4]   2> 1613125 INFO  (qtp1797060855-13930) [n:127.0.0.1:44819_solr c:org.apache.solr.search.facet.TestCloudJSONFacetSKG_collection s:shard1 r:core_node2 x:org.apache.solr.search.facet.TestCloudJSONFacetSKG_collection_shard1_replica_n1 ] o.a.s.c.ShardLeaderElectionContext Enough replicas found to continue.
   [junit4]   2> 1613125 INFO  (qtp1797060855-13930) [n:127.0.0.1:44819_solr c:org.apache.solr.search.facet.TestCloudJSONFacetSKG_collection s:shard1 r:core_node2 x:org.apache.solr.search.facet.TestCloudJSONFacetSKG_collection_shard1_replica_n1 ] o.a.s.c.ShardLeaderElectionContext I may be the new leader - try and sync
   [junit4]   2> 1613125 INFO  (qtp1797060855-13930) [n:127.0.0.1:44819_solr c:org.apache.solr.search.facet.TestCloudJSONFacetSKG_collection s:shard1 r:core_node2 x:org.apache.solr.search.facet.TestCloudJSONFacetSKG_collection_shard1_replica_n1 ] o.a.s.c.SyncStrategy Sync replicas to http://127.0.0.1:44819/solr/org.apache.solr.search.facet.TestCloudJSONFacetSKG_collection_shard1_replica_n1/
   [junit4]   2> 1613125 INFO  (qtp1797060855-13930) [n:127.0.0.1:44819_solr c:org.apache.solr.search.facet.TestCloudJSONFacetSKG_collection s:shard1 r:core_node2 x:org.apache.solr.search.facet.TestCloudJSONFacetSKG_collection_shard1_replica_n1 ] o.a.s.c.SyncStrategy Sync Success - now sync replicas to me
   [junit4]   2> 1613125 INFO  (qtp1797060855-13930) [n:127.0.0.1:44819_solr c:org.apache.solr.search.facet.TestCloudJSONFacetSKG_collection s:shard1 r:core_node2 x:org.apache.solr.search.facet.TestCloudJSONFacetSKG_collection_shard1_replica_n1 ] o.a.s.c.SyncStrategy http://127.0.0.1:44819/solr/org.apache.solr.search.facet.TestCloudJSONFacetSKG_collection_shard1_replica_n1/ has no replicas
   [junit4]   2> 1613125 INFO  (qtp1797060855-13930) [n:127.0.0.1:44819_solr c:org.apache.solr.search.facet.TestCloudJSONFacetSKG_collection s:shard1 r:core_node2 x:org.apache.solr.search.facet.TestCloudJSONFacetSKG_collection_shard1_replica_n1 ] o.a.s.c.ShardLeaderElectionContextBase Creating leader registration node /collections/org.apache.solr.search.facet.TestCloudJSONFacetSKG_collection/leaders/shard1/leader after winning as /collections/org.apache.solr.search.facet.TestCloudJSONFacetSKG_collection/leader_elect/shard1/election/75353493128019973-core_node2-n_0000000000
   [junit4]   2> 1613128 INFO  (qtp1797060855-13930) [n:127.0.0.1:44819_solr c:org.apache.solr.search.facet.TestCloudJSONFacetSKG_collection s:shard1 r:core_node2 x:org.apache.solr.search.facet.TestCloudJSONFacetSKG_collection_shard1_replica_n1 ] o.a.s.c.ShardLeaderElectionContext I am the new leader: http://127.0.0.1:44819/solr/org.apache.solr.search.facet.TestCloudJSONFacetSKG_collection_shard1_replica_n1/ shard1
   [junit4]   2> 1613219 INFO  (qtp1797060855-13930) [n:127.0.0.1:44819_solr c:org.apache.solr.search.facet.TestCloudJSONFacetSKG_collection s:shard1 r:core_node2 x:org.apache.solr.search.facet.TestCloudJSONFacetSKG_collection_shard1_replica_n1 ] o.a.s.c.ZkController I am the leader, no recovery necessary
   [junit4]   2> 1613234 INFO  (qtp1797060855-13930) [n:127.0.0.1:44819_solr c:org.apache.solr.search.facet.TestCloudJSONFacetSKG_collection s:shard1 r:core_node2 x:org.apache.solr.search.facet.TestCloudJSONFacetSKG_collection_shard1_replica_n1 ] o.a.s.s.HttpSolrCall [admin] webapp=null path=/admin/cores params={qt=/admin/cores&collection.configName=org.apache.solr.search.facet.TestCloudJSONFacetSKG_config-set&newCollection=true&collection=org.apache.solr.search.facet.TestCloudJSONFacetSKG_collection&version=2&replicaType=NRT&property.schema=schema_latest.xml&property.config=solrconfig-tlog.xml&coreNodeName=core_node2&name=org.apache.solr.search.facet.TestCloudJSONFacetSKG_collection_shard1_replica_n1&action=CREATE&numShards=1&shard=shard1&wt=javabin} status=0 QTime=2511
   [junit4]   2> 1613251 INFO  (qtp1797060855-13928) [n:127.0.0.1:44819_solr     ] o.a.s.h.a.CollectionsHandler Wait for new collection to be active for at most 45 seconds. Check all shard replicas
   [junit4]   2> 1613325 INFO  (zkCallback-5448-thread-1) [     ] o.a.s.c.c.ZkStateReader A cluster state change: [WatchedEvent state:SyncConnected type:NodeDataChanged path:/collections/org.apache.solr.search.facet.TestCloudJSONFacetSKG_collection/state.json] for collection [org.apache.solr.search.facet.TestCloudJSONFacetSKG_collection] has occurred - updating... (live nodes size: [1])
   [junit4]   2> 1613331 INFO  (zkCallback-5448-thread-2) [     ] o.a.s.c.c.ZkStateReader A cluster state change: [WatchedEvent state:SyncConnected type:NodeDataChanged path:/collections/org.apache.solr.search.facet.TestCloudJSONFacetSKG_collection/state.json] for collection [org.apache.solr.search.facet.TestCloudJSONFacetSKG_collection] has occurred - updating... (live nodes size: [1])
   [junit4]   2> 1613339 INFO  (qtp1797060855-13928) [n:127.0.0.1:44819_solr     ] o.a.s.s.HttpSolrCall [admin] webapp=null path=/admin/collections params={property.schema=schema_latest.xml&property.config=solrconfig-tlog.xml&collection.configName=org.apache.solr.search.facet.TestCloudJSONFacetSKG_config-set&name=org.apache.solr.search.facet.TestCloudJSONFacetSKG_collection&nrtReplicas=1&action=CREATE&numShards=1&wt=javabin&version=2} status=0 QTime=3046
   [junit4]   2> 1613347 INFO  (SUITE-TestCloudJSONFacetSKG-seed#[71703D6A1E770DC3]-worker) [     ] o.a.s.c.AbstractDistribZkTestBase Wait for recoveries to finish - collection: org.apache.solr.search.facet.TestCloudJSONFacetSKG_collection failOnTimeout:true timeout (sec):330
   [junit4]   1> replica:core_node2 rstate:active live:true
   [junit4]   1> no one is recoverying
   [junit4]   1> replica:core_node2 rstate:active live:true
   [junit4]   1> no one is recoverying
   [junit4]   1> replica:core_node2 rstate:active live:true
   [junit4]   1> no one is recoverying
   [junit4]   1> replica:core_node2 rstate:active live:true
   [junit4]   1> no one is recoverying
   [junit4]   2> 1613405 INFO  (SUITE-TestCloudJSONFacetSKG-seed#[71703D6A1E770DC3]-worker) [     ] o.a.s.c.AbstractDistribZkTestBase Recoveries finished - collection: org.apache.solr.search.facet.TestCloudJSONFacetSKG_collection
   [junit4]   2> 1613905 INFO  (qtp1797060855-13931) [n:127.0.0.1:44819_solr c:org.apache.solr.search.facet.TestCloudJSONFacetSKG_collection s:shard1 r:core_node2 x:org.apache.solr.search.facet.TestCloudJSONFacetSKG_collection_shard1_replica_n1 ] o.a.s.c.ZkShardTerms Successful update of terms at /collections/org.apache.solr.search.facet.TestCloudJSONFacetSKG_collection/terms/shard1 to Terms{values={core_node2=1}, version=1}
   [junit4]   2> 1613905 INFO  (qtp1797060855-13931) [n:127.0.0.1:44819_solr c:org.apache.solr.search.facet.TestCloudJSONFacetSKG_collection s:shard1 r:core_node2 x:org.apache.solr.search.facet.TestCloudJSONFacetSKG_collection_shard1_replica_n1 ] o.a.s.u.p.LogUpdateProcessorFactory [org.apache.solr.search.facet.TestCloudJSONFacetSKG_collection_shard1_replica_n1]  webapp=/solr path=/update params={wt=javabin&version=2}{add=[0 (1644118968639684608)]} 0 172
   [junit4]   2> 1613976 INFO  (qtp1797060855-13927) [n:127.0.0.1:44819_solr c:org.apache.solr.search.facet.TestCloudJSONFacetSKG_collection s:shard1 r:core_node2 x:org.apache.solr.search.facet.TestCloudJSONFacetSKG_collection_shard1_replica_n1 ] o.a.s.u.p.LogUpdateProcessorFactory [org.apache.solr.search.facet.TestCloudJSONFacetSKG_collection_shard1_replica_n1]  webapp=/solr path=/update params={wt=javabin&version=2}{add=[1 (1644118968893440000)]} 0 37
   [junit4]   2> 1613993 INFO  (qtp1797060855-13929) [n:127.0.0.1:44819_solr c:org.apache.solr.search.facet.TestCloudJSONFacetSKG_collection s:shard1 r:core_node2 x:org.apache.solr.search.facet.TestCloudJSONFacetSKG_collection_shard1_replica_n1 ] o.a.s.u.p.LogUpdateProcessorFactory [org.apache.solr.search.facet.TestCloudJSONFacetSKG_collection_shard1_replica_n1]  webapp=/solr path=/update params={wt=javabin&version=2}{add=[2 (1644118968910217216)]} 0 0
   [junit4]   2> 1613996 INFO  (qtp1797060855-13930) [n:127.0.0.1:44819_solr c:org.apache.solr.search.facet.TestCloudJSONFacetSKG_collection s:shard1 r:core_node2 x:org.apache.solr.search.facet.TestCloudJSONFacetSKG_collection_shard1_replica_n1 ] o.a.s.u.p.LogUpdateProcessorFactory [org.apache.solr.search.facet.TestCloudJSONFacetSKG_collection_shard1_replica_n1]  webapp=/solr path=/update params={wt=javabin&version=2}{add=[3 (1644118968914411520)]} 0 0
   [junit4]   2> 1614013 INFO  (qtp1797060855-13928) [n:127.0.0.1:44819_solr c:org.apache.solr.search.facet.TestCloudJSONFacetSKG_collection s:shard1 r:core_node2 x:org.apache.solr.search.facet.TestCloudJSONFacetSKG_collection_shard1_replica_n1 ] o.a.s.u.p.LogUpdateProcessorFactory [org.apache.solr.search.facet.TestCloudJSONFacetSKG_collection_shard1_replica_n1]  webapp=/solr path=/update params={wt=javabin&version=2}{add=[4 (1644118968932237312)]} 0 0
   [junit4]   2> 1614015 INFO  (qtp1797060855-13931) [n:127.0.0.1:44819_solr c:org.apache.solr.search.facet.TestCloudJSONFacetSKG_collection s:shard1 r:core_node2 x:org.apache.solr.search.facet.TestCloudJSONFacetSKG_collection_shard1_replica_n1 ] o.a.s.u.p.LogUpdateProcessorFactory [org.apache.solr.search.facet.TestCloudJSONFacetSKG_collection_shard1_replica_n1]  webapp=/solr path=/update params={wt=javabin&version=2}{add=[5 (1644118968934334464)]} 0 0
   [junit4]   2> 1614031 INFO  (qtp1797060855-13927) [n:127.0.0.1:44819_solr c:org.apache.solr.search.facet.TestCloudJSONFacetSKG_collection s:shard1 r:core_node2 x:org.apache.solr.search.facet.TestCloudJSONFacetSKG_collection_shard1_replica_n1 ] o.a.s.u.p.LogUpdateProcessorFactory [org.apache.solr.search.facet.TestCloudJSONFacetSKG_collection_shard1_replica_n1]  webapp=/solr path=/update params={wt=javabin&version=2}{add=[6 (1644118968951111680)]} 0 0
   [junit4]   2> 1614066 INFO  (qtp1797060855-13929) [n:127.0.0.1:44819_solr c:org.apache.solr.search.facet.TestCloudJSONFacetSKG_collection s:shard1 r:core_node2 x:org.apache.solr.search.facet.TestCloudJSONFacetSKG_collection_shard1_replica_n1 ] o.a.s.u.p.LogUpdateProcessorFactory [org.apache.solr.search.facet.TestCloudJSONFacetSKG_collection_shard1_replica_n1]  webapp=/solr path=/update params={wt=javabin&version=2}{add=[7 (1644118968987811840)]} 0 0
   [junit4]   2> 1614068 INFO  (qtp1797060855-13930) [n:127.0.0.1:44819_solr c:org.apache.solr.search.facet.TestCloudJSONFacetSKG_collection s:shard1 r:core_node2 x:org.apache.solr.search.facet.TestCloudJSONFacetSKG_collection_shard1_replica_n1 ] o.a.s.u.p.LogUpdateProcessorFactory [org.apache.solr.search.facet.TestCloudJSONFacetSKG_collection_shard1_replica_n1]  webapp=/solr path=/update params={wt=javabin&version=2}{add=[8 (1644118968988860416)]} 0 0
   [junit4]   2> 1614087 INFO  (qtp1797060855-13928) [n:127.0.0.1:44819_solr c:org.apache.solr.search.facet.TestCloudJSONFacetSKG_collection s:shard1 r:core_node2 x:org.apache.solr.search.facet.TestCloudJSONFacetSKG_collection_shard1_replica_n1 ] o.a.s.u.p.LogUpdateProcessorFactory [org.apache.solr.search.facet.TestCloudJSONFacetSKG_collection_shard1_replica_n1]  webapp=/solr path=/update params={wt=javabin&version=2}{add=[9 (1644118969009831936)]} 0 0
   [junit4]   2> 1614122 INFO  (qtp1797060855-13931) [n:127.0.0.1:44819_solr c:org.apache.solr.search.facet.TestCloudJSONFacetSKG_collection s:shard1 r:core_node2 x:org.apache.solr.search.facet.TestCloudJSONFacetSKG_collection_shard1_replica_n1 ] o.a.s.u.p.LogUpdateProcessorFactory [org.apache.solr.search.facet.TestCloudJSONFacetSKG_collection_shard1_replica_n1]  webapp=/solr path=/update params={wt=javabin&version=2}{add=[10 (1644118969045483520)]} 0 33
   [junit4]   2> 1614124 INFO  (qtp1797060855-13931) [n:127.0.0.1:44819_solr c:org.apache.solr.search.facet.TestCloudJSONFacetSKG_collection s:shard1 r:core_node2 x:org.apache.solr.search.facet.TestCloudJSONFacetSKG_collection_shard1_replica_n1 ] o.a.s.u.p.LogUpdateProcessorFactory [org.apache.solr.search.facet.TestCloudJSONFacetSKG_collection_shard1_replica_n1]  webapp=/solr path=/update params={wt=javabin&version=2}{add=[11 (1644118969047580672)]} 0 0
   [junit4]   2> 1614137 INFO  (qtp1797060855-13931) [n:127.0.0.1:44819_solr c:org.apache.solr.search.facet.TestCloudJSONFacetSKG_collection s:shard1 r:core_node2 x:org.apache.solr.search.facet.TestCloudJSONFacetSKG_collection_shard1_replica_n1 ] o.a.s.u.p.LogUpdateProcessorFactory [org.apache.solr.search.facet.TestCloudJSONFacetSKG_collection_shard1_replica_n1]  webapp=/solr path=/update params={wt=javabin&version=2}{add=[12 (1644118969049677824)]} 0 12
   [junit4]   2> 1614139 INFO  (qtp1797060855-13931) [n:127.0.0.1:44819_solr c:org.apache.solr.search.facet.TestCloudJSONFacetSKG_collection s:shard1 r:core_node2 x:org.apache.solr.search.facet.TestCloudJSONFacetSKG_collection_shard1_replica_n1 ] o.a.s.u.p.LogUpdateProcessorFactory [org.apache.solr.search.facet.TestCloudJSONFacetSKG_collection_shard1_replica_n1]  webapp=/solr path=/update params={wt=javabin&version=2}{add=[13 (1644118969063309312)]} 0 0
   [junit4]   2> 1614140 INFO  (qtp1797060855-13931) [n:127.0.0.1:44819_solr c:org.apache.solr.search.facet.TestCloudJSONFacetSKG_collection s:shard1 r:core_node2 x:org.apache.solr.search.facet.TestCloudJSONFacetSKG_collection_shard1_replica_n1 ] o.a.s.u.p.LogUpdateProcessorFactory [org.apache.solr.search.facet.TestCloudJSONFacetSKG_collection_shard1_replica_n1]  webapp=/solr path=/update params={wt=javabin&version=2}{add=[14 (1644118969064357888)]} 0 0
   [junit4]   2> 1614141 INFO  (qtp1797060855-13931) [n:127.0.0.1:44819_solr c:org.apache.solr.search.facet.TestCloudJSONFacetSKG_collection s:shard1 r:core_node2 x:org.apache.solr.search.facet.TestCloudJSONFacetSKG_collection_shard1_replica_n1 ] o.a.s.u.p.LogUpdateProcessorFactory [org.apache.solr.search.facet.TestCloudJSONFacetSKG_collection_shard1_replica_n1]  webapp=/solr path=/update params={wt=javabin&version=2}{add=[15 (1644118969066455040)]} 0 0
   [junit4]   2> 1614212 INFO  (qtp1797060855-13927) [n:127.0.0.1:44819_solr c:org.apache.solr.search.facet.TestCloudJSONFacetSKG_collection s:shard1 r:core_node2 x:org.apache.solr.search.facet.TestCloudJSONFacetSKG_collection_shard1_replica_n1 ] o.a.s.u.p.LogUpdateProcessorFactory [org.apache.solr.search.facet.TestCloudJSONFacetSKG_collection_shard1_replica_n1]  webapp=/solr path=/update params={wt=javabin&version=2}{add=[16 (1644118969139855360)]} 0 0
   [junit4]   2> 1614231 INFO  (qtp1797060855-13929) [n:127.0.0.1:44819_solr c:org.apache.solr.search.facet.TestCloudJSONFacetSKG_collection s:shard1 r:core_node2 x:org.apache.solr.search.facet.TestCloudJSONFacetSKG_collection_shard1_replica_n1 ] o.a.s.u.p.LogUpdateProcessorFactory [org.apache.solr.search.facet.TestCloudJSONFacetSKG_collection_shard1_replica_n1]  webapp=/solr path=/update params={wt=javabin&version=2}{add=[17 (1644118969159778304)]} 0 17
   [junit4]   2> 1614305 INFO  (qtp1797060855-13929) [n:127.0.0.1:44819_solr c:org.apache.solr.search.facet.TestCloudJSONFacetSKG_collection s:shard1 r:core_node2 x:org.apache.solr.search.facet.TestCloudJSONFacetSKG_collection_shard1_replica_n1 ] o.a.s.u.p.LogUpdateProcessorFactory [org.apache.solr.search.facet.TestCloudJSONFacetSKG_collection_shard1_replica_n1]  webapp=/solr path=/update params={wt=javabin&version=2}{add=[18 (1644118969237372928)]} 0 1
   [junit4]   2> 1614307 INFO  (qtp1797060855-13929) [n:127.0.0.1:44819_solr c:org.apache.solr.search.facet.TestCloudJSONFacetSKG_collection s:shard1 r:core_node2 x:org.apache.solr.search.facet.TestCloudJSONFacetSKG_collection_shard1_replica_n1 ] o.a.s.u.p.LogUpdateProcessorFactory [org.apache.solr.search.facet.TestCloudJSONFacetSKG_collection_shard1_replica_n1]  webapp=/solr path=/update params={wt=javabin&version=2}{add=[19 (1644118969240518656)]} 0 0
   [junit4]   2> 1614321 INFO  (qtp1797060855-13930) [n:127.0.0.1:44819_solr c:org.apache.solr.search.facet.TestCloudJSONFacetSKG_collection s:shard1 r:core_node2 x:org.apache.solr.search.facet.TestCloudJSONFacetSKG_collection_shard1_replica_n1 ] o.a.s.u.p.LogUpdateProcessorFactory [org.apache.solr.search.facet.TestCloudJSONFacetSKG_collection_shard1_replica_n1]  webapp=/solr path=/update params={wt=javabin&version=2}{add=[20 (1644118969255198720)]} 0 0
   [junit4]   2> 1614322 INFO  (qtp1797060855-13928) [n:127.0.0.1:44819_solr c:org.apache.solr.search.facet.TestCloudJSONFacetSKG_collection s:shard1 r:core_node2 x:org.apache.solr.search.facet.TestCloudJSONFacetSKG_collection_shard1_replica_n1 ] o.a.s.u.p.LogUpdateProcessorFactory [org.apache.solr.search.facet.TestCloudJSONFacetSKG_collection_shard1_replica_n1]  webapp=/solr path=/update params={wt=javabin&version=2}{add=[21 (1644118969256247296)]} 0 0
   [junit4]   2> 1614323 INFO  (qtp1797060855-13931) [n:127.0.0.1:44819_solr c:org.apache.solr.search.facet.TestCloudJSONFacetSKG_collection s:shard1 r:core_node2 x:org.apache.solr.search.facet.TestCloudJSONFacetSKG_collection_shard1_replica_n1 ] o.a.s.u.p.LogUpdateProcessorFactory [org.apache.solr.search.facet.TestCloudJSONFacetSKG_collection_shard1_replica_n1]  webapp=/solr path=/update params={wt=javabin&version=2}{add=[22 (1644118969257295872)]} 0 0
   [junit4]   2> 1614341 INFO  (qtp1797060855-13927) [n:127.0.0.1:44819_solr c:org.apache.solr.search.facet.TestCloudJSONFacetSKG_collection s:shard1 r:core_node2 x:org.apache.solr.search.facet.TestCloudJSONFacetSKG_collection_shard1_replica_n1 ] o.a.s.u.p.LogUpdateProcessorFactory [org.apache.solr.search.facet.TestCloudJSONFacetSKG_collection_shard1_replica_n1]  webapp=/solr path=/update params={wt=javabin&version=2}{add=[23 (1644118969276170240)]} 0 0
   [junit4]   2> 1614361 INFO  (OverseerCollectionConfigSetProcessor-75353493128019973-127.0.0.1:44819_solr-n_0000000000) [n:127.0.0.1:44819_solr     ] o.a.s.c.OverseerTaskQueue Response ZK path: /overseer/collection-queue-work/qnr-0000000000 doesn't exist.  Requestor may have disconnected from ZooKeeper
   [junit4]   2> 1614378 INFO  (qtp1797060855-13929) [n:127.0.0.1:44819_solr c:org.apache.solr.search.facet.TestCloudJSONFacetSKG_collection s:shard1 r:core_node2 x:org.apache.solr.search.facet.TestCloudJSONFacetSKG_collection_shard1_replica_n1 ] o.a.s.u.p.LogUpdateProcessorFactory [org.apache.solr.search.facet.TestCloudJSONFacetSKG_collection_shard1_replica_n1]  webapp=/solr path=/update params={wt=javabin&version=2}{add=[24 (1644118969313918976)]} 0 0
   [junit4]   2> 1614379 INFO  (qtp1797060855-13930) [n:127.0.0.1:44819_solr c:org.apache.solr.search.facet.TestCloudJSONFacetSKG_collection s:shard1 r:core_node2 x:org.apache.solr.search.facet.TestCloudJSONFacetSKG_collection_shard1_replica_n1 ] o.a.s.u.p.LogUpdateProcessorFactory [org.apache.solr.search.facet.TestCloudJSONFacetSKG_collection_shard1_replica_n1]  webapp=/solr path=/update params={wt=javabin&version=2}{add=[25 (1644118969316016128)]} 0 0
   [junit4]   2> 1614429 INFO  (qtp1797060855-13928) [n:127.0.0.1:44819_solr c:org.apache.solr.search.facet.TestCloudJSONFacetSKG_collection s:shard1 r:core_node2 x:org.apache.solr.search.facet.TestCloudJSONFacetSKG_collection_shard1_replica_n1 ] o.a.s.u.p.LogUpdateProcessorFactory [org.apache.solr.search.facet.TestCloudJSONFacetSKG_collection_shard1_replica_n1]  webapp=/solr path=/update params={wt=javabin&version=2}{add=[26 (1644118969333841920)]} 0 33
   [junit4]   2> 1614431 INFO  (qtp1797060855-13928) [n:127.0.0.1:44819_solr c:org.apache.solr.search.facet.TestCloudJSONFacetSKG_collection s:shard1 r:core_node2 x:org.apache.solr.search.facet.TestCloudJSONFacetSKG_collection_shard1_replica_n1 ] o.a.s.u.p.LogUpdateProcessorFactory [org.apache.solr.search.facet.TestCloudJSONFacetSKG_collection_shard1_replica_n1]  webapp=/solr path=/update params={wt=javabin&version=2}{add=[27 (1644118969370542080)]} 0 0
   [junit4]   2> 1614466 INFO  (qtp1797060855-13928) [n:127.0.0.1:44819_solr c:org.apache.solr.search.facet.TestCloudJSONFacetSKG_collection s:shard1 r:core_node2 x:org.apache.solr.search.facet.TestCloudJSONFacetSKG_collection_shard1_replica_n1 ] o.a.s.u.p.LogUpdateProcessorFactory [org.apache.solr.search.facet.TestCloudJSONFacetSKG_collection_shard1_replica_n1]  webapp=/solr path=/update params={wt=javabin&version=2}{add=[28 (1644118969407242240)]} 0 33
   [junit4]   2> 1614468 INFO  (qtp1797060855-13928) [n:127.0.0.1:44819_solr c:org.apache.solr.search.facet.TestCloudJSONFacetSKG_collection s:shard1 r:core_node2 x:org.apache.solr.search.facet.TestCloudJSONFacetSKG_collection_shard1_replica_n1 ] o.a.s.u.p.LogUpdateProcessorFactory [org.apache.solr.search.facet.TestCloudJSONFacetSKG_collection_shard1_replica_n1]  webapp=/solr path=/update params={wt=javabin&version=2}{add=[29 (1644118969408290816)]} 0 0
   [junit4]   2> 1614469 INFO  (qtp1797060855-13928) [n:127.0.0.1:44819_solr c:org.apache.solr.search.facet.TestCloudJSONFacetSKG_collection s:shard1 r:core_node2 x:org.apache.solr.search.facet.TestCloudJSONFacetSKG_collection_shard1_replica_n1 ] o.a.s.u.p.LogUpdateProcessorFactory [org.apache.solr.search.facet.TestCloudJSONFacetSKG_collection_shard1_replica_n1]  webapp=/solr path=/update params={wt=javabin&version=2}{add=[30 (1644118969410387968)]} 0 0
   [junit4]   2> 1614487 INFO  (qtp1797060855-13931) [n:127.0.0.1:44819_solr c:org.apache.solr.search.facet.TestCloudJSONFacetSKG_collection s:shard1 r:core_node2 x:org.apache.solr.search.facet.TestCloudJSONFacetSKG_collection_shard1_replica_n1 ] o.a.s.u.p.LogUpdateProcessorFactory [org.apache.solr.search.facet.TestCloudJSONFacetSKG_collection_shard1_replica_n1]  webapp=/solr path=/update params={wt=javabin&version=2}{add=[31 (1644118969429262336)]} 0 0
   [junit4]   2> 1614489 INFO  (qtp1797060855-13927) [n:127.0.0.1:44819_solr c:org.apache.solr.search.facet.TestCloudJSONFacetSKG_collection s:shard1 r:core_node2 x:org.apache.solr.search.facet.TestCloudJSONFacetSKG_collection_shard1_replica_n1 ] o.a.s.u.p.LogUpdateProcessorFactory [org.apache.solr.search.facet.TestCloudJSONFacetSKG_collection_shard1_replica_n1]  webapp=/solr path=/update params={wt=javabin&version=2}{add=[32 (1644118969430310912)]} 0 0
   [junit4]   2> 1614523 INFO  (qtp1797060855-13929) [n:127.0.0.1:44819_solr c:org.apache.solr.search.facet.TestCloudJSONFacetSKG_collection s:shard1 r:core_node2 x:org.apache.solr.search.facet.TestCloudJSONFacetSKG_collection_shard1_replica_n1 ] o.a.s.u.p.LogUpdateProcessorFactory [org.apache.solr.search.facet.TestCloudJSONFacetSKG_collection_shard1_replica_n1]  webapp=/solr path=/update params={wt=javabin&version=2}{add=[33 (1644118969465962496)]} 0 33
   [junit4]   2> 1614524 INFO  (qtp1797060855-13929) [n:127.0.0.1:44819_solr c:org.apache.solr.search.facet.TestCloudJSONFacetSKG_collection s:shard1 r:core_node2 x:org.apache.solr.search.facet.TestCloudJSONFacetSKG_collection_shard1_replica_n1 ] o.a.s.u.p.LogUpdateProcessorFactory [org.apache.solr.search.facet.TestCloudJSONFacetSKG_collection_shard1_replica_n1]  webapp=/solr path=/update params={wt=javabin&version=2}{add=[34 (1644118969468059648)]} 0 0
   [junit4]   2> 1614525 INFO  (qtp1797060855-13929) [n:127.0.0.1:44819_solr c:org.apache.solr.search.facet.TestCloudJSONFacetSKG_collection s:shard1 r:core_node2 x:org.apache.solr.search.facet.TestCloudJSONFacetSKG_collection_shard1_replica_n1 ] o.a.s.u.p.LogUpdateProcessorFactory [org.apache.solr.search.facet.TestCloudJSONFacetSKG_collection_shard1_replica_n1]  webapp=/solr path=/update params={wt=javabin&version=2}{add=[35 (1644118969469108224)]} 0 0
   [junit4]   2> 1614559 INFO  (qtp1797060855-13929) [n:127.0.0.1:44819_solr c:org.apache.solr.search.facet.TestCloudJSONFacetSKG_collection s:shard1 r:core_node2 x:org.apache.solr.search.facet.TestCloudJSONFacetSKG_collection_shard1_replica_n1 ] o.a.s.u.p.LogUpdateProcessorFactory [org.apache.solr.search.facet.TestCloudJSONFacetSKG_collection_shard1_replica_n1]  webapp=/solr path=/update params={wt=javabin&version=2}{add=[36 (1644118969504759808)]} 0 0
   [junit4]   2> 1614561 INFO  (qtp1797060855-13929) [n:127.0.0.1:44819_solr c:org.apache.solr.search.facet.TestCloudJSONFacetSKG_collection s:shard1 r:core_node2 x:org.apache.solr.search.facet.TestCloudJSONFacetSKG_collection_shard1_replica_n1 ] o.a.s.u.p.LogUpdateProcessorFactory [org.apache.solr.search.facet.TestCloudJSONFacetSKG_collection_shard1_replica_n1]  webapp=/solr path=/update params={wt=javabin&version=2}{add=[37 (1644118969505808384)]} 0 0
   [junit4]   2> 1614562 INFO  (qtp1797060855-13929) [n:127.0.0.1:44819_solr c:org.apache.solr.search.facet.TestCloudJSONFacetSKG_collection s:shard1 r:core_node2 x:org.apache.solr.search.facet.TestCloudJSONFacetSKG_collection_shard1_replica_n1 ] o.a.s.u.p.LogUpdateProcessorFactory [org.apache.solr.search.facet.TestCloudJSONFacetSKG_collection_shard1_replica_n1]  webapp=/solr path=/update params={wt=javabin&version=2}{add=[37 (1644118969507905536)]} 0 0
   [junit4]   2> 1614596 INFO  (qtp1797060855-13929) [n:127.0.0.1:44819_solr c:org.apache.solr.search.facet.TestCloudJSONFacetSKG_collection s:shard1 r:core_node2 x:org.apache.solr.search.facet.TestCloudJSONFacetSKG_collection_shard1_replica_n1 ] o.a.s.u.p.LogUpdateProcessorFactory [org.apache.solr.search.facet.TestCloudJSONFacetSKG_collection_shard1_replica_n1]  webapp=/solr path=/update params={wt=javabin&version=2}{add=[38 (1644118969543557120)]} 0 0
   [junit4]   2> 1614597 INFO  (qtp1797060855-13929) [n:127.0.0.1:44819_solr c:org.apache.solr.search.facet.TestCloudJSONFacetSKG_collection s:shard1 r:core_node2 x:org.apache.solr.search.facet.TestCloudJSONFacetSKG_collection_shard1_replica_n1 ] o.a.s.u.p.LogUpdateProcessorFactory [org.apache.solr.search.facet.TestCloudJSONFacetSKG_collection_shard1_replica_n1]  webapp=/solr path=/update params={wt=javabin&version=2}{add=[39 (1644118969544605696)]} 0 0
   [junit4]   2> 1614598 INFO  (qtp1797060855-13929) [n:127.0.0.1:44819_solr c:org.apache.solr.search.facet.TestCloudJSONFacetSKG_collection s:shard1 r:core_node2 x:org.apache.solr.search.facet.TestCloudJSONFacetSKG_collection_shard1_replica_n1 ] o.a.s.u.p.LogUpdateProcessorFactory [org.apache.solr.search.facet.TestCloudJSONFacetSKG_collection_shard1_replica_n1]  webapp=/solr path=/update params={wt=javabin&version=2}{add=[40 (1644118969545654272)]} 0 0
   [junit4]   2> 1614616 INFO  (qtp1797060855-13929) [n:127.0.0.1:44819_solr c:org.apache.solr.search.facet.TestCloudJSONFacetSKG_collection s:shard1 r:core_node2 x:org.apache.solr.search.facet.TestCloudJSONFacetSKG_collection_shard1_replica_n1 ] o.a.s.u.p.LogUpdateProcessorFactory [org.apache.solr.search.facet.TestCloudJSONFacetSKG_collection_shard1_replica_n1]  webapp=/solr path=/update params={wt=javabin&version=2}{add=[41 (1644118969564528640)]} 0 0
   [junit4]   2> 1614633 INFO  (qtp1797060855-13930) [n:127.0.0.1:44819_solr c:org.apache.solr.search.facet.TestCloudJSONFacetSKG_collection s:shard1 r:core_node2 x:org.apache.solr.search.facet.TestCloudJSONFacetSKG_collection_shard1_replica_n1 ] o.a.s.u.p.LogUpdateProcessorFactory [org.apache.solr.search.facet.TestCloudJSONFacetSKG_collection_shard1_replica_n1]  webapp=/solr path=/update params={wt=javabin&version=2}{add=[42 (1644118969581305856)]} 0 0
   [junit4]   2> 1614634 INFO  (qtp1797060855-13928) [n:127.0.0.1:44819_solr c:org.apache.solr.search.facet.TestCloudJSONFacetSKG_collection s:shard1 r:core_node2 x:org.apache.solr.search.facet.TestCloudJSONFacetSKG_collection_shard1_replica_n1 ] o.a.s.u.p.LogUpdateProcessorFactory [org.apache.solr.search.facet.TestCloudJSONFacetSKG_collection_shard1_replica_n1]  webapp=/solr path=/update params={wt=javabin&version=2}{add=[43 (1644118969583403008)]} 0 0
   [junit4]   2> 1614635 INFO  (qtp1797060855-13931) [n:127.0.0.1:44819_solr c:org.apache.solr.search.facet.TestCloudJSONFacetSKG_collection s:shard1 r:core_node2 x:org.apache.solr.search.facet.TestCloudJSONFacetSKG_collection_shard1_replica_n1 ] o.a.s.u.p.LogUpdateProcessorFactory [org.apache.solr.search.facet.TestCloudJSONFacetSKG_collection_shard1_replica_n1]  webapp=/solr path=/update params={wt=javabin&version=2}{add=[44 (1644118969584451584)]} 0 0
   [junit4]   2> 1614653 INFO  (qtp1797060855-13927) [n:127.0.0.1:44819_solr c:org.apache.solr.search.facet.TestCloudJSONFacetSKG_collection s:shard1 r:core_node2 x:org.apache.solr.search.facet.TestCloudJSONFacetSKG_collection_shard1_replica_n1 ] o.a.s.u.p.LogUpdateProcessorFactory [org.apache.solr.search.facet.TestCloudJSONFacetSKG_collection_shard1_replica_n1]  webapp=/solr path=/update params={wt=javabin&version=2}{add=[45 (1644118969603325952)]} 0 0
   [junit4]   2> 1614654 INFO  (qtp1797060855-13929) [n:127.0.0.1:44819_solr c:org.apache.solr.search.facet.TestCloudJSONFacetSKG_collection s:shard1 r:core_node2 x:org.apache.solr.search.facet.TestCloudJSONFacetSKG_collection_shard1_replica_n1 ] o.a.s.u.p.LogUpdateProcessorFactory [org.apache.solr.search.facet.TestCloudJSONFacetSKG_collection_shard1_replica_n1]  webapp=/solr path=/update params={wt=javabin&version=2}{add=[46 (1644118969604374528)]} 0 0
   [junit4]   2> 1614669 INFO  (qtp1797060855-13930) [n:127.0.0.1:44819_solr c:org.apache.solr.search.facet.TestCloudJSONFacetSKG_collection s:shard1 r:core_node2 x:org.apache.solr.search.facet.TestCloudJSONFacetSKG_collection_shard1_replica_n1 ] o.a.s.u.p.LogUpdateProcessorFactory [org.apache.solr.search.facet.TestCloudJSONFacetSKG_collection_shard1_replica_n1]  webapp=/solr path=/update params={wt=javabin&version=2}{add=[47 (1644118969620103168)]} 0 0
   [junit4]   2> 1614670 INFO  (qtp1797060855-13928) [n:127.0.0.1:44819_solr c:org.apache.solr.search.facet.TestCloudJSONFacetSKG_collection s:shard1 r:core_node2 x:org.apache.solr.search.facet.TestCloudJSONFacetSKG_collection_shard1_replica_n1 ] o.a.s.u.p.LogUpdateProcessorFactory [org.apache.solr.search.facet.TestCloudJSONFacetSKG_collection_shard1_replica_n1]  webapp=/solr path=/update params={wt=javabin&version=2}{add=[48 (1644118969621151744)]} 0 0
   [junit4]   2> 1614671 INFO  (qtp1797060855-13931) [n:127.0.0.1:44819_solr c:org.apache.solr.search.facet.TestCloudJSONFacetSKG_collection s:shard1 r:core_node2 x:org.apache.solr.search.facet.TestCloudJSONFacetSKG_collection_shard1_replica_n1 ] o.a.s.u.p.LogUpdateProcessorFactory [org.apache.solr.search.facet.TestCloudJSONFacetSKG_collection_shard1_replica_n1]  webapp=/solr path=/update params={wt=javabin&version=2}{add=[49 (1644118969622200320)]} 0 0
   [junit4]   2> 1614707 INFO  (qtp1797060855-13927) [n:127.0.0.1:44819_solr c:org.apache.solr.search.facet.TestCloudJSONFacetSKG_collection s:shard1 r:core_node2 x:org.apache.solr.search.facet.TestCloudJSONFacetSKG_collection_shard1_replica_n1 ] o.a.s.u.p.LogUpdateProcessorFactory [org.apache.solr.search.facet.TestCloudJSONFacetSKG_collection_shard1_replica_n1]  webapp=/solr path=/update params={wt=javabin&version=2}{add=[50 (1644118969659949056)]} 0 35
   [junit4]   2> 1614741 INFO  (qtp1797060855-13927) [n:127.0.0.1:44819_solr c:org.apache.solr.search.facet.TestCloudJSONFacetSKG_collection s:shard1 r:core_node2 x:org.apache.solr.search.facet.TestCloudJSONFacetSKG_collection_shard1_replica_n1 ] o.a.s.u.p.LogUpdateProcessorFactory [org.apache.solr.search.facet.TestCloudJSONFacetSKG_collection_shard1_replica_n1]  webapp=/solr path=/update params={wt=javabin&version=2}{add=[51 (1644118969695600640)]} 0 33
   [junit4]   2> 1614745 INFO  (qtp1797060855-13927) [n:127.0.0.1:44819_solr c:org.apache.solr.search.facet.TestCloudJSONFacetSKG_collection s:shard1 r:core_node2 x:org.apache.solr.search.facet.TestCloudJSONFacetSKG_collection_shard1_replica_n1 ] o.a.s.u.p.LogUpdateProcessorFactory [org.apache.solr.search.facet.TestCloudJSONFacetSKG_collection_shard1_replica_n1]  webapp=/solr path=/update params={wt=javabin&version=2}{add=[52 (1644118969699794944)]} 0 0
   [junit4]   2> 1614763 INFO  (qtp1797060855-13927) [n:127.0.0.1:44819_solr c:org.apache.solr.search.facet.TestCloudJSONFacetSKG_collection s:shard1 r:core_node2 x:org.apache.solr.search.facet.TestCloudJSONFacetSKG_collection_shard1_replica_n1 ] o.a.s.u.p.LogUpdateProcessorFactory [org.apache.solr.search.facet.TestCloudJSONFacetSKG_collection_shard1_replica_n1]  webapp=/solr path=/update params={wt=javabin&version=2}{add=[53 (1644118969717620736)]} 0 0
   [junit4]   2> 1614764 INFO  (qtp1797060855-13927) [n:127.0.0.1:44819_solr c:org.apache.solr.search.facet.TestCloudJSONFacetSKG_collection s:shard1 r:core_node2 x:org.apache.solr.search.facet.TestCloudJSONFacetSKG_collection_shard1_replica_n1 ] o.a.s.u.p.LogUpdateProcessorFactory [org.apache.solr.search.facet.TestCloudJSONFacetSKG_collection_shard1_replica_n1]  webapp=/solr path=/update params={wt=javabin&version=2}{add=[54 (1644118969718669312)]} 0 0
   [junit4]   2> 1614765 INFO  (qtp1797060855-13927) [n:127.0.0.1:44819_solr c:org.apache.solr.search.facet.TestCloudJSONFacetSKG_collection s:shard1 r:core_node2 x:org.apache.solr.search.facet.TestCloudJSONFacetSKG_collection_shard1_replica_n1 ] o.a.s.u.p.LogUpdateProcessorFactory [org.apache.solr.search.facet.TestCloudJSONFacetSKG_collection_shard1_replica_n1]  webapp=/solr path=/update params={wt=javabin&version=2}{add=[55 (1644118969719717888)]} 0 0
   [junit4]   2> 1614782 INFO  (qtp1797060855-13927) [n:127.0.0.1:44819_solr c:org.apache.solr.search.facet.TestCloudJSONFacetSKG_collection s:shard1 r:core_node2 x:org.apache.solr.search.facet.TestCloudJSONFacetSKG_collection_shard1_replica_n1 ] o.a.s.u.p.LogUpdateProcessorFactory [org.apache.solr.search.facet.TestCloudJSONFacetSKG_collection_shard1_replica_n1]  webapp=/solr path=/update params={wt=javabin&version=2}{add=[56 (1644118969738592256)]} 0 0
   [junit4]   2> 1614799 INFO  (qtp1797060855-13929) [n:127.0.0.1:44819_solr c:org.apache.solr.search.facet.TestCloudJSONFacetSKG_collection s:shard1 r:core_node2 x:org.apache.solr.search.facet.TestCloudJSONFacetSKG_collection_shard1_replica_n1 ] o.a.s.u.p.LogUpdateProcessorFactory [org.apache.solr.search.facet.TestCloudJSONFacetSKG_collection_shard1_replica_n1]  webapp=/solr path=/update params={wt=javabin&version=2}{add=[57 (1644118969756418048)]} 0 0
   [junit4]   2> 1614800 INFO  (qtp1797060855-13930) [n:127.0.0.1:44819_solr c:org.apache.solr.search.facet.TestCloudJSONFacetSKG_collection s:shard1 r:core_node2 x:org.apache.solr.search.facet.TestCloudJSONFacetSKG_collection_shard1_replica_n1 ] o.a.s.u.p.LogUpdateProcessorFactory [org.apache.solr.search.facet.TestCloudJSONFacetSKG_collection_shard1_replica_n1]  webapp=/solr path=/update params={wt=javabin&version=2}{add=[58 (1644118969757466624)]} 0 0
   [junit4]   2> 1615435 INFO  (qtp1797060855-13928) [n:127.0.0.1:44819_solr c:org.apache.solr.search.facet.TestCloudJSONFacetSKG_collection s:shard1 r:core_node2 x:org.apache.solr.search.facet.TestCloudJSONFacetSKG_collection_shard1_replica_n1 ] o.a.s.u.p.LogUpdateProcessorFactory [org.apache.solr.search.facet.TestCloudJSONFacetSKG_collection_shard1_replica_n1]  webapp=/solr path=/update params={wt=javabin&version=2}{add=[59 (1644118970422263808)]} 0 620
   [junit4]   2> 1615451 INFO  (qtp1797060855-13931) [n:127.0.0.1:44819_solr c:org.apache.solr.search.facet.TestCloudJSONFacetSKG_collection s:shard1 r:core_node2 x:org.apache.solr.search.facet.TestCloudJSONFacetSKG_collection_shard1_replica_n1 ] o.a.s.u.p.LogUpdateProcessorFactory [org.apache.solr.search.facet.TestCloudJSONFacetSKG_collection_shard1_replica_n1]  webapp=/solr path=/update params={wt=javabin&version=2}{add=[60 (1644118970439041024)]} 0 14
   [junit4]   2> 1615452 INFO  (qtp1797060855-13927) [n:127.0.0.1:44819_solr c:org.apache.solr.search.facet.TestCloudJSONFacetSKG_collection s:shard1 r:core_node2 x:org.apache.solr.search.facet.TestCloudJSONFacetSKG_collection_shard1_replica_n1 ] o.a.s.u.p.LogUpdateProcessorFactory [org.apache.solr.search.facet.TestCloudJSONFacetSKG_collection_shard1_replica_n1]  webapp=/solr path=/update params={wt=javabin&version=2}{add=[61 (1644118970441138176)]} 0 0
   [junit4]   2> 1615515 INFO  (qtp1797060855-13929) [n:127.0.0.1:44819_solr c:org.apache.solr.search.facet.TestCloudJSONFacetSKG_collection s:shard1 r:core_node2 x:org.apache.solr.search.facet.TestCloudJSONFacetSKG_collection_shard1_replica_n1 ] o.a.s.u.p.LogUpdateProcessorFactory [org.apache.solr.search.facet.TestCloudJSONFacetSKG_collection_shard1_replica_n1]  webapp=/solr path=/update params={wt=javabin&version=2}{add=[62 (1644118970442186752)]} 0 62
   [junit4]   2> 1615517 INFO  (qtp1797060855-13930) [n:127.0.0.1:44819_solr c:org.apache.solr.search.facet.TestCloudJSONFacetSKG_collection s:shard1 r:core_node2 x:org.apache.solr.search.facet.TestCloudJSONFacetSKG_collection_shard1_replica_n1 ] o.a.s.u.p.LogUpdateProcessorFactory [org.apache.solr.search.facet.TestCloudJSONFacetSKG_collection_shard1_replica_n1]  webapp=/solr path=/update params={wt=javabin&version=2}{add=[63 (1644118970509295616)]} 0 0
   [junit4]   2> 1615518 INFO  (qtp1797060855-13928) [n:127.0.0.1:44819_solr c:org.apache.solr.search.facet.TestCloudJSONFacetSKG_collection s:shard1 r:core_node2 x:org.apache.solr.search.facet.TestCloudJSONFacetSKG_collection_shard1_replica_n1 ] o.a.s.u.p.LogUpdateProcessorFactory [org.apache.solr.search.facet.TestCloudJSONFacetSKG_collection_shard1_replica_n1]  webapp=/solr path=/update params={wt=javabin&version=2}{add=[64 (1644118970510344192)]} 0 0
   [junit4]   2> 1615538 INFO  (qtp1797060855-13931) [n:127.0.0.1:44819_solr c:org.apache.solr.search.facet.TestCloudJSONFacetSKG_collection s:shard1 r:core_node2 x:org.apache.solr.search.facet.TestCloudJSONFacetSKG_collection_shard1_replica_n1 ] o.a.s.u.p.LogUpdateProcessorFactory [org.apache.solr.search.facet.TestCloudJSONFacetSKG_collection_shard1_replica_n1]  webapp=/solr path=/update params={wt=javabin&version=2}{add=[65 (1644118970530267136)]} 0 0
   [junit4]   2> 1615539 INFO  (qtp1797060855-13931) [n:127.0.0.1:44819_solr c:org.apache.solr.search.facet.TestCloudJSONFacetSKG_collection s:shard1 r:core_node2 x:org.apache.solr.search.facet.TestCloudJSONFacetSKG_collection_shard1_replica_n1 ] o.a.s.u.p.LogUpdateProcessorFactory [org.apache.solr.search.facet.TestCloudJSONFacetSKG_collection_shard1_replica_n1]  webapp=/solr path=/update params={wt=javabin&version=2}{add=[66 (1644118970532364288)]} 0 0
   [junit4]   2> 1615552 INFO  (qtp1797060855-13927) [n:127.0.0.1:44819_solr c:org.apache.solr.search.facet.TestCloudJSONFacetSKG_collection s:shard1 r:core_node2 x:org.apache.solr.search.facet.TestCloudJSONFacetSKG_collection_shard1_replica_n1 ] o.a.s.u.p.LogUpdateProcessorFactory [org.apache.solr.search.facet.TestCloudJSONFacetSKG_collection_shard1_replica_n1]  webapp=/solr path=/update params={wt=javabin&version=2}{add=[67 (1644118970545995776)]} 0 0
   [junit4]   2> 1615553 INFO  (qtp1797060855-13929) [n:127.0.0.1:44819_solr c:org.apache.solr.search.facet.TestCloudJSONFacetSKG_collection s:shard1 r:core_node2 x:org.apache.solr.search.facet.TestCloudJSONFacetSKG_collection_shard1_replica_n1 ] o.a.s.u.p.LogUpdateProcessorFactory [org.apache.solr.search.facet.TestCloudJSONFacetSKG_collection_shard1_replica_n1]  webapp=/solr path=/update params={wt=javabin&version=2}{add=[68 (1644118970547044352)]} 0 0
   [junit4]   2> 1615554 INFO  (qtp1797060855-13930) [n:127.0.0.1:44819_solr c:org.apache.solr.search.facet.TestCloudJSONFacetSKG_collection s:shard1 r:core_node2 x:org.apache.solr.search.facet.TestCloudJSONFacetSKG_collection_shard1_replica_n1 ] o.a.s.u.p.LogUpdateProcessorFactory [org.apache.solr.search.facet.TestCloudJSONFacetSKG_collection_shard1_replica_n1]  webapp=/solr path=/update params={wt=javabin&version=2}{add=[69 (1644118970548092928)]} 0 0
   [junit4]   2> 1615555 INFO  (qtp1797060855-13928) [n:127.0.0.1:44819_solr c:org.apache.solr.search.facet.TestCloudJSONFacetSKG_collection s:shard1 r:core_node2 x:org.apache.solr.search.facet.TestCloudJSONFacetSKG_collection_shard1_replica_n1 ] o.a.s.u.p.LogUpdateProcessorFactory [org.apache.solr.search.facet.TestCloudJSONFacetSKG_collection_shard1_replica_n1]  webapp=/solr path=/update params={wt=javabin&version=2}{add=[70 (1644118970549141504)]} 0 0
   [junit4]   2> 1615573 INFO  (qtp1797060855-13928) [n:127.0.0.1:44819_solr c:org.apache.solr.search.facet.TestCloudJSONFacetSKG_collection s:shard1 r:core_node2 x:org.apache.solr.search.facet.TestCloudJSONFacetSKG_collection_shard1_replica_n1 ] o.a.s.u.p.LogUpdateProcessorFactory [org.apache.solr.search.facet.TestCloudJSONFacetSKG_collection_shard1_replica_n1]  webapp=/solr path=/update params={wt=javabin&version=2}{add=[71 (1644118970566967296)]} 0 0
   [junit4]   2> 1615574 INFO  (qtp1797060855-13928) [n:127.0.0.1:44819_solr c:org.apache.solr.search.facet.TestCloudJSONFacetSKG_collection s:shard1 r:core_node2 x:org.apache.solr.search.facet.TestCloudJSONFacetSKG_collection_shard1_replica_n1 ] o.a.s.u.p.LogUpdateProcessorFactory [org.apache.solr.search.facet.TestCloudJSONFacetSKG_collection_shard1_replica_n1]  webapp=/solr path=/update params={wt=javabin&version=2}{add=[72 (1644118970569064448)]} 0 0
   [junit4]   2> 1615575 INFO  (qtp1797060855-13928) [n:127.0.0.1:44819_solr c:org.apache.solr.search.facet.TestCloudJSONFacetSKG_collection s:shard1 r:core_node2 x:org.apache.solr.search.facet.TestCloudJSONFacetSKG_collection_shard1_replica_n1 ] o.a.s.u.p.LogUpdateProcessorFactory [org.apache.solr.search.facet.TestCloudJSONFacetSKG_collection_shard1_replica_n1]  webapp=/solr path=/update params={wt=javabin&version=2}{add=[73 (1644118970569064449)]} 0 0
   [junit4]   2> 1615588 INFO  (qtp1797060855-13928) [n:127.0.0.1:44819_solr c:org.apache.solr.search.facet.TestCloudJSONFacetSKG_collection s:shard1 r:core_node2 x:org.apache.solr.search.facet.TestCloudJSONFacetSKG_collection_shard1_replica_n1 ] o.a.s.u.p.LogUpdateProcessorFactory [org.apache.solr.search.facet.TestCloudJSONFacetSKG_collection_shard1_replica_n1]  webapp=/solr path=/update params={wt=javabin&version=2}{add=[74 (1644118970571161600)]} 0 13
   [junit4]   2> 1615589 INFO  (qtp1797060855-13928) [n:127.0.0.1:44819_solr c:org.apache.solr.search.facet.TestCloudJSONFacetSKG_collection s:shard1 r:core_node2 x:org.apache.solr.search.facet.TestCloudJSONFacetSKG_collection_shard1_replica_n1 ] o.a.s.u.p.LogUpdateProcessorFactory [org.apache.solr.search.facet.TestCloudJSONFacetSKG_collection_shard1_replica_n1]  webapp=/solr path=/update params={wt=javabin&version=2}{add=[75 (1644118970584793088)]} 0 0
   [junit4]   2> 1615591 INFO  (qtp1797060855-13928) [n:127.0.0.1:44819_solr c:org.apache.solr.search.facet.TestCloudJSONFacetSKG_collection s:shard1 r:core_node2 x:org.apache.solr.search.facet.TestCloudJSONFacetSKG_collection_shard1_replica_n1 ] o.a.s.u.p.LogUpdateProcessorFactory [org.apache.solr.search.facet.TestCloudJSONFacetSKG_collection_shard1_replica_n1]  webapp=/solr path=/update params={wt=javabin&version=2}{add=[76 (1644118970585841664)]} 0 1
   [junit4]   2> 1615625 INFO  (qtp1797060855-13928) [n:127.0.0.1:44819_solr c:org.apache.solr.search.facet.TestCloudJSONFacetSKG_collection s:shard1 r:core_node2 x:org.apache.solr.search.facet.TestCloudJSONFacetSKG_collection_shard1_replica_n1 ] o.a.s.u.p.LogUpdateProcessorFactory [org.apache.solr.search.facet.TestCloudJSONFacetSKG_collection_shard1_replica_n1]  webapp=/solr path=/update params={wt=javabin&version=2}{add=[77 (1644118970622541824)]} 0 0
   [junit4]   2> 1615626 INFO  (qtp1797060855-13928) [n:127.0.0.1:44819_solr c:org.apache.solr.search.facet.TestCloudJSONFacetSKG_collection s:shard1 r:core_node2 x:org.apache.solr.search.facet.TestCloudJSONFacetSKG_collection_shard1_replica_n1 ] o.a.s.u.p.LogUpdateProcessorFactory [org.apache.solr.search.facet.TestCloudJSONFacetSKG_collection_shard1_replica_n1]  webapp=/solr path=/update params={wt=javabin&version=2}{add=[78 (1644118970623590400)]} 0 0
   [junit4]   2> 1615627 INFO  (qtp1797060855-13928) [n:127.0.0.1:44819_solr c:org.apache.solr.search.facet.TestCloudJSONFacetSKG_collection s:shard1 r:core_node2 x:org.apache.solr.search.facet.TestCloudJSONFacetSKG_collection_shard1_replica_n1 ] o.a.s.u.p.LogUpdateProcessorFactory [org.apache.solr.search.facet.TestCloudJSONFacetSKG_collection_shard1_replica_n1]  webapp=/solr path=/update params={wt=javabin&version=2}{add=[79 (1644118970624638976)]} 0 0
   [junit4]   2> 1615628 INFO  (qtp1797060855-13928) [n:127.0.0.1:44819_solr c:org.apache.solr.search.facet.TestCloudJSONFacetSKG_collection s:shard1 r:core_node2 x:org.apache.solr.search.facet.TestCloudJSONFacetSKG_collection_shard1_replica_n1 ] o.a.s.u.p.LogUpdateProcessorFactory [org.apache.solr.search.facet.TestCloudJSONFacetSKG_collection_shard1_replica_n1]  webapp=/solr path=/update params={wt=javabin&version=2}{add=[80 (1644118970625687552)]} 0 0
   [junit4]   2> 1615645 INFO  (qtp1797060855-13931) [n:127.0.0.1:44819_solr c:org.apache.solr.search.facet.TestCloudJSONFacetSKG_collection s:shard1 r:core_node2 x:org.apache.solr.search.facet.TestCloudJSONFacetSKG_collection_shard1_replica_n1 ] o.a.s.u.p.LogUpdateProcessorFactory [org.apache.solr.search.facet.TestCloudJSONFacetSKG_collection_shard1_replica_n1]  webapp=/solr path=/update params={wt=javabin&version=2}{add=[81 (1644118970643513344)]} 0 0
   [junit4]   2> 1615646 INFO  (qtp1797060855-13927) [n:127.0.0.1:44819_solr c:org.apache.solr.search.facet.TestCloudJSONFacetSKG_collection s:shard1 r:core_node2 x:org.apache.solr.search.facet.TestCloudJSONFacetSKG_collection_shard1_replica_n1 ] o.a.s.u.p.LogUpdateProcessorFactory [org.apache.solr.search.facet.TestCloudJSONFacetSKG_collection_shard1_replica_n1]  webapp=/solr path=/update params={wt=javabin&version=2}{add=[82 (1644118970644561920)]} 0 0
   [junit4]   2> 1615647 INFO  (qtp1797060855-13929) [n:127.0.0.1:44819_solr c:org.apache.solr.search.facet.TestCloudJSONFacetSKG_collection s:shard1 r:core_node2 x:org.apache.solr.search.facet.TestCloudJSONFacetSKG_collection_shard1_replica_n1 ] o.a.s.u.p.LogUpdateProcessorFactory [org.apache.solr.search.facet.TestCloudJSONFacetSKG_collection_shard1_replica_n1]  webapp=/solr path=/update params={wt=javabin&version=2}{add=[83 (1644118970645610496)]} 0 0
   [junit4]   2> 1615648 INFO  (qtp1797060855-13930) [n:127.0.0.1:44819_solr c:org.apache.solr.search.facet.TestCloudJSONFacetSKG_collection s:shard1 r:core_node2 x:org.apache.solr.search.facet.TestCloudJSONFacetSKG_collection_shard1_replica_n1 ] o.a.s.u.p.LogUpdateProcessorFactory [org.apache.solr.search.facet.TestCloudJSONFacetSKG_collection_shard1_replica_n1]  webapp=/solr path=/update params={wt=javabin&version=2}{add=[84 (1644118970646659072)]} 0 0
   [junit4]   2> 1615662 INFO  (qtp1797060855-13928) [n:127.0.0.1:44819_solr c:org.apache.solr.search.facet.TestCloudJSONFacetSKG_collection s:shard1 r:core_node2 x:org.apache.solr.search.facet.TestCloudJSONFacetSKG_collection_shard1_replica_n1 ] o.a.s.u.p.LogUpdateProcessorFactory [org.apache.solr.search.facet.TestCloudJSONFacetSKG_collection_shard1_replica_n1]  webapp=/solr path=/update params={wt=javabin&version=2}{add=[85 (1644118970661339136)]} 0 0
   [junit4]   2> 1615664 INFO  (qtp1797060855-13931) [n:127.0.0.1:44819_solr c:org.apache.solr.search.facet.TestCloudJSONFacetSKG_collection s:shard1 r:core_node2 x:org.apache.solr.search.facet.TestCloudJSONFacetSKG_collection_shard1_replica_n1 ] o.a.s.u.p.LogUpdateProcessorFactory [org.apache.solr.search.facet.TestCloudJSONFacetSKG_collection_shard1_replica_n1]  webapp=/solr path=/update params={wt=javabin&version=2}{add=[86 (1644118970663436288)]} 0 0
   [junit4]   2> 1615682 INFO  (qtp1797060855-13927) [n:127.0.0.1:44819_solr c:org.apache.solr.search.facet.TestCloudJSONFacetSKG_collection s:shard1 r:core_node2 x:org.apache.solr.search.facet.TestCloudJSONFacetSKG_collection_shard1_replica_n1 ] o.a.s.u.p.LogUpdateProcessorFactory [org.apache.solr.search.facet.TestCloudJSONFacetSKG_collection_shard1_replica_n1]  webapp=/solr path=/update params={wt=javabin&version=2}{add=[87 (1644118970664484864)]} 0 17
   [junit4]   2> 1615683 INFO  (qtp1797060855-13927) [n:127.0.0.1:44819_solr c:org.apache.solr.search.facet.TestCloudJSONFacetSKG_collection s:shard1 r:core_node2 x:org.apache.solr.search.facet.TestCloudJSONFacetSKG_collection_shard1_replica_n1 ] o.a.s.u.p.LogUpdateProcessorFactory [org.apache.solr.search.facet.TestCloudJSONFacetSKG_collection_shard1_replica_n1]  webapp=/solr path=/update params={wt=javabin&version=2}{add=[88 (1644118970683359232)]} 0 0
   [junit4]   2> 1615684 INFO  (qtp1797060855-13927) [n:127.0.0.1:44819_solr c:org.apache.solr.search.facet.TestCloudJSONFacetSKG_collection s:shard1 r:core_node2 x:org.apache.solr.search.facet.TestCloudJSONFacetSKG_collection_shard1_replica_n1 ] o.a.s.u.p.LogUpdateProcessorFactory [org.apache.solr.search.facet.TestCloudJSONFacetSKG_collection_shard1_replica_n1]  webapp=/solr path=/update params={wt=javabin&version=2}{add=[89 (1644118970684407808)]} 0 0
   [junit4]   2> 1615685 INFO  (qtp1797060855-13927) [n:127.0.0.1:44819_solr c:org.apache.solr.search.facet.TestCloudJSONFacetSKG_collection s:shard1 r:core_node2 x:org.apache.solr.search.facet.TestCloudJSONFacetSKG_collection_shard1_replica_n1 ] o.a.s.u.p.LogUpdateProcessorFactory [org.apache.solr.search.facet.TestCloudJSONFacetSKG_collection_shard1_replica_n1]  webapp=/solr path=/update params={wt=javabin&version=2}{add=[90 (1644118970685456384)]} 0 0
   [junit4]   2> 1615698 INFO  (qtp1797060855-13929) [n:127.0.0.1:44819_solr c:org.apache.solr.search.facet.TestCloudJSONFacetSKG_collection s:shard1 r:core_node2 x:org.apache.solr.search.facet.TestCloudJSONFacetSKG_collection_shard1_replica_n1 ] o.a.s.u.p.LogUpdateProcessorFactory [org.apache.solr.search.facet.TestCloudJSONFacetSKG_collection_shard1_replica_n1]  webapp=/solr path=/update params={wt=javabin&version=2}{add=[91 (1644118970699087872)]} 0 0
   [junit4]   2> 1615735 INFO  (qtp1797060855-13930) [n:127.0.0.1:44819_solr c:org.apache.solr.search.facet.TestCloudJSONFacetSKG_collection s:shard1 r:core_node2 x:org.apache.solr.search.facet.TestCloudJSONFacetSKG_collection_shard1_replica_n1 ] o.a.s.u.p.LogUpdateProcessorFactory [org.apache.solr.search.facet.TestCloudJSONFacetSKG_collection_shard1_replica_n1]  webapp=/solr path=/update params={wt=javabin&version=2}{add=[92 (1644118970737885184)]} 0 0
   [junit4]   2> 1615736 INFO  (qtp1797060855-13928) [n:127.0.0.1:44819_solr c:org.apache.solr.search.facet.TestCloudJSONFacetSKG_collection s:shard1 r:core_node2 x:org.apache.solr.search.facet.TestCloudJSONFacetSKG_collection_shard1_replica_n1 ] o.a.s.u.p.LogUpdateProcessorFactory [org.apache.solr.search.facet.TestCloudJSONFacetSKG_collection_shard1_replica_n1]  webapp=/solr path=/update params={wt=javabin&version=2}{add=[93 (1644118970738933760)]} 0 0
   [junit4]   2> 1615737 INFO  (qtp1797060855-13931) [n:127.0.0.1:44819_solr c:org.apache.solr.search.facet.TestCloudJSONFacetSKG_collection s:shard1 r:core_node2 x:org.apache.solr.search.facet.TestCloudJSONFacetSKG_collection_shard1_replica_n1 ] o.a.s.u.p.LogUpdateProcessorFactory [org.apache.solr.search.facet.TestCloudJSONFacetSKG_collection_shard1_replica_n1]  webapp=/solr path=/update params={wt=javabin&version=2}{add=[94 (1644118970739982336)]} 0 0
   [junit4]   2> 1615771 INFO  (qtp1797060855-13927) [n:127.0.0.1:44819_solr c:org.apache.solr.search.facet.TestCloudJSONFacetSKG_collection s:shard1 r:core_node2 x:org.apache.solr.search.facet.TestCloudJSONFacetSKG_collection_shard1_replica_n1 ] o.a.s.u.DirectUpdateHandler2 start commit{_version_=1644118970775633920,optimize=false,openSearcher=true,waitSearcher=true,expungeDeletes=false,softCommit=false,prepareCommit=false}
   [junit4]   2> 1615786 INFO  (qtp1797060855-13927) [n:127.0.0.1:44819_solr c:org.apache.solr.search.facet.TestCloudJSONFacetSKG_collection s:shard1 r:core_node2 x:org.apache.solr.search.facet.TestCloudJSONFacetSKG_collection_shard1_replica_n1 ] o.a.s.u.SolrIndexWriter Calling setCommitData with IW:org.apache.solr.update.SolrIndexWriter@53a0f5ac commitCommandVersion:1644118970775633920
   [junit4]   2> 1616073 INFO  (qtp1797060855-13927) [n:127.0.0.1:44819_solr c:org.apache.solr.search.facet.TestCloudJSONFacetSKG_collection s:shard1 r:core_node2 x:org.apache.solr.search.facet.TestCloudJSONFacetSKG_collection_shard1_replica_n1 ] o.a.s.s.SolrIndexSearcher Opening [Searcher@783b79b6[org.apache.solr.search.facet.TestCloudJSONFacetSKG_collection_shard1_replica_n1] main]
   [junit4]   2> 1616129 INFO  (searcherExecutor-4197-thread-1-processing-n:127.0.0.1:44819_solr x:org.apache.solr.search.facet.TestCloudJSONFacetSKG_collection_shard1_replica_n1 c:org.apache.solr.search.facet.TestCloudJSONFacetSKG_collection s:shard1 r:core_node2) [n:127.0.0.1:44819_solr c:org.apache.solr.search.facet.TestCloudJSONFacetSKG_collection s:shard1 r:core_node2 x:org.apache.solr.search.facet.TestCloudJSONFacetSKG_collection_shard1_replica_n1 ] o.a.s.c.SolrCore [org.apache.solr.search.facet.TestCloudJSONFacetSKG_collection_shard1_replica_n1] Registered new searcher Searcher@783b79b6[org.apache.solr.search.facet.TestCloudJSONFacetSKG_collection_shard1_replica_n1] main{ExitableDirectoryReader(UninvertingDirectoryReader(Uninverting(_0(9.0.0):c96/1:[diagnostics={source=flush, os.arch=amd64, java.runtime.version=11.0.1+13-LTS, os.version=4.4.0-112-generic, os=Linux, java.vendor=Oracle Corporation, timestamp=1567954035831, java.version=11.0.1, java.vm.version=11.0.1+13-LTS, lucene.version=9.0.0}]:[attributes={Lucene50StoredFieldsFormat.mode=BEST_SPEED}]:delGen=1)))}
   [junit4]   2> 1616147 INFO  (qtp1797060855-13927) [n:127.0.0.1:44819_solr c:org.apache.solr.search.facet.TestCloudJSONFacetSKG_collection s:shard1 r:core_node2 x:org.apache.solr.search.facet.TestCloudJSONFacetSKG_collection_shard1_replica_n1 ] o.a.s.u.DirectUpdateHandler2 end_commit_flush
   [junit4]   2> 1616147 INFO  (qtp1797060855-13927) [n:127.0.0.1:44819_solr c:org.apache.solr.search.facet.TestCloudJSONFacetSKG_collection s:shard1 r:core_node2 x:org.apache.solr.search.facet.TestCloudJSONFacetSKG_collection_shard1_replica_n1 ] o.a.s.u.p.LogUpdateProcessorFactory [org.apache.solr.search.facet.TestCloudJSONFacetSKG_collection_shard1_replica_n1]  webapp=/solr path=/update params={_stateVer_=org.apache.solr.search.facet.TestCloudJSONFacetSKG_collection:4&waitSearcher=true&commit=true&softCommit=false&wt=javabin&version=2}{commit=} 0 389
   [junit4]   2> 1616166 INFO  (qtp1797060855-13929) [n:127.0.0.1:44819_solr c:org.apache.solr.search.facet.TestCloudJSONFacetSKG_collection s:shard1 r:core_node2 x:org.apache.solr.search.facet.TestCloudJSONFacetSKG_collection_shard1_replica_n1 ] o.a.s.u.p.LogUpdateProcessorFactory [org.apache.solr.search.facet.TestCloudJSONFacetSKG_collection_shard1_replica_n1]  webapp=/solr path=/update params={wt=javabin&version=2}{add=[95 (1644118971170947072)]} 0 17
   [junit4]   2> 1616216 INFO  (qtp1797060855-13930) [n:127.0.0.1:44819_solr c:org.apache.solr.search.facet.TestCloudJSONFacetSKG_collection s:shard1 r:core_node2 x:org.apache.solr.search.facet.TestCloudJSONFacetSKG_collection_shard1_replica_n1 ] o.a.s.u.p.LogUpdateProcessorFactory [org.apache.solr.search.facet.TestCloudJSONFacetSKG_collection_shard1_replica_n1]  webapp=/solr path=/update params={wt=javabin&version=2}{add=[96 (1

[...truncated too long message...]

ene-Solr-Tests-master/lucene/top-level-ivy-settings.xml

resolve:

ivy-availability-check:
[loadresource] Do not set property disallowed.ivy.jars.list as its length is 0.

-ivy-fail-disallowed-ivy-version:

ivy-fail:

ivy-configure:
[ivy:configure] :: loading settings :: file = /home/jenkins/jenkins-slave/workspace/Lucene-Solr-Tests-master/lucene/top-level-ivy-settings.xml

resolve:

ivy-availability-check:
[loadresource] Do not set property disallowed.ivy.jars.list as its length is 0.

-ivy-fail-disallowed-ivy-version:

ivy-fail:

ivy-fail:

ivy-configure:
[ivy:configure] :: loading settings :: file = /home/jenkins/jenkins-slave/workspace/Lucene-Solr-Tests-master/lucene/top-level-ivy-settings.xml

resolve:

ivy-availability-check:
[loadresource] Do not set property disallowed.ivy.jars.list as its length is 0.

-ivy-fail-disallowed-ivy-version:

ivy-fail:

ivy-configure:
[ivy:configure] :: loading settings :: file = /home/jenkins/jenkins-slave/workspace/Lucene-Solr-Tests-master/lucene/top-level-ivy-settings.xml

resolve:

ivy-availability-check:
[loadresource] Do not set property disallowed.ivy.jars.list as its length is 0.

-ivy-fail-disallowed-ivy-version:

ivy-fail:

ivy-fail:

ivy-configure:
[ivy:configure] :: loading settings :: file = /home/jenkins/jenkins-slave/workspace/Lucene-Solr-Tests-master/lucene/top-level-ivy-settings.xml

resolve:

ivy-availability-check:
[loadresource] Do not set property disallowed.ivy.jars.list as its length is 0.

-ivy-fail-disallowed-ivy-version:

ivy-fail:

ivy-fail:

ivy-configure:
[ivy:configure] :: loading settings :: file = /home/jenkins/jenkins-slave/workspace/Lucene-Solr-Tests-master/lucene/top-level-ivy-settings.xml

resolve:

ivy-availability-check:
[loadresource] Do not set property disallowed.ivy.jars.list as its length is 0.

-ivy-fail-disallowed-ivy-version:

ivy-fail:

ivy-fail:

ivy-configure:
[ivy:configure] :: loading settings :: file = /home/jenkins/jenkins-slave/workspace/Lucene-Solr-Tests-master/lucene/top-level-ivy-settings.xml

resolve:

ivy-availability-check:
[loadresource] Do not set property disallowed.ivy.jars.list as its length is 0.

-ivy-fail-disallowed-ivy-version:

ivy-fail:

ivy-fail:

ivy-configure:
[ivy:configure] :: loading settings :: file = /home/jenkins/jenkins-slave/workspace/Lucene-Solr-Tests-master/lucene/top-level-ivy-settings.xml

resolve:

ivy-availability-check:
[loadresource] Do not set property disallowed.ivy.jars.list as its length is 0.

-ivy-fail-disallowed-ivy-version:

ivy-fail:

ivy-fail:

ivy-configure:
[ivy:configure] :: loading settings :: file = /home/jenkins/jenkins-slave/workspace/Lucene-Solr-Tests-master/lucene/top-level-ivy-settings.xml

resolve:

ivy-availability-check:
[loadresource] Do not set property disallowed.ivy.jars.list as its length is 0.

-ivy-fail-disallowed-ivy-version:

ivy-fail:

ivy-fail:

ivy-configure:
[ivy:configure] :: loading settings :: file = /home/jenkins/jenkins-slave/workspace/Lucene-Solr-Tests-master/lucene/top-level-ivy-settings.xml

resolve:

ivy-availability-check:
[loadresource] Do not set property disallowed.ivy.jars.list as its length is 0.

-ivy-fail-disallowed-ivy-version:

ivy-fail:

ivy-fail:

ivy-configure:
[ivy:configure] :: loading settings :: file = /home/jenkins/jenkins-slave/workspace/Lucene-Solr-Tests-master/lucene/top-level-ivy-settings.xml

resolve:

ivy-availability-check:
[loadresource] Do not set property disallowed.ivy.jars.list as its length is 0.

-ivy-fail-disallowed-ivy-version:

ivy-fail:

ivy-fail:

ivy-configure:
[ivy:configure] :: loading settings :: file = /home/jenkins/jenkins-slave/workspace/Lucene-Solr-Tests-master/lucene/top-level-ivy-settings.xml

resolve:

ivy-availability-check:
[loadresource] Do not set property disallowed.ivy.jars.list as its length is 0.

-ivy-fail-disallowed-ivy-version:

ivy-fail:

ivy-fail:

ivy-configure:
[ivy:configure] :: loading settings :: file = /home/jenkins/jenkins-slave/workspace/Lucene-Solr-Tests-master/lucene/top-level-ivy-settings.xml

resolve:

ivy-availability-check:
[loadresource] Do not set property disallowed.ivy.jars.list as its length is 0.

-ivy-fail-disallowed-ivy-version:

ivy-fail:

ivy-fail:

ivy-configure:
[ivy:configure] :: loading settings :: file = /home/jenkins/jenkins-slave/workspace/Lucene-Solr-Tests-master/lucene/top-level-ivy-settings.xml

resolve:

ivy-availability-check:
[loadresource] Do not set property disallowed.ivy.jars.list as its length is 0.

-ivy-fail-disallowed-ivy-version:

ivy-fail:

ivy-fail:

ivy-configure:
[ivy:configure] :: loading settings :: file = /home/jenkins/jenkins-slave/workspace/Lucene-Solr-Tests-master/lucene/top-level-ivy-settings.xml

resolve:

jar-checksums:
    [mkdir] Created dir: /home/jenkins/jenkins-slave/workspace/Lucene-Solr-Tests-master/solr/null1645009913
     [copy] Copying 249 files to /home/jenkins/jenkins-slave/workspace/Lucene-Solr-Tests-master/solr/null1645009913
   [delete] Deleting directory /home/jenkins/jenkins-slave/workspace/Lucene-Solr-Tests-master/solr/null1645009913

check-working-copy:
[ivy:cachepath] :: resolving dependencies :: #;[hidden email]
[ivy:cachepath] confs: [default]
[ivy:cachepath] found org.eclipse.jgit#org.eclipse.jgit;5.3.0.201903130848-r in public
[ivy:cachepath] found com.jcraft#jsch;0.1.54 in public
[ivy:cachepath] found com.jcraft#jzlib;1.1.1 in public
[ivy:cachepath] found com.googlecode.javaewah#JavaEWAH;1.1.6 in public
[ivy:cachepath] found org.slf4j#slf4j-api;1.7.2 in public
[ivy:cachepath] found org.bouncycastle#bcpg-jdk15on;1.60 in public
[ivy:cachepath] found org.bouncycastle#bcprov-jdk15on;1.60 in public
[ivy:cachepath] found org.bouncycastle#bcpkix-jdk15on;1.60 in public
[ivy:cachepath] found org.slf4j#slf4j-nop;1.7.2 in public
[ivy:cachepath] :: resolution report :: resolve 30ms :: artifacts dl 2ms
        ---------------------------------------------------------------------
        |                  |            modules            ||   artifacts   |
        |       conf       | number| search|dwnlded|evicted|| number|dwnlded|
        ---------------------------------------------------------------------
        |      default     |   9   |   0   |   0   |   0   ||   9   |   0   |
        ---------------------------------------------------------------------
[wc-checker] Initializing working copy...
[wc-checker] Checking working copy status...

-jenkins-base:

BUILD SUCCESSFUL
Total time: 181 minutes 41 seconds
Archiving artifacts
java.lang.InterruptedException: no matches found within 10000
        at hudson.FilePath$ValidateAntFileMask.hasMatch(FilePath.java:2847)
        at hudson.FilePath$ValidateAntFileMask.invoke(FilePath.java:2726)
        at hudson.FilePath$ValidateAntFileMask.invoke(FilePath.java:2707)
        at hudson.FilePath$FileCallableWrapper.call(FilePath.java:3086)
Also:   hudson.remoting.Channel$CallSiteStackTrace: Remote call to lucene2
                at hudson.remoting.Channel.attachCallSiteStackTrace(Channel.java:1741)
                at hudson.remoting.UserRequest$ExceptionResponse.retrieve(UserRequest.java:357)
                at hudson.remoting.Channel.call(Channel.java:955)
                at hudson.FilePath.act(FilePath.java:1072)
                at hudson.FilePath.act(FilePath.java:1061)
                at hudson.FilePath.validateAntFileMask(FilePath.java:2705)
                at hudson.tasks.ArtifactArchiver.perform(ArtifactArchiver.java:243)
                at hudson.tasks.BuildStepCompatibilityLayer.perform(BuildStepCompatibilityLayer.java:81)
                at hudson.tasks.BuildStepMonitor$1.perform(BuildStepMonitor.java:20)
                at hudson.model.AbstractBuild$AbstractBuildExecution.perform(AbstractBuild.java:744)
                at hudson.model.AbstractBuild$AbstractBuildExecution.performAllBuildSteps(AbstractBuild.java:690)
                at hudson.model.Build$BuildExecution.post2(Build.java:186)
                at hudson.model.AbstractBuild$AbstractBuildExecution.post(AbstractBuild.java:635)
                at hudson.model.Run.execute(Run.java:1835)
                at hudson.model.FreeStyleBuild.run(FreeStyleBuild.java:43)
                at hudson.model.ResourceController.execute(ResourceController.java:97)
                at hudson.model.Executor.run(Executor.java:429)
Caused: hudson.FilePath$TunneledInterruptedException
        at hudson.FilePath$FileCallableWrapper.call(FilePath.java:3088)
        at hudson.remoting.UserRequest.perform(UserRequest.java:212)
        at hudson.remoting.UserRequest.perform(UserRequest.java:54)
        at hudson.remoting.Request$2.run(Request.java:369)
        at hudson.remoting.InterceptingExecutorService$1.call(InterceptingExecutorService.java:72)
        at java.util.concurrent.FutureTask.run(FutureTask.java:266)
        at java.util.concurrent.ThreadPoolExecutor.runWorker(ThreadPoolExecutor.java:1142)
        at java.util.concurrent.ThreadPoolExecutor$Worker.run(ThreadPoolExecutor.java:617)
        at java.lang.Thread.run(Thread.java:748)
Caused: java.lang.InterruptedException: java.lang.InterruptedException: no matches found within 10000
        at hudson.FilePath.act(FilePath.java:1074)
        at hudson.FilePath.act(FilePath.java:1061)
        at hudson.FilePath.validateAntFileMask(FilePath.java:2705)
        at hudson.tasks.ArtifactArchiver.perform(ArtifactArchiver.java:243)
        at hudson.tasks.BuildStepCompatibilityLayer.perform(BuildStepCompatibilityLayer.java:81)
        at hudson.tasks.BuildStepMonitor$1.perform(BuildStepMonitor.java:20)
        at hudson.model.AbstractBuild$AbstractBuildExecution.perform(AbstractBuild.java:744)
        at hudson.model.AbstractBuild$AbstractBuildExecution.performAllBuildSteps(AbstractBuild.java:690)
        at hudson.model.Build$BuildExecution.post2(Build.java:186)
        at hudson.model.AbstractBuild$AbstractBuildExecution.post(AbstractBuild.java:635)
        at hudson.model.Run.execute(Run.java:1835)
        at hudson.model.FreeStyleBuild.run(FreeStyleBuild.java:43)
        at hudson.model.ResourceController.execute(ResourceController.java:97)
        at hudson.model.Executor.run(Executor.java:429)
No artifacts found that match the file pattern "**/*.events,heapdumps/**,**/hs_err_pid*". Configuration error?
Recording test results
Build step 'Publish JUnit test result report' changed build result to UNSTABLE
Email was triggered for: Unstable (Test Failures)
Sending email for trigger: Unstable (Test Failures)


---------------------------------------------------------------------
To unsubscribe, e-mail: [hidden email]
For additional commands, e-mail: [hidden email]