[JENKINS] Lucene-Solr-master-Linux (64bit/jdk-11.0.3) - Build # 24623 - Unstable!

classic Classic list List threaded Threaded
1 message Options
Reply | Threaded
Open this post in threaded view
|

[JENKINS] Lucene-Solr-master-Linux (64bit/jdk-11.0.3) - Build # 24623 - Unstable!

Policeman Jenkins Server-2
Build: https://jenkins.thetaphi.de/job/Lucene-Solr-master-Linux/24623/
Java: 64bit/jdk-11.0.3 -XX:+UseCompressedOops -XX:+UseSerialGC

2 tests failed.
FAILED:  org.apache.solr.core.TestSolrDeletionPolicy1.testNumCommitsConfigured

Error Message:


Stack Trace:
java.lang.AssertionError
        at __randomizedtesting.SeedInfo.seed([DBD81028BA3ADC8B:721B8A3A832064B]:0)
        at org.junit.Assert.fail(Assert.java:86)
        at org.junit.Assert.assertTrue(Assert.java:41)
        at org.junit.Assert.assertTrue(Assert.java:52)
        at org.apache.solr.core.TestSolrDeletionPolicy1.testNumCommitsConfigured(TestSolrDeletionPolicy1.java:108)
        at java.base/jdk.internal.reflect.NativeMethodAccessorImpl.invoke0(Native Method)
        at java.base/jdk.internal.reflect.NativeMethodAccessorImpl.invoke(NativeMethodAccessorImpl.java:62)
        at java.base/jdk.internal.reflect.DelegatingMethodAccessorImpl.invoke(DelegatingMethodAccessorImpl.java:43)
        at java.base/java.lang.reflect.Method.invoke(Method.java:566)
        at com.carrotsearch.randomizedtesting.RandomizedRunner.invoke(RandomizedRunner.java:1750)
        at com.carrotsearch.randomizedtesting.RandomizedRunner$8.evaluate(RandomizedRunner.java:938)
        at com.carrotsearch.randomizedtesting.RandomizedRunner$9.evaluate(RandomizedRunner.java:974)
        at com.carrotsearch.randomizedtesting.RandomizedRunner$10.evaluate(RandomizedRunner.java:988)
        at com.carrotsearch.randomizedtesting.rules.SystemPropertiesRestoreRule$1.evaluate(SystemPropertiesRestoreRule.java:57)
        at org.apache.lucene.util.TestRuleSetupTeardownChained$1.evaluate(TestRuleSetupTeardownChained.java:49)
        at org.apache.lucene.util.AbstractBeforeAfterRule$1.evaluate(AbstractBeforeAfterRule.java:45)
        at org.apache.lucene.util.TestRuleThreadAndTestName$1.evaluate(TestRuleThreadAndTestName.java:48)
        at org.apache.lucene.util.TestRuleIgnoreAfterMaxFailures$1.evaluate(TestRuleIgnoreAfterMaxFailures.java:64)
        at org.apache.lucene.util.TestRuleMarkFailure$1.evaluate(TestRuleMarkFailure.java:47)
        at com.carrotsearch.randomizedtesting.rules.StatementAdapter.evaluate(StatementAdapter.java:36)
        at com.carrotsearch.randomizedtesting.ThreadLeakControl$StatementRunner.run(ThreadLeakControl.java:368)
        at com.carrotsearch.randomizedtesting.ThreadLeakControl.forkTimeoutingTask(ThreadLeakControl.java:817)
        at com.carrotsearch.randomizedtesting.ThreadLeakControl$3.evaluate(ThreadLeakControl.java:468)
        at com.carrotsearch.randomizedtesting.RandomizedRunner.runSingleTest(RandomizedRunner.java:947)
        at com.carrotsearch.randomizedtesting.RandomizedRunner$5.evaluate(RandomizedRunner.java:832)
        at com.carrotsearch.randomizedtesting.RandomizedRunner$6.evaluate(RandomizedRunner.java:883)
        at com.carrotsearch.randomizedtesting.RandomizedRunner$7.evaluate(RandomizedRunner.java:894)
        at com.carrotsearch.randomizedtesting.rules.StatementAdapter.evaluate(StatementAdapter.java:36)
        at com.carrotsearch.randomizedtesting.rules.SystemPropertiesRestoreRule$1.evaluate(SystemPropertiesRestoreRule.java:57)
        at org.apache.lucene.util.AbstractBeforeAfterRule$1.evaluate(AbstractBeforeAfterRule.java:45)
        at com.carrotsearch.randomizedtesting.rules.StatementAdapter.evaluate(StatementAdapter.java:36)
        at org.apache.lucene.util.TestRuleStoreClassName$1.evaluate(TestRuleStoreClassName.java:41)
        at com.carrotsearch.randomizedtesting.rules.NoShadowingOrOverridesOnMethodsRule$1.evaluate(NoShadowingOrOverridesOnMethodsRule.java:40)
        at com.carrotsearch.randomizedtesting.rules.NoShadowingOrOverridesOnMethodsRule$1.evaluate(NoShadowingOrOverridesOnMethodsRule.java:40)
        at com.carrotsearch.randomizedtesting.rules.StatementAdapter.evaluate(StatementAdapter.java:36)
        at com.carrotsearch.randomizedtesting.rules.StatementAdapter.evaluate(StatementAdapter.java:36)
        at org.apache.lucene.util.TestRuleAssertionsRequired$1.evaluate(TestRuleAssertionsRequired.java:53)
        at org.apache.lucene.util.TestRuleMarkFailure$1.evaluate(TestRuleMarkFailure.java:47)
        at org.apache.lucene.util.TestRuleIgnoreAfterMaxFailures$1.evaluate(TestRuleIgnoreAfterMaxFailures.java:64)
        at org.apache.lucene.util.TestRuleIgnoreTestSuites$1.evaluate(TestRuleIgnoreTestSuites.java:54)
        at com.carrotsearch.randomizedtesting.rules.StatementAdapter.evaluate(StatementAdapter.java:36)
        at com.carrotsearch.randomizedtesting.ThreadLeakControl$StatementRunner.run(ThreadLeakControl.java:368)
        at java.base/java.lang.Thread.run(Thread.java:834)


FAILED:  org.apache.solr.core.TestSolrDeletionPolicy1.testNumCommitsConfigured

Error Message:


Stack Trace:
java.lang.AssertionError
        at __randomizedtesting.SeedInfo.seed([DBD81028BA3ADC8B:721B8A3A832064B]:0)
        at org.junit.Assert.fail(Assert.java:86)
        at org.junit.Assert.assertTrue(Assert.java:41)
        at org.junit.Assert.assertTrue(Assert.java:52)
        at org.apache.solr.core.TestSolrDeletionPolicy1.testNumCommitsConfigured(TestSolrDeletionPolicy1.java:108)
        at java.base/jdk.internal.reflect.NativeMethodAccessorImpl.invoke0(Native Method)
        at java.base/jdk.internal.reflect.NativeMethodAccessorImpl.invoke(NativeMethodAccessorImpl.java:62)
        at java.base/jdk.internal.reflect.DelegatingMethodAccessorImpl.invoke(DelegatingMethodAccessorImpl.java:43)
        at java.base/java.lang.reflect.Method.invoke(Method.java:566)
        at com.carrotsearch.randomizedtesting.RandomizedRunner.invoke(RandomizedRunner.java:1750)
        at com.carrotsearch.randomizedtesting.RandomizedRunner$8.evaluate(RandomizedRunner.java:938)
        at com.carrotsearch.randomizedtesting.RandomizedRunner$9.evaluate(RandomizedRunner.java:974)
        at com.carrotsearch.randomizedtesting.RandomizedRunner$10.evaluate(RandomizedRunner.java:988)
        at com.carrotsearch.randomizedtesting.rules.SystemPropertiesRestoreRule$1.evaluate(SystemPropertiesRestoreRule.java:57)
        at org.apache.lucene.util.TestRuleSetupTeardownChained$1.evaluate(TestRuleSetupTeardownChained.java:49)
        at org.apache.lucene.util.AbstractBeforeAfterRule$1.evaluate(AbstractBeforeAfterRule.java:45)
        at org.apache.lucene.util.TestRuleThreadAndTestName$1.evaluate(TestRuleThreadAndTestName.java:48)
        at org.apache.lucene.util.TestRuleIgnoreAfterMaxFailures$1.evaluate(TestRuleIgnoreAfterMaxFailures.java:64)
        at org.apache.lucene.util.TestRuleMarkFailure$1.evaluate(TestRuleMarkFailure.java:47)
        at com.carrotsearch.randomizedtesting.rules.StatementAdapter.evaluate(StatementAdapter.java:36)
        at com.carrotsearch.randomizedtesting.ThreadLeakControl$StatementRunner.run(ThreadLeakControl.java:368)
        at com.carrotsearch.randomizedtesting.ThreadLeakControl.forkTimeoutingTask(ThreadLeakControl.java:817)
        at com.carrotsearch.randomizedtesting.ThreadLeakControl$3.evaluate(ThreadLeakControl.java:468)
        at com.carrotsearch.randomizedtesting.RandomizedRunner.runSingleTest(RandomizedRunner.java:947)
        at com.carrotsearch.randomizedtesting.RandomizedRunner$5.evaluate(RandomizedRunner.java:832)
        at com.carrotsearch.randomizedtesting.RandomizedRunner$6.evaluate(RandomizedRunner.java:883)
        at com.carrotsearch.randomizedtesting.RandomizedRunner$7.evaluate(RandomizedRunner.java:894)
        at com.carrotsearch.randomizedtesting.rules.StatementAdapter.evaluate(StatementAdapter.java:36)
        at com.carrotsearch.randomizedtesting.rules.SystemPropertiesRestoreRule$1.evaluate(SystemPropertiesRestoreRule.java:57)
        at org.apache.lucene.util.AbstractBeforeAfterRule$1.evaluate(AbstractBeforeAfterRule.java:45)
        at com.carrotsearch.randomizedtesting.rules.StatementAdapter.evaluate(StatementAdapter.java:36)
        at org.apache.lucene.util.TestRuleStoreClassName$1.evaluate(TestRuleStoreClassName.java:41)
        at com.carrotsearch.randomizedtesting.rules.NoShadowingOrOverridesOnMethodsRule$1.evaluate(NoShadowingOrOverridesOnMethodsRule.java:40)
        at com.carrotsearch.randomizedtesting.rules.NoShadowingOrOverridesOnMethodsRule$1.evaluate(NoShadowingOrOverridesOnMethodsRule.java:40)
        at com.carrotsearch.randomizedtesting.rules.StatementAdapter.evaluate(StatementAdapter.java:36)
        at com.carrotsearch.randomizedtesting.rules.StatementAdapter.evaluate(StatementAdapter.java:36)
        at org.apache.lucene.util.TestRuleAssertionsRequired$1.evaluate(TestRuleAssertionsRequired.java:53)
        at org.apache.lucene.util.TestRuleMarkFailure$1.evaluate(TestRuleMarkFailure.java:47)
        at org.apache.lucene.util.TestRuleIgnoreAfterMaxFailures$1.evaluate(TestRuleIgnoreAfterMaxFailures.java:64)
        at org.apache.lucene.util.TestRuleIgnoreTestSuites$1.evaluate(TestRuleIgnoreTestSuites.java:54)
        at com.carrotsearch.randomizedtesting.rules.StatementAdapter.evaluate(StatementAdapter.java:36)
        at com.carrotsearch.randomizedtesting.ThreadLeakControl$StatementRunner.run(ThreadLeakControl.java:368)
        at java.base/java.lang.Thread.run(Thread.java:834)




Build Log:
[...truncated 14499 lines...]
   [junit4] Suite: org.apache.solr.core.TestSolrDeletionPolicy1
   [junit4]   2> 1518953 INFO  (SUITE-TestSolrDeletionPolicy1-seed#[DBD81028BA3ADC8B]-worker) [     ] o.a.s.SolrTestCaseJ4 Created dataDir: /home/jenkins/workspace/Lucene-Solr-master-Linux/solr/build/solr-core/test/J1/temp/solr.core.TestSolrDeletionPolicy1_DBD81028BA3ADC8B-001/data-dir-142-001
   [junit4]   2> 1518953 WARN  (SUITE-TestSolrDeletionPolicy1-seed#[DBD81028BA3ADC8B]-worker) [     ] o.a.s.SolrTestCaseJ4 startTrackingSearchers: numOpens=12 numCloses=12
   [junit4]   2> 1518953 INFO  (SUITE-TestSolrDeletionPolicy1-seed#[DBD81028BA3ADC8B]-worker) [     ] o.a.s.SolrTestCaseJ4 Using PointFields (NUMERIC_POINTS_SYSPROP=true) w/NUMERIC_DOCVALUES_SYSPROP=false
   [junit4]   2> 1518953 INFO  (SUITE-TestSolrDeletionPolicy1-seed#[DBD81028BA3ADC8B]-worker) [     ] o.a.s.SolrTestCaseJ4 Randomized ssl (false) and clientAuth (true) via: @org.apache.solr.util.RandomizeSSL(reason="", ssl=0.0/0.0, value=0.0/0.0, clientAuth=0.0/0.0)
   [junit4]   2> 1518953 INFO  (SUITE-TestSolrDeletionPolicy1-seed#[DBD81028BA3ADC8B]-worker) [     ] o.a.s.SolrTestCaseJ4 SecureRandom sanity checks: test.solr.allowed.securerandom=null & java.security.egd=file:/dev/./urandom
   [junit4]   2> 1518954 INFO  (SUITE-TestSolrDeletionPolicy1-seed#[DBD81028BA3ADC8B]-worker) [     ] o.a.s.SolrTestCaseJ4 ####initCore
   [junit4]   2> 1518954 INFO  (SUITE-TestSolrDeletionPolicy1-seed#[DBD81028BA3ADC8B]-worker) [     ] o.a.s.c.SolrResourceLoader [null] Added 2 libs to classloader, from paths: [/home/jenkins/workspace/Lucene-Solr-master-Linux/solr/core/src/test-files/solr/collection1/lib, /home/jenkins/workspace/Lucene-Solr-master-Linux/solr/core/src/test-files/solr/collection1/lib/classes]
   [junit4]   2> 1518963 INFO  (SUITE-TestSolrDeletionPolicy1-seed#[DBD81028BA3ADC8B]-worker) [     ] o.a.s.c.SolrConfig Using Lucene MatchVersion: 9.0.0
   [junit4]   2> 1518969 INFO  (SUITE-TestSolrDeletionPolicy1-seed#[DBD81028BA3ADC8B]-worker) [     ] o.a.s.s.IndexSchema [null] Schema name=test
   [junit4]   2> 1519020 INFO  (SUITE-TestSolrDeletionPolicy1-seed#[DBD81028BA3ADC8B]-worker) [     ] o.a.s.s.IndexSchema Loaded schema test/1.0 with uniqueid field id
   [junit4]   2> 1519063 INFO  (SUITE-TestSolrDeletionPolicy1-seed#[DBD81028BA3ADC8B]-worker) [     ] o.a.s.h.c.HttpShardHandlerFactory Host whitelist initialized: WhitelistHostChecker [whitelistHosts=null, whitelistHostCheckingEnabled=true]
   [junit4]   2> 1519064 WARN  (SUITE-TestSolrDeletionPolicy1-seed#[DBD81028BA3ADC8B]-worker) [     ] o.e.j.u.s.S.config Trusting all certificates configured for Client@3f33337f[provider=null,keyStore=null,trustStore=null]
   [junit4]   2> 1519064 WARN  (SUITE-TestSolrDeletionPolicy1-seed#[DBD81028BA3ADC8B]-worker) [     ] o.e.j.u.s.S.config No Client EndPointIdentificationAlgorithm configured for Client@3f33337f[provider=null,keyStore=null,trustStore=null]
   [junit4]   2> 1519065 WARN  (SUITE-TestSolrDeletionPolicy1-seed#[DBD81028BA3ADC8B]-worker) [     ] o.e.j.u.s.S.config Trusting all certificates configured for Client@15d3aec8[provider=null,keyStore=null,trustStore=null]
   [junit4]   2> 1519065 WARN  (SUITE-TestSolrDeletionPolicy1-seed#[DBD81028BA3ADC8B]-worker) [     ] o.e.j.u.s.S.config No Client EndPointIdentificationAlgorithm configured for Client@15d3aec8[provider=null,keyStore=null,trustStore=null]
   [junit4]   2> 1519073 INFO  (SUITE-TestSolrDeletionPolicy1-seed#[DBD81028BA3ADC8B]-worker) [     ] o.a.s.c.TransientSolrCoreCacheDefault Allocating transient cache for 2147483647 transient cores
   [junit4]   2> 1519073 INFO  (SUITE-TestSolrDeletionPolicy1-seed#[DBD81028BA3ADC8B]-worker) [     ] o.a.s.h.a.MetricsHistoryHandler No .system collection, keeping metrics history in memory.
   [junit4]   2> 1519081 INFO  (SUITE-TestSolrDeletionPolicy1-seed#[DBD81028BA3ADC8B]-worker) [     ] o.a.s.m.r.SolrJmxReporter JMX monitoring for 'solr.node' (registry 'solr.node') enabled at server: com.sun.jmx.mbeanserver.JmxMBeanServer@6ef32814
   [junit4]   2> 1519086 INFO  (SUITE-TestSolrDeletionPolicy1-seed#[DBD81028BA3ADC8B]-worker) [     ] o.a.s.m.r.SolrJmxReporter JMX monitoring for 'solr.jvm' (registry 'solr.jvm') enabled at server: com.sun.jmx.mbeanserver.JmxMBeanServer@6ef32814
   [junit4]   2> 1519086 INFO  (SUITE-TestSolrDeletionPolicy1-seed#[DBD81028BA3ADC8B]-worker) [     ] o.a.s.m.r.SolrJmxReporter JMX monitoring for 'solr.jetty' (registry 'solr.jetty') enabled at server: com.sun.jmx.mbeanserver.JmxMBeanServer@6ef32814
   [junit4]   2> 1519087 INFO  (coreLoadExecutor-8347-thread-1) [    x:collection1 ] o.a.s.c.SolrResourceLoader [null] Added 2 libs to classloader, from paths: [/home/jenkins/workspace/Lucene-Solr-master-Linux/solr/core/src/test-files/solr/collection1/lib, /home/jenkins/workspace/Lucene-Solr-master-Linux/solr/core/src/test-files/solr/collection1/lib/classes]
   [junit4]   2> 1519094 INFO  (coreLoadExecutor-8347-thread-1) [    x:collection1 ] o.a.s.c.SolrConfig Using Lucene MatchVersion: 9.0.0
   [junit4]   2> 1519099 INFO  (coreLoadExecutor-8347-thread-1) [    x:collection1 ] o.a.s.s.IndexSchema [collection1] Schema name=test
   [junit4]   2> 1519147 INFO  (coreLoadExecutor-8347-thread-1) [    x:collection1 ] o.a.s.s.IndexSchema Loaded schema test/1.0 with uniqueid field id
   [junit4]   2> 1519151 INFO  (coreLoadExecutor-8347-thread-1) [    x:collection1 ] o.a.s.c.CoreContainer Creating SolrCore 'collection1' using configuration from instancedir /home/jenkins/workspace/Lucene-Solr-master-Linux/solr/core/src/test-files/solr/collection1, trusted=true
   [junit4]   2> 1519151 INFO  (coreLoadExecutor-8347-thread-1) [    x:collection1 ] o.a.s.m.r.SolrJmxReporter JMX monitoring for 'solr.core.collection1' (registry 'solr.core.collection1') enabled at server: com.sun.jmx.mbeanserver.JmxMBeanServer@6ef32814
   [junit4]   2> 1519152 INFO  (coreLoadExecutor-8347-thread-1) [    x:collection1 ] o.a.s.c.SolrCore [[collection1] ] Opening new SolrCore at [/home/jenkins/workspace/Lucene-Solr-master-Linux/solr/core/src/test-files/solr/collection1], dataDir=[/home/jenkins/workspace/Lucene-Solr-master-Linux/solr/build/solr-core/test/J1/temp/solr.core.TestSolrDeletionPolicy1_DBD81028BA3ADC8B-001/data-dir-142-001/]
   [junit4]   2> 1519154 INFO  (coreLoadExecutor-8347-thread-1) [    x:collection1 ] o.a.s.u.RandomMergePolicy RandomMergePolicy wrapping class org.apache.lucene.index.LogDocMergePolicy: [LogDocMergePolicy: minMergeSize=1000, mergeFactor=21, maxMergeSize=9223372036854775807, maxMergeSizeForForcedMerge=9223372036854775807, calibrateSizeByDeletes=true, maxMergeDocs=2147483647, maxCFSSegmentSizeMB=8.796093022207999E12, noCFSRatio=0.0]
   [junit4]   2> 1519171 INFO  (coreLoadExecutor-8347-thread-1) [    x:collection1 ] o.a.s.u.CommitTracker Hard AutoCommit: disabled
   [junit4]   2> 1519171 INFO  (coreLoadExecutor-8347-thread-1) [    x:collection1 ] o.a.s.u.CommitTracker Soft AutoCommit: disabled
   [junit4]   2> 1519172 INFO  (coreLoadExecutor-8347-thread-1) [    x:collection1 ] o.a.s.u.RandomMergePolicy RandomMergePolicy wrapping class org.apache.lucene.index.LogDocMergePolicy: [LogDocMergePolicy: minMergeSize=1000, mergeFactor=4, maxMergeSize=9223372036854775807, maxMergeSizeForForcedMerge=9223372036854775807, calibrateSizeByDeletes=false, maxMergeDocs=2147483647, maxCFSSegmentSizeMB=8.796093022207999E12, noCFSRatio=0.0]
   [junit4]   2> 1519172 INFO  (coreLoadExecutor-8347-thread-1) [    x:collection1 ] o.a.s.s.SolrIndexSearcher Opening [Searcher@2f837eb8[collection1] main]
   [junit4]   2> 1519172 WARN  (coreLoadExecutor-8347-thread-1) [    x:collection1 ] o.a.s.r.ManagedResourceStorage Cannot write to config directory /home/jenkins/workspace/Lucene-Solr-master-Linux/solr/core/src/test-files/solr/collection1/conf; switching to use InMemory storage instead.
   [junit4]   2> 1519172 INFO  (coreLoadExecutor-8347-thread-1) [    x:collection1 ] o.a.s.h.ReplicationHandler Commits will be reserved for 10000ms.
   [junit4]   2> 1519173 INFO  (searcherExecutor-8348-thread-1-processing-x:collection1) [    x:collection1 ] o.a.s.c.SolrCore [collection1] Registered new searcher Searcher@2f837eb8[collection1] main{ExitableDirectoryReader(UninvertingDirectoryReader())}
   [junit4]   2> 1519173 INFO  (SUITE-TestSolrDeletionPolicy1-seed#[DBD81028BA3ADC8B]-worker) [     ] o.a.s.SolrTestCaseJ4 ####initCore end
   [junit4]   2> 1519175 INFO  (TEST-TestSolrDeletionPolicy1.testKeepOptimizedOnlyCommits-seed#[DBD81028BA3ADC8B]) [     ] o.a.s.SolrTestCaseJ4 ###Starting testKeepOptimizedOnlyCommits
   [junit4]   2> 1519175 INFO  (TEST-TestSolrDeletionPolicy1.testKeepOptimizedOnlyCommits-seed#[DBD81028BA3ADC8B]) [     ] o.a.s.u.DirectUpdateHandler2 [collection1] REMOVING ALL DOCUMENTS FROM INDEX
   [junit4]   2> 1519175 INFO  (TEST-TestSolrDeletionPolicy1.testKeepOptimizedOnlyCommits-seed#[DBD81028BA3ADC8B]) [     ] o.a.s.u.p.LogUpdateProcessorFactory [collection1]  webapp=null path=null params={_version_=-9223372036854775807&update.distrib=FROMLEADER&versions=true&wt=json&indent=true}{deleteByQuery=*:*} 0 0
   [junit4]   2> 1519176 INFO  (TEST-TestSolrDeletionPolicy1.testKeepOptimizedOnlyCommits-seed#[DBD81028BA3ADC8B]) [     ] o.a.s.u.p.LogUpdateProcessorFactory [collection1]  webapp=null path=null params={}{add=[1]} 0 0
   [junit4]   2> 1519177 INFO  (TEST-TestSolrDeletionPolicy1.testKeepOptimizedOnlyCommits-seed#[DBD81028BA3ADC8B]) [     ] o.a.s.u.DirectUpdateHandler2 start commit{,optimize=false,openSearcher=true,waitSearcher=true,expungeDeletes=false,softCommit=false,prepareCommit=false}
   [junit4]   2> 1519177 INFO  (TEST-TestSolrDeletionPolicy1.testKeepOptimizedOnlyCommits-seed#[DBD81028BA3ADC8B]) [     ] o.a.s.u.SolrIndexWriter Calling setCommitData with IW:org.apache.solr.update.SolrIndexWriter@18e9c6a8 commitCommandVersion:0
   [junit4]   2> 1519180 INFO  (TEST-TestSolrDeletionPolicy1.testKeepOptimizedOnlyCommits-seed#[DBD81028BA3ADC8B]) [     ] o.a.s.s.SolrIndexSearcher Opening [Searcher@1d7cfb7d[collection1] main]
   [junit4]   2> 1519180 INFO  (TEST-TestSolrDeletionPolicy1.testKeepOptimizedOnlyCommits-seed#[DBD81028BA3ADC8B]) [     ] o.a.s.u.DirectUpdateHandler2 end_commit_flush
   [junit4]   2> 1519181 INFO  (searcherExecutor-8348-thread-1) [     ] o.a.s.c.SolrCore [collection1] Registered new searcher Searcher@1d7cfb7d[collection1] main{ExitableDirectoryReader(UninvertingDirectoryReader(Uninverting(_0(9.0.0):c1:[diagnostics={java.vm.version=11.0.3+7, java.version=11.0.3, timestamp=1566984448684, java.vendor=AdoptOpenJDK, os=Linux, os.version=5.0.0-23-generic, java.runtime.version=11.0.3+7, os.arch=amd64, source=flush, lucene.version=9.0.0}]:[attributes={Lucene50StoredFieldsFormat.mode=BEST_SPEED}])))}
   [junit4]   2> 1519181 INFO  (TEST-TestSolrDeletionPolicy1.testKeepOptimizedOnlyCommits-seed#[DBD81028BA3ADC8B]) [     ] o.a.s.u.p.LogUpdateProcessorFactory [collection1]  webapp=null path=null params={}{commit=} 0 3
   [junit4]   2> 1519181 INFO  (TEST-TestSolrDeletionPolicy1.testKeepOptimizedOnlyCommits-seed#[DBD81028BA3ADC8B]) [     ] o.a.s.c.S.Request [collection1]  webapp=null path=null params={q=id:[0+TO+1]&qt=&start=0&rows=20&version=2.2} hits=1 status=0 QTime=0
   [junit4]   2> 1519182 INFO  (TEST-TestSolrDeletionPolicy1.testKeepOptimizedOnlyCommits-seed#[DBD81028BA3ADC8B]) [     ] o.a.s.u.p.LogUpdateProcessorFactory [collection1]  webapp=null path=null params={}{add=[2]} 0 0
   [junit4]   2> 1519182 INFO  (TEST-TestSolrDeletionPolicy1.testKeepOptimizedOnlyCommits-seed#[DBD81028BA3ADC8B]) [     ] o.a.s.u.DirectUpdateHandler2 start commit{,optimize=false,openSearcher=true,waitSearcher=true,expungeDeletes=false,softCommit=false,prepareCommit=false}
   [junit4]   2> 1519182 INFO  (TEST-TestSolrDeletionPolicy1.testKeepOptimizedOnlyCommits-seed#[DBD81028BA3ADC8B]) [     ] o.a.s.u.SolrIndexWriter Calling setCommitData with IW:org.apache.solr.update.SolrIndexWriter@18e9c6a8 commitCommandVersion:0
   [junit4]   2> 1519184 INFO  (TEST-TestSolrDeletionPolicy1.testKeepOptimizedOnlyCommits-seed#[DBD81028BA3ADC8B]) [     ] o.a.s.s.SolrIndexSearcher Opening [Searcher@2f0df75e[collection1] main]
   [junit4]   2> 1519184 INFO  (TEST-TestSolrDeletionPolicy1.testKeepOptimizedOnlyCommits-seed#[DBD81028BA3ADC8B]) [     ] o.a.s.u.DirectUpdateHandler2 end_commit_flush
   [junit4]   2> 1519185 INFO  (searcherExecutor-8348-thread-1) [     ] o.a.s.c.SolrCore [collection1] Registered new searcher Searcher@2f0df75e[collection1] main{ExitableDirectoryReader(UninvertingDirectoryReader(Uninverting(_0(9.0.0):c1:[diagnostics={java.vm.version=11.0.3+7, java.version=11.0.3, timestamp=1566984448684, java.vendor=AdoptOpenJDK, os=Linux, os.version=5.0.0-23-generic, java.runtime.version=11.0.3+7, os.arch=amd64, source=flush, lucene.version=9.0.0}]:[attributes={Lucene50StoredFieldsFormat.mode=BEST_SPEED}]) Uninverting(_1(9.0.0):c1:[diagnostics={java.vm.version=11.0.3+7, java.version=11.0.3, timestamp=1566984448689, java.vendor=AdoptOpenJDK, os=Linux, os.version=5.0.0-23-generic, java.runtime.version=11.0.3+7, os.arch=amd64, source=flush, lucene.version=9.0.0}]:[attributes={Lucene50StoredFieldsFormat.mode=BEST_SPEED}])))}
   [junit4]   2> 1519185 INFO  (TEST-TestSolrDeletionPolicy1.testKeepOptimizedOnlyCommits-seed#[DBD81028BA3ADC8B]) [     ] o.a.s.u.p.LogUpdateProcessorFactory [collection1]  webapp=null path=null params={}{commit=} 0 2
   [junit4]   2> 1519185 INFO  (TEST-TestSolrDeletionPolicy1.testKeepOptimizedOnlyCommits-seed#[DBD81028BA3ADC8B]) [     ] o.a.s.c.S.Request [collection1]  webapp=null path=null params={q=id:[0+TO+2]&qt=&start=0&rows=20&version=2.2} hits=2 status=0 QTime=0
   [junit4]   2> 1519186 INFO  (TEST-TestSolrDeletionPolicy1.testKeepOptimizedOnlyCommits-seed#[DBD81028BA3ADC8B]) [     ] o.a.s.u.p.LogUpdateProcessorFactory [collection1]  webapp=null path=null params={}{add=[3]} 0 0
   [junit4]   2> 1519186 INFO  (TEST-TestSolrDeletionPolicy1.testKeepOptimizedOnlyCommits-seed#[DBD81028BA3ADC8B]) [     ] o.a.s.u.DirectUpdateHandler2 start commit{,optimize=true,openSearcher=true,waitSearcher=true,expungeDeletes=false,softCommit=false,prepareCommit=false}
   [junit4]   2> 1519188 INFO  (TEST-TestSolrDeletionPolicy1.testKeepOptimizedOnlyCommits-seed#[DBD81028BA3ADC8B]) [     ] o.a.s.u.SolrIndexWriter Calling setCommitData with IW:org.apache.solr.update.SolrIndexWriter@18e9c6a8 commitCommandVersion:0
   [junit4]   2> 1519189 INFO  (TEST-TestSolrDeletionPolicy1.testKeepOptimizedOnlyCommits-seed#[DBD81028BA3ADC8B]) [     ] o.a.s.s.SolrIndexSearcher Opening [Searcher@7924320e[collection1] main]
   [junit4]   2> 1519189 INFO  (TEST-TestSolrDeletionPolicy1.testKeepOptimizedOnlyCommits-seed#[DBD81028BA3ADC8B]) [     ] o.a.s.u.DirectUpdateHandler2 end_commit_flush
   [junit4]   2> 1519190 INFO  (searcherExecutor-8348-thread-1) [     ] o.a.s.c.SolrCore [collection1] Registered new searcher Searcher@7924320e[collection1] main{ExitableDirectoryReader(UninvertingDirectoryReader(Uninverting(_0(9.0.0):c1:[diagnostics={java.vm.version=11.0.3+7, java.version=11.0.3, timestamp=1566984448684, java.vendor=AdoptOpenJDK, os=Linux, os.version=5.0.0-23-generic, java.runtime.version=11.0.3+7, os.arch=amd64, source=flush, lucene.version=9.0.0}]:[attributes={Lucene50StoredFieldsFormat.mode=BEST_SPEED}]) Uninverting(_1(9.0.0):c1:[diagnostics={java.vm.version=11.0.3+7, java.version=11.0.3, timestamp=1566984448689, java.vendor=AdoptOpenJDK, os=Linux, os.version=5.0.0-23-generic, java.runtime.version=11.0.3+7, os.arch=amd64, source=flush, lucene.version=9.0.0}]:[attributes={Lucene50StoredFieldsFormat.mode=BEST_SPEED}]) Uninverting(_2(9.0.0):c1:[diagnostics={java.vm.version=11.0.3+7, java.version=11.0.3, timestamp=1566984448693, java.vendor=AdoptOpenJDK, os=Linux, os.version=5.0.0-23-generic, java.runtime.version=11.0.3+7, os.arch=amd64, source=flush, lucene.version=9.0.0}]:[attributes={Lucene50StoredFieldsFormat.mode=BEST_SPEED}])))}
   [junit4]   2> 1519190 INFO  (TEST-TestSolrDeletionPolicy1.testKeepOptimizedOnlyCommits-seed#[DBD81028BA3ADC8B]) [     ] o.a.s.u.p.LogUpdateProcessorFactory [collection1]  webapp=null path=null params={}{optimize=} 0 4
   [junit4]   2> 1519191 INFO  (TEST-TestSolrDeletionPolicy1.testKeepOptimizedOnlyCommits-seed#[DBD81028BA3ADC8B]) [     ] o.a.s.c.S.Request [collection1]  webapp=null path=null params={q=id:[0+TO+3]&qt=&start=0&rows=20&version=2.2} hits=3 status=0 QTime=0
   [junit4]   2> 1519192 INFO  (TEST-TestSolrDeletionPolicy1.testKeepOptimizedOnlyCommits-seed#[DBD81028BA3ADC8B]) [     ] o.a.s.u.p.LogUpdateProcessorFactory [collection1]  webapp=null path=null params={}{add=[4]} 0 0
   [junit4]   2> 1519192 INFO  (TEST-TestSolrDeletionPolicy1.testKeepOptimizedOnlyCommits-seed#[DBD81028BA3ADC8B]) [     ] o.a.s.u.DirectUpdateHandler2 start commit{,optimize=true,openSearcher=true,waitSearcher=true,expungeDeletes=false,softCommit=false,prepareCommit=false}
   [junit4]   2> 1519196 INFO  (TEST-TestSolrDeletionPolicy1.testKeepOptimizedOnlyCommits-seed#[DBD81028BA3ADC8B]) [     ] o.a.s.u.SolrIndexWriter Calling setCommitData with IW:org.apache.solr.update.SolrIndexWriter@18e9c6a8 commitCommandVersion:0
   [junit4]   2> 1519197 INFO  (TEST-TestSolrDeletionPolicy1.testKeepOptimizedOnlyCommits-seed#[DBD81028BA3ADC8B]) [     ] o.a.s.s.SolrIndexSearcher Opening [Searcher@52076e9d[collection1] main]
   [junit4]   2> 1519197 INFO  (TEST-TestSolrDeletionPolicy1.testKeepOptimizedOnlyCommits-seed#[DBD81028BA3ADC8B]) [     ] o.a.s.u.DirectUpdateHandler2 end_commit_flush
   [junit4]   2> 1519198 INFO  (searcherExecutor-8348-thread-1) [     ] o.a.s.c.SolrCore [collection1] Registered new searcher Searcher@52076e9d[collection1] main{ExitableDirectoryReader(UninvertingDirectoryReader(Uninverting(_4(9.0.0):C4:[diagnostics={java.runtime.version=11.0.3+7, os=Linux, timestamp=1566984448700, lucene.version=9.0.0, java.vm.version=11.0.3+7, java.version=11.0.3, mergeMaxNumSegments=2147483647, os.version=5.0.0-23-generic, java.vendor=AdoptOpenJDK, source=merge, os.arch=amd64, mergeFactor=4}]:[attributes={Lucene50StoredFieldsFormat.mode=BEST_SPEED}])))}
   [junit4]   2> 1519198 INFO  (TEST-TestSolrDeletionPolicy1.testKeepOptimizedOnlyCommits-seed#[DBD81028BA3ADC8B]) [     ] o.a.s.u.p.LogUpdateProcessorFactory [collection1]  webapp=null path=null params={}{optimize=} 0 6
   [junit4]   2> 1519199 INFO  (TEST-TestSolrDeletionPolicy1.testKeepOptimizedOnlyCommits-seed#[DBD81028BA3ADC8B]) [     ] o.a.s.c.S.Request [collection1]  webapp=null path=null params={q=id:[0+TO+4]&qt=&start=0&rows=20&version=2.2} hits=4 status=0 QTime=0
   [junit4]   2> 1519200 INFO  (TEST-TestSolrDeletionPolicy1.testKeepOptimizedOnlyCommits-seed#[DBD81028BA3ADC8B]) [     ] o.a.s.u.p.LogUpdateProcessorFactory [collection1]  webapp=null path=null params={}{add=[5]} 0 0
   [junit4]   2> 1519200 INFO  (TEST-TestSolrDeletionPolicy1.testKeepOptimizedOnlyCommits-seed#[DBD81028BA3ADC8B]) [     ] o.a.s.u.DirectUpdateHandler2 start commit{,optimize=true,openSearcher=true,waitSearcher=true,expungeDeletes=false,softCommit=false,prepareCommit=false}
   [junit4]   2> 1519201 INFO  (TEST-TestSolrDeletionPolicy1.testKeepOptimizedOnlyCommits-seed#[DBD81028BA3ADC8B]) [     ] o.a.s.u.SolrIndexWriter Calling setCommitData with IW:org.apache.solr.update.SolrIndexWriter@18e9c6a8 commitCommandVersion:0
   [junit4]   2> 1519201 INFO  (TEST-TestSolrDeletionPolicy1.testKeepOptimizedOnlyCommits-seed#[DBD81028BA3ADC8B]) [     ] o.a.s.s.SolrIndexSearcher Opening [Searcher@22787f09[collection1] main]
   [junit4]   2> 1519202 INFO  (TEST-TestSolrDeletionPolicy1.testKeepOptimizedOnlyCommits-seed#[DBD81028BA3ADC8B]) [     ] o.a.s.u.DirectUpdateHandler2 end_commit_flush
   [junit4]   2> 1519202 INFO  (searcherExecutor-8348-thread-1) [     ] o.a.s.c.SolrCore [collection1] Registered new searcher Searcher@22787f09[collection1] main{ExitableDirectoryReader(UninvertingDirectoryReader(Uninverting(_4(9.0.0):C4:[diagnostics={java.runtime.version=11.0.3+7, os=Linux, timestamp=1566984448700, lucene.version=9.0.0, java.vm.version=11.0.3+7, java.version=11.0.3, mergeMaxNumSegments=2147483647, os.version=5.0.0-23-generic, java.vendor=AdoptOpenJDK, source=merge, os.arch=amd64, mergeFactor=4}]:[attributes={Lucene50StoredFieldsFormat.mode=BEST_SPEED}]) Uninverting(_5(9.0.0):c1:[diagnostics={java.vm.version=11.0.3+7, java.version=11.0.3, timestamp=1566984448706, java.vendor=AdoptOpenJDK, os=Linux, os.version=5.0.0-23-generic, java.runtime.version=11.0.3+7, os.arch=amd64, source=flush, lucene.version=9.0.0}]:[attributes={Lucene50StoredFieldsFormat.mode=BEST_SPEED}])))}
   [junit4]   2> 1519203 INFO  (TEST-TestSolrDeletionPolicy1.testKeepOptimizedOnlyCommits-seed#[DBD81028BA3ADC8B]) [     ] o.a.s.u.p.LogUpdateProcessorFactory [collection1]  webapp=null path=null params={}{optimize=} 0 2
   [junit4]   2> 1519203 INFO  (TEST-TestSolrDeletionPolicy1.testKeepOptimizedOnlyCommits-seed#[DBD81028BA3ADC8B]) [     ] o.a.s.c.S.Request [collection1]  webapp=null path=null params={q=id:[0+TO+5]&qt=&start=0&rows=20&version=2.2} hits=5 status=0 QTime=0
   [junit4]   2> 1519204 INFO  (TEST-TestSolrDeletionPolicy1.testKeepOptimizedOnlyCommits-seed#[DBD81028BA3ADC8B]) [     ] o.a.s.SolrTestCaseJ4 ###Ending testKeepOptimizedOnlyCommits
   [junit4]   2> 1519206 INFO  (TEST-TestSolrDeletionPolicy1.testNumCommitsConfigured-seed#[DBD81028BA3ADC8B]) [     ] o.a.s.SolrTestCaseJ4 ###Starting testNumCommitsConfigured
   [junit4]   2> 1519206 INFO  (TEST-TestSolrDeletionPolicy1.testNumCommitsConfigured-seed#[DBD81028BA3ADC8B]) [     ] o.a.s.u.DirectUpdateHandler2 [collection1] REMOVING ALL DOCUMENTS FROM INDEX
   [junit4]   2> 1519206 INFO  (TEST-TestSolrDeletionPolicy1.testNumCommitsConfigured-seed#[DBD81028BA3ADC8B]) [     ] o.a.s.u.p.LogUpdateProcessorFactory [collection1]  webapp=null path=null params={_version_=-9223372036854775807&update.distrib=FROMLEADER&versions=true&wt=json&indent=true}{deleteByQuery=*:*} 0 0
   [junit4]   2> 1519206 INFO  (TEST-TestSolrDeletionPolicy1.testNumCommitsConfigured-seed#[DBD81028BA3ADC8B]) [     ] o.a.s.u.p.LogUpdateProcessorFactory [collection1]  webapp=null path=null params={}{add=[1]} 0 0
   [junit4]   2> 1519207 INFO  (TEST-TestSolrDeletionPolicy1.testNumCommitsConfigured-seed#[DBD81028BA3ADC8B]) [     ] o.a.s.u.DirectUpdateHandler2 start commit{,optimize=false,openSearcher=true,waitSearcher=true,expungeDeletes=false,softCommit=false,prepareCommit=false}
   [junit4]   2> 1519207 INFO  (TEST-TestSolrDeletionPolicy1.testNumCommitsConfigured-seed#[DBD81028BA3ADC8B]) [     ] o.a.s.u.SolrIndexWriter Calling setCommitData with IW:org.apache.solr.update.SolrIndexWriter@18e9c6a8 commitCommandVersion:0
   [junit4]   2> 1519209 INFO  (TEST-TestSolrDeletionPolicy1.testNumCommitsConfigured-seed#[DBD81028BA3ADC8B]) [     ] o.a.s.s.SolrIndexSearcher Opening [Searcher@34b8c8cd[collection1] main]
   [junit4]   2> 1519209 INFO  (TEST-TestSolrDeletionPolicy1.testNumCommitsConfigured-seed#[DBD81028BA3ADC8B]) [     ] o.a.s.u.DirectUpdateHandler2 end_commit_flush
   [junit4]   2> 1519210 INFO  (searcherExecutor-8348-thread-1) [     ] o.a.s.c.SolrCore [collection1] Registered new searcher Searcher@34b8c8cd[collection1] main{ExitableDirectoryReader(UninvertingDirectoryReader(Uninverting(_6(9.0.0):c1:[diagnostics={java.vm.version=11.0.3+7, java.version=11.0.3, timestamp=1566984448714, java.vendor=AdoptOpenJDK, os=Linux, os.version=5.0.0-23-generic, java.runtime.version=11.0.3+7, os.arch=amd64, source=flush, lucene.version=9.0.0}]:[attributes={Lucene50StoredFieldsFormat.mode=BEST_SPEED}])))}
   [junit4]   2> 1519210 INFO  (TEST-TestSolrDeletionPolicy1.testNumCommitsConfigured-seed#[DBD81028BA3ADC8B]) [     ] o.a.s.u.p.LogUpdateProcessorFactory [collection1]  webapp=null path=null params={}{commit=} 0 3
   [junit4]   2> 1519211 INFO  (TEST-TestSolrDeletionPolicy1.testNumCommitsConfigured-seed#[DBD81028BA3ADC8B]) [     ] o.a.s.c.S.Request [collection1]  webapp=null path=null params={q=id:[0+TO+1]&qt=&start=0&rows=20&version=2.2} hits=1 status=0 QTime=0
   [junit4]   2> 1519211 INFO  (TEST-TestSolrDeletionPolicy1.testNumCommitsConfigured-seed#[DBD81028BA3ADC8B]) [     ] o.a.s.u.p.LogUpdateProcessorFactory [collection1]  webapp=null path=null params={}{add=[2]} 0 0
   [junit4]   2> 1519211 INFO  (TEST-TestSolrDeletionPolicy1.testNumCommitsConfigured-seed#[DBD81028BA3ADC8B]) [     ] o.a.s.u.DirectUpdateHandler2 start commit{,optimize=false,openSearcher=true,waitSearcher=true,expungeDeletes=false,softCommit=false,prepareCommit=false}
   [junit4]   2> 1519211 INFO  (TEST-TestSolrDeletionPolicy1.testNumCommitsConfigured-seed#[DBD81028BA3ADC8B]) [     ] o.a.s.u.SolrIndexWriter Calling setCommitData with IW:org.apache.solr.update.SolrIndexWriter@18e9c6a8 commitCommandVersion:0
   [junit4]   2> 1519214 INFO  (TEST-TestSolrDeletionPolicy1.testNumCommitsConfigured-seed#[DBD81028BA3ADC8B]) [     ] o.a.s.s.SolrIndexSearcher Opening [Searcher@35c388dc[collection1] main]
   [junit4]   2> 1519214 INFO  (TEST-TestSolrDeletionPolicy1.testNumCommitsConfigured-seed#[DBD81028BA3ADC8B]) [     ] o.a.s.u.DirectUpdateHandler2 end_commit_flush
   [junit4]   2> 1519215 INFO  (searcherExecutor-8348-thread-1) [     ] o.a.s.c.SolrCore [collection1] Registered new searcher Searcher@35c388dc[collection1] main{ExitableDirectoryReader(UninvertingDirectoryReader(Uninverting(_6(9.0.0):c1:[diagnostics={java.vm.version=11.0.3+7, java.version=11.0.3, timestamp=1566984448714, java.vendor=AdoptOpenJDK, os=Linux, os.version=5.0.0-23-generic, java.runtime.version=11.0.3+7, os.arch=amd64, source=flush, lucene.version=9.0.0}]:[attributes={Lucene50StoredFieldsFormat.mode=BEST_SPEED}]) Uninverting(_7(9.0.0):c1:[diagnostics={java.vm.version=11.0.3+7, java.version=11.0.3, timestamp=1566984448718, java.vendor=AdoptOpenJDK, os=Linux, os.version=5.0.0-23-generic, java.runtime.version=11.0.3+7, os.arch=amd64, source=flush, lucene.version=9.0.0}]:[attributes={Lucene50StoredFieldsFormat.mode=BEST_SPEED}])))}
   [junit4]   2> 1519215 INFO  (TEST-TestSolrDeletionPolicy1.testNumCommitsConfigured-seed#[DBD81028BA3ADC8B]) [     ] o.a.s.u.p.LogUpdateProcessorFactory [collection1]  webapp=null path=null params={}{commit=} 0 3
   [junit4]   2> 1519216 INFO  (TEST-TestSolrDeletionPolicy1.testNumCommitsConfigured-seed#[DBD81028BA3ADC8B]) [     ] o.a.s.c.S.Request [collection1]  webapp=null path=null params={q=id:[0+TO+2]&qt=&start=0&rows=20&version=2.2} hits=2 status=0 QTime=0
   [junit4]   2> 1519216 INFO  (TEST-TestSolrDeletionPolicy1.testNumCommitsConfigured-seed#[DBD81028BA3ADC8B]) [     ] o.a.s.u.p.LogUpdateProcessorFactory [collection1]  webapp=null path=null params={}{add=[3]} 0 0
   [junit4]   2> 1519216 INFO  (TEST-TestSolrDeletionPolicy1.testNumCommitsConfigured-seed#[DBD81028BA3ADC8B]) [     ] o.a.s.u.DirectUpdateHandler2 start commit{,optimize=true,openSearcher=true,waitSearcher=true,expungeDeletes=false,softCommit=false,prepareCommit=false}
   [junit4]   2> 1519218 INFO  (TEST-TestSolrDeletionPolicy1.testNumCommitsConfigured-seed#[DBD81028BA3ADC8B]) [     ] o.a.s.u.SolrIndexWriter Calling setCommitData with IW:org.apache.solr.update.SolrIndexWriter@18e9c6a8 commitCommandVersion:0
   [junit4]   2> 1519219 INFO  (TEST-TestSolrDeletionPolicy1.testNumCommitsConfigured-seed#[DBD81028BA3ADC8B]) [     ] o.a.s.s.SolrIndexSearcher Opening [Searcher@1d0881c0[collection1] main]
   [junit4]   2> 1519219 INFO  (TEST-TestSolrDeletionPolicy1.testNumCommitsConfigured-seed#[DBD81028BA3ADC8B]) [     ] o.a.s.u.DirectUpdateHandler2 end_commit_flush
   [junit4]   2> 1519220 INFO  (searcherExecutor-8348-thread-1) [     ] o.a.s.c.SolrCore [collection1] Registered new searcher Searcher@1d0881c0[collection1] main{ExitableDirectoryReader(UninvertingDirectoryReader(Uninverting(_6(9.0.0):c1:[diagnostics={java.vm.version=11.0.3+7, java.version=11.0.3, timestamp=1566984448714, java.vendor=AdoptOpenJDK, os=Linux, os.version=5.0.0-23-generic, java.runtime.version=11.0.3+7, os.arch=amd64, source=flush, lucene.version=9.0.0}]:[attributes={Lucene50StoredFieldsFormat.mode=BEST_SPEED}]) Uninverting(_7(9.0.0):c1:[diagnostics={java.vm.version=11.0.3+7, java.version=11.0.3, timestamp=1566984448718, java.vendor=AdoptOpenJDK, os=Linux, os.version=5.0.0-23-generic, java.runtime.version=11.0.3+7, os.arch=amd64, source=flush, lucene.version=9.0.0}]:[attributes={Lucene50StoredFieldsFormat.mode=BEST_SPEED}]) Uninverting(_8(9.0.0):c1:[diagnostics={java.vm.version=11.0.3+7, java.version=11.0.3, timestamp=1566984448723, java.vendor=AdoptOpenJDK, os=Linux, os.version=5.0.0-23-generic, java.runtime.version=11.0.3+7, os.arch=amd64, source=flush, lucene.version=9.0.0}]:[attributes={Lucene50StoredFieldsFormat.mode=BEST_SPEED}])))}
   [junit4]   2> 1519220 INFO  (TEST-TestSolrDeletionPolicy1.testNumCommitsConfigured-seed#[DBD81028BA3ADC8B]) [     ] o.a.s.u.p.LogUpdateProcessorFactory [collection1]  webapp=null path=null params={}{optimize=} 0 3
   [junit4]   2> 1519221 INFO  (TEST-TestSolrDeletionPolicy1.testNumCommitsConfigured-seed#[DBD81028BA3ADC8B]) [     ] o.a.s.c.S.Request [collection1]  webapp=null path=null params={q=id:[0+TO+3]&qt=&start=0&rows=20&version=2.2} hits=3 status=0 QTime=0
   [junit4]   2> 1519221 INFO  (TEST-TestSolrDeletionPolicy1.testNumCommitsConfigured-seed#[DBD81028BA3ADC8B]) [     ] o.a.s.u.p.LogUpdateProcessorFactory [collection1]  webapp=null path=null params={}{add=[4]} 0 0
   [junit4]   2> 1519221 INFO  (TEST-TestSolrDeletionPolicy1.testNumCommitsConfigured-seed#[DBD81028BA3ADC8B]) [     ] o.a.s.u.DirectUpdateHandler2 start commit{,optimize=true,openSearcher=true,waitSearcher=true,expungeDeletes=false,softCommit=false,prepareCommit=false}
   [junit4]   2> 1519226 INFO  (TEST-TestSolrDeletionPolicy1.testNumCommitsConfigured-seed#[DBD81028BA3ADC8B]) [     ] o.a.s.u.SolrIndexWriter Calling setCommitData with IW:org.apache.solr.update.SolrIndexWriter@18e9c6a8 commitCommandVersion:0
   [junit4]   2> 1519227 INFO  (TEST-TestSolrDeletionPolicy1.testNumCommitsConfigured-seed#[DBD81028BA3ADC8B]) [     ] o.a.s.s.SolrIndexSearcher Opening [Searcher@6aca2ed9[collection1] main]
   [junit4]   2> 1519227 INFO  (TEST-TestSolrDeletionPolicy1.testNumCommitsConfigured-seed#[DBD81028BA3ADC8B]) [     ] o.a.s.u.DirectUpdateHandler2 end_commit_flush
   [junit4]   2> 1519228 INFO  (searcherExecutor-8348-thread-1) [     ] o.a.s.c.SolrCore [collection1] Registered new searcher Searcher@6aca2ed9[collection1] main{ExitableDirectoryReader(UninvertingDirectoryReader(Uninverting(_a(9.0.0):C4:[diagnostics={java.runtime.version=11.0.3+7, os=Linux, timestamp=1566984448730, lucene.version=9.0.0, java.vm.version=11.0.3+7, java.version=11.0.3, mergeMaxNumSegments=2147483647, os.version=5.0.0-23-generic, java.vendor=AdoptOpenJDK, source=merge, os.arch=amd64, mergeFactor=4}]:[attributes={Lucene50StoredFieldsFormat.mode=BEST_SPEED}])))}
   [junit4]   2> 1519228 INFO  (TEST-TestSolrDeletionPolicy1.testNumCommitsConfigured-seed#[DBD81028BA3ADC8B]) [     ] o.a.s.u.p.LogUpdateProcessorFactory [collection1]  webapp=null path=null params={}{optimize=} 0 7
   [junit4]   2> 1519229 INFO  (TEST-TestSolrDeletionPolicy1.testNumCommitsConfigured-seed#[DBD81028BA3ADC8B]) [     ] o.a.s.c.S.Request [collection1]  webapp=null path=null params={q=id:[0+TO+4]&qt=&start=0&rows=20&version=2.2} hits=4 status=0 QTime=0
   [junit4]   2> 1519230 INFO  (TEST-TestSolrDeletionPolicy1.testNumCommitsConfigured-seed#[DBD81028BA3ADC8B]) [     ] o.a.s.u.p.LogUpdateProcessorFactory [collection1]  webapp=null path=null params={}{add=[5]} 0 0
   [junit4]   2> 1519230 INFO  (TEST-TestSolrDeletionPolicy1.testNumCommitsConfigured-seed#[DBD81028BA3ADC8B]) [     ] o.a.s.u.DirectUpdateHandler2 start commit{,optimize=true,openSearcher=true,waitSearcher=true,expungeDeletes=false,softCommit=false,prepareCommit=false}
   [junit4]   2> 1519232 INFO  (TEST-TestSolrDeletionPolicy1.testNumCommitsConfigured-seed#[DBD81028BA3ADC8B]) [     ] o.a.s.u.SolrIndexWriter Calling setCommitData with IW:org.apache.solr.update.SolrIndexWriter@18e9c6a8 commitCommandVersion:0
   [junit4]   2> 1519233 INFO  (TEST-TestSolrDeletionPolicy1.testNumCommitsConfigured-seed#[DBD81028BA3ADC8B]) [     ] o.a.s.s.SolrIndexSearcher Opening [Searcher@3ff1ff4a[collection1] main]
   [junit4]   2> 1519233 INFO  (TEST-TestSolrDeletionPolicy1.testNumCommitsConfigured-seed#[DBD81028BA3ADC8B]) [     ] o.a.s.u.DirectUpdateHandler2 end_commit_flush
   [junit4]   2> 1519234 INFO  (searcherExecutor-8348-thread-1) [     ] o.a.s.c.SolrCore [collection1] Registered new searcher Searcher@3ff1ff4a[collection1] main{ExitableDirectoryReader(UninvertingDirectoryReader(Uninverting(_a(9.0.0):C4:[diagnostics={java.runtime.version=11.0.3+7, os=Linux, timestamp=1566984448730, lucene.version=9.0.0, java.vm.version=11.0.3+7, java.version=11.0.3, mergeMaxNumSegments=2147483647, os.version=5.0.0-23-generic, java.vendor=AdoptOpenJDK, source=merge, os.arch=amd64, mergeFactor=4}]:[attributes={Lucene50StoredFieldsFormat.mode=BEST_SPEED}]) Uninverting(_b(9.0.0):c1:[diagnostics={java.vm.version=11.0.3+7, java.version=11.0.3, timestamp=1566984448737, java.vendor=AdoptOpenJDK, os=Linux, os.version=5.0.0-23-generic, java.runtime.version=11.0.3+7, os.arch=amd64, source=flush, lucene.version=9.0.0}]:[attributes={Lucene50StoredFieldsFormat.mode=BEST_SPEED}])))}
   [junit4]   2> 1519234 INFO  (TEST-TestSolrDeletionPolicy1.testNumCommitsConfigured-seed#[DBD81028BA3ADC8B]) [     ] o.a.s.u.p.LogUpdateProcessorFactory [collection1]  webapp=null path=null params={}{optimize=} 0 4
   [junit4]   2> 1519235 INFO  (TEST-TestSolrDeletionPolicy1.testNumCommitsConfigured-seed#[DBD81028BA3ADC8B]) [     ] o.a.s.c.S.Request [collection1]  webapp=null path=null params={q=id:[0+TO+5]&qt=&start=0&rows=20&version=2.2} hits=5 status=0 QTime=0
   [junit4]   2> 1519236 INFO  (TEST-TestSolrDeletionPolicy1.testNumCommitsConfigured-seed#[DBD81028BA3ADC8B]) [     ] o.a.s.SolrTestCaseJ4 ###Ending testNumCommitsConfigured
   [junit4]   2> NOTE: reproduce with: ant test  -Dtestcase=TestSolrDeletionPolicy1 -Dtests.method=testNumCommitsConfigured -Dtests.seed=DBD81028BA3ADC8B -Dtests.multiplier=3 -Dtests.slow=true -Dtests.locale=wae-CH -Dtests.timezone=Jamaica -Dtests.asserts=true -Dtests.file.encoding=UTF-8
   [junit4] FAILURE 0.03s J1 | TestSolrDeletionPolicy1.testNumCommitsConfigured <<<
   [junit4]    > Throwable #1: java.lang.AssertionError
   [junit4]    > at __randomizedtesting.SeedInfo.seed([DBD81028BA3ADC8B:721B8A3A832064B]:0)
   [junit4]    > at org.apache.solr.core.TestSolrDeletionPolicy1.testNumCommitsConfigured(TestSolrDeletionPolicy1.java:108)
   [junit4]    > at java.base/jdk.internal.reflect.NativeMethodAccessorImpl.invoke0(Native Method)
   [junit4]    > at java.base/jdk.internal.reflect.NativeMethodAccessorImpl.invoke(NativeMethodAccessorImpl.java:62)
   [junit4]    > at java.base/jdk.internal.reflect.DelegatingMethodAccessorImpl.invoke(DelegatingMethodAccessorImpl.java:43)
   [junit4]    > at java.base/java.lang.reflect.Method.invoke(Method.java:566)
   [junit4]    > at java.base/java.lang.Thread.run(Thread.java:834)
   [junit4]   2> 1519240 INFO  (TEST-TestSolrDeletionPolicy1.testCommitAge-seed#[DBD81028BA3ADC8B]) [     ] o.a.s.SolrTestCaseJ4 ###Starting testCommitAge
   [junit4]   2> 1519240 INFO  (TEST-TestSolrDeletionPolicy1.testCommitAge-seed#[DBD81028BA3ADC8B]) [     ] o.a.s.u.DirectUpdateHandler2 [collection1] REMOVING ALL DOCUMENTS FROM INDEX
   [junit4]   2> 1519240 INFO  (TEST-TestSolrDeletionPolicy1.testCommitAge-seed#[DBD81028BA3ADC8B]) [     ] o.a.s.u.p.LogUpdateProcessorFactory [collection1]  webapp=null path=null params={_version_=-9223372036854775807&update.distrib=FROMLEADER&versions=true&wt=json&indent=true}{deleteByQuery=*:*} 0 0
   [junit4]   2> 1519240 INFO  (TEST-TestSolrDeletionPolicy1.testCommitAge-seed#[DBD81028BA3ADC8B]) [     ] o.a.s.u.p.LogUpdateProcessorFactory [collection1]  webapp=null path=null params={}{add=[1]} 0 0
   [junit4]   2> 1519240 INFO  (TEST-TestSolrDeletionPolicy1.testCommitAge-seed#[DBD81028BA3ADC8B]) [     ] o.a.s.u.DirectUpdateHandler2 start commit{,optimize=false,openSearcher=true,waitSearcher=true,expungeDeletes=false,softCommit=false,prepareCommit=false}
   [junit4]   2> 1519240 INFO  (TEST-TestSolrDeletionPolicy1.testCommitAge-seed#[DBD81028BA3ADC8B]) [     ] o.a.s.u.SolrIndexWriter Calling setCommitData with IW:org.apache.solr.update.SolrIndexWriter@18e9c6a8 commitCommandVersion:0
   [junit4]   2> 1519243 INFO  (TEST-TestSolrDeletionPolicy1.testCommitAge-seed#[DBD81028BA3ADC8B]) [     ] o.a.s.s.SolrIndexSearcher Opening [Searcher@974217a[collection1] main]
   [junit4]   2> 1519243 INFO  (TEST-TestSolrDeletionPolicy1.testCommitAge-seed#[DBD81028BA3ADC8B]) [     ] o.a.s.u.DirectUpdateHandler2 end_commit_flush
   [junit4]   2> 1519244 INFO  (searcherExecutor-8348-thread-1) [     ] o.a.s.c.SolrCore [collection1] Registered new searcher Searcher@974217a[collection1] main{ExitableDirectoryReader(UninvertingDirectoryReader(Uninverting(_c(9.0.0):c1:[diagnostics={java.vm.version=11.0.3+7, java.version=11.0.3, timestamp=1566984448747, java.vendor=AdoptOpenJDK, os=Linux, os.version=5.0.0-23-generic, java.runtime.version=11.0.3+7, os.arch=amd64, source=flush, lucene.version=9.0.0}]:[attributes={Lucene50StoredFieldsFormat.mode=BEST_SPEED}])))}
   [junit4]   2> 1519244 INFO  (TEST-TestSolrDeletionPolicy1.testCommitAge-seed#[DBD81028BA3ADC8B]) [     ] o.a.s.u.p.LogUpdateProcessorFactory [collection1]  webapp=null path=null params={}{commit=} 0 3
   [junit4]   2> 1519245 INFO  (TEST-TestSolrDeletionPolicy1.testCommitAge-seed#[DBD81028BA3ADC8B]) [     ] o.a.s.c.S.Request [collection1]  webapp=null path=null params={q=id:[0+TO+1]&qt=&start=0&rows=20&version=2.2} hits=1 status=0 QTime=0
   [junit4]   2> 1519245 INFO  (TEST-TestSolrDeletionPolicy1.testCommitAge-seed#[DBD81028BA3ADC8B]) [     ] o.a.s.u.p.LogUpdateProcessorFactory [collection1]  webapp=null path=null params={}{add=[2]} 0 0
   [junit4]   2> 1519251 INFO  (TEST-TestSolrDeletionPolicy1.testCommitAge-seed#[DBD81028BA3ADC8B]) [     ] o.a.s.u.DirectUpdateHandler2 start commit{,optimize=false,openSearcher=true,waitSearcher=true,expungeDeletes=false,softCommit=false,prepareCommit=false}
   [junit4]   2> 1519251 INFO  (TEST-TestSolrDeletionPolicy1.testCommitAge-seed#[DBD81028BA3ADC8B]) [     ] o.a.s.u.SolrIndexWriter Calling setCommitData with IW:org.apache.solr.update.SolrIndexWriter@18e9c6a8 commitCommandVersion:0
   [junit4]   2> 1519254 INFO  (TEST-TestSolrDeletionPolicy1.testCommitAge-seed#[DBD81028BA3ADC8B]) [     ] o.a.s.s.SolrIndexSearcher Opening [Searcher@22837b06[collection1] main]
   [junit4]   2> 1519254 INFO  (TEST-TestSolrDeletionPolicy1.testCommitAge-seed#[DBD81028BA3ADC8B]) [     ] o.a.s.u.DirectUpdateHandler2 end_commit_flush
   [junit4]   2> 1519255 INFO  (searcherExecutor-8348-thread-1) [     ] o.a.s.c.SolrCore [collection1] Registered new searcher Searcher@22837b06[collection1] main{ExitableDirectoryReader(UninvertingDirectoryReader(Uninverting(_c(9.0.0):c1:[diagnostics={java.vm.version=11.0.3+7, java.version=11.0.3, timestamp=1566984448747, java.vendor=AdoptOpenJDK, os=Linux, os.version=5.0.0-23-generic, java.runtime.version=11.0.3+7, os.arch=amd64, source=flush, lucene.version=9.0.0}]:[attributes={Lucene50StoredFieldsFormat.mode=BEST_SPEED}]) Uninverting(_d(9.0.0):c1:[diagnostics={java.vm.version=11.0.3+7, java.version=11.0.3, timestamp=1566984448758, java.vendor=AdoptOpenJDK, os=Linux, os.version=5.0.0-23-generic, java.runtime.version=11.0.3+7, os.arch=amd64, source=flush, lucene.version=9.0.0}]:[attributes={Lucene50StoredFieldsFormat.mode=BEST_SPEED}])))}
   [junit4]   2> 1519255 INFO  (TEST-TestSolrDeletionPolicy1.testCommitAge-seed#[DBD81028BA3ADC8B]) [     ] o.a.s.u.p.LogUpdateProcessorFactory [collection1]  webapp=null path=null params={}{commit=} 0 3
   [junit4]   2> 1519255 INFO  (TEST-TestSolrDeletionPolicy1.testCommitAge-seed#[DBD81028BA3ADC8B]) [     ] o.a.s.c.S.Request [collection1]  webapp=null path=null params={q=id:[0+TO+2]&qt=&start=0&rows=20&version=2.2} hits=2 status=0 QTime=0
   [junit4]   2> 1519256 INFO  (TEST-TestSolrDeletionPolicy1.testCommitAge-seed#[DBD81028BA3ADC8B]) [     ] o.a.s.u.p.LogUpdateProcessorFactory [collection1]  webapp=null path=null params={}{add=[3]} 0 0
   [junit4]   2> 1519256 INFO  (TEST-TestSolrDeletionPolicy1.testCommitAge-seed#[DBD81028BA3ADC8B]) [     ] o.a.s.u.DirectUpdateHandler2 start commit{,optimize=true,openSearcher=true,waitSearcher=true,expungeDeletes=false,softCommit=false,prepareCommit=false}
   [junit4]   2> 1519258 INFO  (TEST-TestSolrDeletionPolicy1.testCommitAge-seed#[DBD81028BA3ADC8B]) [     ] o.a.s.u.SolrIndexWriter Calling setCommitData with IW:org.apache.solr.update.SolrIndexWriter@18e9c6a8 commitCommandVersion:0
   [junit4]   2> 1519259 INFO  (TEST-TestSolrDeletionPolicy1.testCommitAge-seed#[DBD81028BA3ADC8B]) [     ] o.a.s.s.SolrIndexSearcher Opening [Searcher@63e49733[collection1] main]
   [junit4]   2> 1519259 INFO  (TEST-TestSolrDeletionPolicy1.testCommitAge-seed#[DBD81028BA3ADC8B]) [     ] o.a.s.u.DirectUpdateHandler2 end_commit_flush
   [junit4]   2> 1519260 INFO  (searcherExecutor-8348-thread-1) [     ] o.a.s.c.SolrCore [collection1] Registered new searcher Searcher@63e49733[collection1] main{ExitableDirectoryReader(UninvertingDirectoryReader(Uninverting(_c(9.0.0):c1:[diagnostics={java.vm.version=11.0.3+7, java.version=11.0.3, timestamp=1566984448747, java.vendor=AdoptOpenJDK, os=Linux, os.version=5.0.0-23-generic, java.runtime.version=11.0.3+7, os.arch=amd64, source=flush, lucene.version=9.0.0}]:[attributes={Lucene50StoredFieldsFormat.mode=BEST_SPEED}]) Uninverting(_d(9.0.0):c1:[diagnostics={java.vm.version=11.0.3+7, java.version=11.0.3, timestamp=1566984448758, java.vendor=AdoptOpenJDK, os=Linux, os.version=5.0.0-23-generic, java.runtime.version=11.0.3+7, os.arch=amd64, source=flush, lucene.version=9.0.0}]:[attributes={Lucene50StoredFieldsFormat.mode=BEST_SPEED}]) Uninverting(_e(9.0.0):c1:[diagnostics={java.vm.version=11.0.3+7, java.version=11.0.3, timestamp=1566984448763, java.vendor=AdoptOpenJDK, os=Linux, os.version=5.0.0-23-generic, java.runtime.version=11.0.3+7, os.arch=amd64, source=flush, lucene.version=9.0.0}]:[attributes={Lucene50StoredFieldsFormat.mode=BEST_SPEED}])))}
   [junit4]   2> 1519260 INFO  (TEST-TestSolrDeletionPolicy1.testCommitAge-seed#[DBD81028BA3ADC8B]) [     ] o.a.s.u.p.LogUpdateProcessorFactory [collection1]  webapp=null path=null params={}{optimize=} 0 3
   [junit4]   2> 1519260 INFO  (TEST-TestSolrDeletionPolicy1.testCommitAge-seed#[DBD81028BA3ADC8B]) [     ] o.a.s.c.S.Request [collection1]  webapp=null path=null params={q=id:[0+TO+3]&qt=&start=0&rows=20&version=2.2} hits=3 status=0 QTime=0
   [junit4]   2> 1519261 INFO  (TEST-TestSolrDeletionPolicy1.testCommitAge-seed#[DBD81028BA3ADC8B]) [     ] o.a.s.u.p.LogUpdateProcessorFactory [collection1]  webapp=null path=null params={}{add=[4]} 0 0
   [junit4]   2> 1519261 INFO  (TEST-TestSolrDeletionPolicy1.testCommitAge-seed#[DBD81028BA3ADC8B]) [     ] o.a.s.u.DirectUpdateHandler2 start commit{,optimize=true,openSearcher=true,waitSearcher=true,expungeDeletes=false,softCommit=false,prepareCommit=false}
   [junit4]   2> 1519265 INFO  (TEST-TestSolrDeletionPolicy1.testCommitAge-seed#[DBD81028BA3ADC8B]) [     ] o.a.s.u.SolrIndexWriter Calling setCommitData with IW:org.apache.solr.update.SolrIndexWriter@18e9c6a8 commitCommandVersion:0
   [junit4]   2> 1519266 INFO  (TEST-TestSolrDeletionPolicy1.testCommitAge-seed#[DBD81028BA3ADC8B]) [     ] o.a.s.s.SolrIndexSearcher Opening [Searcher@dbf86d2[collection1] main]
   [junit4]   2> 1519266 INFO  (TEST-TestSolrDeletionPolicy1.testCommitAge-seed#[DBD81028BA3ADC8B]) [     ] o.a.s.u.DirectUpdateHandler2 end_commit_flush
   [junit4]   2> 1519267 INFO  (searcherExecutor-8348-thread-1) [     ] o.a.s.c.SolrCore [collection1] Registered new searcher Searcher@dbf86d2[collection1] main{ExitableDirectoryReader(UninvertingDirectoryReader(Uninverting(_g(9.0.0):C4:[diagnostics={java.runtime.version=11.0.3+7, os=Linux, timestamp=1566984448769, lucene.version=9.0.0, java.vm.version=11.0.3+7, java.version=11.0.3, mergeMaxNumSegments=2147483647, os.version=5.0.0-23-generic, java.vendor=AdoptOpenJDK, source=merge, os.arch=amd64, mergeFactor=4}]:[attributes={Lucene50StoredFieldsFormat.mode=BEST_SPEED}])))}
   [junit4]   2> 1519267 INFO  (TEST-TestSolrDeletionPolicy1.testCommitAge-seed#[DBD81028BA3ADC8B]) [     ] o.a.s.u.p.LogUpdateProcessorFactory [collection1]  webapp=null path=null params={}{optimize=} 0 5
   [junit4]   2> 1519267 INFO  (TEST-TestSolrDeletionPolicy1.testCommitAge-seed#[DBD81028BA3ADC8B]) [     ] o.a.s.c.S.Request [collection1]  webapp=null path=null params={q=id:[0+TO+4]&qt=&start=0&rows=20&version=2.2} hits=4 status=0 QTime=0
   [junit4]   2> 1519268 INFO  (TEST-TestSolrDeletionPolicy1.testCommitAge-seed#[DBD81028BA3ADC8B]) [     ] o.a.s.u.p.LogUpdateProcessorFactory [collection1]  webapp=null path=null params={}{add=[5]} 0 0
   [junit4]   2> 1519268 INFO  (TEST-TestSolrDeletionPolicy1.testCommitAge-seed#[DBD81028BA3ADC8B]) [     ] o.a.s.u.DirectUpdateHandler2 start commit{,optimize=true,openSearcher=true,waitSearcher=true,expungeDeletes=false,softCommit=false,prepareCommit=false}
   [junit4]   2> 1519270 INFO  (TEST-TestSolrDeletionPolicy1.testCommitAge-seed#[DBD81028BA3ADC8B]) [     ] o.a.s.u.SolrIndexWriter Calling setCommitData with IW:org.apache.solr.update.SolrIndexWriter@18e9c6a8 commitCommandVersion:0
   [junit4]   2> 1519271 INFO  (TEST-TestSolrDeletionPolicy1.testCommitAge-seed#[DBD81028BA3ADC8B]) [     ] o.a.s.s.SolrIndexSearcher Opening [Searcher@6c95e8e1[collection1] main]
   [junit4]   2> 1519271 INFO  (TEST-TestSolrDeletionPolicy1.testCommitAge-seed#[DBD81028BA3ADC8B]) [     ] o.a.s.u.DirectUpdateHandler2 end_commit_flush
   [junit4]   2> 1519272 INFO  (searcherExecutor-8348-thread-1) [     ] o.a.s.c.SolrCore [collection1] Registered new searcher Searcher@6c95e8e1[collection1] main{ExitableDirectoryReader(UninvertingDirectoryReader(Uninverting(_g(9.0.0):C4:[diagnostics={java.runtime.version=11.0.3+7, os=Linux, timestamp=1566984448769, lucene.version=9.0.0, java.vm.version=11.0.3+7, java.version=11.0.3, mergeMaxNumSegments=2147483647, os.version=5.0.0-23-generic, java.vendor=AdoptOpenJDK, source=merge, os.arch=amd64, mergeFactor=4}]:[attributes={Lucene50StoredFieldsFormat.mode=BEST_SPEED}]) Uninverting(_h(9.0.0):c1:[diagnostics={java.vm.version=11.0.3+7, java.version=11.0.3, timestamp=1566984448775, java.vendor=AdoptOpenJDK, os=Linux, os.version=5.0.0-23-generic, java.runtime.version=11.0.3+7, os.arch=amd64, source=flush, lucene.version=9.0.0}]:[attributes={Lucene50StoredFieldsFormat.mode=BEST_SPEED}])))}
   [junit4]   2> 1519272 INFO  (TEST-TestSolrDeletionPolicy1.testCommitAge-seed#[DBD81028BA3ADC8B]) [     ] o.a.s.u.p.LogUpdateProcessorFactory [collection1]  webapp=null path=null params={}{optimize=} 0 4
   [junit4]   2> 1519273 INFO  (TEST-TestSolrDeletionPolicy1.testCommitAge-seed#[DBD81028BA3ADC8B]) [     ] o.a.s.c.S.Request [collection1]  webapp=null path=null params={q=id:[0+TO+5]&qt=&start=0&rows=20&version=2.2} hits=5 status=0 QTime=0
   [junit4]   2> 1519374 INFO  (TEST-TestSolrDeletionPolicy1.testCommitAge-seed#[DBD81028BA3ADC8B]) [     ] o.a.s.u.p.LogUpdateProcessorFactory [collection1]  webapp=null path=null params={}{add=[6]} 0 0
   [junit4]   2> 1519375 INFO  (TEST-TestSolrDeletionPolicy1.testCommitAge-seed#[DBD81028BA3ADC8B]) [     ] o.a.s.u.DirectUpdateHandler2 start commit{,optimize=true,openSearcher=true,waitSearcher=true,expungeDeletes=false,softCommit=false,prepareCommit=false}
   [junit4]   2> 1519376 INFO  (TEST-TestSolrDeletionPolicy1.testCommitAge-seed#[DBD81028BA3ADC8B]) [     ] o.a.s.u.SolrIndexWriter Calling setCommitData with IW:org.apache.solr.update.SolrIndexWriter@18e9c6a8 commitCommandVersion:0
   [junit4]   2> 1519376 INFO  (TEST-TestSolrDeletionPolicy1.testCommitAge-seed#[DBD81028BA3ADC8B]) [     ] o.a.s.s.SolrIndexSearcher Opening [Searcher@36803695[collection1] main]
   [junit4]   2> 1519377 INFO  (TEST-TestSolrDeletionPolicy1.testCommitAge-seed#[DBD81028BA3ADC8B]) [     ] o.a.s.u.DirectUpdateHandler2 end_commit_flush
   [junit4]   2> 1519377 INFO  (searcherExecutor-8348-thread-1) [     ] o.a.s.c.SolrCore [collection1] Registered new searcher Searcher@36803695[collection1] main{ExitableDirectoryReader(UninvertingDirectoryReader(Uninverting(_g(9.0.0):C4:[diagnostics={java.runtime.version=11.0.3+7, os=Linux, timestamp=1566984448769, lucene.version=9.0.0, java.vm.version=11.0.3+7, java.version=11.0.3, mergeMaxNumSegments=2147483647, os.version=5.0.0-23-generic, java.vendor=AdoptOpenJDK, source=merge, os.arch=amd64, mergeFactor=4}]:[attributes={Lucene50StoredFieldsFormat.mode=BEST_SPEED}]) Uninverting(_h(9.0.0):c1:[diagnostics={java.vm.version=11.0.3+7, java.version=11.0.3, timestamp=1566984448775, java.vendor=AdoptOpenJDK, os=Linux, os.version=5.0.0-23-generic, java.runtime.version=11.0.3+7, os.arch=amd64, source=flush, lucene.version=9.0.0}]:[attributes={Lucene50StoredFieldsFormat.mode=BEST_SPEED}]) Uninverting(_i(9.0.0):c1:[diagnostics={java.vm.version=11.0.3+7, java.version=11.0.3, timestamp=1566984448881, java.vendor=AdoptOpenJDK, os=Linux, os.version=5.0.0-23-generic, java.runtime.version=11.0.3+7, os.arch=amd64, source=flush, lucene.version=9.0.0}]:[attributes={Lucene50StoredFieldsFormat.mode=BEST_SPEED}])))}
   [junit4]   2> 1519377 INFO  (TEST-TestSolrDeletionPolicy1.testCommitAge-seed#[DBD81028BA3ADC8B]) [     ] o.a.s.u.p.LogUpdateProcessorFactory [collection1]  webapp=null path=null params={}{optimize=} 0 2
   [junit4]   2> 1519378 INFO  (TEST-TestSolrDeletionPolicy1.testCommitAge-seed#[DBD81028BA3ADC8B]) [     ] o.a.s.c.S.Request [collection1]  webapp=null path=null params={q=id:[0+TO+6]&qt=&start=0&rows=20&version=2.2} hits=6 status=0 QTime=0
   [junit4]   2> 1519378 INFO  (TEST-TestSolrDeletionPolicy1.testCommitAge-seed#[DBD81028BA3ADC8B]) [     ] o.a.s.SolrTestCaseJ4 ###Ending testCommitAge
   [junit4]   2> 1519379 INFO  (SUITE-TestSolrDeletionPolicy1-seed#[DBD81028BA3ADC8B]-worker) [     ] o.a.s.SolrTestCaseJ4 ###deleteCore
   [junit4]   2> 1519379 INFO  (SUITE-TestSolrDeletionPolicy1-seed#[DBD81028BA3ADC8B]-worker) [     ] o.a.s.c.CoreContainer Shutting down CoreContainer instance=1741811636
   [junit4]   2> 1519379 INFO  (coreCloseExecutor-8352-thread-1) [    x:collection1 ] o.a.s.c.SolrCore [collection1]  CLOSING SolrCore org.apache.solr.core.SolrCore@4765adf8
   [junit4]   2> 1519379 INFO  (coreCloseExecutor-8352-thread-1) [    x:collection1 ] o.a.s.m.SolrMetricManager Closing metric reporters for registry=solr.core.collection1, tag=SolrCore@4765adf8
   [junit4]   2> 1519379 INFO  (coreCloseExecutor-8352-thread-1) [    x:collection1 ] o.a.s.m.r.SolrJmxReporter Closing reporter [org.apache.solr.metrics.reporters.SolrJmxReporter@38845cc0: rootName = null, domain = solr.core.collection1, service url = null, agent id = null] for registry solr.core.collection1 / com.codahale.metrics.MetricRegistry@19a504a8
   [junit4]   2> 1519387 INFO  (SUITE-TestSolrDeletionPolicy1-seed#[DBD81028BA3ADC8B]-worker) [     ] o.a.s.m.SolrMetricManager Closing metric reporters for registry=solr.node, tag=null
   [junit4]   2> 1519387 INFO  (SUITE-TestSolrDeletionPolicy1-seed#[DBD81028BA3ADC8B]-worker) [     ] o.a.s.m.r.SolrJmxReporter Closing reporter [org.apache.solr.metrics.reporters.SolrJmxReporter@1d23d65f: rootName = null, domain = solr.node, service url = null, agent id = null] for registry solr.node / com.codahale.metrics.MetricRegistry@110d52bd
   [junit4]   2> 1519390 INFO  (SUITE-TestSolrDeletionPolicy1-seed#[DBD81028BA3ADC8B]-worker) [     ] o.a.s.m.SolrMetricManager Closing metric reporters for registry=solr.jvm, tag=null
   [junit4]   2> 1519390 INFO  (SUITE-TestSolrDeletionPolicy1-seed#[DBD81028BA3ADC8B]-worker) [     ] o.a.s.m.r.SolrJmxReporter Closing reporter [org.apache.solr.metrics.reporters.SolrJmxReporter@1aed32d6: rootName = null, domain = solr.jvm, service url = null, agent id = null] for registry solr.jvm / com.codahale.metrics.MetricRegistry@6fcaa5fd
   [junit4]   2> 1519392 INFO  (SUITE-TestSolrDeletionPolicy1-seed#[DBD81028BA3ADC8B]-worker) [     ] o.a.s.m.SolrMetricManager Closing metric reporters for registry=solr.jetty, tag=null
   [junit4]   2> 1519392 INFO  (SUITE-TestSolrDeletionPolicy1-seed#[DBD81028BA3ADC8B]-worker) [     ] o.a.s.m.r.SolrJmxReporter Closing reporter [org.apache.solr.metrics.reporters.SolrJmxReporter@21138027: rootName = null, domain = solr.jetty, service url = null, agent id = null] for registry solr.jetty / com.codahale.metrics.MetricRegistry@5946cf76
   [junit4]   2> NOTE: leaving temporary files on disk at: /home/jenkins/workspace/Lucene-Solr-master-Linux/solr/build/solr-core/test/J1/temp/solr.core.TestSolrDeletionPolicy1_DBD81028BA3ADC8B-001
   [junit4]   2> NOTE: test params are: codec=Asserting(Lucene80), sim=Asserting(org.apache.lucene.search.similarities.AssertingSimilarity@11e31227), locale=wae-CH, timezone=Jamaica
   [junit4]   2> NOTE: Linux 5.0.0-23-generic amd64/AdoptOpenJDK 11.0.3 (64-bit)/cpus=8,threads=1,free=406401608,total=518979584
   [junit4]   2> NOTE: All tests run in this JVM: [SystemLogListenerTest, CSVRequestHandlerTest, BlockCacheTest, TestCloudRecovery, GraphQueryTest, TestSolrJ, TestSolr4Spatial2, PeerSyncWithLeaderAndIndexFingerprintCachingTest, TestSortableTextField, ClassificationUpdateProcessorFactoryTest, TestDistribDocBasedVersion, VersionInfoTest, CloneFieldUpdateProcessorFactoryTest, TestSimGenericDistributedQueue, SpellCheckCollatorTest, EnumFieldTest, AuditLoggerPluginTest, TestSolrCloudWithSecureImpersonation, AutoAddReplicasIntegrationTest, ShardSplitTest, ForceLeaderWithTlogReplicasTest, DisMaxRequestHandlerTest, MetricTriggerTest, ZkStateWriterTest, TestCollapseQParserPlugin, TestDeprecatedFilters, ComputePlanActionTest, TestScoreJoinQPNoScore, CoreAdminCreateDiscoverTest, HDFSCollectionsAPITest, PreAnalyzedFieldManagedSchemaCloudTest, CollectionTooManyReplicasTest, TestCollectionAPI, TestPullReplicaErrorHandling, TestCloudConsistency, SortSpecParsingTest, UUIDUpdateProcessorFallbackTest, TestFieldCollectionResource, TestWithCollection, LeaderElectionContextKeyTest, TestLeaderElectionZkExpiry, TestElisionMultitermQuery, TestCollationFieldDocValues, TestIndexingPerformance, TestRandomFaceting, TestConfigSetsAPIZkFailure, CurrencyFieldTypeTest, ReplaceNodeTest, TestSimClusterStateProvider, ParsingFieldUpdateProcessorsTest, MetricsHistoryHandlerTest, TestSimpleQParserPlugin, HdfsDirectoryTest, TestSha256AuthenticationProvider, TestAuthorizationFramework, TestStressLiveNodes, PathHierarchyTokenizerFactoryTest, ReindexCollectionTest, TestHighlightDedupGrouping, BasicFunctionalityTest, TestExceedMaxTermLength, TestLRUCache, DateMathParserTest, TestCloudManagedSchema, SchemaVersionSpecificBehaviorTest, TimeRoutedAliasUpdateProcessorTest, TestSortByMinMaxFunction, TestSolrCloudSnapshots, DeleteShardTest, TestConfigSetImmutable, TestFieldTypeResource, TestPushWriter, HLLSerializationTest, SimplePostToolTest, TestShardHandlerFactory, TestComponentsName, DistributedQueryComponentCustomSortTest, TestTolerantUpdateProcessorRandomCloud, SolrCloudReportersTest, TestDefaultStatsCache, TestChildDocTransformerHierarchy, RollingRestartTest, TestLazyCores, RequestLoggingTest, XmlInterpolationTest, BitVectorTest, MoveReplicaHDFSFailoverTest, HdfsUnloadDistributedZkTest, MultiDestinationAuditLoggerTest, TestFunctionQuery, Tagger2Test, OverseerStatusTest, StatsComponentTest, MergeStrategyTest, SharedFSAutoReplicaFailoverTest, TestCopyFieldCollectionResource, TestPerFieldSimilarityWithDefaultOverride, TestClassicSimilarityFactory, TestRangeQuery, ConcurrentDeleteAndCreateCollectionTest, TestClusterProperties, TestSnapshotCloudManager, TestCursorMarkWithoutUniqueKey, UUIDFieldTest, ShardsWhitelistTest, LeaderFailoverAfterPartitionTest, TestFastOutputStream, SolrMetricReporterTest, PeerSyncTest, WrapperMergePolicyFactoryTest, MetricsHistoryWithAuthIntegrationTest, TestCoreContainer, TestCoreBackup, TestSubQueryTransformerCrossCore, SparseHLLTest, SegmentsInfoRequestHandlerTest, LeaderVoteWaitTimeoutTest, ExitableDirectoryReaderTest, CreateCollectionCleanupTest, ConfigureRecoveryStrategyTest, TestWordDelimiterFilterFactory, RequiredFieldsTest, TestInfoStreamLogging, TestFoldingMultitermQuery, MultiSolrCloudTestCaseTest, XsltUpdateRequestHandlerTest, SolrCoreTest, TestReloadDeadlock, JSONWriterTest, TestCloudPhrasesIdentificationComponent, TestStandardQParsers, TestSimNodeLostTrigger, TestCustomStream, HdfsChaosMonkeyNothingIsSafeTest, MinimalSchemaTest, FacetPivotSmallTest, TestBlendedInfixSuggestions, TestInPlaceUpdatesDistrib, TestWriterPerf, SolrIndexMetricsTest, CdcrRequestHandlerTest, TestSolrDeletionPolicy1]
   [junit4] Completed [486/875 (1!)] on J1 in 0.51s, 3 tests, 1 failure <<< FAILURES!

[...truncated 53381 lines...]
[asciidoctor:convert] asciidoctor: ERROR: about-this-guide.adoc: line 1: invalid part, must have at least one section (e.g., chapter, appendix, etc.)
[asciidoctor:convert] asciidoctor: ERROR: solr-glossary.adoc: line 1: invalid part, must have at least one section (e.g., chapter, appendix, etc.)
     [java] Processed 2594 links (2120 relative) to 3411 anchors in 259 files
     [echo] Validated Links & Anchors via: /home/jenkins/workspace/Lucene-Solr-master-Linux/solr/build/solr-ref-guide/bare-bones-html/

-documentation-lint:
    [jtidy] FIXME: Broken HTML checks were disabled, as jtidy can't handle HTML5.
     [echo] Checking for broken links...
     [exec]
     [exec] Crawl/parse...
     [exec]
     [exec] Verify...
     [echo] Checking for malformed docs...

jar-checksums:

resolve:

ivy-availability-check:
[loadresource] Do not set property disallowed.ivy.jars.list as its length is 0.

-ivy-fail-disallowed-ivy-version:

ivy-fail:

ivy-configure:
[ivy:configure] :: loading settings :: file = /home/jenkins/workspace/Lucene-Solr-master-Linux/lucene/top-level-ivy-settings.xml

resolve:

ivy-availability-check:
[loadresource] Do not set property disallowed.ivy.jars.list as its length is 0.

-ivy-fail-disallowed-ivy-version:

ivy-fail:

ivy-configure:
[ivy:configure] :: loading settings :: file = /home/jenkins/workspace/Lucene-Solr-master-Linux/lucene/top-level-ivy-settings.xml

resolve:

resolve:

ivy-availability-check:
[loadresource] Do not set property disallowed.ivy.jars.list as its length is 0.

-ivy-fail-disallowed-ivy-version:

ivy-fail:

ivy-configure:
[ivy:configure] :: loading settings :: file = /home/jenkins/workspace/Lucene-Solr-master-Linux/lucene/top-level-ivy-settings.xml

resolve:

ivy-availability-check:
[loadresource] Do not set property disallowed.ivy.jars.list as its length is 0.

-ivy-fail-disallowed-ivy-version:

ivy-fail:

ivy-configure:
[ivy:configure] :: loading settings :: file = /home/jenkins/workspace/Lucene-Solr-master-Linux/lucene/top-level-ivy-settings.xml

resolve:

ivy-availability-check:
[loadresource] Do not set property disallowed.ivy.jars.list as its length is 0.

-ivy-fail-disallowed-ivy-version:

ivy-fail:

ivy-configure:
[ivy:configure] :: loading settings :: file = /home/jenkins/workspace/Lucene-Solr-master-Linux/lucene/top-level-ivy-settings.xml

resolve:

ivy-availability-check:
[loadresource] Do not set property disallowed.ivy.jars.list as its length is 0.

-ivy-fail-disallowed-ivy-version:

ivy-fail:

ivy-configure:
[ivy:configure] :: loading settings :: file = /home/jenkins/workspace/Lucene-Solr-master-Linux/lucene/top-level-ivy-settings.xml

resolve:

ivy-availability-check:
[loadresource] Do not set property disallowed.ivy.jars.list as its length is 0.

-ivy-fail-disallowed-ivy-version:

ivy-fail:

ivy-configure:
[ivy:configure] :: loading settings :: file = /home/jenkins/workspace/Lucene-Solr-master-Linux/lucene/top-level-ivy-settings.xml

resolve:

ivy-availability-check:
[loadresource] Do not set property disallowed.ivy.jars.list as its length is 0.

-ivy-fail-disallowed-ivy-version:

ivy-fail:

ivy-configure:
[ivy:configure] :: loading settings :: file = /home/jenkins/workspace/Lucene-Solr-master-Linux/lucene/top-level-ivy-settings.xml

resolve:

ivy-availability-check:
[loadresource] Do not set property disallowed.ivy.jars.list as its length is 0.

-ivy-fail-disallowed-ivy-version:

ivy-fail:

ivy-configure:
[ivy:configure] :: loading settings :: file = /home/jenkins/workspace/Lucene-Solr-master-Linux/lucene/top-level-ivy-settings.xml

resolve:

ivy-availability-check:
[loadresource] Do not set property disallowed.ivy.jars.list as its length is 0.

-ivy-fail-disallowed-ivy-version:

ivy-fail:

ivy-configure:
[ivy:configure] :: loading settings :: file = /home/jenkins/workspace/Lucene-Solr-master-Linux/lucene/top-level-ivy-settings.xml

resolve:

ivy-availability-check:
[loadresource] Do not set property disallowed.ivy.jars.list as its length is 0.

-ivy-fail-disallowed-ivy-version:

ivy-fail:

ivy-configure:
[ivy:configure] :: loading settings :: file = /home/jenkins/workspace/Lucene-Solr-master-Linux/lucene/top-level-ivy-settings.xml

resolve:

ivy-availability-check:
[loadresource] Do not set property disallowed.ivy.jars.list as its length is 0.

-ivy-fail-disallowed-ivy-version:

ivy-fail:

ivy-configure:
[ivy:configure] :: loading settings :: file = /home/jenkins/workspace/Lucene-Solr-master-Linux/lucene/top-level-ivy-settings.xml

resolve:

ivy-availability-check:
[loadresource] Do not set property disallowed.ivy.jars.list as its length is 0.

-ivy-fail-disallowed-ivy-version:

ivy-fail:

ivy-configure:
[ivy:configure] :: loading settings :: file = /home/jenkins/workspace/Lucene-Solr-master-Linux/lucene/top-level-ivy-settings.xml

resolve:

ivy-availability-check:
[loadresource] Do not set property disallowed.ivy.jars.list as its length is 0.

-ivy-fail-disallowed-ivy-version:

ivy-fail:

ivy-configure:
[ivy:configure] :: loading settings :: file = /home/jenkins/workspace/Lucene-Solr-master-Linux/lucene/top-level-ivy-settings.xml

resolve:

ivy-availability-check:
[loadresource] Do not set property disallowed.ivy.jars.list as its length is 0.

-ivy-fail-disallowed-ivy-version:

ivy-fail:

ivy-configure:
[ivy:configure] :: loading settings :: file = /home/jenkins/workspace/Lucene-Solr-master-Linux/lucene/top-level-ivy-settings.xml

resolve:

ivy-availability-check:
[loadresource] Do not set property disallowed.ivy.jars.list as its length is 0.

-ivy-fail-disallowed-ivy-version:

ivy-fail:

ivy-configure:
[ivy:configure] :: loading settings :: file = /home/jenkins/workspace/Lucene-Solr-master-Linux/lucene/top-level-ivy-settings.xml

resolve:

ivy-availability-check:
[loadresource] Do not set property disallowed.ivy.jars.list as its length is 0.

-ivy-fail-disallowed-ivy-version:

ivy-fail:

ivy-configure:
[ivy:configure] :: loading settings :: file = /home/jenkins/workspace/Lucene-Solr-master-Linux/lucene/top-level-ivy-settings.xml

resolve:

ivy-availability-check:
[loadresource] Do not set property disallowed.ivy.jars.list as its length is 0.

-ivy-fail-disallowed-ivy-version:

ivy-fail:

ivy-configure:
[ivy:configure] :: loading settings :: file = /home/jenkins/workspace/Lucene-Solr-master-Linux/lucene/top-level-ivy-settings.xml

resolve:

ivy-availability-check:
[loadresource] Do not set property disallowed.ivy.jars.list as its length is 0.

-ivy-fail-disallowed-ivy-version:

ivy-fail:

ivy-configure:
[ivy:configure] :: loading settings :: file = /home/jenkins/workspace/Lucene-Solr-master-Linux/lucene/top-level-ivy-settings.xml

resolve:

ivy-availability-check:
[loadresource] Do not set property disallowed.ivy.jars.list as its length is 0.

-ivy-fail-disallowed-ivy-version:

ivy-fail:

ivy-configure:
[ivy:configure] :: loading settings :: file = /home/jenkins/workspace/Lucene-Solr-master-Linux/lucene/top-level-ivy-settings.xml

resolve:

ivy-availability-check:
[loadresource] Do not set property disallowed.ivy.jars.list as its length is 0.

-ivy-fail-disallowed-ivy-version:

ivy-fail:

ivy-configure:
[ivy:configure] :: loading settings :: file = /home/jenkins/workspace/Lucene-Solr-master-Linux/lucene/top-level-ivy-settings.xml

resolve:

ivy-availability-check:
[loadresource] Do not set property disallowed.ivy.jars.list as its length is 0.

-ivy-fail-disallowed-ivy-version:

ivy-fail:

ivy-configure:
[ivy:configure] :: loading settings :: file = /home/jenkins/workspace/Lucene-Solr-master-Linux/lucene/top-level-ivy-settings.xml

resolve:

ivy-availability-check:
[loadresource] Do not set property disallowed.ivy.jars.list as its length is 0.

-ivy-fail-disallowed-ivy-version:

ivy-fail:

ivy-configure:
[ivy:configure] :: loading settings :: file = /home/jenkins/workspace/Lucene-Solr-master-Linux/lucene/top-level-ivy-settings.xml

resolve:

ivy-availability-check:
[loadresource] Do not set property disallowed.ivy.jars.list as its length is 0.

-ivy-fail-disallowed-ivy-version:

ivy-fail:

ivy-configure:
[ivy:configure] :: loading settings :: file = /home/jenkins/workspace/Lucene-Solr-master-Linux/lucene/top-level-ivy-settings.xml

resolve:

ivy-availability-check:
[loadresource] Do not set property disallowed.ivy.jars.list as its length is 0.

-ivy-fail-disallowed-ivy-version:

ivy-fail:

ivy-configure:
[ivy:configure] :: loading settings :: file = /home/jenkins/workspace/Lucene-Solr-master-Linux/lucene/top-level-ivy-settings.xml

resolve:

ivy-availability-check:
[loadresource] Do not set property disallowed.ivy.jars.list as its length is 0.

-ivy-fail-disallowed-ivy-version:

ivy-fail:

ivy-configure:
[ivy:configure] :: loading settings :: file = /home/jenkins/workspace/Lucene-Solr-master-Linux/lucene/top-level-ivy-settings.xml

resolve:

ivy-availability-check:
[loadresource] Do not set property disallowed.ivy.jars.list as its length is 0.

-ivy-fail-disallowed-ivy-version:

ivy-fail:

ivy-configure:
[ivy:configure] :: loading settings :: file = /home/jenkins/workspace/Lucene-Solr-master-Linux/lucene/top-level-ivy-settings.xml

resolve:

ivy-availability-check:
[loadresource] Do not set property disallowed.ivy.jars.list as its length is 0.

-ivy-fail-disallowed-ivy-version:

ivy-fail:

ivy-configure:
[ivy:configure] :: loading settings :: file = /home/jenkins/workspace/Lucene-Solr-master-Linux/lucene/top-level-ivy-settings.xml

common.resolve:

resolve:

ivy-availability-check:
[loadresource] Do not set property disallowed.ivy.jars.list as its length is 0.

-ivy-fail-disallowed-ivy-version:

ivy-fail:

ivy-configure:
[ivy:configure] :: loading settings :: file = /home/jenkins/workspace/Lucene-Solr-master-Linux/lucene/top-level-ivy-settings.xml

resolve:

ivy-availability-check:
[loadresource] Do not set property disallowed.ivy.jars.list as its length is 0.

-ivy-fail-disallowed-ivy-version:

ivy-fail:

ivy-configure:
[ivy:configure] :: loading settings :: file = /home/jenkins/workspace/Lucene-Solr-master-Linux/lucene/top-level-ivy-settings.xml

resolve:

ivy-availability-check:
[loadresource] Do not set property disallowed.ivy.jars.list as its length is 0.

-ivy-fail-disallowed-ivy-version:

ivy-fail:

ivy-configure:
[ivy:configure] :: loading settings :: file = /home/jenkins/workspace/Lucene-Solr-master-Linux/lucene/top-level-ivy-settings.xml

resolve:

ivy-availability-check:
[loadresource] Do not set property disallowed.ivy.jars.list as its length is 0.

-ivy-fail-disallowed-ivy-version:

ivy-fail:

ivy-configure:
[ivy:configure] :: loading settings :: file = /home/jenkins/workspace/Lucene-Solr-master-Linux/lucene/top-level-ivy-settings.xml

resolve:

ivy-availability-check:
[loadresource] Do not set property disallowed.ivy.jars.list as its length is 0.

-ivy-fail-disallowed-ivy-version:

ivy-fail:

ivy-configure:
[ivy:configure] :: loading settings :: file = /home/jenkins/workspace/Lucene-Solr-master-Linux/lucene/top-level-ivy-settings.xml

resolve:

jar-checksums:
    [mkdir] Created dir: /home/jenkins/workspace/Lucene-Solr-master-Linux/lucene/null1409052240
     [copy] Copying 38 files to /home/jenkins/workspace/Lucene-Solr-master-Linux/lucene/null1409052240
   [delete] Deleting directory /home/jenkins/workspace/Lucene-Solr-master-Linux/lucene/null1409052240

resolve-example:

ivy-availability-check:
[loadresource] Do not set property disallowed.ivy.jars.list as its length is 0.

-ivy-fail-disallowed-ivy-version:

ivy-fail:

ivy-configure:
[ivy:configure] :: loading settings :: file = /home/jenkins/workspace/Lucene-Solr-master-Linux/lucene/top-level-ivy-settings.xml

resolve:

resolve-server:

ivy-availability-check:
[loadresource] Do not set property disallowed.ivy.jars.list as its length is 0.

-ivy-fail-disallowed-ivy-version:

ivy-fail:

ivy-fail:

ivy-configure:
[ivy:configure] :: loading settings :: file = /home/jenkins/workspace/Lucene-Solr-master-Linux/lucene/top-level-ivy-settings.xml

resolve:

resolve:

ivy-availability-check:
[loadresource] Do not set property disallowed.ivy.jars.list as its length is 0.

-ivy-fail-disallowed-ivy-version:

ivy-fail:

ivy-fail:

ivy-configure:
[ivy:configure] :: loading settings :: file = /home/jenkins/workspace/Lucene-Solr-master-Linux/lucene/top-level-ivy-settings.xml

resolve:

ivy-availability-check:
[loadresource] Do not set property disallowed.ivy.jars.list as its length is 0.

-ivy-fail-disallowed-ivy-version:

ivy-fail:

ivy-fail:

ivy-configure:
[ivy:configure] :: loading settings :: file = /home/jenkins/workspace/Lucene-Solr-master-Linux/lucene/top-level-ivy-settings.xml

resolve:

ivy-availability-check:
[loadresource] Do not set property disallowed.ivy.jars.list as its length is 0.

-ivy-fail-disallowed-ivy-version:

ivy-fail:

ivy-configure:
[ivy:configure] :: loading settings :: file = /home/jenkins/workspace/Lucene-Solr-master-Linux/lucene/top-level-ivy-settings.xml

resolve:

ivy-availability-check:
[loadresource] Do not set property disallowed.ivy.jars.list as its length is 0.

-ivy-fail-disallowed-ivy-version:

ivy-fail:

ivy-fail:

ivy-configure:
[ivy:configure] :: loading settings :: file = /home/jenkins/workspace/Lucene-Solr-master-Linux/lucene/top-level-ivy-settings.xml

resolve:

ivy-availability-check:
[loadresource] Do not set property disallowed.ivy.jars.list as its length is 0.

-ivy-fail-disallowed-ivy-version:

ivy-fail:

ivy-configure:
[ivy:configure] :: loading settings :: file = /home/jenkins/workspace/Lucene-Solr-master-Linux/lucene/top-level-ivy-settings.xml

resolve:

ivy-availability-check:
[loadresource] Do not set property disallowed.ivy.jars.list as its length is 0.

-ivy-fail-disallowed-ivy-version:

ivy-fail:

ivy-fail:

ivy-configure:
[ivy:configure] :: loading settings :: file = /home/jenkins/workspace/Lucene-Solr-master-Linux/lucene/top-level-ivy-settings.xml

resolve:

ivy-availability-check:
[loadresource] Do not set property disallowed.ivy.jars.list as its length is 0.

-ivy-fail-disallowed-ivy-version:

ivy-fail:

ivy-fail:

ivy-configure:
[ivy:configure] :: loading settings :: file = /home/jenkins/workspace/Lucene-Solr-master-Linux/lucene/top-level-ivy-settings.xml

resolve:

ivy-availability-check:
[loadresource] Do not set property disallowed.ivy.jars.list as its length is 0.

-ivy-fail-disallowed-ivy-version:

ivy-fail:

ivy-fail:

ivy-configure:
[ivy:configure] :: loading settings :: file = /home/jenkins/workspace/Lucene-Solr-master-Linux/lucene/top-level-ivy-settings.xml

resolve:

ivy-availability-check:
[loadresource] Do not set property disallowed.ivy.jars.list as its length is 0.

-ivy-fail-disallowed-ivy-version:

ivy-fail:

ivy-fail:

ivy-configure:
[ivy:configure] :: loading settings :: file = /home/jenkins/workspace/Lucene-Solr-master-Linux/lucene/top-level-ivy-settings.xml

resolve:

ivy-availability-check:
[loadresource] Do not set property disallowed.ivy.jars.list as its length is 0.

-ivy-fail-disallowed-ivy-version:

ivy-fail:

ivy-fail:

ivy-configure:
[ivy:configure] :: loading settings :: file = /home/jenkins/workspace/Lucene-Solr-master-Linux/lucene/top-level-ivy-settings.xml

resolve:

ivy-availability-check:
[loadresource] Do not set property disallowed.ivy.jars.list as its length is 0.

-ivy-fail-disallowed-ivy-version:

ivy-fail:

ivy-fail:

ivy-configure:
[ivy:configure] :: loading settings :: file = /home/jenkins/workspace/Lucene-Solr-master-Linux/lucene/top-level-ivy-settings.xml

resolve:

ivy-availability-check:
[loadresource] Do not set property disallowed.ivy.jars.list as its length is 0.

-ivy-fail-disallowed-ivy-version:

ivy-fail:

ivy-fail:

ivy-configure:
[ivy:configure] :: loading settings :: file = /home/jenkins/workspace/Lucene-Solr-master-Linux/lucene/top-level-ivy-settings.xml

resolve:

ivy-availability-check:
[loadresource] Do not set property disallowed.ivy.jars.list as its length is 0.

-ivy-fail-disallowed-ivy-version:

ivy-fail:

ivy-fail:

ivy-configure:
[ivy:configure] :: loading settings :: file = /home/jenkins/workspace/Lucene-Solr-master-Linux/lucene/top-level-ivy-settings.xml

resolve:

ivy-availability-check:
[loadresource] Do not set property disallowed.ivy.jars.list as its length is 0.

-ivy-fail-disallowed-ivy-version:

ivy-fail:

ivy-fail:

ivy-configure:
[ivy:configure] :: loading settings :: file = /home/jenkins/workspace/Lucene-Solr-master-Linux/lucene/top-level-ivy-settings.xml

resolve:

ivy-availability-check:
[loadresource] Do not set property disallowed.ivy.jars.list as its length is 0.

-ivy-fail-disallowed-ivy-version:

ivy-fail:

ivy-fail:

ivy-configure:
[ivy:configure] :: loading settings :: file = /home/jenkins/workspace/Lucene-Solr-master-Linux/lucene/top-level-ivy-settings.xml

resolve:

ivy-availability-check:
[loadresource] Do not set property disallowed.ivy.jars.list as its length is 0.

-ivy-fail-disallowed-ivy-version:

ivy-fail:

ivy-fail:

ivy-configure:
[ivy:configure] :: loading settings :: file = /home/jenkins/workspace/Lucene-Solr-master-Linux/lucene/top-level-ivy-settings.xml

resolve:

jar-checksums:
    [mkdir] Created dir: /home/jenkins/workspace/Lucene-Solr-master-Linux/solr/null381858761
     [copy] Copying 249 files to /home/jenkins/workspace/Lucene-Solr-master-Linux/solr/null381858761
   [delete] Deleting directory /home/jenkins/workspace/Lucene-Solr-master-Linux/solr/null381858761

check-working-copy:
[ivy:cachepath] :: resolving dependencies :: #;[hidden email]
[ivy:cachepath] confs: [default]
[ivy:cachepath] found org.eclipse.jgit#org.eclipse.jgit;5.3.0.201903130848-r in public
[ivy:cachepath] found com.jcraft#jsch;0.1.54 in public
[ivy:cachepath] found com.jcraft#jzlib;1.1.1 in public
[ivy:cachepath] found com.googlecode.javaewah#JavaEWAH;1.1.6 in public
[ivy:cachepath] found org.slf4j#slf4j-api;1.7.2 in public
[ivy:cachepath] found org.bouncycastle#bcpg-jdk15on;1.60 in public
[ivy:cachepath] found org.bouncycastle#bcprov-jdk15on;1.60 in public
[ivy:cachepath] found org.bouncycastle#bcpkix-jdk15on;1.60 in public
[ivy:cachepath] found org.slf4j#slf4j-nop;1.7.2 in public
[ivy:cachepath] :: resolution report :: resolve 48ms :: artifacts dl 1ms
        ---------------------------------------------------------------------
        |                  |            modules            ||   artifacts   |
        |       conf       | number| search|dwnlded|evicted|| number|dwnlded|
        ---------------------------------------------------------------------
        |      default     |   9   |   0   |   0   |   0   ||   9   |   0   |
        ---------------------------------------------------------------------
[wc-checker] Initializing working copy...
[wc-checker] Checking working copy status...

-jenkins-base:

BUILD SUCCESSFUL
Total time: 87 minutes 0 seconds
Setting ANT_1_8_2_HOME=/home/jenkins/tools/hudson.tasks.Ant_AntInstallation/ANT_1.8.2
[Lucene-Solr-master-Linux] $ /bin/sh -xe /tmp/jenkins7171186613507724144.sh
+ mv lucene/build lucene/build.orig
+ mv solr/build solr/build.orig
+ export ANT_HOME=/home/jenkins/tools/hudson.tasks.Ant_AntInstallation/ANT_1.8.2
+ export PATH=/home/jenkins/tools/hudson.tasks.Ant_AntInstallation/ANT_1.8.2/bin:/home/jenkins/tools/java/64bit/jdk-11.0.3/bin:/usr/local/sbin:/usr/local/bin:/usr/sbin:/usr/bin:/sbin:/bin:/usr/games:/usr/local/games
+ python3 -u dev-tools/scripts/reproduceJenkinsFailures.py --no-git https://jenkins.thetaphi.de/job/Lucene-Solr-master-Linux/24623/consoleText
[repro] Jenkins log URL: https://jenkins.thetaphi.de/job/Lucene-Solr-master-Linux/24623/consoleText

[repro] Revision: 54bd950819673800344a9dd532f6c330f5522b6b

[repro] Ant options: "-Dargs=-XX:+UseCompressedOops -XX:+UseSerialGC"
[repro] Repro line:  ant test  -Dtestcase=TestSolrDeletionPolicy1 -Dtests.method=testNumCommitsConfigured -Dtests.seed=DBD81028BA3ADC8B -Dtests.multiplier=3 -Dtests.slow=true -Dtests.locale=wae-CH -Dtests.timezone=Jamaica -Dtests.asserts=true -Dtests.file.encoding=UTF-8

[repro] ant clean
Buildfile: /home/jenkins/workspace/Lucene-Solr-master-Linux/build.xml

clean:

clean:

clean:

BUILD SUCCESSFUL
Total time: 0 seconds
[repro] Test suites by module:
[repro]    solr/core
[repro]       TestSolrDeletionPolicy1
[repro] ant compile-test
Buildfile: /home/jenkins/workspace/Lucene-Solr-master-Linux/solr/core/build.xml

check-analyzers-icu-uptodate:

jar-analyzers-icu:

check-analyzers-common-uptodate:

jar-analyzers-common:

-check-git-state:

-git-cleanroot:

-copy-git-state:
    [mkdir] Created dir: /home/jenkins/workspace/Lucene-Solr-master-Linux/lucene/build
     [copy] Copying 1 file to /home/jenkins/workspace/Lucene-Solr-master-Linux/lucene/build

git-autoclean:

ivy-availability-check:
[loadresource] Do not set property disallowed.ivy.jars.list as its length is 0.

-ivy-fail-disallowed-ivy-version:

ivy-fail:

ivy-configure:
[ivy:configure] :: Apache Ivy 2.4.0 - 20141213170938 :: http://ant.apache.org/ivy/ ::
[ivy:configure] :: loading settings :: file = /home/jenkins/workspace/Lucene-Solr-master-Linux/lucene/top-level-ivy-settings.xml

resolve:

common.init:

compile-lucene-core:

-check-git-state:

-git-cleanroot:

-copy-git-state:

git-autoclean:

ivy-availability-check:
[loadresource] Do not set property disallowed.ivy.jars.list as its length is 0.

-ivy-fail-disallowed-ivy-version:

ivy-fail:

ivy-configure:
[ivy:configure] :: loading settings :: file = /home/jenkins/workspace/Lucene-Solr-master-Linux/lucene/top-level-ivy-settings.xml

resolve:

init:

-clover.disable:

-clover.load:

-clover.classpath:

-clover.setup:

clover:

compile-core:
    [mkdir] Created dir: /home/jenkins/workspace/Lucene-Solr-master-Linux/lucene/build/core/classes/java
    [javac] Compiling 876 source files to /home/jenkins/workspace/Lucene-Solr-master-Linux/lucene/build/core/classes/java
    [javac] Note: /home/jenkins/workspace/Lucene-Solr-master-Linux/lucene/core/src/java/org/apache/lucene/util/fst/PositiveIntOutputs.java uses or overrides a deprecated API.
    [javac] Note: Recompile with -Xlint:deprecation for details.
    [javac] Creating empty /home/jenkins/workspace/Lucene-Solr-master-Linux/lucene/build/core/classes/java/org/apache/lucene/util/graph/package-info.class
    [javac] Creating empty /home/jenkins/workspace/Lucene-Solr-master-Linux/lucene/build/core/classes/java/org/apache/lucene/document/package-info.class
    [javac] Creating empty /home/jenkins/workspace/Lucene-Solr-master-Linux/lucene/build/core/classes/java/org/apache/lucene/package-info.class
    [javac] Creating empty /home/jenkins/workspace/Lucene-Solr-master-Linux/lucene/build/core/classes/java/org/apache/lucene/util/bkd/package-info.class
    [javac] Creating empty /home/jenkins/workspace/Lucene-Solr-master-Linux/lucene/build/core/classes/java/org/apache/lucene/codecs/compressing/package-info.class
    [javac] Creating empty /home/jenkins/workspace/Lucene-Solr-master-Linux/lucene/build/core/classes/java/org/apache/lucene/codecs/lucene60/package-info.class
    [javac] Creating empty /home/jenkins/workspace/Lucene-Solr-master-Linux/lucene/build/core/classes/java/org/apache/lucene/codecs/package-info.class
    [javac] Creating empty /home/jenkins/workspace/Lucene-Solr-master-Linux/lucene/build/core/classes/java/org/apache/lucene/codecs/lucene80/package-info.class
    [javac] Creating empty /home/jenkins/workspace/Lucene-Solr-master-Linux/lucene/build/core/classes/java/org/apache/lucene/util/package-info.class
    [javac] Creating empty /home/jenkins/workspace/Lucene-Solr-master-Linux/lucene/build/core/classes/java/org/apache/lucene/index/package-info.class
    [javac] Creating empty /home/jenkins/workspace/Lucene-Solr-master-Linux/lucene/build/core/classes/java/org/apache/lucene/util/fst/package-info.class
    [javac] Creating empty /home/jenkins/workspace/Lucene-Solr-master-Linux/lucene/build/core/classes/java/org/apache/lucene/analysis/tokenattributes/package-info.class
    [javac] Creating empty /home/jenkins/workspace/Lucene-Solr-master-Linux/lucene/build/core/classes/java/org/apache/lucene/search/package-info.class
    [javac] Creating empty /home/jenkins/workspace/Lucene-Solr-master-Linux/lucene/build/core/classes/java/org/apache/lucene/util/packed/package-info.class
    [javac] Creating empty /home/jenkins/workspace/Lucene-Solr-master-Linux/lucene/build/core/classes/java/org/apache/lucene/util/mutable/package-info.class
    [javac] Creating empty /home/jenkins/workspace/Lucene-Solr-master-Linux/lucene/build/core/classes/java/org/apache/lucene/codecs/lucene70/package-info.class
    [javac] Creating empty /home/jenkins/workspace/Lucene-Solr-master-Linux/lucene/build/core/classes/java/org/apache/luce

[...truncated too long message...]

(_g(9.0.0):C4:[diagnostics={os=Linux, timestamp=1566986360215, lucene.version=9.0.0, java.vm.version=11.0.3+7, java.version=11.0.3, mergeMaxNumSegments=2147483647, os.version=5.0.0-23-generic, java.vendor=AdoptOpenJDK, source=merge, os.arch=amd64, mergeFactor=4, java.runtime.version=11.0.3+7}]:[attributes={Lucene50StoredFieldsFormat.mode=BEST_SPEED}]) Uninverting(_h(9.0.0):c1:[diagnostics={java.vm.version=11.0.3+7, java.version=11.0.3, timestamp=1566986360239, java.vendor=AdoptOpenJDK, os=Linux, os.version=5.0.0-23-generic, java.runtime.version=11.0.3+7, os.arch=amd64, source=flush, lucene.version=9.0.0}]:[attributes={Lucene50StoredFieldsFormat.mode=BEST_SPEED}])))}
   [junit4]   2> 9598 INFO  (TEST-TestSolrDeletionPolicy1.testCommitAge-seed#[DBD81028BA3ADC8B]) [     ] o.a.s.u.DirectUpdateHandler2 end_commit_flush
   [junit4]   2> 9598 INFO  (TEST-TestSolrDeletionPolicy1.testCommitAge-seed#[DBD81028BA3ADC8B]) [     ] o.a.s.u.p.LogUpdateProcessorFactory [collection1]  webapp=null path=null params={}{optimize=} 0 9
   [junit4]   2> 9600 INFO  (TEST-TestSolrDeletionPolicy1.testCommitAge-seed#[DBD81028BA3ADC8B]) [     ] o.a.s.c.S.Request [collection1]  webapp=null path=null params={q=id:[0+TO+5]&qt=&start=0&rows=20&version=2.2} hits=5 status=0 QTime=1
   [junit4]   2> 9703 INFO  (TEST-TestSolrDeletionPolicy1.testCommitAge-seed#[DBD81028BA3ADC8B]) [     ] o.a.s.u.p.LogUpdateProcessorFactory [collection1]  webapp=null path=null params={}{add=[6]} 0 1
   [junit4]   2> 9704 INFO  (TEST-TestSolrDeletionPolicy1.testCommitAge-seed#[DBD81028BA3ADC8B]) [     ] o.a.s.u.DirectUpdateHandler2 start commit{,optimize=true,openSearcher=true,waitSearcher=true,expungeDeletes=false,softCommit=false,prepareCommit=false}
   [junit4]   2> 9707 INFO  (TEST-TestSolrDeletionPolicy1.testCommitAge-seed#[DBD81028BA3ADC8B]) [     ] o.a.s.u.SolrIndexWriter Calling setCommitData with IW:org.apache.solr.update.SolrIndexWriter@62a7468 commitCommandVersion:0
   [junit4]   2> 9710 INFO  (TEST-TestSolrDeletionPolicy1.testCommitAge-seed#[DBD81028BA3ADC8B]) [     ] o.a.s.s.SolrIndexSearcher Opening [Searcher@378d8c68[collection1] main]
   [junit4]   2> 9710 INFO  (TEST-TestSolrDeletionPolicy1.testCommitAge-seed#[DBD81028BA3ADC8B]) [     ] o.a.s.u.DirectUpdateHandler2 end_commit_flush
   [junit4]   2> 9712 INFO  (searcherExecutor-25-thread-1) [     ] o.a.s.c.SolrCore [collection1] Registered new searcher Searcher@378d8c68[collection1] main{ExitableDirectoryReader(UninvertingDirectoryReader(Uninverting(_g(9.0.0):C4:[diagnostics={os=Linux, timestamp=1566986360215, lucene.version=9.0.0, java.vm.version=11.0.3+7, java.version=11.0.3, mergeMaxNumSegments=2147483647, os.version=5.0.0-23-generic, java.vendor=AdoptOpenJDK, source=merge, os.arch=amd64, mergeFactor=4, java.runtime.version=11.0.3+7}]:[attributes={Lucene50StoredFieldsFormat.mode=BEST_SPEED}]) Uninverting(_h(9.0.0):c1:[diagnostics={java.vm.version=11.0.3+7, java.version=11.0.3, timestamp=1566986360239, java.vendor=AdoptOpenJDK, os=Linux, os.version=5.0.0-23-generic, java.runtime.version=11.0.3+7, os.arch=amd64, source=flush, lucene.version=9.0.0}]:[attributes={Lucene50StoredFieldsFormat.mode=BEST_SPEED}]) Uninverting(_i(9.0.0):c1:[diagnostics={java.vm.version=11.0.3+7, java.version=11.0.3, timestamp=1566986360354, java.vendor=AdoptOpenJDK, os=Linux, os.version=5.0.0-23-generic, java.runtime.version=11.0.3+7, os.arch=amd64, source=flush, lucene.version=9.0.0}]:[attributes={Lucene50StoredFieldsFormat.mode=BEST_SPEED}])))}
   [junit4]   2> 9712 INFO  (TEST-TestSolrDeletionPolicy1.testCommitAge-seed#[DBD81028BA3ADC8B]) [     ] o.a.s.u.p.LogUpdateProcessorFactory [collection1]  webapp=null path=null params={}{optimize=} 0 8
   [junit4]   2> 9713 INFO  (TEST-TestSolrDeletionPolicy1.testCommitAge-seed#[DBD81028BA3ADC8B]) [     ] o.a.s.c.S.Request [collection1]  webapp=null path=null params={q=id:[0+TO+6]&qt=&start=0&rows=20&version=2.2} hits=6 status=0 QTime=1
   [junit4]   2> 9715 INFO  (TEST-TestSolrDeletionPolicy1.testCommitAge-seed#[DBD81028BA3ADC8B]) [     ] o.a.s.SolrTestCaseJ4 ###Ending testCommitAge
   [junit4] OK      0.19s J2 | TestSolrDeletionPolicy1.testCommitAge
   [junit4]   2> 9715 INFO  (SUITE-TestSolrDeletionPolicy1-seed#[DBD81028BA3ADC8B]-worker) [     ] o.a.s.SolrTestCaseJ4 ###deleteCore
   [junit4]   2> 9715 INFO  (SUITE-TestSolrDeletionPolicy1-seed#[DBD81028BA3ADC8B]-worker) [     ] o.a.s.c.CoreContainer Shutting down CoreContainer instance=821654146
   [junit4]   2> 9716 INFO  (coreCloseExecutor-29-thread-1) [    x:collection1 ] o.a.s.c.SolrCore [collection1]  CLOSING SolrCore org.apache.solr.core.SolrCore@4488c62
   [junit4]   2> 9716 INFO  (coreCloseExecutor-29-thread-1) [    x:collection1 ] o.a.s.m.SolrMetricManager Closing metric reporters for registry=solr.core.collection1, tag=SolrCore@4488c62
   [junit4]   2> 9716 INFO  (coreCloseExecutor-29-thread-1) [    x:collection1 ] o.a.s.m.r.SolrJmxReporter Closing reporter [org.apache.solr.metrics.reporters.SolrJmxReporter@7c7fb76a: rootName = null, domain = solr.core.collection1, service url = null, agent id = null] for registry solr.core.collection1 / com.codahale.metrics.MetricRegistry@4e3b3038
   [junit4]   2> 9733 INFO  (SUITE-TestSolrDeletionPolicy1-seed#[DBD81028BA3ADC8B]-worker) [     ] o.a.s.m.SolrMetricManager Closing metric reporters for registry=solr.node, tag=null
   [junit4]   2> 9733 INFO  (SUITE-TestSolrDeletionPolicy1-seed#[DBD81028BA3ADC8B]-worker) [     ] o.a.s.m.r.SolrJmxReporter Closing reporter [org.apache.solr.metrics.reporters.SolrJmxReporter@7a41d109: rootName = null, domain = solr.node, service url = null, agent id = null] for registry solr.node / com.codahale.metrics.MetricRegistry@1e3f14ab
   [junit4]   2> 9739 INFO  (SUITE-TestSolrDeletionPolicy1-seed#[DBD81028BA3ADC8B]-worker) [     ] o.a.s.m.SolrMetricManager Closing metric reporters for registry=solr.jvm, tag=null
   [junit4]   2> 9739 INFO  (SUITE-TestSolrDeletionPolicy1-seed#[DBD81028BA3ADC8B]-worker) [     ] o.a.s.m.r.SolrJmxReporter Closing reporter [org.apache.solr.metrics.reporters.SolrJmxReporter@1847569b: rootName = null, domain = solr.jvm, service url = null, agent id = null] for registry solr.jvm / com.codahale.metrics.MetricRegistry@ee78aec
   [junit4]   2> 9739 INFO  (SUITE-TestSolrDeletionPolicy1-seed#[DBD81028BA3ADC8B]-worker) [     ] o.a.s.m.SolrMetricManager Closing metric reporters for registry=solr.jetty, tag=null
   [junit4]   2> 9739 INFO  (SUITE-TestSolrDeletionPolicy1-seed#[DBD81028BA3ADC8B]-worker) [     ] o.a.s.m.r.SolrJmxReporter Closing reporter [org.apache.solr.metrics.reporters.SolrJmxReporter@68499879: rootName = null, domain = solr.jetty, service url = null, agent id = null] for registry solr.jetty / com.codahale.metrics.MetricRegistry@1a8bed89
   [junit4]   2> NOTE: leaving temporary files on disk at: /home/jenkins/workspace/Lucene-Solr-master-Linux/solr/build/solr-core/test/J2/temp/solr.core.TestSolrDeletionPolicy1_DBD81028BA3ADC8B-001
   [junit4]   2> NOTE: test params are: codec=Asserting(Lucene80), sim=Asserting(org.apache.lucene.search.similarities.AssertingSimilarity@722bd5bd), locale=wae-CH, timezone=Jamaica
   [junit4]   2> NOTE: Linux 5.0.0-23-generic amd64/AdoptOpenJDK 11.0.3 (64-bit)/cpus=8,threads=1,free=421837472,total=518979584
   [junit4]   2> NOTE: All tests run in this JVM: [TestSolrDeletionPolicy1, TestSolrDeletionPolicy1]
   [junit4] Completed [5/5 (1!)] on J2 in 1.52s, 3 tests, 1 failure <<< FAILURES!
   [junit4]
   [junit4]
   [junit4] Tests with failures [seed: DBD81028BA3ADC8B]:
   [junit4]   - org.apache.solr.core.TestSolrDeletionPolicy1.testNumCommitsConfigured
   [junit4]
   [junit4]
   [junit4] JVM J0:     0.75 ..    10.44 =     9.70s
   [junit4] JVM J1:     0.78 ..     9.07 =     8.29s
   [junit4] JVM J2:     0.75 ..    10.64 =     9.89s
   [junit4] Execution time total: 10 seconds
   [junit4] Tests summary: 5 suites, 15 tests, 1 failure

BUILD FAILED
/home/jenkins/workspace/Lucene-Solr-master-Linux/lucene/common-build.xml:1492: The following error occurred while executing this line:
/home/jenkins/workspace/Lucene-Solr-master-Linux/lucene/common-build.xml:1019: There were test failures: 5 suites, 15 tests, 1 failure [seed: DBD81028BA3ADC8B]

Total time: 12 seconds

[repro] Setting last failure code to 256

[repro] Failures:
[repro]   1/5 failed: org.apache.solr.core.TestSolrDeletionPolicy1
[repro] Exiting with code 256
+ mv lucene/build lucene/build.repro
+ mv solr/build solr/build.repro
+ mv lucene/build.orig lucene/build
+ mv solr/build.orig solr/build
Archiving artifacts
Setting ANT_1_8_2_HOME=/home/jenkins/tools/hudson.tasks.Ant_AntInstallation/ANT_1.8.2
[WARNINGS] Parsing warnings in console log with parser Java Compiler (javac)
Setting ANT_1_8_2_HOME=/home/jenkins/tools/hudson.tasks.Ant_AntInstallation/ANT_1.8.2
No credentials specified
Setting ANT_1_8_2_HOME=/home/jenkins/tools/hudson.tasks.Ant_AntInstallation/ANT_1.8.2
<Git Blamer> Using GitBlamer to create author and commit information for all warnings.
<Git Blamer> GIT_COMMIT=54bd950819673800344a9dd532f6c330f5522b6b, workspace=/home/jenkins/workspace/Lucene-Solr-master-Linux
[WARNINGS] Computing warning deltas based on reference build #24622
Recording test results
Setting ANT_1_8_2_HOME=/home/jenkins/tools/hudson.tasks.Ant_AntInstallation/ANT_1.8.2
Build step 'Publish JUnit test result report' changed build result to UNSTABLE
Email was triggered for: Unstable (Test Failures)
Sending email for trigger: Unstable (Test Failures)
Setting ANT_1_8_2_HOME=/home/jenkins/tools/hudson.tasks.Ant_AntInstallation/ANT_1.8.2
Setting ANT_1_8_2_HOME=/home/jenkins/tools/hudson.tasks.Ant_AntInstallation/ANT_1.8.2
Setting ANT_1_8_2_HOME=/home/jenkins/tools/hudson.tasks.Ant_AntInstallation/ANT_1.8.2
Setting ANT_1_8_2_HOME=/home/jenkins/tools/hudson.tasks.Ant_AntInstallation/ANT_1.8.2
Setting ANT_1_8_2_HOME=/home/jenkins/tools/hudson.tasks.Ant_AntInstallation/ANT_1.8.2
Setting ANT_1_8_2_HOME=/home/jenkins/tools/hudson.tasks.Ant_AntInstallation/ANT_1.8.2


---------------------------------------------------------------------
To unsubscribe, e-mail: [hidden email]
For additional commands, e-mail: [hidden email]