[JENKINS] Lucene-Solr-master-Windows (64bit/jdk-13-rc) - Build # 8103 - Unstable!

classic Classic list List threaded Threaded
2 messages Options
Reply | Threaded
Open this post in threaded view
|

[JENKINS] Lucene-Solr-master-Windows (64bit/jdk-13-rc) - Build # 8103 - Unstable!

Policeman Jenkins Server-2
Build: https://jenkins.thetaphi.de/job/Lucene-Solr-master-Windows/8103/
Java: 64bit/jdk-13-rc -XX:-UseCompressedOops -XX:+UseG1GC

3 tests failed.
FAILED:  org.apache.solr.update.processor.DimensionalRoutedAliasUpdateProcessorTest.testCatTime

Error Message:
expected:<6> but was:<5>

Stack Trace:
java.lang.AssertionError: expected:<6> but was:<5>
        at __randomizedtesting.SeedInfo.seed([90D75D12A53B504E:97DC12119AC801A6]:0)
        at org.junit.Assert.fail(Assert.java:88)
        at org.junit.Assert.failNotEquals(Assert.java:834)
        at org.junit.Assert.assertEquals(Assert.java:645)
        at org.junit.Assert.assertEquals(Assert.java:631)
        at org.apache.solr.update.processor.DimensionalRoutedAliasUpdateProcessorTest.assertCatTimeInvariants(DimensionalRoutedAliasUpdateProcessorTest.java:677)
        at org.apache.solr.update.processor.DimensionalRoutedAliasUpdateProcessorTest.testCatTime(DimensionalRoutedAliasUpdateProcessorTest.java:433)
        at java.base/jdk.internal.reflect.NativeMethodAccessorImpl.invoke0(Native Method)
        at java.base/jdk.internal.reflect.NativeMethodAccessorImpl.invoke(NativeMethodAccessorImpl.java:62)
        at java.base/jdk.internal.reflect.DelegatingMethodAccessorImpl.invoke(DelegatingMethodAccessorImpl.java:43)
        at java.base/java.lang.reflect.Method.invoke(Method.java:567)
        at com.carrotsearch.randomizedtesting.RandomizedRunner.invoke(RandomizedRunner.java:1750)
        at com.carrotsearch.randomizedtesting.RandomizedRunner$8.evaluate(RandomizedRunner.java:938)
        at com.carrotsearch.randomizedtesting.RandomizedRunner$9.evaluate(RandomizedRunner.java:974)
        at com.carrotsearch.randomizedtesting.RandomizedRunner$10.evaluate(RandomizedRunner.java:988)
        at com.carrotsearch.randomizedtesting.rules.SystemPropertiesRestoreRule$1.evaluate(SystemPropertiesRestoreRule.java:57)
        at org.apache.lucene.util.TestRuleSetupTeardownChained$1.evaluate(TestRuleSetupTeardownChained.java:49)
        at org.apache.lucene.util.AbstractBeforeAfterRule$1.evaluate(AbstractBeforeAfterRule.java:45)
        at org.apache.lucene.util.TestRuleThreadAndTestName$1.evaluate(TestRuleThreadAndTestName.java:48)
        at org.apache.lucene.util.TestRuleIgnoreAfterMaxFailures$1.evaluate(TestRuleIgnoreAfterMaxFailures.java:64)
        at org.apache.lucene.util.TestRuleMarkFailure$1.evaluate(TestRuleMarkFailure.java:47)
        at com.carrotsearch.randomizedtesting.rules.StatementAdapter.evaluate(StatementAdapter.java:36)
        at com.carrotsearch.randomizedtesting.ThreadLeakControl$StatementRunner.run(ThreadLeakControl.java:368)
        at com.carrotsearch.randomizedtesting.ThreadLeakControl.forkTimeoutingTask(ThreadLeakControl.java:817)
        at com.carrotsearch.randomizedtesting.ThreadLeakControl$3.evaluate(ThreadLeakControl.java:468)
        at com.carrotsearch.randomizedtesting.RandomizedRunner.runSingleTest(RandomizedRunner.java:947)
        at com.carrotsearch.randomizedtesting.RandomizedRunner$5.evaluate(RandomizedRunner.java:832)
        at com.carrotsearch.randomizedtesting.RandomizedRunner$6.evaluate(RandomizedRunner.java:883)
        at com.carrotsearch.randomizedtesting.RandomizedRunner$7.evaluate(RandomizedRunner.java:894)
        at com.carrotsearch.randomizedtesting.rules.StatementAdapter.evaluate(StatementAdapter.java:36)
        at com.carrotsearch.randomizedtesting.rules.SystemPropertiesRestoreRule$1.evaluate(SystemPropertiesRestoreRule.java:57)
        at org.apache.lucene.util.AbstractBeforeAfterRule$1.evaluate(AbstractBeforeAfterRule.java:45)
        at com.carrotsearch.randomizedtesting.rules.StatementAdapter.evaluate(StatementAdapter.java:36)
        at org.apache.lucene.util.TestRuleStoreClassName$1.evaluate(TestRuleStoreClassName.java:41)
        at com.carrotsearch.randomizedtesting.rules.NoShadowingOrOverridesOnMethodsRule$1.evaluate(NoShadowingOrOverridesOnMethodsRule.java:40)
        at com.carrotsearch.randomizedtesting.rules.NoShadowingOrOverridesOnMethodsRule$1.evaluate(NoShadowingOrOverridesOnMethodsRule.java:40)
        at com.carrotsearch.randomizedtesting.rules.StatementAdapter.evaluate(StatementAdapter.java:36)
        at com.carrotsearch.randomizedtesting.rules.StatementAdapter.evaluate(StatementAdapter.java:36)
        at org.apache.lucene.util.TestRuleAssertionsRequired$1.evaluate(TestRuleAssertionsRequired.java:53)
        at org.apache.lucene.util.TestRuleMarkFailure$1.evaluate(TestRuleMarkFailure.java:47)
        at org.apache.lucene.util.TestRuleIgnoreAfterMaxFailures$1.evaluate(TestRuleIgnoreAfterMaxFailures.java:64)
        at org.apache.lucene.util.TestRuleIgnoreTestSuites$1.evaluate(TestRuleIgnoreTestSuites.java:54)
        at com.carrotsearch.randomizedtesting.rules.StatementAdapter.evaluate(StatementAdapter.java:36)
        at com.carrotsearch.randomizedtesting.ThreadLeakControl$StatementRunner.run(ThreadLeakControl.java:368)
        at java.base/java.lang.Thread.run(Thread.java:830)


FAILED:  junit.framework.TestSuite.org.apache.solr.client.solrj.io.stream.StreamExpressionTest

Error Message:
Could not remove the following files (in the order of attempts):    C:\Users\jenkins\workspace\Lucene-Solr-master-Windows\solr\build\solr-solrj\test\J1\temp\solr.client.solrj.io.stream.StreamExpressionTest_AC9D79173301FBFC-001\tempDir-001\node1\userfiles\directory1\secondLevel2.txt: java.nio.file.FileSystemException: C:\Users\jenkins\workspace\Lucene-Solr-master-Windows\solr\build\solr-solrj\test\J1\temp\solr.client.solrj.io.stream.StreamExpressionTest_AC9D79173301FBFC-001\tempDir-001\node1\userfiles\directory1\secondLevel2.txt: The process cannot access the file because it is being used by another process.     C:\Users\jenkins\workspace\Lucene-Solr-master-Windows\solr\build\solr-solrj\test\J1\temp\solr.client.solrj.io.stream.StreamExpressionTest_AC9D79173301FBFC-001\tempDir-001\node1\userfiles\directory1: java.nio.file.DirectoryNotEmptyException: C:\Users\jenkins\workspace\Lucene-Solr-master-Windows\solr\build\solr-solrj\test\J1\temp\solr.client.solrj.io.stream.StreamExpressionTest_AC9D79173301FBFC-001\tempDir-001\node1\userfiles\directory1    C:\Users\jenkins\workspace\Lucene-Solr-master-Windows\solr\build\solr-solrj\test\J1\temp\solr.client.solrj.io.stream.StreamExpressionTest_AC9D79173301FBFC-001\tempDir-001\node1\userfiles: java.nio.file.DirectoryNotEmptyException: C:\Users\jenkins\workspace\Lucene-Solr-master-Windows\solr\build\solr-solrj\test\J1\temp\solr.client.solrj.io.stream.StreamExpressionTest_AC9D79173301FBFC-001\tempDir-001\node1\userfiles    C:\Users\jenkins\workspace\Lucene-Solr-master-Windows\solr\build\solr-solrj\test\J1\temp\solr.client.solrj.io.stream.StreamExpressionTest_AC9D79173301FBFC-001\tempDir-001\node1: java.nio.file.DirectoryNotEmptyException: C:\Users\jenkins\workspace\Lucene-Solr-master-Windows\solr\build\solr-solrj\test\J1\temp\solr.client.solrj.io.stream.StreamExpressionTest_AC9D79173301FBFC-001\tempDir-001\node1    C:\Users\jenkins\workspace\Lucene-Solr-master-Windows\solr\build\solr-solrj\test\J1\temp\solr.client.solrj.io.stream.StreamExpressionTest_AC9D79173301FBFC-001\tempDir-001: java.nio.file.DirectoryNotEmptyException: C:\Users\jenkins\workspace\Lucene-Solr-master-Windows\solr\build\solr-solrj\test\J1\temp\solr.client.solrj.io.stream.StreamExpressionTest_AC9D79173301FBFC-001\tempDir-001    C:\Users\jenkins\workspace\Lucene-Solr-master-Windows\solr\build\solr-solrj\test\J1\temp\solr.client.solrj.io.stream.StreamExpressionTest_AC9D79173301FBFC-001: java.nio.file.DirectoryNotEmptyException: C:\Users\jenkins\workspace\Lucene-Solr-master-Windows\solr\build\solr-solrj\test\J1\temp\solr.client.solrj.io.stream.StreamExpressionTest_AC9D79173301FBFC-001

Stack Trace:
java.io.IOException: Could not remove the following files (in the order of attempts):
   C:\Users\jenkins\workspace\Lucene-Solr-master-Windows\solr\build\solr-solrj\test\J1\temp\solr.client.solrj.io.stream.StreamExpressionTest_AC9D79173301FBFC-001\tempDir-001\node1\userfiles\directory1\secondLevel2.txt: java.nio.file.FileSystemException: C:\Users\jenkins\workspace\Lucene-Solr-master-Windows\solr\build\solr-solrj\test\J1\temp\solr.client.solrj.io.stream.StreamExpressionTest_AC9D79173301FBFC-001\tempDir-001\node1\userfiles\directory1\secondLevel2.txt: The process cannot access the file because it is being used by another process.

   C:\Users\jenkins\workspace\Lucene-Solr-master-Windows\solr\build\solr-solrj\test\J1\temp\solr.client.solrj.io.stream.StreamExpressionTest_AC9D79173301FBFC-001\tempDir-001\node1\userfiles\directory1: java.nio.file.DirectoryNotEmptyException: C:\Users\jenkins\workspace\Lucene-Solr-master-Windows\solr\build\solr-solrj\test\J1\temp\solr.client.solrj.io.stream.StreamExpressionTest_AC9D79173301FBFC-001\tempDir-001\node1\userfiles\directory1
   C:\Users\jenkins\workspace\Lucene-Solr-master-Windows\solr\build\solr-solrj\test\J1\temp\solr.client.solrj.io.stream.StreamExpressionTest_AC9D79173301FBFC-001\tempDir-001\node1\userfiles: java.nio.file.DirectoryNotEmptyException: C:\Users\jenkins\workspace\Lucene-Solr-master-Windows\solr\build\solr-solrj\test\J1\temp\solr.client.solrj.io.stream.StreamExpressionTest_AC9D79173301FBFC-001\tempDir-001\node1\userfiles
   C:\Users\jenkins\workspace\Lucene-Solr-master-Windows\solr\build\solr-solrj\test\J1\temp\solr.client.solrj.io.stream.StreamExpressionTest_AC9D79173301FBFC-001\tempDir-001\node1: java.nio.file.DirectoryNotEmptyException: C:\Users\jenkins\workspace\Lucene-Solr-master-Windows\solr\build\solr-solrj\test\J1\temp\solr.client.solrj.io.stream.StreamExpressionTest_AC9D79173301FBFC-001\tempDir-001\node1
   C:\Users\jenkins\workspace\Lucene-Solr-master-Windows\solr\build\solr-solrj\test\J1\temp\solr.client.solrj.io.stream.StreamExpressionTest_AC9D79173301FBFC-001\tempDir-001: java.nio.file.DirectoryNotEmptyException: C:\Users\jenkins\workspace\Lucene-Solr-master-Windows\solr\build\solr-solrj\test\J1\temp\solr.client.solrj.io.stream.StreamExpressionTest_AC9D79173301FBFC-001\tempDir-001
   C:\Users\jenkins\workspace\Lucene-Solr-master-Windows\solr\build\solr-solrj\test\J1\temp\solr.client.solrj.io.stream.StreamExpressionTest_AC9D79173301FBFC-001: java.nio.file.DirectoryNotEmptyException: C:\Users\jenkins\workspace\Lucene-Solr-master-Windows\solr\build\solr-solrj\test\J1\temp\solr.client.solrj.io.stream.StreamExpressionTest_AC9D79173301FBFC-001

        at __randomizedtesting.SeedInfo.seed([AC9D79173301FBFC]:0)
        at org.apache.lucene.util.IOUtils.rm(IOUtils.java:319)
        at org.apache.lucene.util.TestRuleTemporaryFilesCleanup.afterAlways(TestRuleTemporaryFilesCleanup.java:216)
        at com.carrotsearch.randomizedtesting.rules.TestRuleAdapter$1.afterAlways(TestRuleAdapter.java:31)
        at com.carrotsearch.randomizedtesting.rules.StatementAdapter.evaluate(StatementAdapter.java:43)
        at com.carrotsearch.randomizedtesting.rules.StatementAdapter.evaluate(StatementAdapter.java:36)
        at org.apache.lucene.util.TestRuleAssertionsRequired$1.evaluate(TestRuleAssertionsRequired.java:53)
        at org.apache.lucene.util.TestRuleMarkFailure$1.evaluate(TestRuleMarkFailure.java:47)
        at org.apache.lucene.util.TestRuleIgnoreAfterMaxFailures$1.evaluate(TestRuleIgnoreAfterMaxFailures.java:64)
        at org.apache.lucene.util.TestRuleIgnoreTestSuites$1.evaluate(TestRuleIgnoreTestSuites.java:54)
        at com.carrotsearch.randomizedtesting.rules.StatementAdapter.evaluate(StatementAdapter.java:36)
        at com.carrotsearch.randomizedtesting.ThreadLeakControl$StatementRunner.run(ThreadLeakControl.java:368)
        at java.base/java.lang.Thread.run(Thread.java:830)


FAILED:  junit.framework.TestSuite.org.apache.solr.client.solrj.io.stream.StreamExpressionTest

Error Message:
Could not remove the following files (in the order of attempts):    C:\Users\jenkins\workspace\Lucene-Solr-master-Windows\solr\build\solr-solrj\test\J1\temp\solr.client.solrj.io.stream.StreamExpressionTest_AC9D79173301FBFC-001\tempDir-001\node1\userfiles\directory1\secondLevel2.txt: java.nio.file.FileSystemException: C:\Users\jenkins\workspace\Lucene-Solr-master-Windows\solr\build\solr-solrj\test\J1\temp\solr.client.solrj.io.stream.StreamExpressionTest_AC9D79173301FBFC-001\tempDir-001\node1\userfiles\directory1\secondLevel2.txt: The process cannot access the file because it is being used by another process.     C:\Users\jenkins\workspace\Lucene-Solr-master-Windows\solr\build\solr-solrj\test\J1\temp\solr.client.solrj.io.stream.StreamExpressionTest_AC9D79173301FBFC-001\tempDir-001\node1\userfiles\directory1: java.nio.file.DirectoryNotEmptyException: C:\Users\jenkins\workspace\Lucene-Solr-master-Windows\solr\build\solr-solrj\test\J1\temp\solr.client.solrj.io.stream.StreamExpressionTest_AC9D79173301FBFC-001\tempDir-001\node1\userfiles\directory1    C:\Users\jenkins\workspace\Lucene-Solr-master-Windows\solr\build\solr-solrj\test\J1\temp\solr.client.solrj.io.stream.StreamExpressionTest_AC9D79173301FBFC-001\tempDir-001\node1\userfiles: java.nio.file.DirectoryNotEmptyException: C:\Users\jenkins\workspace\Lucene-Solr-master-Windows\solr\build\solr-solrj\test\J1\temp\solr.client.solrj.io.stream.StreamExpressionTest_AC9D79173301FBFC-001\tempDir-001\node1\userfiles    C:\Users\jenkins\workspace\Lucene-Solr-master-Windows\solr\build\solr-solrj\test\J1\temp\solr.client.solrj.io.stream.StreamExpressionTest_AC9D79173301FBFC-001\tempDir-001\node1: java.nio.file.DirectoryNotEmptyException: C:\Users\jenkins\workspace\Lucene-Solr-master-Windows\solr\build\solr-solrj\test\J1\temp\solr.client.solrj.io.stream.StreamExpressionTest_AC9D79173301FBFC-001\tempDir-001\node1    C:\Users\jenkins\workspace\Lucene-Solr-master-Windows\solr\build\solr-solrj\test\J1\temp\solr.client.solrj.io.stream.StreamExpressionTest_AC9D79173301FBFC-001\tempDir-001: java.nio.file.DirectoryNotEmptyException: C:\Users\jenkins\workspace\Lucene-Solr-master-Windows\solr\build\solr-solrj\test\J1\temp\solr.client.solrj.io.stream.StreamExpressionTest_AC9D79173301FBFC-001\tempDir-001    C:\Users\jenkins\workspace\Lucene-Solr-master-Windows\solr\build\solr-solrj\test\J1\temp\solr.client.solrj.io.stream.StreamExpressionTest_AC9D79173301FBFC-001: java.nio.file.DirectoryNotEmptyException: C:\Users\jenkins\workspace\Lucene-Solr-master-Windows\solr\build\solr-solrj\test\J1\temp\solr.client.solrj.io.stream.StreamExpressionTest_AC9D79173301FBFC-001

Stack Trace:
java.io.IOException: Could not remove the following files (in the order of attempts):
   C:\Users\jenkins\workspace\Lucene-Solr-master-Windows\solr\build\solr-solrj\test\J1\temp\solr.client.solrj.io.stream.StreamExpressionTest_AC9D79173301FBFC-001\tempDir-001\node1\userfiles\directory1\secondLevel2.txt: java.nio.file.FileSystemException: C:\Users\jenkins\workspace\Lucene-Solr-master-Windows\solr\build\solr-solrj\test\J1\temp\solr.client.solrj.io.stream.StreamExpressionTest_AC9D79173301FBFC-001\tempDir-001\node1\userfiles\directory1\secondLevel2.txt: The process cannot access the file because it is being used by another process.

   C:\Users\jenkins\workspace\Lucene-Solr-master-Windows\solr\build\solr-solrj\test\J1\temp\solr.client.solrj.io.stream.StreamExpressionTest_AC9D79173301FBFC-001\tempDir-001\node1\userfiles\directory1: java.nio.file.DirectoryNotEmptyException: C:\Users\jenkins\workspace\Lucene-Solr-master-Windows\solr\build\solr-solrj\test\J1\temp\solr.client.solrj.io.stream.StreamExpressionTest_AC9D79173301FBFC-001\tempDir-001\node1\userfiles\directory1
   C:\Users\jenkins\workspace\Lucene-Solr-master-Windows\solr\build\solr-solrj\test\J1\temp\solr.client.solrj.io.stream.StreamExpressionTest_AC9D79173301FBFC-001\tempDir-001\node1\userfiles: java.nio.file.DirectoryNotEmptyException: C:\Users\jenkins\workspace\Lucene-Solr-master-Windows\solr\build\solr-solrj\test\J1\temp\solr.client.solrj.io.stream.StreamExpressionTest_AC9D79173301FBFC-001\tempDir-001\node1\userfiles
   C:\Users\jenkins\workspace\Lucene-Solr-master-Windows\solr\build\solr-solrj\test\J1\temp\solr.client.solrj.io.stream.StreamExpressionTest_AC9D79173301FBFC-001\tempDir-001\node1: java.nio.file.DirectoryNotEmptyException: C:\Users\jenkins\workspace\Lucene-Solr-master-Windows\solr\build\solr-solrj\test\J1\temp\solr.client.solrj.io.stream.StreamExpressionTest_AC9D79173301FBFC-001\tempDir-001\node1
   C:\Users\jenkins\workspace\Lucene-Solr-master-Windows\solr\build\solr-solrj\test\J1\temp\solr.client.solrj.io.stream.StreamExpressionTest_AC9D79173301FBFC-001\tempDir-001: java.nio.file.DirectoryNotEmptyException: C:\Users\jenkins\workspace\Lucene-Solr-master-Windows\solr\build\solr-solrj\test\J1\temp\solr.client.solrj.io.stream.StreamExpressionTest_AC9D79173301FBFC-001\tempDir-001
   C:\Users\jenkins\workspace\Lucene-Solr-master-Windows\solr\build\solr-solrj\test\J1\temp\solr.client.solrj.io.stream.StreamExpressionTest_AC9D79173301FBFC-001: java.nio.file.DirectoryNotEmptyException: C:\Users\jenkins\workspace\Lucene-Solr-master-Windows\solr\build\solr-solrj\test\J1\temp\solr.client.solrj.io.stream.StreamExpressionTest_AC9D79173301FBFC-001

        at __randomizedtesting.SeedInfo.seed([AC9D79173301FBFC]:0)
        at org.apache.lucene.util.IOUtils.rm(IOUtils.java:319)
        at org.apache.lucene.util.TestRuleTemporaryFilesCleanup.afterAlways(TestRuleTemporaryFilesCleanup.java:216)
        at com.carrotsearch.randomizedtesting.rules.TestRuleAdapter$1.afterAlways(TestRuleAdapter.java:31)
        at com.carrotsearch.randomizedtesting.rules.StatementAdapter.evaluate(StatementAdapter.java:43)
        at com.carrotsearch.randomizedtesting.rules.StatementAdapter.evaluate(StatementAdapter.java:36)
        at org.apache.lucene.util.TestRuleAssertionsRequired$1.evaluate(TestRuleAssertionsRequired.java:53)
        at org.apache.lucene.util.TestRuleMarkFailure$1.evaluate(TestRuleMarkFailure.java:47)
        at org.apache.lucene.util.TestRuleIgnoreAfterMaxFailures$1.evaluate(TestRuleIgnoreAfterMaxFailures.java:64)
        at org.apache.lucene.util.TestRuleIgnoreTestSuites$1.evaluate(TestRuleIgnoreTestSuites.java:54)
        at com.carrotsearch.randomizedtesting.rules.StatementAdapter.evaluate(StatementAdapter.java:36)
        at com.carrotsearch.randomizedtesting.ThreadLeakControl$StatementRunner.run(ThreadLeakControl.java:368)
        at java.base/java.lang.Thread.run(Thread.java:830)




Build Log:
[...truncated 14043 lines...]
   [junit4] Suite: org.apache.solr.update.processor.DimensionalRoutedAliasUpdateProcessorTest
   [junit4]   2> 2014576 INFO  (SUITE-DimensionalRoutedAliasUpdateProcessorTest-seed#[90D75D12A53B504E]-worker) [     ] o.a.s.SolrTestCaseJ4 Created dataDir: C:\Users\jenkins\workspace\Lucene-Solr-master-Windows\solr\build\solr-core\test\J0\temp\solr.update.processor.DimensionalRoutedAliasUpdateProcessorTest_90D75D12A53B504E-001\data-dir-212-001
   [junit4]   2> 2014577 INFO  (SUITE-DimensionalRoutedAliasUpdateProcessorTest-seed#[90D75D12A53B504E]-worker) [     ] o.a.s.SolrTestCaseJ4 Using PointFields (NUMERIC_POINTS_SYSPROP=true) w/NUMERIC_DOCVALUES_SYSPROP=false
   [junit4]   2> 2014577 INFO  (SUITE-DimensionalRoutedAliasUpdateProcessorTest-seed#[90D75D12A53B504E]-worker) [     ] o.a.s.SolrTestCaseJ4 Randomized ssl (false) and clientAuth (false) via: @org.apache.solr.util.RandomizeSSL(reason="", value=0.0/0.0, ssl=0.0/0.0, clientAuth=0.0/0.0)
   [junit4]   2> 2014577 INFO  (SUITE-DimensionalRoutedAliasUpdateProcessorTest-seed#[90D75D12A53B504E]-worker) [     ] o.a.s.SolrTestCaseJ4 SecureRandom sanity checks: test.solr.allowed.securerandom=null & java.security.egd=file:/dev/./urandom
   [junit4]   2> 2014585 INFO  (TEST-DimensionalRoutedAliasUpdateProcessorTest.testCatTime-seed#[90D75D12A53B504E]) [     ] o.a.s.SolrTestCaseJ4 ###Starting testCatTime
   [junit4]   2> 2014586 INFO  (TEST-DimensionalRoutedAliasUpdateProcessorTest.testCatTime-seed#[90D75D12A53B504E]) [     ] o.a.s.c.MiniSolrCloudCluster Starting cluster of 4 servers in C:\Users\jenkins\workspace\Lucene-Solr-master-Windows\solr\build\solr-core\test\J0\temp\solr.update.processor.DimensionalRoutedAliasUpdateProcessorTest_90D75D12A53B504E-001\tempDir-001
   [junit4]   2> 2014587 INFO  (TEST-DimensionalRoutedAliasUpdateProcessorTest.testCatTime-seed#[90D75D12A53B504E]) [     ] o.a.s.c.ZkTestServer STARTING ZK TEST SERVER
   [junit4]   2> 2014587 INFO  (ZkTestServer Run Thread) [     ] o.a.s.c.ZkTestServer client port:0.0.0.0/0.0.0.0:0
   [junit4]   2> 2014587 INFO  (ZkTestServer Run Thread) [     ] o.a.s.c.ZkTestServer Starting server
   [junit4]   2> 2014731 INFO  (TEST-DimensionalRoutedAliasUpdateProcessorTest.testCatTime-seed#[90D75D12A53B504E]) [     ] o.a.s.c.ZkTestServer start zk server on port:50940
   [junit4]   2> 2014731 INFO  (TEST-DimensionalRoutedAliasUpdateProcessorTest.testCatTime-seed#[90D75D12A53B504E]) [     ] o.a.s.c.ZkTestServer waitForServerUp: 127.0.0.1:50940
   [junit4]   2> 2014731 INFO  (TEST-DimensionalRoutedAliasUpdateProcessorTest.testCatTime-seed#[90D75D12A53B504E]) [     ] o.a.s.c.ZkTestServer parse host and port list: 127.0.0.1:50940
   [junit4]   2> 2014731 INFO  (TEST-DimensionalRoutedAliasUpdateProcessorTest.testCatTime-seed#[90D75D12A53B504E]) [     ] o.a.s.c.ZkTestServer connecting to 127.0.0.1 50940
   [junit4]   2> 2014735 INFO  (TEST-DimensionalRoutedAliasUpdateProcessorTest.testCatTime-seed#[90D75D12A53B504E]) [     ] o.a.s.c.c.ConnectionManager Waiting for client to connect to ZooKeeper
   [junit4]   2> 2014755 INFO  (zkConnectionManagerCallback-7793-thread-1) [     ] o.a.s.c.c.ConnectionManager zkClient has connected
   [junit4]   2> 2014755 INFO  (TEST-DimensionalRoutedAliasUpdateProcessorTest.testCatTime-seed#[90D75D12A53B504E]) [     ] o.a.s.c.c.ConnectionManager Client is connected to ZooKeeper
   [junit4]   2> 2014762 INFO  (TEST-DimensionalRoutedAliasUpdateProcessorTest.testCatTime-seed#[90D75D12A53B504E]) [     ] o.a.s.c.c.ConnectionManager Waiting for client to connect to ZooKeeper
   [junit4]   2> 2014766 INFO  (zkConnectionManagerCallback-7795-thread-1) [     ] o.a.s.c.c.ConnectionManager zkClient has connected
   [junit4]   2> 2014766 INFO  (TEST-DimensionalRoutedAliasUpdateProcessorTest.testCatTime-seed#[90D75D12A53B504E]) [     ] o.a.s.c.c.ConnectionManager Client is connected to ZooKeeper
   [junit4]   2> 2014768 INFO  (TEST-DimensionalRoutedAliasUpdateProcessorTest.testCatTime-seed#[90D75D12A53B504E]) [     ] o.a.s.c.c.ConnectionManager Waiting for client to connect to ZooKeeper
   [junit4]   2> 2014772 INFO  (zkConnectionManagerCallback-7797-thread-1) [     ] o.a.s.c.c.ConnectionManager zkClient has connected
   [junit4]   2> 2014773 INFO  (TEST-DimensionalRoutedAliasUpdateProcessorTest.testCatTime-seed#[90D75D12A53B504E]) [     ] o.a.s.c.c.ConnectionManager Client is connected to ZooKeeper
   [junit4]   2> 2014923 WARN  (jetty-launcher-7798-thread-1) [     ] o.e.j.s.AbstractConnector Ignoring deprecated socket close linger time
   [junit4]   2> 2014923 WARN  (jetty-launcher-7798-thread-3) [     ] o.e.j.s.AbstractConnector Ignoring deprecated socket close linger time
   [junit4]   2> 2014923 WARN  (jetty-launcher-7798-thread-4) [     ] o.e.j.s.AbstractConnector Ignoring deprecated socket close linger time
   [junit4]   2> 2014923 WARN  (jetty-launcher-7798-thread-2) [     ] o.e.j.s.AbstractConnector Ignoring deprecated socket close linger time
   [junit4]   2> 2014923 INFO  (jetty-launcher-7798-thread-2) [     ] o.a.s.c.s.e.JettySolrRunner Start Jetty (original configured port=0)
   [junit4]   2> 2014923 INFO  (jetty-launcher-7798-thread-4) [     ] o.a.s.c.s.e.JettySolrRunner Start Jetty (original configured port=0)
   [junit4]   2> 2014923 INFO  (jetty-launcher-7798-thread-1) [     ] o.a.s.c.s.e.JettySolrRunner Start Jetty (original configured port=0)
   [junit4]   2> 2014923 INFO  (jetty-launcher-7798-thread-2) [     ] o.a.s.c.s.e.JettySolrRunner Trying to start Jetty on port 0 try number 1 ...
   [junit4]   2> 2014923 INFO  (jetty-launcher-7798-thread-1) [     ] o.a.s.c.s.e.JettySolrRunner Trying to start Jetty on port 0 try number 1 ...
   [junit4]   2> 2014923 INFO  (jetty-launcher-7798-thread-2) [     ] o.e.j.s.Server jetty-9.4.19.v20190610; built: 2019-06-10T16:30:51.723Z; git: afcf563148970e98786327af5e07c261fda175d3; jvm 13+33
   [junit4]   2> 2014923 INFO  (jetty-launcher-7798-thread-1) [     ] o.e.j.s.Server jetty-9.4.19.v20190610; built: 2019-06-10T16:30:51.723Z; git: afcf563148970e98786327af5e07c261fda175d3; jvm 13+33
   [junit4]   2> 2014923 INFO  (jetty-launcher-7798-thread-3) [     ] o.a.s.c.s.e.JettySolrRunner Start Jetty (original configured port=0)
   [junit4]   2> 2014923 INFO  (jetty-launcher-7798-thread-4) [     ] o.a.s.c.s.e.JettySolrRunner Trying to start Jetty on port 0 try number 1 ...
   [junit4]   2> 2014923 INFO  (jetty-launcher-7798-thread-3) [     ] o.a.s.c.s.e.JettySolrRunner Trying to start Jetty on port 0 try number 1 ...
   [junit4]   2> 2014923 INFO  (jetty-launcher-7798-thread-3) [     ] o.e.j.s.Server jetty-9.4.19.v20190610; built: 2019-06-10T16:30:51.723Z; git: afcf563148970e98786327af5e07c261fda175d3; jvm 13+33
   [junit4]   2> 2014923 INFO  (jetty-launcher-7798-thread-4) [     ] o.e.j.s.Server jetty-9.4.19.v20190610; built: 2019-06-10T16:30:51.723Z; git: afcf563148970e98786327af5e07c261fda175d3; jvm 13+33
   [junit4]   2> 2014926 INFO  (jetty-launcher-7798-thread-2) [     ] o.e.j.s.session DefaultSessionIdManager workerName=node0
   [junit4]   2> 2014926 INFO  (jetty-launcher-7798-thread-2) [     ] o.e.j.s.session No SessionScavenger set, using defaults
   [junit4]   2> 2014926 INFO  (jetty-launcher-7798-thread-2) [     ] o.e.j.s.session node0 Scavenging every 660000ms
   [junit4]   2> 2014926 INFO  (jetty-launcher-7798-thread-1) [     ] o.e.j.s.session DefaultSessionIdManager workerName=node0
   [junit4]   2> 2014926 INFO  (jetty-launcher-7798-thread-1) [     ] o.e.j.s.session No SessionScavenger set, using defaults
   [junit4]   2> 2014926 INFO  (jetty-launcher-7798-thread-1) [     ] o.e.j.s.session node0 Scavenging every 660000ms
   [junit4]   2> 2014926 INFO  (jetty-launcher-7798-thread-2) [     ] o.e.j.s.h.ContextHandler Started o.e.j.s.ServletContextHandler@5ea89424{/solr,null,AVAILABLE}
   [junit4]   2> 2014926 INFO  (jetty-launcher-7798-thread-1) [     ] o.e.j.s.h.ContextHandler Started o.e.j.s.ServletContextHandler@44080f5f{/solr,null,AVAILABLE}
   [junit4]   2> 2014926 INFO  (jetty-launcher-7798-thread-4) [     ] o.e.j.s.session DefaultSessionIdManager workerName=node0
   [junit4]   2> 2014926 INFO  (jetty-launcher-7798-thread-4) [     ] o.e.j.s.session No SessionScavenger set, using defaults
   [junit4]   2> 2014926 INFO  (jetty-launcher-7798-thread-4) [     ] o.e.j.s.session node0 Scavenging every 660000ms
   [junit4]   2> 2014926 INFO  (jetty-launcher-7798-thread-4) [     ] o.e.j.s.h.ContextHandler Started o.e.j.s.ServletContextHandler@384f425c{/solr,null,AVAILABLE}
   [junit4]   2> 2014927 INFO  (jetty-launcher-7798-thread-1) [     ] o.e.j.s.AbstractConnector Started ServerConnector@5012e14e{HTTP/1.1,[http/1.1, h2c]}{127.0.0.1:50954}
   [junit4]   2> 2014927 INFO  (jetty-launcher-7798-thread-1) [     ] o.e.j.s.Server Started @2037708ms
   [junit4]   2> 2014927 INFO  (jetty-launcher-7798-thread-2) [     ] o.e.j.s.AbstractConnector Started ServerConnector@69324693{HTTP/1.1,[http/1.1, h2c]}{127.0.0.1:50953}
   [junit4]   2> 2014927 INFO  (jetty-launcher-7798-thread-2) [     ] o.e.j.s.Server Started @2037708ms
   [junit4]   2> 2014927 INFO  (jetty-launcher-7798-thread-1) [     ] o.a.s.c.s.e.JettySolrRunner Jetty properties: {hostContext=/solr, hostPort=50954}
   [junit4]   2> 2014927 INFO  (jetty-launcher-7798-thread-2) [     ] o.a.s.c.s.e.JettySolrRunner Jetty properties: {hostContext=/solr, hostPort=50953}
   [junit4]   2> 2014927 ERROR (jetty-launcher-7798-thread-2) [     ] o.a.s.u.StartupLoggingUtils Missing Java Option solr.log.dir. Logging may be missing or incomplete.
   [junit4]   2> 2014927 INFO  (jetty-launcher-7798-thread-2) [     ] o.a.s.s.SolrDispatchFilter Using logger factory org.apache.logging.slf4j.Log4jLoggerFactory
   [junit4]   2> 2014927 ERROR (jetty-launcher-7798-thread-1) [     ] o.a.s.u.StartupLoggingUtils Missing Java Option solr.log.dir. Logging may be missing or incomplete.
   [junit4]   2> 2014927 INFO  (jetty-launcher-7798-thread-1) [     ] o.a.s.s.SolrDispatchFilter Using logger factory org.apache.logging.slf4j.Log4jLoggerFactory
   [junit4]   2> 2014927 INFO  (jetty-launcher-7798-thread-2) [     ] o.a.s.s.SolrDispatchFilter  ___      _       Welcome to Apache Solr? version 9.0.0
   [junit4]   2> 2014927 INFO  (jetty-launcher-7798-thread-1) [     ] o.a.s.s.SolrDispatchFilter  ___      _       Welcome to Apache Solr? version 9.0.0
   [junit4]   2> 2014927 INFO  (jetty-launcher-7798-thread-2) [     ] o.a.s.s.SolrDispatchFilter / __| ___| |_ _   Starting in cloud mode on port null
   [junit4]   2> 2014927 INFO  (jetty-launcher-7798-thread-2) [     ] o.a.s.s.SolrDispatchFilter \__ \/ _ \ | '_|  Install dir: null
   [junit4]   2> 2014927 INFO  (jetty-launcher-7798-thread-1) [     ] o.a.s.s.SolrDispatchFilter / __| ___| |_ _   Starting in cloud mode on port null
   [junit4]   2> 2014927 INFO  (jetty-launcher-7798-thread-1) [     ] o.a.s.s.SolrDispatchFilter \__ \/ _ \ | '_|  Install dir: null
   [junit4]   2> 2014927 INFO  (jetty-launcher-7798-thread-2) [     ] o.a.s.s.SolrDispatchFilter |___/\___/_|_|    Start time: 2019-08-23T03:16:18.257749400Z
   [junit4]   2> 2014927 INFO  (jetty-launcher-7798-thread-1) [     ] o.a.s.s.SolrDispatchFilter |___/\___/_|_|    Start time: 2019-08-23T03:16:18.257749400Z
   [junit4]   2> 2014929 INFO  (jetty-launcher-7798-thread-3) [     ] o.e.j.s.session DefaultSessionIdManager workerName=node0
   [junit4]   2> 2014929 INFO  (jetty-launcher-7798-thread-3) [     ] o.e.j.s.session No SessionScavenger set, using defaults
   [junit4]   2> 2014929 INFO  (jetty-launcher-7798-thread-2) [     ] o.a.s.c.c.ConnectionManager Waiting for client to connect to ZooKeeper
   [junit4]   2> 2014930 INFO  (jetty-launcher-7798-thread-3) [     ] o.e.j.s.session node0 Scavenging every 600000ms
   [junit4]   2> 2014930 INFO  (jetty-launcher-7798-thread-1) [     ] o.a.s.c.c.ConnectionManager Waiting for client to connect to ZooKeeper
   [junit4]   2> 2014930 INFO  (jetty-launcher-7798-thread-4) [     ] o.e.j.s.AbstractConnector Started ServerConnector@4b8fed23{HTTP/1.1,[http/1.1, h2c]}{127.0.0.1:50959}
   [junit4]   2> 2014930 INFO  (jetty-launcher-7798-thread-4) [     ] o.e.j.s.Server Started @2037710ms
   [junit4]   2> 2014930 INFO  (jetty-launcher-7798-thread-4) [     ] o.a.s.c.s.e.JettySolrRunner Jetty properties: {hostContext=/solr, hostPort=50959}
   [junit4]   2> 2014930 INFO  (jetty-launcher-7798-thread-3) [     ] o.e.j.s.h.ContextHandler Started o.e.j.s.ServletContextHandler@33dad9fa{/solr,null,AVAILABLE}
   [junit4]   2> 2014930 ERROR (jetty-launcher-7798-thread-4) [     ] o.a.s.u.StartupLoggingUtils Missing Java Option solr.log.dir. Logging may be missing or incomplete.
   [junit4]   2> 2014930 INFO  (jetty-launcher-7798-thread-4) [     ] o.a.s.s.SolrDispatchFilter Using logger factory org.apache.logging.slf4j.Log4jLoggerFactory
   [junit4]   2> 2014930 INFO  (jetty-launcher-7798-thread-4) [     ] o.a.s.s.SolrDispatchFilter  ___      _       Welcome to Apache Solr? version 9.0.0
   [junit4]   2> 2014930 INFO  (jetty-launcher-7798-thread-4) [     ] o.a.s.s.SolrDispatchFilter / __| ___| |_ _   Starting in cloud mode on port null
   [junit4]   2> 2014930 INFO  (jetty-launcher-7798-thread-4) [     ] o.a.s.s.SolrDispatchFilter \__ \/ _ \ | '_|  Install dir: null
   [junit4]   2> 2014930 INFO  (jetty-launcher-7798-thread-4) [     ] o.a.s.s.SolrDispatchFilter |___/\___/_|_|    Start time: 2019-08-23T03:16:18.260564500Z
   [junit4]   2> 2014930 INFO  (jetty-launcher-7798-thread-3) [     ] o.e.j.s.AbstractConnector Started ServerConnector@1a2a582b{HTTP/1.1,[http/1.1, h2c]}{127.0.0.1:50966}
   [junit4]   2> 2014930 INFO  (jetty-launcher-7798-thread-3) [     ] o.e.j.s.Server Started @2037710ms
   [junit4]   2> 2014930 INFO  (jetty-launcher-7798-thread-3) [     ] o.a.s.c.s.e.JettySolrRunner Jetty properties: {hostContext=/solr, hostPort=50966}
   [junit4]   2> 2014930 ERROR (jetty-launcher-7798-thread-3) [     ] o.a.s.u.StartupLoggingUtils Missing Java Option solr.log.dir. Logging may be missing or incomplete.
   [junit4]   2> 2014930 INFO  (jetty-launcher-7798-thread-3) [     ] o.a.s.s.SolrDispatchFilter Using logger factory org.apache.logging.slf4j.Log4jLoggerFactory
   [junit4]   2> 2014930 INFO  (jetty-launcher-7798-thread-3) [     ] o.a.s.s.SolrDispatchFilter  ___      _       Welcome to Apache Solr? version 9.0.0
   [junit4]   2> 2014930 INFO  (jetty-launcher-7798-thread-3) [     ] o.a.s.s.SolrDispatchFilter / __| ___| |_ _   Starting in cloud mode on port null
   [junit4]   2> 2014932 INFO  (jetty-launcher-7798-thread-3) [     ] o.a.s.s.SolrDispatchFilter \__ \/ _ \ | '_|  Install dir: null
   [junit4]   2> 2014932 INFO  (jetty-launcher-7798-thread-3) [     ] o.a.s.s.SolrDispatchFilter |___/\___/_|_|    Start time: 2019-08-23T03:16:18.262363600Z
   [junit4]   2> 2014933 INFO  (jetty-launcher-7798-thread-4) [     ] o.a.s.c.c.ConnectionManager Waiting for client to connect to ZooKeeper
   [junit4]   2> 2014933 INFO  (jetty-launcher-7798-thread-3) [     ] o.a.s.c.c.ConnectionManager Waiting for client to connect to ZooKeeper
   [junit4]   2> 2014940 INFO  (zkConnectionManagerCallback-7800-thread-1) [     ] o.a.s.c.c.ConnectionManager zkClient has connected
   [junit4]   2> 2014941 INFO  (jetty-launcher-7798-thread-2) [     ] o.a.s.c.c.ConnectionManager Client is connected to ZooKeeper
   [junit4]   2> 2014941 INFO  (zkConnectionManagerCallback-7802-thread-1) [     ] o.a.s.c.c.ConnectionManager zkClient has connected
   [junit4]   2> 2014941 INFO  (jetty-launcher-7798-thread-1) [     ] o.a.s.c.c.ConnectionManager Client is connected to ZooKeeper
   [junit4]   2> 2014942 INFO  (zkConnectionManagerCallback-7804-thread-1) [     ] o.a.s.c.c.ConnectionManager zkClient has connected
   [junit4]   2> 2014942 INFO  (jetty-launcher-7798-thread-1) [     ] o.a.s.s.SolrDispatchFilter solr.xml found in ZooKeeper. Loading...
   [junit4]   2> 2014942 INFO  (jetty-launcher-7798-thread-4) [     ] o.a.s.c.c.ConnectionManager Client is connected to ZooKeeper
   [junit4]   2> 2014942 INFO  (jetty-launcher-7798-thread-2) [     ] o.a.s.s.SolrDispatchFilter solr.xml found in ZooKeeper. Loading...
   [junit4]   2> 2014943 INFO  (jetty-launcher-7798-thread-4) [     ] o.a.s.s.SolrDispatchFilter solr.xml found in ZooKeeper. Loading...
   [junit4]   2> 2014950 INFO  (zkConnectionManagerCallback-7806-thread-1) [     ] o.a.s.c.c.ConnectionManager zkClient has connected
   [junit4]   2> 2014950 INFO  (jetty-launcher-7798-thread-3) [     ] o.a.s.c.c.ConnectionManager Client is connected to ZooKeeper
   [junit4]   2> 2014950 INFO  (jetty-launcher-7798-thread-3) [     ] o.a.s.s.SolrDispatchFilter solr.xml found in ZooKeeper. Loading...
   [junit4]   2> 2015218 INFO  (jetty-launcher-7798-thread-3) [     ] o.a.s.h.c.HttpShardHandlerFactory Host whitelist initialized: WhitelistHostChecker [whitelistHosts=null, whitelistHostCheckingEnabled=true]
   [junit4]   2> 2015222 WARN  (jetty-launcher-7798-thread-3) [     ] o.e.j.u.s.S.config Trusting all certificates configured for Client@67229561[provider=null,keyStore=null,trustStore=null]
   [junit4]   2> 2015222 WARN  (jetty-launcher-7798-thread-3) [     ] o.e.j.u.s.S.config No Client EndPointIdentificationAlgorithm configured for Client@67229561[provider=null,keyStore=null,trustStore=null]
   [junit4]   2> 2015228 WARN  (jetty-launcher-7798-thread-3) [     ] o.e.j.u.s.S.config Trusting all certificates configured for Client@68c424ef[provider=null,keyStore=null,trustStore=null]
   [junit4]   2> 2015228 WARN  (jetty-launcher-7798-thread-3) [     ] o.e.j.u.s.S.config No Client EndPointIdentificationAlgorithm configured for Client@68c424ef[provider=null,keyStore=null,trustStore=null]
   [junit4]   2> 2015229 INFO  (jetty-launcher-7798-thread-3) [     ] o.a.s.c.ZkContainer Zookeeper client=127.0.0.1:50940/solr
   [junit4]   2> 2015231 INFO  (jetty-launcher-7798-thread-3) [     ] o.a.s.c.c.ConnectionManager Waiting for client to connect to ZooKeeper
   [junit4]   2> 2015237 INFO  (zkConnectionManagerCallback-7814-thread-1) [     ] o.a.s.c.c.ConnectionManager zkClient has connected
   [junit4]   2> 2015237 INFO  (jetty-launcher-7798-thread-3) [     ] o.a.s.c.c.ConnectionManager Client is connected to ZooKeeper
   [junit4]   2> 2015397 INFO  (jetty-launcher-7798-thread-2) [     ] o.a.s.h.c.HttpShardHandlerFactory Host whitelist initialized: WhitelistHostChecker [whitelistHosts=null, whitelistHostCheckingEnabled=true]
   [junit4]   2> 2015399 WARN  (jetty-launcher-7798-thread-2) [     ] o.e.j.u.s.S.config Trusting all certificates configured for Client@2185ebb[provider=null,keyStore=null,trustStore=null]
   [junit4]   2> 2015399 WARN  (jetty-launcher-7798-thread-2) [     ] o.e.j.u.s.S.config No Client EndPointIdentificationAlgorithm configured for Client@2185ebb[provider=null,keyStore=null,trustStore=null]
   [junit4]   2> 2015403 WARN  (jetty-launcher-7798-thread-2) [     ] o.e.j.u.s.S.config Trusting all certificates configured for Client@4e77ae6c[provider=null,keyStore=null,trustStore=null]
   [junit4]   2> 2015403 WARN  (jetty-launcher-7798-thread-2) [     ] o.e.j.u.s.S.config No Client EndPointIdentificationAlgorithm configured for Client@4e77ae6c[provider=null,keyStore=null,trustStore=null]
   [junit4]   2> 2015404 INFO  (jetty-launcher-7798-thread-2) [     ] o.a.s.c.ZkContainer Zookeeper client=127.0.0.1:50940/solr
   [junit4]   2> 2015406 INFO  (jetty-launcher-7798-thread-2) [     ] o.a.s.c.c.ConnectionManager Waiting for client to connect to ZooKeeper
   [junit4]   2> 2015408 INFO  (zkConnectionManagerCallback-7822-thread-1) [     ] o.a.s.c.c.ConnectionManager zkClient has connected
   [junit4]   2> 2015408 INFO  (jetty-launcher-7798-thread-2) [     ] o.a.s.c.c.ConnectionManager Client is connected to ZooKeeper
   [junit4]   2> 2015437 INFO  (jetty-launcher-7798-thread-4) [     ] o.a.s.h.c.HttpShardHandlerFactory Host whitelist initialized: WhitelistHostChecker [whitelistHosts=null, whitelistHostCheckingEnabled=true]
   [junit4]   2> 2015440 WARN  (jetty-launcher-7798-thread-4) [     ] o.e.j.u.s.S.config Trusting all certificates configured for Client@10c8278a[provider=null,keyStore=null,trustStore=null]
   [junit4]   2> 2015440 WARN  (jetty-launcher-7798-thread-4) [     ] o.e.j.u.s.S.config No Client EndPointIdentificationAlgorithm configured for Client@10c8278a[provider=null,keyStore=null,trustStore=null]
   [junit4]   2> 2015443 WARN  (jetty-launcher-7798-thread-4) [     ] o.e.j.u.s.S.config Trusting all certificates configured for Client@58f67333[provider=null,keyStore=null,trustStore=null]
   [junit4]   2> 2015443 WARN  (jetty-launcher-7798-thread-4) [     ] o.e.j.u.s.S.config No Client EndPointIdentificationAlgorithm configured for Client@58f67333[provider=null,keyStore=null,trustStore=null]
   [junit4]   2> 2015446 INFO  (jetty-launcher-7798-thread-4) [     ] o.a.s.c.ZkContainer Zookeeper client=127.0.0.1:50940/solr
   [junit4]   2> 2015448 INFO  (jetty-launcher-7798-thread-4) [     ] o.a.s.c.c.ConnectionManager Waiting for client to connect to ZooKeeper
   [junit4]   2> 2015452 INFO  (zkConnectionManagerCallback-7828-thread-1) [     ] o.a.s.c.c.ConnectionManager zkClient has connected
   [junit4]   2> 2015453 INFO  (jetty-launcher-7798-thread-4) [     ] o.a.s.c.c.ConnectionManager Client is connected to ZooKeeper
   [junit4]   2> 2015514 INFO  (jetty-launcher-7798-thread-3) [n:127.0.0.1:50966_solr     ] o.a.s.c.c.ConnectionManager Waiting for client to connect to ZooKeeper
   [junit4]   2> 2015519 INFO  (zkConnectionManagerCallback-7830-thread-1) [     ] o.a.s.c.c.ConnectionManager zkClient has connected
   [junit4]   2> 2015519 INFO  (jetty-launcher-7798-thread-3) [n:127.0.0.1:50966_solr     ] o.a.s.c.c.ConnectionManager Client is connected to ZooKeeper
   [junit4]   2> 2015579 INFO  (jetty-launcher-7798-thread-1) [     ] o.a.s.h.c.HttpShardHandlerFactory Host whitelist initialized: WhitelistHostChecker [whitelistHosts=null, whitelistHostCheckingEnabled=true]
   [junit4]   2> 2015585 WARN  (jetty-launcher-7798-thread-1) [     ] o.e.j.u.s.S.config Trusting all certificates configured for Client@23c59e9c[provider=null,keyStore=null,trustStore=null]
   [junit4]   2> 2015585 WARN  (jetty-launcher-7798-thread-1) [     ] o.e.j.u.s.S.config No Client EndPointIdentificationAlgorithm configured for Client@23c59e9c[provider=null,keyStore=null,trustStore=null]
   [junit4]   2> 2015594 WARN  (jetty-launcher-7798-thread-1) [     ] o.e.j.u.s.S.config Trusting all certificates configured for Client@1f8a2b2c[provider=null,keyStore=null,trustStore=null]
   [junit4]   2> 2015594 WARN  (jetty-launcher-7798-thread-1) [     ] o.e.j.u.s.S.config No Client EndPointIdentificationAlgorithm configured for Client@1f8a2b2c[provider=null,keyStore=null,trustStore=null]
   [junit4]   2> 2015595 INFO  (jetty-launcher-7798-thread-1) [     ] o.a.s.c.ZkContainer Zookeeper client=127.0.0.1:50940/solr
   [junit4]   2> 2015599 INFO  (jetty-launcher-7798-thread-1) [     ] o.a.s.c.c.ConnectionManager Waiting for client to connect to ZooKeeper
   [junit4]   2> 2015604 INFO  (zkConnectionManagerCallback-7836-thread-1) [     ] o.a.s.c.c.ConnectionManager zkClient has connected
   [junit4]   2> 2015604 INFO  (jetty-launcher-7798-thread-1) [     ] o.a.s.c.c.ConnectionManager Client is connected to ZooKeeper
   [junit4]   2> 2015660 INFO  (jetty-launcher-7798-thread-2) [n:127.0.0.1:50953_solr     ] o.a.s.c.c.ConnectionManager Waiting for client to connect to ZooKeeper
   [junit4]   2> 2015664 INFO  (zkConnectionManagerCallback-7838-thread-1) [     ] o.a.s.c.c.ConnectionManager zkClient has connected
   [junit4]   2> 2015664 INFO  (jetty-launcher-7798-thread-2) [n:127.0.0.1:50953_solr     ] o.a.s.c.c.ConnectionManager Client is connected to ZooKeeper
   [junit4]   2> 2015805 INFO  (jetty-launcher-7798-thread-4) [n:127.0.0.1:50959_solr     ] o.a.s.c.c.ConnectionManager Waiting for client to connect to ZooKeeper
   [junit4]   2> 2015811 INFO  (zkConnectionManagerCallback-7840-thread-1) [     ] o.a.s.c.c.ConnectionManager zkClient has connected
   [junit4]   2> 2015811 INFO  (jetty-launcher-7798-thread-4) [n:127.0.0.1:50959_solr     ] o.a.s.c.c.ConnectionManager Client is connected to ZooKeeper
   [junit4]   2> 2015948 INFO  (jetty-launcher-7798-thread-1) [n:127.0.0.1:50954_solr     ] o.a.s.c.c.ConnectionManager Waiting for client to connect to ZooKeeper
   [junit4]   2> 2015957 INFO  (zkConnectionManagerCallback-7848-thread-1) [     ] o.a.s.c.c.ConnectionManager zkClient has connected
   [junit4]   2> 2015958 INFO  (jetty-launcher-7798-thread-1) [n:127.0.0.1:50954_solr     ] o.a.s.c.c.ConnectionManager Client is connected to ZooKeeper
   [junit4]   2> 2015982 INFO  (jetty-launcher-7798-thread-1) [n:127.0.0.1:50954_solr     ] o.a.s.c.OverseerElectionContext I am going to be the leader 127.0.0.1:50954_solr
   [junit4]   2> 2015983 INFO  (jetty-launcher-7798-thread-1) [n:127.0.0.1:50954_solr     ] o.a.s.c.Overseer Overseer (id=72099871108169742-127.0.0.1:50954_solr-n_0000000000) starting
   [junit4]   2> 2015998 INFO  (jetty-launcher-7798-thread-1) [n:127.0.0.1:50954_solr     ] o.a.s.c.c.ConnectionManager Waiting for client to connect to ZooKeeper
   [junit4]   2> 2016005 INFO  (jetty-launcher-7798-thread-2) [n:127.0.0.1:50953_solr     ] o.a.s.c.ZkController Register node as live in ZooKeeper:/live_nodes/127.0.0.1:50953_solr
   [junit4]   2> 2016008 INFO  (jetty-launcher-7798-thread-2) [n:127.0.0.1:50953_solr     ] o.a.s.c.c.ConnectionManager Waiting for client to connect to ZooKeeper
   [junit4]   2> 2016012 INFO  (zkCallback-7847-thread-1) [     ] o.a.s.c.c.ZkStateReader Updated live nodes from ZooKeeper... (0) -> (1)
   [junit4]   2> 2016014 INFO  (zkConnectionManagerCallback-7855-thread-1) [     ] o.a.s.c.c.ConnectionManager zkClient has connected
   [junit4]   2> 2016014 INFO  (jetty-launcher-7798-thread-1) [n:127.0.0.1:50954_solr     ] o.a.s.c.c.ConnectionManager Client is connected to ZooKeeper
   [junit4]   2> 2016014 INFO  (zkCallback-7837-thread-1) [     ] o.a.s.c.c.ZkStateReader Updated live nodes from ZooKeeper... (0) -> (1)
   [junit4]   2> 2016014 INFO  (jetty-launcher-7798-thread-1) [n:127.0.0.1:50954_solr     ] o.a.s.c.c.ZkStateReader Updated live nodes from ZooKeeper... (0) -> (1)
   [junit4]   2> 2016014 INFO  (jetty-launcher-7798-thread-1) [n:127.0.0.1:50954_solr     ] o.a.s.c.s.i.ZkClientClusterStateProvider Cluster at 127.0.0.1:50940/solr ready
   [junit4]   2> 2016014 INFO  (jetty-launcher-7798-thread-1) [n:127.0.0.1:50954_solr     ] o.a.s.c.ZkController Publish node=127.0.0.1:50954_solr as DOWN
   [junit4]   2> 2016022 INFO  (jetty-launcher-7798-thread-1) [n:127.0.0.1:50954_solr     ] o.a.s.c.TransientSolrCoreCacheDefault Allocating transient cache for 2147483647 transient cores
   [junit4]   2> 2016022 INFO  (jetty-launcher-7798-thread-1) [n:127.0.0.1:50954_solr     ] o.a.s.c.ZkController Register node as live in ZooKeeper:/live_nodes/127.0.0.1:50954_solr
   [junit4]   2> 2016022 INFO  (zkCallback-7837-thread-1) [     ] o.a.s.c.c.ZkStateReader Updated live nodes from ZooKeeper... (1) -> (2)
   [junit4]   2> 2016022 INFO  (zkCallback-7847-thread-1) [     ] o.a.s.c.c.ZkStateReader Updated live nodes from ZooKeeper... (1) -> (2)
   [junit4]   2> 2016022 INFO  (jetty-launcher-7798-thread-1) [n:127.0.0.1:50954_solr     ] o.a.s.c.PackageManager clusterprops.json changed , version -1
   [junit4]   2> 2016046 INFO  (jetty-launcher-7798-thread-3) [n:127.0.0.1:50966_solr     ] o.a.s.c.c.ZkStateReader Updated live nodes from ZooKeeper... (0) -> (2)
   [junit4]   2> 2016054 INFO  (jetty-launcher-7798-thread-3) [n:127.0.0.1:50966_solr     ] o.a.s.c.ZkController Publish node=127.0.0.1:50966_solr as DOWN
   [junit4]   2> 2016055 INFO  (jetty-launcher-7798-thread-4) [n:127.0.0.1:50959_solr     ] o.a.s.c.c.ZkStateReader Updated live nodes from ZooKeeper... (0) -> (2)
   [junit4]   2> 2016056 INFO  (jetty-launcher-7798-thread-3) [n:127.0.0.1:50966_solr     ] o.a.s.c.TransientSolrCoreCacheDefault Allocating transient cache for 2147483647 transient cores
   [junit4]   2> 2016056 INFO  (jetty-launcher-7798-thread-3) [n:127.0.0.1:50966_solr     ] o.a.s.c.ZkController Register node as live in ZooKeeper:/live_nodes/127.0.0.1:50966_solr
   [junit4]   2> 2016057 INFO  (zkCallback-7847-thread-1) [     ] o.a.s.c.c.ZkStateReader Updated live nodes from ZooKeeper... (2) -> (3)
   [junit4]   2> 2016058 INFO  (zkCallback-7837-thread-1) [     ] o.a.s.c.c.ZkStateReader Updated live nodes from ZooKeeper... (2) -> (3)
   [junit4]   2> 2016060 INFO  (jetty-launcher-7798-thread-3) [n:127.0.0.1:50966_solr     ] o.a.s.c.c.ConnectionManager Waiting for client to connect to ZooKeeper
   [junit4]   2> 2016060 INFO  (OverseerStateUpdate-72099871108169742-127.0.0.1:50954_solr-n_0000000000) [n:127.0.0.1:50954_solr     ] o.a.s.c.Overseer Starting to work on the main queue : 127.0.0.1:50954_solr
   [junit4]   2> 2016060 INFO  (jetty-launcher-7798-thread-4) [n:127.0.0.1:50959_solr     ] o.a.s.c.ZkController Publish node=127.0.0.1:50959_solr as DOWN
   [junit4]   2> 2016063 INFO  (jetty-launcher-7798-thread-4) [n:127.0.0.1:50959_solr     ] o.a.s.c.TransientSolrCoreCacheDefault Allocating transient cache for 2147483647 transient cores
   [junit4]   2> 2016063 INFO  (jetty-launcher-7798-thread-4) [n:127.0.0.1:50959_solr     ] o.a.s.c.ZkController Register node as live in ZooKeeper:/live_nodes/127.0.0.1:50959_solr
   [junit4]   2> 2016064 INFO  (zkCallback-7837-thread-1) [     ] o.a.s.c.c.ZkStateReader Updated live nodes from ZooKeeper... (3) -> (4)
   [junit4]   2> 2016066 INFO  (zkCallback-7847-thread-1) [     ] o.a.s.c.c.ZkStateReader Updated live nodes from ZooKeeper... (3) -> (4)
   [junit4]   2> 2016068 INFO  (jetty-launcher-7798-thread-4) [n:127.0.0.1:50959_solr     ] o.a.s.c.c.ConnectionManager Waiting for client to connect to ZooKeeper
   [junit4]   2> 2016068 INFO  (zkConnectionManagerCallback-7860-thread-1) [     ] o.a.s.c.c.ConnectionManager zkClient has connected
   [junit4]   2> 2016068 INFO  (zkCallback-7854-thread-1) [     ] o.a.s.c.c.ZkStateReader Updated live nodes from ZooKeeper... (1) -> (4)
   [junit4]   2> 2016068 INFO  (jetty-launcher-7798-thread-2) [n:127.0.0.1:50953_solr     ] o.a.s.c.c.ConnectionManager Client is connected to ZooKeeper
   [junit4]   2> 2016071 INFO  (jetty-launcher-7798-thread-2) [n:127.0.0.1:50953_solr     ] o.a.s.c.c.ZkStateReader Updated live nodes from ZooKeeper... (0) -> (4)
   [junit4]   2> 2016073 INFO  (jetty-launcher-7798-thread-2) [n:127.0.0.1:50953_solr     ] o.a.s.c.s.i.ZkClientClusterStateProvider Cluster at 127.0.0.1:50940/solr ready
   [junit4]   2> 2016073 INFO  (jetty-launcher-7798-thread-2) [n:127.0.0.1:50953_solr     ] o.a.s.c.PackageManager clusterprops.json changed , version -1
   [junit4]   2> 2016075 INFO  (jetty-launcher-7798-thread-1) [n:127.0.0.1:50954_solr     ] o.a.s.h.a.MetricsHistoryHandler No .system collection, keeping metrics history in memory.
   [junit4]   2> 2016121 INFO  (zkCallback-7829-thread-1) [     ] o.a.s.c.c.ZkStateReader Updated live nodes from ZooKeeper... (2) -> (4)
   [junit4]   2> 2016137 INFO  (jetty-launcher-7798-thread-2) [n:127.0.0.1:50953_solr     ] o.a.s.h.a.MetricsHistoryHandler No .system collection, keeping metrics history in memory.
   [junit4]   2> 2016137 INFO  (jetty-launcher-7798-thread-1) [n:127.0.0.1:50954_solr     ] o.a.s.m.r.SolrJmxReporter JMX monitoring for 'solr_50954.solr.node' (registry 'solr.node') enabled at server: com.sun.jmx.mbeanserver.JmxMBeanServer@1742f3a5
   [junit4]   2> 2016153 INFO  (jetty-launcher-7798-thread-1) [n:127.0.0.1:50954_solr     ] o.a.s.m.r.SolrJmxReporter JMX monitoring for 'solr_50954.solr.jvm' (registry 'solr.jvm') enabled at server: com.sun.jmx.mbeanserver.JmxMBeanServer@1742f3a5
   [junit4]   2> 2016153 INFO  (jetty-launcher-7798-thread-1) [n:127.0.0.1:50954_solr     ] o.a.s.m.r.SolrJmxReporter JMX monitoring for 'solr_50954.solr.jetty' (registry 'solr.jetty') enabled at server: com.sun.jmx.mbeanserver.JmxMBeanServer@1742f3a5
   [junit4]   2> 2016153 INFO  (jetty-launcher-7798-thread-1) [n:127.0.0.1:50954_solr     ] o.a.s.c.CorePropertiesLocator Found 0 core definitions underneath C:\Users\jenkins\workspace\Lucene-Solr-master-Windows\solr\build\solr-core\test\J0\temp\solr.update.processor.DimensionalRoutedAliasUpdateProcessorTest_90D75D12A53B504E-001\tempDir-001\node1\.
   [junit4]   2> 2016160 INFO  (zkCallback-7839-thread-1) [     ] o.a.s.c.c.ZkStateReader Updated live nodes from ZooKeeper... (2) -> (4)
   [junit4]   2> 2016176 INFO  (jetty-launcher-7798-thread-2) [n:127.0.0.1:50953_solr     ] o.a.s.m.r.SolrJmxReporter JMX monitoring for 'solr_50953.solr.node' (registry 'solr.node') enabled at server: com.sun.jmx.mbeanserver.JmxMBeanServer@1742f3a5
   [junit4]   2> 2016188 INFO  (jetty-launcher-7798-thread-2) [n:127.0.0.1:50953_solr     ] o.a.s.m.r.SolrJmxReporter JMX monitoring for 'solr_50953.solr.jvm' (registry 'solr.jvm') enabled at server: com.sun.jmx.mbeanserver.JmxMBeanServer@1742f3a5
   [junit4]   2> 2016192 INFO  (jetty-launcher-7798-thread-2) [n:127.0.0.1:50953_solr     ] o.a.s.m.r.SolrJmxReporter JMX monitoring for 'solr_50953.solr.jetty' (registry 'solr.jetty') enabled at server: com.sun.jmx.mbeanserver.JmxMBeanServer@1742f3a5
   [junit4]   2> 2016192 INFO  (jetty-launcher-7798-thread-2) [n:127.0.0.1:50953_solr     ] o.a.s.c.CorePropertiesLocator Found 0 core definitions underneath C:\Users\jenkins\workspace\Lucene-Solr-master-Windows\solr\build\solr-core\test\J0\temp\solr.update.processor.DimensionalRoutedAliasUpdateProcessorTest_90D75D12A53B504E-001\tempDir-001\node3\.
   [junit4]   2> 2016261 INFO  (zkConnectionManagerCallback-7865-thread-1) [     ] o.a.s.c.c.ConnectionManager zkClient has connected
   [junit4]   2> 2016262 INFO  (jetty-launcher-7798-thread-3) [n:127.0.0.1:50966_solr     ] o.a.s.c.c.ConnectionManager Client is connected to ZooKeeper
   [junit4]   2> 2016264 INFO  (jetty-launcher-7798-thread-3) [n:127.0.0.1:50966_solr     ] o.a.s.c.c.ZkStateReader Updated live nodes from ZooKeeper... (0) -> (4)
   [junit4]   2> 2016267 INFO  (jetty-launcher-7798-thread-3) [n:127.0.0.1:50966_solr     ] o.a.s.c.s.i.ZkClientClusterStateProvider Cluster at 127.0.0.1:50940/solr ready
   [junit4]   2> 2016268 INFO  (jetty-launcher-7798-thread-3) [n:127.0.0.1:50966_solr     ] o.a.s.c.PackageManager clusterprops.json changed , version -1
   [junit4]   2> 2016280 INFO  (zkConnectionManagerCallback-7870-thread-1) [     ] o.a.s.c.c.ConnectionManager zkClient has connected
   [junit4]   2> 2016280 INFO  (jetty-launcher-7798-thread-4) [n:127.0.0.1:50959_solr     ] o.a.s.c.c.ConnectionManager Client is connected to ZooKeeper
   [junit4]   2> 2016282 INFO  (jetty-launcher-7798-thread-4) [n:127.0.0.1:50959_solr     ] o.a.s.c.c.ZkStateReader Updated live nodes from ZooKeeper... (0) -> (4)
   [junit4]   2> 2016282 INFO  (jetty-launcher-7798-thread-4) [n:127.0.0.1:50959_solr     ] o.a.s.c.s.i.ZkClientClusterStateProvider Cluster at 127.0.0.1:50940/solr ready
   [junit4]   2> 2016282 INFO  (jetty-launcher-7798-thread-4) [n:127.0.0.1:50959_solr     ] o.a.s.c.PackageManager clusterprops.json changed , version -1
   [junit4]   2> 2016311 INFO  (jetty-launcher-7798-thread-3) [n:127.0.0.1:50966_solr     ] o.a.s.h.a.MetricsHistoryHandler No .system collection, keeping metrics history in memory.
   [junit4]   2> 2016327 INFO  (jetty-launcher-7798-thread-4) [n:127.0.0.1:50959_solr     ] o.a.s.h.a.MetricsHistoryHandler No .system collection, keeping metrics history in memory.
   [junit4]   2> 2016337 INFO  (jetty-launcher-7798-thread-3) [n:127.0.0.1:50966_solr     ] o.a.s.m.r.SolrJmxReporter JMX monitoring for 'solr_50966.solr.node' (registry 'solr.node') enabled at server: com.sun.jmx.mbeanserver.JmxMBeanServer@1742f3a5
   [junit4]   2> 2016348 INFO  (jetty-launcher-7798-thread-3) [n:127.0.0.1:50966_solr     ] o.a.s.m.r.SolrJmxReporter JMX monitoring for 'solr_50966.solr.jvm' (registry 'solr.jvm') enabled at server: com.sun.jmx.mbeanserver.JmxMBeanServer@1742f3a5
   [junit4]   2> 2016350 INFO  (jetty-launcher-7798-thread-3) [n:127.0.0.1:50966_solr     ] o.a.s.m.r.SolrJmxReporter JMX monitoring for 'solr_50966.solr.jetty' (registry 'solr.jetty') enabled at server: com.sun.jmx.mbeanserver.JmxMBeanServer@1742f3a5
   [junit4]   2> 2016351 INFO  (jetty-launcher-7798-thread-3) [n:127.0.0.1:50966_solr     ] o.a.s.c.CorePropertiesLocator Found 0 core definitions underneath C:\Users\jenkins\workspace\Lucene-Solr-master-Windows\solr\build\solr-core\test\J0\temp\solr.update.processor.DimensionalRoutedAliasUpdateProcessorTest_90D75D12A53B504E-001\tempDir-001\node2\.
   [junit4]   2> 2016353 INFO  (jetty-launcher-7798-thread-4) [n:127.0.0.1:50959_solr     ] o.a.s.m.r.SolrJmxReporter JMX monitoring for 'solr_50959.solr.node' (registry 'solr.node') enabled at server: com.sun.jmx.mbeanserver.JmxMBeanServer@1742f3a5
   [junit4]   2> 2016362 INFO  (jetty-launcher-7798-thread-4) [n:127.0.0.1:50959_solr     ] o.a.s.m.r.SolrJmxReporter JMX monitoring for 'solr_50959.solr.jvm' (registry 'solr.jvm') enabled at server: com.sun.jmx.mbeanserver.JmxMBeanServer@1742f3a5
   [junit4]   2> 2016364 INFO  (jetty-launcher-7798-thread-4) [n:127.0.0.1:50959_solr     ] o.a.s.m.r.SolrJmxReporter JMX monitoring for 'solr_50959.solr.jetty' (registry 'solr.jetty') enabled at server: com.sun.jmx.mbeanserver.JmxMBeanServer@1742f3a5
   [junit4]   2> 2016364 INFO  (jetty-launcher-7798-thread-4) [n:127.0.0.1:50959_solr     ] o.a.s.c.CorePropertiesLocator Found 0 core definitions underneath C:\Users\jenkins\workspace\Lucene-Solr-master-Windows\solr\build\solr-core\test\J0\temp\solr.update.processor.DimensionalRoutedAliasUpdateProcessorTest_90D75D12A53B504E-001\tempDir-001\node4\.
   [junit4]   2> 2016444 INFO  (TEST-DimensionalRoutedAliasUpdateProcessorTest.testCatTime-seed#[90D75D12A53B504E]) [     ] o.a.s.c.MiniSolrCloudCluster waitForAllNodes: numServers=4
   [junit4]   2> 2016447 INFO  (TEST-DimensionalRoutedAliasUpdateProcessorTest.testCatTime-seed#[90D75D12A53B504E]) [     ] o.a.s.c.c.ConnectionManager Waiting for client to connect to ZooKeeper
   [junit4]   2> 2016450 INFO  (zkConnectionManagerCallback-7879-thread-1) [     ] o.a.s.c.c.ConnectionManager zkClient has connected
   [junit4]   2> 2016450 INFO  (TEST-DimensionalRoutedAliasUpdateProcessorTest.testCatTime-seed#[90D75D12A53B504E]) [     ] o.a.s.c.c.ConnectionManager Client is connected to ZooKeeper
   [junit4]   2> 2016453 INFO  (TEST-DimensionalRoutedAliasUpdateProcessorTest.testCatTime-seed#[90D75D12A53B504E]) [     ] o.a.s.c.c.ZkStateReader Updated live nodes from ZooKeeper... (0) -> (4)
   [junit4]   2> 2016454 INFO  (TEST-DimensionalRoutedAliasUpdateProcessorTest.testCatTime-seed#[90D75D12A53B504E]) [     ] o.a.s.c.s.i.ZkClientClusterStateProvider Cluster at 127.0.0.1:50940/solr ready
   [junit4]   2> 2016456 INFO  (TEST-DimensionalRoutedAliasUpdateProcessorTest.testCatTime-seed#[90D75D12A53B504E]) [     ] o.a.s.u.p.DimensionalRoutedAliasUpdateProcessorTest SolrClient: org.apache.solr.client.solrj.impl.CloudSolrClient@47b7dcb3
   [junit4]   2> 2016456 INFO  (TEST-DimensionalRoutedAliasUpdateProcessorTest.testCatTime-seed#[90D75D12A53B504E]) [     ] o.a.s.u.p.DimensionalRoutedAliasUpdateProcessorTest ClusterStateProvider 127.0.0.1:50940/solr
   [junit4]   2> 2016466 INFO  (TEST-DimensionalRoutedAliasUpdateProcessorTest.testCatTime-seed#[90D75D12A53B504E]) [     ] o.a.s.c.c.ConnectionManager Waiting for client to connect to ZooKeeper
   [junit4]   2> 2016470 INFO  (zkConnectionManagerCallback-7884-thread-1) [     ] o.a.s.c.c.ConnectionManager zkClient has connected
   [junit4]   2> 2016470 INFO  (TEST-DimensionalRoutedAliasUpdateProcessorTest.testCatTime-seed#[90D75D12A53B504E]) [     ] o.a.s.c.c.ConnectionManager Client is connected to ZooKeeper
   [junit4]   2> 2016473 INFO  (TEST-DimensionalRoutedAliasUpdateProcessorTest.testCatTime-seed#[90D75D12A53B504E]) [     ] o.a.s.c.c.ZkStateReader Updated live nodes from ZooKeeper... (0) -> (4)
   [junit4]   2> 2016475 INFO  (TEST-DimensionalRoutedAliasUpdateProcessorTest.testCatTime-seed#[90D75D12A53B504E]) [     ] o.a.s.c.s.i.ZkClientClusterStateProvider Cluster at 127.0.0.1:50940/solr ready
   [junit4]   2> 2016477 INFO  (qtp351118534-21977) [n:127.0.0.1:50966_solr     ] o.a.s.h.a.ConfigSetsHandler Invoked ConfigSet Action :create with params baseConfigSet=_default&name=testCatTime&action=CREATE&wt=javabin&version=2
   [junit4]   2> 2016482 INFO  (OverseerThreadFactory-7316-thread-1-processing-n:127.0.0.1:50954_solr) [n:127.0.0.1:50954_solr     ] o.a.s.c.OverseerConfigSetMessageHandler OverseerConfigSetMessageHandler.processMessage : create , {
   [junit4]   2>   "name":"testCatTime",
   [junit4]   2>   "baseConfigSet":"_default",
   [junit4]   2>   "immutable":"false",
   [junit4]   2>   "operation":"configsets:create"}
   [junit4]   2> 2016483 INFO  (OverseerThreadFactory-7316-thread-1-processing-n:127.0.0.1:50954_solr) [n:127.0.0.1:50954_solr     ] o.a.s.c.c.ZkConfigManager Copying zk node /configs/_default/managed-schema to /configs/testCatTime/managed-schema
   [junit4]   2> 2016487 INFO  (OverseerThreadFactory-7316-thread-1-processing-n:127.0.0.1:50954_solr) [n:127.0.0.1:50954_solr     ] o.a.s.c.c.ZkConfigManager Copying zk node /configs/_default/protwords.txt to /configs/testCatTime/protwords.txt
   [junit4]   2> 2016490 INFO  (OverseerThreadFactory-7316-thread-1-processing-n:127.0.0.1:50954_solr) [n:127.0.0.1:50954_solr     ] o.a.s.c.c.ZkConfigManager Copying zk node /configs/_default/solrconfig.xml to /configs/testCatTime/solrconfig.xml
   [junit4]   2> 2016493 INFO  (OverseerThreadFactory-7316-thread-1-processing-n:127.0.0.1:50954_solr) [n:127.0.0.1:50954_solr     ] o.a.s.c.c.ZkConfigManager Copying zk node /configs/_default/synonyms.txt to /configs/testCatTime/synonyms.txt
   [junit4]   2> 2016495 INFO  (OverseerThreadFactory-7316-thread-1-processing-n:127.0.0.1:50954_solr) [n:127.0.0.1:50954_solr     ] o.a.s.c.c.ZkConfigManager Copying zk node /configs/_default/stopwords.txt to /configs/testCatTime/stopwords.txt
   [junit4]   2> 2016499 INFO  (OverseerThreadFactory-7316-thread-1-processing-n:127.0.0.1:50954_solr) [n:127.0.0.1:50954_solr     ] o.a.s.c.c.ZkConfigManager Copying zk node /configs/_default/lang/contractions_it.txt to /configs/testCatTime/lang/contractions_it.txt
   [junit4]   2> 2016502 INFO  (OverseerThreadFactory-7316-thread-1-processing-n:127.0.0.1:50954_solr) [n:127.0.0.1:50954_solr     ] o.a.s.c.c.ZkConfigManager Copying zk node /configs/_default/lang/contractions_ca.txt to /configs/testCatTime/lang/contractions_ca.txt
   [junit4]   2> 2016505 INFO  (OverseerThreadFactory-7316-thread-1-processing-n:127.0.0.1:50954_solr) [n:127.0.0.1:50954_solr     ] o.a.s.c.c.ZkConfigManager Copying zk node /configs/_default/lang/stemdict_nl.txt to /configs/testCatTime/lang/stemdict_nl.txt
   [junit4]   2> 2016507 INFO  (OverseerThreadFactory-7316-thread-1-processing-n:127.0.0.1:50954_solr) [n:127.0.0.1:50954_solr     ] o.a.s.c.c.ZkConfigManager Copying zk node /configs/_default/lang/stopwords_hy.txt to /configs/testCatTime/lang/stopwords_hy.txt
   [junit4]   2> 2016510 INFO  (OverseerThreadFactory-7316-thread-1-processing-n:127.0.0.1:50954_solr) [n:127.0.0.1:50954_solr     ] o.a.s.c.c.ZkConfigManager Copying zk node /configs/_default/lang/stopwords_no.txt to /configs/testCatTime/lang/stopwords_no.txt
   [junit4]   2> 2016513 INFO  (OverseerThreadFactory-7316-thread-1-processing-n:127.0.0.1:50954_solr) [n:127.0.0.1:50954_solr     ] o.a.s.c.c.ZkConfigManager Copying zk node /configs/_default/lang/stopwords_id.txt to /configs/testCatTime/lang/stopwords_id.txt
   [junit4]   2> 2016516 INFO  (OverseerThreadFactory-7316-thread-1-processing-n:127.0.0.1:50954_solr) [n:127.0.0.1:50954_solr     ] o.a.s.c.c.ZkConfigManager Copying zk node /configs/_default/lang/stopwords_et.txt to /configs/testCatTime/lang/stopwords_et.txt
   [junit4]   2> 2016519 INFO  (OverseerThreadFactory-7316-thread-1-processing-n:127.0.0.1:50954_solr) [n:127.0.0.1:50954_solr     ] o.a.s.c.c.ZkConfigManager Copying zk node /configs/_default/lang/stopwords_da.txt to /configs/testCatTime/lang/stopwords_da.txt
   [junit4]   2> 2016522 INFO  (OverseerThreadFactory-7316-thread-1-processing-n:127.0.0.1:50954_solr) [n:127.0.0.1:50954_solr     ] o.a.s.c.c.ZkConfigManager Copying zk node /configs/_default/lang/stopwords_ga.txt to /configs/testCatTime/lang/stopwords_ga.txt
   [junit4]   2> 2016523 INFO  (OverseerThreadFactory-7316-thread-1-processing-n:127.0.0.1:50954_solr) [n:127.0.0.1:50954_solr     ] o.a.s.c.c.ZkConfigManager Copying zk node /configs/_default/lang/stopwords_hi.txt to /configs/testCatTime/lang/stopwords_hi.txt
   [junit4]   2> 2016526 INFO  (OverseerThreadFactory-7316-thread-1-processing-n:127.0.0.1:50954_solr) [n:127.0.0.1:50954_solr     ] o.a.s.c.c.ZkConfigManager Copying zk node /configs/_default/lang/stopwords_ja.txt to /configs/testCatTime/lang/stopwords_ja.txt
   [junit4]   2> 2016529 INFO  (OverseerThreadFactory-7316-thread-1-processing-n:127.0.0.1:50954_solr) [n:127.0.0.1:50954_solr     ] o.a.s.c.c.ZkConfigManager Copying zk node /configs/_default/lang/stopwords_pt.txt to /configs/testCatTime/lang/stopwords_pt.txt
   [junit4]   2> 2016532 INFO  (OverseerThreadFactory-7316-thread-1-processing-n:127.0.0.1:50954_solr) [n:127.0.0.1:50954_solr     ] o.a.s.c.c.ZkConfigManager Copying zk node /configs/_default/lang/stopwords_hu.txt to /configs/testCatTime/lang/stopwords_hu.txt
   [junit4]   2> 2016535 INFO  (OverseerThreadFactory-7316-thread-1-processing-n:127.0.0.1:50954_solr) [n:127.0.0.1:50954_solr     ] o.a.s.c.c.ZkConfigManager Copying zk node /configs/_default/lang/stopwords_el.txt to /configs/testCatTime/lang/stopwords_el.txt
   [junit4]   2> 2016537 INFO  (OverseerThreadFactory-7316-thread-1-processing-n:127.0.0.1:50954_solr) [n:127.0.0.1:50954_solr     ] o.a.s.c.c.ZkConfigManager Copying zk node /configs/_default/lang/stopwords_ru.txt to /configs/testCatTime/lang/stopwords_ru.txt
   [junit4]   2> 2016540 INFO  (OverseerThreadFactory-7316-thread-1-processing-n:127.0.0.1:50954_solr) [n:127.0.0.1:50954_solr     ] o.a.s.c.c.ZkConfigManager Copying zk node /configs/_default/lang/stopwords_tr.txt to /configs/testCatTime/lang/stopwords_tr.txt
   [junit4]   2> 2016543 INFO  (OverseerThreadFactory-7316-thread-1-processing-n:127.0.0.1:50954_solr) [n:127.0.0.1:50954_solr     ] o.a.s.c.c.ZkConfigManager Copying zk node /configs/_default/lang/stopwords_ar.txt to /configs/testCatTime/lang/stopwords_ar.txt
   [junit4]   2> 2016546 INFO  (OverseerThreadFactory-7316-thread-1-processing-n:127.0.0.1:50954_solr) [n:127.0.0.1:50954_solr     ] o.a.s.c.c.ZkConfigManager Copying zk node /configs/_default/lang/userdict_ja.txt to /configs/testCatTime/lang/userdict_ja.txt
   [junit4]   2> 2016549 INFO  (OverseerThreadFactory-7316-thread-1-processing-n:127.0.0.1:50954_solr) [n:127.0.0.1:50954_solr     ] o.a.s.c.c.ZkConfigManager Copying zk node /configs/_default/lang/stopwords_eu.txt to /configs/testCatTime/lang/stopwords_eu.txt
   [junit4]   2> 2016553 INFO  (OverseerThreadFactory-7316-thread-1-processing-n:127.0.0.1:50954_solr) [n:127.0.0.1:50954_solr     ] o.a.s.c.c.ZkConfigManager Copying zk node /configs/_default/lang/stopwords_it.txt to /configs/testCatTime/lang/stopwords_it.txt
   [junit4]   2> 2016555 INFO  (OverseerThreadFactory-7316-thread-1-processing-n:127.0.0.1:50954_solr) [n:127.0.0.1:50954_solr     ] o.a.s.c.c.ZkConfigManager Copying zk node /configs/_default/lang/stopwords_cz.txt to /configs/testCatTime/lang/stopwords_cz.txt
   [junit4]   2> 2016555 INFO  (OverseerThreadFactory-7316-thread-1-processing-n:127.0.0.1:50954_solr) [n:127.0.0.1:50954_solr     ] o.a.s.c.c.ZkConfigManager Copying zk node /configs/_default/lang/stoptags_ja.txt to /configs/testCatTime/lang/stoptags_ja.txt
   [junit4]   2> 2016563 INFO  (OverseerThreadFactory-7316-thread-1-processing-n:127.0.0.1:50954_solr) [n:127.0.0.1:50954_solr     ] o.a.s.c.c.ZkConfigManager Copying zk node /configs/_default/lang/contractions_fr.txt to /configs/testCatTime/lang/contractions_fr.txt
   [junit4]   2> 2016567 INFO  (OverseerThreadFactory-7316-thread-1-processing-n:127.0.0.1:50954_solr) [n:127.0.0.1:50954_solr     ] o.a.s.c.c.ZkConfigManager Copying zk node /configs/_default/lang/stopwords_de.txt to /configs/testCatTime/lang/stopwords_de.txt
   [junit4]   2> 2016571 INFO  (OverseerThreadFactory-7316-thread-1-processing-n:127.0.0.1:50954_solr) [n:127.0.0.1:50954_solr     ] o.a.s.c.c.ZkConfigManager Copying zk node /configs/_default/lang/stopwords_fa.txt to /configs/testCatTime/lang/stopwords_fa.txt
   [junit4]   2> 2016573 INFO  (OverseerThreadFactory-7316-thread-1-processing-n:127.0.0.1:50954_solr) [n:127.0.0.1:50954_solr     ] o.a.s.c.c.ZkConfigManager Copying zk node /configs/_default/lang/contractions_ga.txt to /configs/testCatTime/lang/contractions_ga.txt
   [junit4]   2> 2016576 INFO  (OverseerThreadFactory-7316-thread-1-processing-n:127.0.0.1:50954_solr) [n:127.0.0.1:50954_solr     ] o.a.s.c.c.ZkConfigManager Copying zk node /configs/_default/lang/stopwords_ca.txt to /configs/testCatTime/lang/stopwords_ca.txt
   [junit4]   2> 2016581 INFO  (OverseerThreadFactory-7316-thread-1-processing-n:127.0.0.1:50954_solr) [n:127.0.0.1:50954_solr     ] o.a.s.c.c.ZkConfigManager Copying zk node /configs/_default/lang/stopwords_nl.txt to /configs/testCatTime/lang/stopwords_nl.txt
   [junit4]   2> 2016585 INFO  (OverseerThreadFactory-7316-thread-1-processing-n:127.0.0.1:50954_solr) [n:127.0.0.1:50954_solr     ] o.a.s.c.c.ZkConfigManager Copying zk node /configs/_default/lang/stopwords_bg.txt to /configs/testCatTime/lang/stopwords_bg.txt
   [junit4]   2> 2016588 INFO  (OverseerThreadFactory-7316-thread-1-processing-n:127.0.0.1:50954_solr) [n:127.0.0.1:50954_solr     ] o.a.s.c.c.ZkConfigManager Copying zk node /configs/_default/lang/stopwords_en.txt to /configs/testCatTime/lang/stopwords_en.txt
   [junit4]   2> 2016592 INFO  (OverseerThreadFactory-7316-thread-1-processing-n:127.0.0.1:50954_solr) [n:127.0.0.1:50954_solr     ] o.a.s.c.c.ZkConfigManager Copying zk node /configs/_default/lang/stopwords_es.txt to /configs/testCatTime/lang/stopwords_es.txt
   [junit4]   2> 2016596 INFO  (OverseerThreadFactory-7316-thread-1-processing-n:127.0.0.1:50954_solr) [n:127.0.0.1:50954_solr     ] o.a.s.c.c.ZkConfigManager Copying zk node /configs/_default/lang/stopwords_lv.txt to /configs/testCatTime/lang/stopwords_lv.txt
   [junit4]   2> 2016598 INFO  (OverseerThreadFactory-7316-thread-1-processing-n:127.0.0.1:50954_solr) [n:127.0.0.1:50954_solr     ] o.a.s.c.c.ZkConfigManager Copying zk node /configs/_default/lang/stopwords_ro.txt to /configs/testCatTime/lang/stopwords_ro.txt
   [junit4]   2> 2016601 INFO  (OverseerThreadFactory-7316-thread-1-processing-n:127.0.0.1:50954_solr) [n:127.0.0.1:50954_solr     ] o.a.s.c.c.ZkConfigManager Copying zk node /configs/_default/lang/stopwords_th.txt to /configs/testCatTime/lang/stopwords_th.txt
   [junit4]   2> 2016603 INFO  (OverseerThreadFactory-7316-thread-1-processing-n:127.0.0.1:50954_solr) [n:127.0.0.1:50954_solr     ] o.a.s.c.c.ZkConfigManager Copying zk node /configs/_default/lang/stopwords_fr.txt to /configs/testCatTime/lang/stopwords_fr.txt
   [junit4]   2> 2016608 INFO  (OverseerThreadFactory-7316-thread-1-processing-n:127.0.0.1:50954_solr) [n:127.0.0.1:50954_solr     ] o.a.s.c.c.ZkConfigManager Copying zk node /configs/_default/lang/stopwords_sv.txt to /configs/testCatTime/lang/stopwords_sv.txt
   [junit4]   2> 2016611 INFO  (OverseerThreadFactory-7316-thread-1-processing-n:127.0.0.1:50954_solr) [n:127.0.0.1:50954_solr     ] o.a.s.c.c.ZkConfigManager Copying zk node /configs/_default/lang/stopwords_fi.txt to /configs/testCatTime/lang/stopwords_fi.txt
   [junit4]   2> 2016614 INFO  (OverseerThreadFactory-7316-thread-1-processing-n:127.0.0.1:50954_solr) [n:127.0.0.1:50954_solr     ] o.a.s.c.c.ZkConfigManager Copying zk node /configs/_default/lang/hyphenations_ga.txt to /configs/testCatTime/lang/hyphenations_ga.txt
   [junit4]   2> 2016618 INFO  (OverseerThreadFactory-7316-thread-1-processing-n:127.0.0.1:50954_solr) [n:127.0.0.1:50954_solr     ] o.a.s.c.c.ZkConfigManager Copying zk node /configs/_default/lang/stopwords_gl.txt to /configs/testCatTime/lang/stopwords_gl.txt
   [junit4]   2> 2016621 INFO  (OverseerThreadFactory-7316-thread-1-processing-n:127.0.0.1:50954_solr) [n:127.0.0.1:50954_solr     ] o.a.s.c.c.ZkConfigManager Copying zk node /configs/_default/params.json to /configs/testCatTime/params.json
   [junit4]   2> 2016625 INFO  (qtp351118534-21977) [n:127.0.0.1:50966_solr     ] o.a.s.s.HttpSolrCall [admin] webapp=null path=/admin/configs params={baseConfigSet=_default&name=testCatTime&action=CREATE&wt=javabin&version=2} status=0 QTime=103
   [junit4]   2> 2016627 INFO  (qtp351118534-21981) [n:127.0.0.1:50966_solr     ] o.a.s.h.a.CollectionsHandler Invoked Collection Action :create with params collection.configName=testCatTime&name=testCatTime&nrtReplicas=1&action=CREATE&numShards=1&wt=javabin&version=2 and sendToOCPQueue=true
   [junit4]   2> 2016632 INFO  (OverseerThreadFactory-7316-thread-2-processing-n:127.0.0.1:50954_solr) [n:127.0.0.1:50954_solr     ] o.a.s.c.a.c.CreateCollectionCmd Create collection testCatTime
   [junit4]   2> 2016632 INFO  (OverseerCollectionConfigSetProcessor-72099871108169742-127.0.0.1:50954_solr-n_0000000000) [n:127.0.0.1:50954_solr     ] o.a.s.c.OverseerTaskQueue Response ZK path: /overseer/collection-queue-work/qnr-0000000000 doesn't exist.  Requestor may have disconnected from ZooKeeper
   [junit4]   2> 2016791 INFO  (OverseerStateUpdate-72099871108169742-127.0.0.1:50954_solr-n_0000000000) [n:127.0.0.1:50954_solr     ] o.a.s.c.o.SliceMutator createReplica() {
   [junit4]   2>   "operation":"ADDREPLICA",
   [junit4]   2>   "collection":"testCatTime",
   [junit4]   2>   "shard":"shard1",
   [junit4]   2>   "core":"testCatTime_shard1_replica_n1",
   [junit4]   2>   "state":"down",
   [junit4]   2>   "base_url":"http://127.0.0.1:50953/solr",
   [junit4]   2>   "type":"NRT",
   [junit4]   2>   "waitForFinalState":"false"}
   [junit4]   2> 2017081 INFO  (qtp1744151581-21972) [n:127.0.0.1:50953_solr    x:testCatTime_shard1_replica_n1 ] o.a.s.h.a.CoreAdminOperation core create command qt=/admin/cores&coreNodeName=core_node2&collection.configName=testCatTime&newCollection=true&name=testCatTime_shard1_replica_n1&action=CREATE&numShards=1&collection=testCatTime&shard=shard1&wt=javabin&version=2&replicaType=NRT
   [junit4]   2> 2017082 INFO  (qtp1744151581-21972) [n:127.0.0.1:50953_solr    x:testCatTime_shard1_replica_n1 ] o.a.s.c.TransientSolrCoreCacheDefault Allocating transient cache for 2147483647 transient cores
   [junit4]   2> 2018542 INFO  (qtp1744151581-21972) [n:127.0.0.1:50953_solr c:testCatTime s:shard1 r:core_node2 x:testCatTime_shard1_replica_n1 ] o.a.s.c.RequestParams conf resource params.json loaded . version : 0
   [junit4]   2> 2018543 INFO  (qtp1744151581-21972) [n:127.0.0.1:50953_solr c:testCatTime s:shard1 r:core_node2 x:testCatTime_shard1_replica_n1 ] o.a.s.c.RequestParams request params refreshed to version 0
   [junit4]   2> 2018544 WARN  (qtp1744151581-21972) [n:127.0.0.1:50953_solr c:testCatTime s:shard1 r:core_node2 x:testCatTime_shard1_replica_n1 ] o.a.s.c.SolrConfig Couldn't add files from C:\Users\jenkins\workspace\Lucene-Solr-master-Windows\solr\build\solr-core\test\J0\temp\solr.update.processor.DimensionalRoutedAliasUpdateProcessorTest_90D75D12A53B504E-001\tempDir-001\node3\testCatTime_shard1_replica_n1\..\..\..\..\contrib\extraction\lib filtered by .*\.jar to classpath: C:\Users\jenkins\workspace\Lucene-Solr-master-Windows\solr\build\solr-core\test\J0\temp\solr.update.processor.DimensionalRoutedAliasUpdateProcessorTest_90D75D12A53B504E-001\tempDir-001\node3\testCatTime_shard1_replica_n1\..\..\..\..\contrib\extraction\lib
   [junit4]   2> 2018544 WARN  (qtp1744151581-21972) [n:127.0.0.1:50953_solr c:testCatTime s:shard1 r:core_node2 x:testCatTime_shard1_replica_n1 ] o.a.s.c.SolrConfig Couldn't add files from C:\Users\jenkins\workspace\Lucene-Solr-master-Windows\solr\build\solr-core\test\J0\temp\solr.update.processor.DimensionalRoutedAliasUpdateProcessorTest_90D75D12A53B504E-001\tempDir-001\node3\testCatTime_shard1_replica_n1\..\..\..\..\dist filtered by solr-cell-\d.*\.jar to classpath: C:\Users\jenkins\workspace\Lucene-Solr-master-Windows\solr\build\solr-core\test\J0\temp\solr.update.processor.DimensionalRoutedAliasUpdateProcessorTest_90D75D12A53B504E-001\tempDir-001\node3\testCatTime_shard1_replica_n1\..\..\..\..\dist
   [junit4]   2> 2018544 WARN  (qtp1744151581-21972) [n:127.0.0.1:50953_solr c:testCatTime s:shard1 r:core_node2 x:testCatTime_shard1_replica_n1 ] o.a.s.c.SolrConfig Couldn't add files from C:\Users\jenkins\workspace\Lucene-Solr-master-Windows\solr\build\solr-core\test\J0\temp\solr.update.processor.DimensionalRoutedAliasUpdateProcessorTest_90D75D12A53B504E-001\tempDir-001\node3\testCatTime_shard1_replica_n1\..\..\..\..\contrib\clustering\lib filtered by .*\.jar to classpath: C:\Users\jenkins\workspace\Lucene-Solr-master-Windows\solr\build\solr-core\test\J0\temp\solr.update.processor.DimensionalRoutedAliasUpdateProcessorTest_90D75D12A53B504E-001\tempDir-001\node3\testCatTime_shard1_replica_n1\..\..\..\..\contrib\clustering\lib
   [junit4]   2> 2018544 WARN  (qtp1744151581-21972) [n:127.0.0.1:50953_solr c:testCatTime s:shard1 r:core_node2 x:testCatTime_shard1_replica_n1 ] o.a.s.c.SolrConfig Couldn't add files from C:\Users\jenkins\workspace\Lucene-Solr-master-Windows\solr\build\solr-core\test\J0\temp\solr.update.processor.DimensionalRoutedAliasUpdateProcessorTest_90D75D12A53B504E-001\tempDir-001\node3\testCatTime_shard1_replica_n1\..\..\..\..\dist filtered by solr-clustering-\d.*\.jar to classpath: C:\Users\jenkins\workspace\Lucene-Solr-master-Windows\solr\build\solr-core\test\J0\temp\solr.update.processor.DimensionalRoutedAliasUpdateProcessorTest_90D75D12A53B504E-001\tempDir-001\node3\testCatTime_shard1_replica_n1\..\..\..\..\dist
   [junit4]   2> 2018544 WARN  (qtp1744151581-21972) [n:127.0.0.1:50953_solr c:testCatTime s:shard1 r:core_node2 x:testCatTime_shard1_replica_n1 ] o.a.s.c.SolrConfig Couldn't add files from C:\Users\jenkins\workspace\Lucene-Solr-master-Windows\solr\build\solr-core\test\J0\temp\solr.update.processor.DimensionalRoutedAliasUpdateProcessorTest_90D75D12A53B504E-001\tempDir-001\node3\testCatTime_shard1_replica_n1\..\..\..\..\contrib\langid\lib filtered by .*\.jar to classpath: C:\Users\jenkins\workspace\Lucene-Solr-master-Windows\solr\build\solr-core\test\J0\temp\solr.update.processor.DimensionalRoutedAliasUpdateProcessorTest_90D75D12A53B504E-001\tempDir-001\node3\testCatTime_shard1_replica_n1\..\..\..\..\contrib\langid\lib
   [junit4]   2> 2018544 WARN  (qtp1744151581-21972) [n:127.0.0.1:50953_solr c:testCatTime s:shard1 r:core_node2 x:testCatTime_shard1_replica_n1 ] o.a.s.c.SolrConfig Couldn't add files from C:\Users\jenkins\workspace\Lucene-Solr-master-Windows\solr\build\solr-core\test\J0\temp\solr.update.processor.DimensionalRoutedAliasUpdateProcessorTest_90D75D12A53B504E-001\tempDir-001\node3\testCatTime_shard1_replica_n1\..\..\..\..\dist filtered by solr-langid-\d.*\.jar to classpath: C:\Users\jenkins\workspace\Lucene-Solr-master-Windows\solr\build\solr-core\test\J0\temp\solr.update.processor.DimensionalRoutedAliasUpdateProcessorTest_90D75D12A53B504E-001\tempDir-001\node3\testCatTime_shard1_replica_n1\..\..\..\..\dist
   [junit4]   2> 2018545 WARN  (qtp1744151581-21972) [n:127.0.0.1:50953_solr c:testCatTime s:shard1 r:core_node2 x:testCatTime_shard1_replica_n1 ] o.a.s.c.SolrConfig Couldn't add files from C:\Users\jenkins\workspace\Lucene-Solr-master-Windows\solr\build\solr-core\test\J0\temp\solr.update.processor.DimensionalRoutedAliasUpdateProcessorTest_90D75D12A53B504E-001\tempDir-001\node3\testCatTime_shard1_replica_n1\..\..\..\..\contrib\velocity\lib filtered by .*\.jar to classpath: C:\Users\jenkins\workspace\Lucene-Solr-master-Windows\solr\build\solr-core\test\J0\temp\solr.update.processor.DimensionalRoutedAliasUpdateProcessorTest_90D75D12A53B504E-001\tempDir-001\node3\testCatTime_shard1_replica_n1\..\..\..\..\contrib\velocity\lib
   [junit4]   2> 2018545 WARN  (qtp1744151581-21972) [n:127.0.0.1:50953_solr c:testCatTime s:shard1 r:core_node2 x:testCatTime_shard1_replica_n1 ] o.a.s.c.SolrConfig Couldn't add files from C:\Users\jenkins\workspace\Lucene-Solr-master-Windows\solr\build\solr-core\test\J0\temp\solr.update.processor.DimensionalRoutedAliasUpdateProcessorTest_90D75D12A53B504E-001\tempDir-001\node3\testCatTime_shard1_replica_n1\..\..\..\..\dist filtered by solr-velocity-\d.*\.jar to classpath: C:\Users\jenkins\workspace\Lucene-Solr-master-Windows\solr\build\solr-core\test\J0\temp\solr.update.processor.DimensionalRoutedAliasUpdateProcessorTest_90D75D12A53B504E-001\tempDir-001\node3\testCatTime_shard1_replica_n1\..\..\..\..\dist
   [junit4]   2> 2018545 WARN  (qtp1744151581-21972) [n:127.0.0.1:50953_solr c:testCatTime s:shard1 r:core_node2 x:testCatTime_shard1_replica_n1 ] o.a.s.c.SolrConfig Couldn't add files from C:\Users\jenkins\workspace\Lucene-Solr-master-Windows\solr\build\solr-core\test\J0\temp\solr.update.processor.DimensionalRoutedAliasUpdateProcessorTest_90D75D12A53B504E-001\tempDir-001\node3\testCatTime_shard1_replica_n1\..\..\..\..\dist filtered by solr-ltr-\d.*\.jar to classpath: C:\Users\jenkins\workspace\Lucene-Solr-master-Windows\solr\build\solr-core\test\J0\temp\solr.update.processor.DimensionalRoutedAliasUpdateProcessorTest_90D75D12A53B504E-001\tempDir-001\node3\testCatTime_shard1_replica_n1\..\..\..\..\dist
   [junit4]   2> 2018546 INFO  (qtp1744151581-21972) [n:127.0.0.1:50953_solr c:testCatTime s:shard1 r:core_node2 x:testCatTime_shard1_replica_n1 ] o.a.s.c.SolrConfig Using Lucene MatchVersion: 9.0.0
   [junit4]   2> 2018578 INFO  (qtp1744151581-21972) [n:127.0.0.1:50953_solr c:testCatTime s:shard1 r:core_node2 x:testCatTime_shard1_replica_n1 ] o.a.s.s.IndexSchema [testCatTime_shard1_replica_n1] Schema name=default-config
   [junit4]   2> 2019010 INFO  (qtp1744151581-21972) [n:127.0.0.1:50953_solr c:testCatTime s:shard1 r:core_node2 x:testCatTime_shard1_replica_n1 ] o.a.s.s.IndexSchema Loaded schema default-config/1.6 with uniqueid field id
   [junit4]   2> 2019120 INFO  (qtp1744151581-21972) [n:127.0.0.1:50953_solr c:testCatTime s:shard1 r:core_node2 x:testCatTime_shard1_replica_n1 ] o.a.s.c.CoreContainer Creating SolrCore 'testCatTime_shard1_replica_n1' using configuration from collection testCatTime, trusted=true
   [junit4]   2> 2019120 INFO  (qtp1744151581-21972) [n:127.0.0.1:50953_solr c:testCatTime s:shard1 r:core_node2 x:testCatTime_shard1_replica_n1 ] o.a.s.m.r.SolrJmxReporter JMX monitoring for 'solr_50953.solr.core.testCatTime.shard1.replica_n1' (registry 'solr.core.testCatTime.shard1.replica_n1') enabled at server: com.sun.jmx.mbeanserver.JmxMBeanServer@1742f3a5
   [junit4]   2> 2019122 INFO  (qtp1744151581-21972) [n:127.0.0.1:50953_solr c:testCatTime s:shard1 r:core_node2 x:testCatTime_shard1_replica_n1 ] o.a.s.c.SolrCore [[testCatTime_shard1_replica_n1] ] Opening new SolrCore at [C:\Users\jenkins\workspace\Lucene-Solr-master-Windows\solr\build\solr-core\test\J0\temp\solr.update.processor.DimensionalRoutedAliasUpdateProcessorTest_90D75D12A53B504E-001\tempDir-001\node3\testCatTime_shard1_replica_n1], dataDir=[C:\Users\jenkins\workspace\Lucene-Solr-master-Windows\solr\build\solr-core\test\J0\temp\solr.update.processor.DimensionalRoutedAliasUpdateProcessorTest_90D75D12A53B504E-001\tempDir-001\node3\.\testCatTime_shard1_replica_n1\data\]
   [junit4]   2> 2019129 INFO  (qtp1744151581-21972) [n:127.0.0.1:50953_solr c:testCatTime s:shard1 r:core_node2 x:testCatTime_shard1_replica_n1 ] o.a.s.r.XSLTResponseWriter xsltCacheLifetimeSeconds=5
   [junit4]   2> 2019389 INFO  (qtp1744151581-21972) [n:127.0.0.1:50953_solr c:testCatTime s:shard1 r:core_node2 x:testCatTime_shard1_replica_n1 ] o.a.s.u.UpdateHandler Using UpdateLog implementation: org.apache.solr.update.UpdateLog
   [junit4]   2> 2019389 INFO  (qtp1744151581-21972) [n:127.0.0.1:50953_solr c:testCatTime s:shard1 r:core_node2 x:testCatTime_shard1_replica_n1 ] o.a.s.u.UpdateLog Initializing UpdateLog: dataDir= defaultSyncLevel=FLUSH numRecordsToKeep=100 maxNumLogsToKeep=10 numVersionBuckets=65536
   [junit4]   2> 2019399 INFO  (qtp1744151581-21972) [n:127.0.0.1:50953_solr c:testCatTime s:shard1 r:core_node2 x:testCatTime_shard1_replica_n1 ] o.a.s.u.CommitTracker Hard AutoCommit: if uncommitted for 15000ms;
   [junit4]   2> 2019399 INFO  (qtp1744151581-21972) [n:127.0.0.1:50953_solr c:testCatTime s:shard1 r:core_node2 x:testCatTime_shard1_replica_n1 ] o.a.s.u.CommitTracker Soft AutoCommit: disabled
   [junit4]   2> 2019402 INFO  (qtp1744151581-21972) [n:127.0.0.1:50953_solr c:testCatTime s:shard1 r:core_node2 x:testCatTime_shard1_replica_n1 ] o.a.s.s.SolrIndexSearcher Opening [Searcher@f9901d6[testCatTime_shard1_replica_n1] main]
   [junit4]   2> 2019406 INFO  (qtp1744151581-21972) [n:127.0.0.1:50953_solr c:testCatTime s:shard1 r:core_node2 x:testCatTime_shard1_replica_n1 ] o.a.s.r.ManagedResourceStorage Configured ZooKeeperStorageIO with znodeBase: /configs/testCatTime
   [junit4]   2> 2019407 INFO  (qtp1744151581-21972) [n:127.0.0.1:50953_solr c:testCatTime s:shard1 r:core_node2 x:testCatTime_shard1_replica_n1 ] o.a.s.r.ManagedResourceStorage Loaded null at path _rest_managed.json using ZooKeeperStorageIO:path=/configs/testCatTime
   [junit4]   2> 2019407 INFO  (qtp1744151581-21972) [n:127.0.0.1:50953_solr c:testCatTime s:shard1 r:core_node2 x:testCatTime_shard1_replica_n1 ] o.a.s.s.ZkIndexSchemaReader Creating ZooKeeper watch for the managed schema at /configs/testCatTime/managed-schema
   [junit4]   2> 2019409 INFO  (qtp1744151581-21972) [n:127.0.0.1:50953_solr c:testCatTime s:shard1 r:core_node2 x:testCatTime_shard1_replica_n1 ] o.a.s.s.ZkIndexSchemaReader Current schema version 0 is already the latest
   [junit4]   2> 2019410 INFO  (qtp1744151581-21972) [n:127.0.0.1:50953_solr c:testCatTime s:shard1 r:core_node2 x:testCatTime_shard1_replica_n1 ] o.a.s.h.c.SpellCheckComponent Initializing spell checkers
   [junit4]   2> 2019410 INFO  (qtp1744151581-21972) [n:127.0.0.1:50953_solr c:testCatTime s:shard1 r:core_node2 x:testCatTime_shard1_replica_n1 ] o.a.s.s.DirectSolrSpellChecker init: {name=default,field=_text_,classname=solr.DirectSolrSpellChecker,distanceMeasure=internal,accuracy=0.5,maxEdits=2,minPrefix=1,maxInspections=5,minQueryLength=4,maxQueryFrequency=0.01}
   [junit4]   2> 2019412 INFO  (qtp1744151581-21972) [n:127.0.0.1:50953_solr c:testCatTime s:shard1 r:core_node2 x:testCatTime_shard1_replica_n1 ] o.a.s.h.ReplicationHandler Commits will be reserved for 10000ms.
   [junit4]   2> 2019412 INFO  (qtp1744151581-21972) [n:127.0.0.1:50953_solr c:testCatTime s:shard1 r:core_node2 x:testCatTime_shard1_replica_n1 ] o.a.s.u.UpdateLog Could not find max version in index or recent updates, using new clock 1642625952898875392
   [junit4]   2> 2019417 INFO  (searcherExecutor-7332-thread-1-processing-n:127.0.0.1:50953_solr x:testCatTime_shard1_replica_n1 c:testCatTime s:shard1 r:core_node2) [n:127.0.0.1:50953_solr c:testCatTime s:shard1 r:core_node2 x:testCatTime_shard1_replica_n1 ] o.a.s.c.QuerySenderListener QuerySenderListener sending requests to Searcher@f9901d6[testCatTime_shard1_replica_n1] main{ExitableDirectoryReader(UninvertingDirectoryReader())}
   [junit4]   2> 2019417 INFO  (searcherExecutor-7332-thread-1-processing-n:127.0.0.1:50953_solr x:testCatTime_shard1_replica_n1 c:testCatTime s:shard1 r:core_node2) [n:127.0.0.1:50953_solr c:testCatTime s:shard1 r:core_node2 x:testCatTime_shard1_replica_n1 ] o.a.s.c.QuerySenderListener QuerySenderListener done.
   [junit4]   2> 2019417 INFO  (searcherExecutor-7332-thread-1-processing-n:127.0.0.1:50953_solr x:testCatTime_shard1_replica_n1 c:testCatTime s:shard1 r:core_node2) [n:127.0.0.1:50953_solr c:testCatTime s:shard1 r:core_node2 x:testCatTime_shard1_replica_n1 ] o.a.s.h.c.SpellCheckComponent Loading spell index for spellchecker: default
   [junit4]   2> 2019419 INFO  (searcherExecutor-7332-thread-1-processing-n:127.0.0.1:50953_solr x:testCatTime_shard1_replica_n1 c:testCatTime s:shard1 r:core_node2) [n:127.0.0.1:50953_solr c:testCatTime s:shard1 r:core_node2 x:testCatTime_shard1_replica_n1 ] o.a.s.c.SolrCore [testCatTime_shard1_replica_n1] Registered new searcher Searcher@f9901d6[testCatTime_shard1_replica_n1] main{ExitableDirectoryReader(UninvertingDirectoryReader())}
   [junit4]   2> 2019424 INFO  (qtp1744151581-21972) [n:127.0.0.1:50953_solr c:testCatTime s:shard1 r:core_node2 x:testCatTime_shard1_replica_n1 ] o.a.s.c.ZkShardTerms Successful update of terms at /collections/testCatTime/terms/shard1 to Terms{values={core_node2=0}, version=0}
   [junit4]   2> 2019424 INFO  (qtp1744151581-21972) [n:127.0.0.1:50953_solr c:testCatTime s:shard1 r:core_node2 x:testCatTime_shard1_replica_n1 ] o.a.s.c.ShardLeaderElectionContextBase make sure parent is created /collections/testCatTime/leaders/shard1
   [junit4]   2> 2019432 INFO  (qtp1744151581-21972) [n:127.0.0.1:50953_solr c:testCatTime s:shard1 r:core_node2 x:testCatTime_shard1_replica_n1 ] o.a.s.c.ShardLeaderElectionContext Enough replicas found to continue.
   [junit4]   2> 2019432 INFO  (qtp1744151581-21972) [n:127.0.0.1:50953_solr c:testCatTime s:shard1 r:core_node2 x:testCatTime_shard1_replica_n1 ] o.a.s.c.ShardLeaderElectionContext I may be the new leader - try and sync
   [junit4]   2> 2019432 INFO  (qtp1744151581-21972) [n:127.0.0.1:50953_solr c:testCatTime s:shard1 r:core_node2 x:testCatTime_shard1_replica_n1 ] o.a.s.c.SyncStrategy Sync replicas to http://127.0.0.1:50953/solr/testCatTime_shard1_replica_n1/
   [junit4]   2> 2019433 INFO  (qtp1744151581-21972) [n:127.0.0.1:50953_solr c:testCatTime s:shard1 r:core_node2 x:testCatTime_shard1_replica_n1 ] o.a.s.c.SyncStrategy Sync Success - now sync replicas to me
   [junit4]   2> 2019433 INFO  (qtp1744151581-21972) [n:127.0.0.1:50953_solr c:testCatTime s:shard1 r:core_node2 x:testCatTime_shard1_replica_n1 ] o.a.s.c.SyncStrategy http://127.0.0.1:50953/solr/testCatTime_shard1_replica_n1/ has no replicas
   [junit4]   2> 2019433 INFO  (qtp1744151581-21972) [n:127.0.0.1:50953_solr c:testCatTime s:shard1 r:core_node2 x:testCatTime_shard1_replica_n1 ] o.a.s.c.ShardLeaderElectionContextBase Creating leader registration node /collections/testCatTime/leaders/shard1/leader after winning as /collections/testCatTime/leader_elect/shard1/election/72099871108169740-core_node2-n_0000000000
   [junit4]   2> 2019438 INFO  (qtp1744151581-21972) [n:127.0.0.1:50953_solr c:testCatTime s:shard1 r:core_node2 x:testCatTime_shard1_replica_n1 ] o.a.s.c.ShardLeaderElectionContext I am the new leader: http://127.0.0.1:50953/solr/testCatTime_shard1_replica_n1/ shard1
   [junit4]   2> 2019585 INFO  (zkCallback-7837-thread-1) [     ] o.a.s.c.c.ZkStateReader A cluster state change: [WatchedEvent state:SyncConnected type:NodeDataChanged path:/collections/testCatTime/state.json] for collection [testCatTime] has occurred - updating... (live nodes size: [4])
   [junit4]   2> 2019587 INFO  (qtp1744151581-21972) [n:127.0.0.1:50953_solr c:testCatTime s:shard1 r:core_node2 x:testCatTime_shard1_replica_n1 ] o.a.s.c.ZkController I am the leader, no recovery necessary
   [junit4]   2> 2019591 INFO  (zkCallback-7837-thread-2) [     ] o.a.s.c.c.ZkStateReader A cluster state change: [WatchedEvent state:SyncConnected type:NodeDataChanged path:/collections/testCatTime/state.json] for collection [testCatTime] has occurred - updating... (live nodes size: [4])
   [junit4]   2> 2019600 INFO  (qtp1744151581-21972) [n:127.0.0.1:50953_solr c:testCatTime s:shard1 r:core_node2 x:testCatTime_shard1_replica_n1 ] o.a.s.s.HttpSolrCall [admin] webapp=null path=/admin/cores params={qt=/admin/cores&coreNodeN

[...truncated too long message...]

d identifier in a future release
    [javac]               yield(l);
    [javac]               ^
    [javac]   (to invoke a method called yield, qualify the yield with a receiver or type name)
    [javac] Note: Some input files use or override a deprecated API.
    [javac] Note: Recompile with -Xlint:deprecation for details.
    [javac] Note: Some input files use unchecked or unsafe operations.
    [javac] Note: Recompile with -Xlint:unchecked for details.
    [javac] 5 warnings
     [copy] Copying 1 file to C:\Users\jenkins\workspace\Lucene-Solr-master-Windows\solr\build\solr-core\classes\test

common-solr.compile-test:

compile-test:

BUILD SUCCESSFUL
Total time: 1 minute 9 seconds
[repro] ant test-nocompile -Dtests.dups=5 -Dtests.maxfailures=5 -Dtests.class="*.DimensionalRoutedAliasUpdateProcessorTest" -Dtests.showOutput=onerror "-Dargs=-XX:-UseCompressedOops -XX:+UseG1GC" -Dtests.seed=90D75D12A53B504E -Dtests.slow=true -Dtests.locale=dje-NE -Dtests.timezone=America/Montserrat -Dtests.asserts=true -Dtests.file.encoding=US-ASCII
Buildfile: C:\Users\jenkins\workspace\Lucene-Solr-master-Windows\solr\core\build.xml

-clover.disable:

ivy-configure:
[ivy:configure] :: Apache Ivy 2.4.0 - 20141213170938 :: http://ant.apache.org/ivy/ ::
[ivy:configure] :: loading settings :: file = C:\Users\jenkins\workspace\Lucene-Solr-master-Windows\lucene\top-level-ivy-settings.xml

install-junit4-taskdef:

ivy-availability-check:
[loadresource] Do not set property disallowed.ivy.jars.list as its length is 0.

-ivy-fail-disallowed-ivy-version:

ivy-fail:

resolve-groovy:
[ivy:cachepath] :: resolving dependencies :: org.codehaus.groovy#groovy-all-caller;working
[ivy:cachepath] confs: [default]
[ivy:cachepath] found org.codehaus.groovy#groovy-all;2.4.16 in public
[ivy:cachepath] :: resolution report :: resolve 26ms :: artifacts dl 2ms
        ---------------------------------------------------------------------
        |                  |            modules            ||   artifacts   |
        |       conf       | number| search|dwnlded|evicted|| number|dwnlded|
        ---------------------------------------------------------------------
        |      default     |   1   |   0   |   0   |   0   ||   1   |   0   |
        ---------------------------------------------------------------------

-init-totals:

-test:
    [mkdir] Created dir: C:\Users\jenkins\workspace\Lucene-Solr-master-Windows\solr\build\solr-core\test
[junit4:pickseed] Seed property 'tests.seed' already defined: 90D75D12A53B504E
    [mkdir] Created dir: C:\Users\jenkins\workspace\Lucene-Solr-master-Windows\solr\build\solr-core\test\temp
   [junit4] <JUnit4> says ahoj! Master seed: 90D75D12A53B504E
   [junit4] Your default console's encoding may not display certain unicode glyphs: windows-1252
   [junit4] Executing 5 suites with 2 JVMs.
   [junit4]
   [junit4] Started J1 PID(8004@serv1-vm1).
   [junit4] Started J0 PID(11808@serv1-vm1).
   [junit4] HEARTBEAT J1 PID(8004@serv1-vm1): 2019-08-23T04:49:29, stalled for 64.2s at: DimensionalRoutedAliasUpdateProcessorTest.testCatTime
   [junit4] HEARTBEAT J0 PID(11808@serv1-vm1): 2019-08-23T04:49:29, stalled for 64.2s at: DimensionalRoutedAliasUpdateProcessorTest.testCatTime
   [junit4] HEARTBEAT J0 PID(11808@serv1-vm1): 2019-08-23T04:51:13, stalled for 60.5s at: DimensionalRoutedAliasUpdateProcessorTest.testTimeCat
   [junit4] HEARTBEAT J1 PID(8004@serv1-vm1): 2019-08-23T04:51:13, stalled for 60.6s at: DimensionalRoutedAliasUpdateProcessorTest.testTimeCat
   [junit4] Suite: org.apache.solr.update.processor.DimensionalRoutedAliasUpdateProcessorTest
   [junit4] OK       107s J0 | DimensionalRoutedAliasUpdateProcessorTest.testCatTime
   [junit4] OK      77.5s J0 | DimensionalRoutedAliasUpdateProcessorTest.testTimeCat
   [junit4] Completed [1/5] on J0 in 193.66s, 2 tests
   [junit4]
   [junit4] Suite: org.apache.solr.update.processor.DimensionalRoutedAliasUpdateProcessorTest
   [junit4] OK       107s J1 | DimensionalRoutedAliasUpdateProcessorTest.testCatTime
   [junit4] OK      77.5s J1 | DimensionalRoutedAliasUpdateProcessorTest.testTimeCat
   [junit4] Completed [2/5] on J1 in 194.12s, 2 tests
   [junit4]
   [junit4] HEARTBEAT J1 PID(8004@serv1-vm1): 2019-08-23T04:52:39, stalled for 68.6s at: DimensionalRoutedAliasUpdateProcessorTest.testCatTime
   [junit4] HEARTBEAT J0 PID(11808@serv1-vm1): 2019-08-23T04:52:39, stalled for 69.1s at: DimensionalRoutedAliasUpdateProcessorTest.testCatTime
   [junit4] HEARTBEAT J0 PID(11808@serv1-vm1): 2019-08-23T04:53:50, stalled for 60.7s at: DimensionalRoutedAliasUpdateProcessorTest.testTimeCat
   [junit4] HEARTBEAT J1 PID(8004@serv1-vm1): 2019-08-23T04:53:50, stalled for 60.5s at: DimensionalRoutedAliasUpdateProcessorTest.testTimeCat
   [junit4] Suite: org.apache.solr.update.processor.DimensionalRoutedAliasUpdateProcessorTest
   [junit4] OK      79.6s J0 | DimensionalRoutedAliasUpdateProcessorTest.testCatTime
   [junit4] OK      78.6s J0 | DimensionalRoutedAliasUpdateProcessorTest.testTimeCat
   [junit4] Completed [3/5] on J0 in 158.53s, 2 tests
   [junit4]
   [junit4] Suite: org.apache.solr.update.processor.DimensionalRoutedAliasUpdateProcessorTest
   [junit4] OK      79.4s J1 | DimensionalRoutedAliasUpdateProcessorTest.testCatTime
   [junit4] OK      78.4s J1 | DimensionalRoutedAliasUpdateProcessorTest.testTimeCat
   [junit4] Completed [4/5] on J1 in 158.19s, 2 tests
   [junit4]
   [junit4] Suite: org.apache.solr.update.processor.DimensionalRoutedAliasUpdateProcessorTest
   [junit4] OK      53.7s J0 | DimensionalRoutedAliasUpdateProcessorTest.testCatTime
   [junit4] OK      67.7s J0 | DimensionalRoutedAliasUpdateProcessorTest.testTimeCat
   [junit4] Completed [5/5] on J0 in 121.87s, 2 tests
   [junit4]
   [junit4] JVM J0:     0.86 ..   476.28 =   475.42s
   [junit4] JVM J1:     0.82 ..   354.11 =   353.28s
   [junit4] Execution time total: 7 minutes 56 seconds
   [junit4] Tests summary: 5 suites, 10 tests
   [junit4] Could not remove temporary path: C:\Users\jenkins\workspace\Lucene-Solr-master-Windows\solr\build\solr-core\test\J1 (java.nio.file.DirectoryNotEmptyException: Remaining files: [C:\Users\jenkins\workspace\Lucene-Solr-master-Windows\solr\build\solr-core\test\J1\temp])
   [junit4] Could not remove temporary path: C:\Users\jenkins\workspace\Lucene-Solr-master-Windows\solr\build\solr-core\test\J0 (java.nio.file.DirectoryNotEmptyException: Remaining files: [C:\Users\jenkins\workspace\Lucene-Solr-master-Windows\solr\build\solr-core\test\J0\temp])
     [echo] 5 slowest tests:
[junit4:tophints] 273.24s | org.apache.solr.cloud.autoscaling.IndexSizeTriggerTest
[junit4:tophints] 264.24s | org.apache.solr.cloud.api.collections.ShardSplitTest
[junit4:tophints] 185.83s | org.apache.solr.search.facet.TestJsonFacets
[junit4:tophints] 179.83s | org.apache.solr.cloud.ReplicationFactorTest
[junit4:tophints] 157.86s | org.apache.solr.cloud.CollectionsAPISolrJTest

-check-totals:
WARNING: An illegal reflective access operation has occurred
WARNING: Illegal reflective access by org.codehaus.groovy.reflection.CachedClass (file:/C:/Users/jenkins/.ivy2/cache/org.codehaus.groovy/groovy-all/jars/groovy-all-2.4.16.jar) to method java.lang.Object.finalize()
WARNING: Please consider reporting this to the maintainers of org.codehaus.groovy.reflection.CachedClass
WARNING: Use --illegal-access=warn to enable warnings of further illegal reflective access operations
WARNING: All illegal access operations will be denied in a future release

test-nocompile:

BUILD SUCCESSFUL
Total time: 7 minutes 59 seconds
[repro] Failures:
[repro]   0/5 failed: org.apache.solr.update.processor.DimensionalRoutedAliasUpdateProcessorTest
[repro]   1/5 failed: org.apache.solr.client.solrj.io.stream.StreamExpressionTest
[repro] Exiting with code 1

C:\Users\jenkins\workspace\Lucene-Solr-master-Windows>IF EXIST lucene\build move /y lucene\build lucene\build.repro
        1 dir(s) moved.

C:\Users\jenkins\workspace\Lucene-Solr-master-Windows>IF EXIST solr\build move /y solr\build solr\build.repro
        1 dir(s) moved.

C:\Users\jenkins\workspace\Lucene-Solr-master-Windows>IF EXIST lucene\build.orig move /y lucene\build.orig lucene\build
        1 dir(s) moved.

C:\Users\jenkins\workspace\Lucene-Solr-master-Windows>IF EXIST solr\build.orig move /y solr\build.orig solr\build
        1 dir(s) moved.

C:\Users\jenkins\workspace\Lucene-Solr-master-Windows>exit 0
Archiving artifacts
Setting ANT_1_8_2_HOME=C:\Users\jenkins\tools\hudson.tasks.Ant_AntInstallation\ANT_1.8.2
[WARNINGS] Parsing warnings in console log with parser Java Compiler (javac)
Setting ANT_1_8_2_HOME=C:\Users\jenkins\tools\hudson.tasks.Ant_AntInstallation\ANT_1.8.2
No credentials specified
Setting ANT_1_8_2_HOME=C:\Users\jenkins\tools\hudson.tasks.Ant_AntInstallation\ANT_1.8.2
<Git Blamer> Using GitBlamer to create author and commit information for all warnings.
<Git Blamer> GIT_COMMIT=1cbc5eaf51dc5e3c2bfefc014477c73db3e85b98, workspace=C:\Users\jenkins\workspace\Lucene-Solr-master-Windows
[WARNINGS] Computing warning deltas based on reference build #8102
Recording test results
Setting ANT_1_8_2_HOME=C:\Users\jenkins\tools\hudson.tasks.Ant_AntInstallation\ANT_1.8.2
Build step 'Publish JUnit test result report' changed build result to UNSTABLE
Email was triggered for: Unstable (Test Failures)
Sending email for trigger: Unstable (Test Failures)
Setting ANT_1_8_2_HOME=C:\Users\jenkins\tools\hudson.tasks.Ant_AntInstallation\ANT_1.8.2
Setting ANT_1_8_2_HOME=C:\Users\jenkins\tools\hudson.tasks.Ant_AntInstallation\ANT_1.8.2
Setting ANT_1_8_2_HOME=C:\Users\jenkins\tools\hudson.tasks.Ant_AntInstallation\ANT_1.8.2
Setting ANT_1_8_2_HOME=C:\Users\jenkins\tools\hudson.tasks.Ant_AntInstallation\ANT_1.8.2
Setting ANT_1_8_2_HOME=C:\Users\jenkins\tools\hudson.tasks.Ant_AntInstallation\ANT_1.8.2
Setting ANT_1_8_2_HOME=C:\Users\jenkins\tools\hudson.tasks.Ant_AntInstallation\ANT_1.8.2


---------------------------------------------------------------------
To unsubscribe, e-mail: [hidden email]
For additional commands, e-mail: [hidden email]
Reply | Threaded
Open this post in threaded view
|

[JENKINS] Lucene-Solr-master-Windows (64bit/jdk-12.0.1) - Build # 8104 - Still Unstable!

Policeman Jenkins Server-2
Build: https://jenkins.thetaphi.de/job/Lucene-Solr-master-Windows/8104/
Java: 64bit/jdk-12.0.1 -XX:+UseCompressedOops -XX:+UseSerialGC

21 tests failed.
FAILED:  org.apache.solr.ltr.store.rest.TestModelManagerPersistence.testFilePersistence

Error Message:
Software caused connection abort: recv failed

Stack Trace:
javax.net.ssl.SSLException: Software caused connection abort: recv failed
        at __randomizedtesting.SeedInfo.seed([8DEEF5F94E5FF5D1:AF4F9184EB339394]:0)
        at java.base/sun.security.ssl.Alert.createSSLException(Alert.java:127)
        at java.base/sun.security.ssl.TransportContext.fatal(TransportContext.java:320)
        at java.base/sun.security.ssl.TransportContext.fatal(TransportContext.java:263)
        at java.base/sun.security.ssl.TransportContext.fatal(TransportContext.java:258)
        at java.base/sun.security.ssl.SSLSocketImpl.handleException(SSLSocketImpl.java:1342)
        at java.base/sun.security.ssl.SSLSocketImpl$AppInputStream.read(SSLSocketImpl.java:844)
        at org.apache.http.impl.io.SessionInputBufferImpl.streamRead(SessionInputBufferImpl.java:137)
        at org.apache.http.impl.io.SessionInputBufferImpl.fillBuffer(SessionInputBufferImpl.java:153)
        at org.apache.http.impl.io.SessionInputBufferImpl.readLine(SessionInputBufferImpl.java:282)
        at org.apache.http.impl.conn.DefaultHttpResponseParser.parseHead(DefaultHttpResponseParser.java:138)
        at org.apache.http.impl.conn.DefaultHttpResponseParser.parseHead(DefaultHttpResponseParser.java:56)
        at org.apache.http.impl.io.AbstractMessageParser.parse(AbstractMessageParser.java:259)
        at org.apache.http.impl.DefaultBHttpClientConnection.receiveResponseHeader(DefaultBHttpClientConnection.java:163)
        at org.apache.http.impl.conn.CPoolProxy.receiveResponseHeader(CPoolProxy.java:165)
        at org.apache.http.protocol.HttpRequestExecutor.doReceiveResponse(HttpRequestExecutor.java:273)
        at org.apache.http.protocol.HttpRequestExecutor.execute(HttpRequestExecutor.java:125)
        at org.apache.http.impl.execchain.MainClientExec.execute(MainClientExec.java:272)
        at org.apache.http.impl.execchain.ProtocolExec.execute(ProtocolExec.java:185)
        at org.apache.http.impl.execchain.RetryExec.execute(RetryExec.java:89)
        at org.apache.http.impl.execchain.RedirectExec.execute(RedirectExec.java:110)
        at org.apache.http.impl.client.InternalHttpClient.doExecute(InternalHttpClient.java:185)
        at org.apache.http.impl.client.CloseableHttpClient.execute(CloseableHttpClient.java:83)
        at org.apache.solr.util.RestTestHarness.getResponse(RestTestHarness.java:215)
        at org.apache.solr.util.RestTestHarness.query(RestTestHarness.java:107)
        at org.apache.solr.util.RestTestBase.assertJQ(RestTestBase.java:226)
        at org.apache.solr.util.RestTestBase.assertJQ(RestTestBase.java:192)
        at org.apache.solr.ltr.store.rest.TestModelManagerPersistence.testFilePersistence(TestModelManagerPersistence.java:168)
        at java.base/jdk.internal.reflect.NativeMethodAccessorImpl.invoke0(Native Method)
        at java.base/jdk.internal.reflect.NativeMethodAccessorImpl.invoke(NativeMethodAccessorImpl.java:62)
        at java.base/jdk.internal.reflect.DelegatingMethodAccessorImpl.invoke(DelegatingMethodAccessorImpl.java:43)
        at java.base/java.lang.reflect.Method.invoke(Method.java:567)
        at com.carrotsearch.randomizedtesting.RandomizedRunner.invoke(RandomizedRunner.java:1750)
        at com.carrotsearch.randomizedtesting.RandomizedRunner$8.evaluate(RandomizedRunner.java:938)
        at com.carrotsearch.randomizedtesting.RandomizedRunner$9.evaluate(RandomizedRunner.java:974)
        at com.carrotsearch.randomizedtesting.RandomizedRunner$10.evaluate(RandomizedRunner.java:988)
        at com.carrotsearch.randomizedtesting.rules.SystemPropertiesRestoreRule$1.evaluate(SystemPropertiesRestoreRule.java:57)
        at org.apache.lucene.util.TestRuleSetupTeardownChained$1.evaluate(TestRuleSetupTeardownChained.java:49)
        at org.apache.lucene.util.AbstractBeforeAfterRule$1.evaluate(AbstractBeforeAfterRule.java:45)
        at org.apache.lucene.util.TestRuleThreadAndTestName$1.evaluate(TestRuleThreadAndTestName.java:48)
        at org.apache.lucene.util.TestRuleIgnoreAfterMaxFailures$1.evaluate(TestRuleIgnoreAfterMaxFailures.java:64)
        at org.apache.lucene.util.TestRuleMarkFailure$1.evaluate(TestRuleMarkFailure.java:47)
        at com.carrotsearch.randomizedtesting.rules.StatementAdapter.evaluate(StatementAdapter.java:36)
        at com.carrotsearch.randomizedtesting.ThreadLeakControl$StatementRunner.run(ThreadLeakControl.java:368)
        at com.carrotsearch.randomizedtesting.ThreadLeakControl.forkTimeoutingTask(ThreadLeakControl.java:817)
        at com.carrotsearch.randomizedtesting.ThreadLeakControl$3.evaluate(ThreadLeakControl.java:468)
        at com.carrotsearch.randomizedtesting.RandomizedRunner.runSingleTest(RandomizedRunner.java:947)
        at com.carrotsearch.randomizedtesting.RandomizedRunner$5.evaluate(RandomizedRunner.java:832)
        at com.carrotsearch.randomizedtesting.RandomizedRunner$6.evaluate(RandomizedRunner.java:883)
        at com.carrotsearch.randomizedtesting.RandomizedRunner$7.evaluate(RandomizedRunner.java:894)
        at com.carrotsearch.randomizedtesting.rules.StatementAdapter.evaluate(StatementAdapter.java:36)
        at com.carrotsearch.randomizedtesting.rules.SystemPropertiesRestoreRule$1.evaluate(SystemPropertiesRestoreRule.java:57)
        at org.apache.lucene.util.AbstractBeforeAfterRule$1.evaluate(AbstractBeforeAfterRule.java:45)
        at com.carrotsearch.randomizedtesting.rules.StatementAdapter.evaluate(StatementAdapter.java:36)
        at org.apache.lucene.util.TestRuleStoreClassName$1.evaluate(TestRuleStoreClassName.java:41)
        at com.carrotsearch.randomizedtesting.rules.NoShadowingOrOverridesOnMethodsRule$1.evaluate(NoShadowingOrOverridesOnMethodsRule.java:40)
        at com.carrotsearch.randomizedtesting.rules.NoShadowingOrOverridesOnMethodsRule$1.evaluate(NoShadowingOrOverridesOnMethodsRule.java:40)
        at com.carrotsearch.randomizedtesting.rules.StatementAdapter.evaluate(StatementAdapter.java:36)
        at com.carrotsearch.randomizedtesting.rules.StatementAdapter.evaluate(StatementAdapter.java:36)
        at org.apache.lucene.util.TestRuleAssertionsRequired$1.evaluate(TestRuleAssertionsRequired.java:53)
        at org.apache.lucene.util.TestRuleMarkFailure$1.evaluate(TestRuleMarkFailure.java:47)
        at org.apache.lucene.util.TestRuleIgnoreAfterMaxFailures$1.evaluate(TestRuleIgnoreAfterMaxFailures.java:64)
        at org.apache.lucene.util.TestRuleIgnoreTestSuites$1.evaluate(TestRuleIgnoreTestSuites.java:54)
        at com.carrotsearch.randomizedtesting.rules.StatementAdapter.evaluate(StatementAdapter.java:36)
        at com.carrotsearch.randomizedtesting.ThreadLeakControl$StatementRunner.run(ThreadLeakControl.java:368)
        at java.base/java.lang.Thread.run(Thread.java:835)
        Suppressed: java.net.SocketException: Software caused connection abort: socket write error
                at java.base/java.net.SocketOutputStream.socketWrite0(Native Method)
                at java.base/java.net.SocketOutputStream.socketWrite(SocketOutputStream.java:110)
                at java.base/java.net.SocketOutputStream.write(SocketOutputStream.java:150)
                at java.base/sun.security.ssl.SSLSocketOutputRecord.encodeAlert(SSLSocketOutputRecord.java:81)
                at java.base/sun.security.ssl.TransportContext.fatal(TransportContext.java:351)
                ... 63 more
Caused by: java.net.SocketException: Software caused connection abort: recv failed
        at java.base/java.net.SocketInputStream.socketRead0(Native Method)
        at java.base/java.net.SocketInputStream.socketRead(SocketInputStream.java:115)
        at java.base/java.net.SocketInputStream.read(SocketInputStream.java:168)
        at java.base/java.net.SocketInputStream.read(SocketInputStream.java:140)
        at java.base/sun.security.ssl.SSLSocketInputRecord.read(SSLSocketInputRecord.java:448)
        at java.base/sun.security.ssl.SSLSocketInputRecord.bytesInCompletePacket(SSLSocketInputRecord.java:68)
        at java.base/sun.security.ssl.SSLSocketImpl.readApplicationRecord(SSLSocketImpl.java:1132)
        at java.base/sun.security.ssl.SSLSocketImpl$AppInputStream.read(SSLSocketImpl.java:828)
        ... 59 more


FAILED:  org.apache.solr.ltr.store.rest.TestModelManagerPersistence.testWrapperModelPersistence

Error Message:
List size mismatch @ models

Stack Trace:
java.lang.RuntimeException: List size mismatch @ models
        at __randomizedtesting.SeedInfo.seed([8DEEF5F94E5FF5D1:F8848627F1A38C94]:0)
        at org.apache.solr.util.RestTestBase.assertJQ(RestTestBase.java:248)
        at org.apache.solr.util.RestTestBase.assertJQ(RestTestBase.java:192)
        at org.apache.solr.ltr.store.rest.TestModelManagerPersistence.testWrapperModelPersistence(TestModelManagerPersistence.java:221)
        at java.base/jdk.internal.reflect.NativeMethodAccessorImpl.invoke0(Native Method)
        at java.base/jdk.internal.reflect.NativeMethodAccessorImpl.invoke(NativeMethodAccessorImpl.java:62)
        at java.base/jdk.internal.reflect.DelegatingMethodAccessorImpl.invoke(DelegatingMethodAccessorImpl.java:43)
        at java.base/java.lang.reflect.Method.invoke(Method.java:567)
        at com.carrotsearch.randomizedtesting.RandomizedRunner.invoke(RandomizedRunner.java:1750)
        at com.carrotsearch.randomizedtesting.RandomizedRunner$8.evaluate(RandomizedRunner.java:938)
        at com.carrotsearch.randomizedtesting.RandomizedRunner$9.evaluate(RandomizedRunner.java:974)
        at com.carrotsearch.randomizedtesting.RandomizedRunner$10.evaluate(RandomizedRunner.java:988)
        at com.carrotsearch.randomizedtesting.rules.SystemPropertiesRestoreRule$1.evaluate(SystemPropertiesRestoreRule.java:57)
        at org.apache.lucene.util.TestRuleSetupTeardownChained$1.evaluate(TestRuleSetupTeardownChained.java:49)
        at org.apache.lucene.util.AbstractBeforeAfterRule$1.evaluate(AbstractBeforeAfterRule.java:45)
        at org.apache.lucene.util.TestRuleThreadAndTestName$1.evaluate(TestRuleThreadAndTestName.java:48)
        at org.apache.lucene.util.TestRuleIgnoreAfterMaxFailures$1.evaluate(TestRuleIgnoreAfterMaxFailures.java:64)
        at org.apache.lucene.util.TestRuleMarkFailure$1.evaluate(TestRuleMarkFailure.java:47)
        at com.carrotsearch.randomizedtesting.rules.StatementAdapter.evaluate(StatementAdapter.java:36)
        at com.carrotsearch.randomizedtesting.ThreadLeakControl$StatementRunner.run(ThreadLeakControl.java:368)
        at com.carrotsearch.randomizedtesting.ThreadLeakControl.forkTimeoutingTask(ThreadLeakControl.java:817)
        at com.carrotsearch.randomizedtesting.ThreadLeakControl$3.evaluate(ThreadLeakControl.java:468)
        at com.carrotsearch.randomizedtesting.RandomizedRunner.runSingleTest(RandomizedRunner.java:947)
        at com.carrotsearch.randomizedtesting.RandomizedRunner$5.evaluate(RandomizedRunner.java:832)
        at com.carrotsearch.randomizedtesting.RandomizedRunner$6.evaluate(RandomizedRunner.java:883)
        at com.carrotsearch.randomizedtesting.RandomizedRunner$7.evaluate(RandomizedRunner.java:894)
        at com.carrotsearch.randomizedtesting.rules.StatementAdapter.evaluate(StatementAdapter.java:36)
        at com.carrotsearch.randomizedtesting.rules.SystemPropertiesRestoreRule$1.evaluate(SystemPropertiesRestoreRule.java:57)
        at org.apache.lucene.util.AbstractBeforeAfterRule$1.evaluate(AbstractBeforeAfterRule.java:45)
        at com.carrotsearch.randomizedtesting.rules.StatementAdapter.evaluate(StatementAdapter.java:36)
        at org.apache.lucene.util.TestRuleStoreClassName$1.evaluate(TestRuleStoreClassName.java:41)
        at com.carrotsearch.randomizedtesting.rules.NoShadowingOrOverridesOnMethodsRule$1.evaluate(NoShadowingOrOverridesOnMethodsRule.java:40)
        at com.carrotsearch.randomizedtesting.rules.NoShadowingOrOverridesOnMethodsRule$1.evaluate(NoShadowingOrOverridesOnMethodsRule.java:40)
        at com.carrotsearch.randomizedtesting.rules.StatementAdapter.evaluate(StatementAdapter.java:36)
        at com.carrotsearch.randomizedtesting.rules.StatementAdapter.evaluate(StatementAdapter.java:36)
        at org.apache.lucene.util.TestRuleAssertionsRequired$1.evaluate(TestRuleAssertionsRequired.java:53)
        at org.apache.lucene.util.TestRuleMarkFailure$1.evaluate(TestRuleMarkFailure.java:47)
        at org.apache.lucene.util.TestRuleIgnoreAfterMaxFailures$1.evaluate(TestRuleIgnoreAfterMaxFailures.java:64)
        at org.apache.lucene.util.TestRuleIgnoreTestSuites$1.evaluate(TestRuleIgnoreTestSuites.java:54)
        at com.carrotsearch.randomizedtesting.rules.StatementAdapter.evaluate(StatementAdapter.java:36)
        at com.carrotsearch.randomizedtesting.ThreadLeakControl$StatementRunner.run(ThreadLeakControl.java:368)
        at java.base/java.lang.Thread.run(Thread.java:835)


FAILED:  org.apache.solr.ltr.store.rest.TestModelManagerPersistence.testInnerCustomClassesPersistence

Error Message:
mismatch: 'model42'!='6029760550880411648' @ models/[0]/name

Stack Trace:
java.lang.RuntimeException: mismatch: 'model42'!='6029760550880411648' @ models/[0]/name
        at __randomizedtesting.SeedInfo.seed([8DEEF5F94E5FF5D1:A4EBDECC88B3D3BD]:0)
        at org.apache.solr.util.RestTestBase.assertJQ(RestTestBase.java:248)
        at org.apache.solr.util.RestTestBase.assertJQ(RestTestBase.java:192)
        at org.apache.solr.ltr.store.rest.TestModelManagerPersistence.testInnerCustomClassesPersistence(TestModelManagerPersistence.java:310)
        at java.base/jdk.internal.reflect.NativeMethodAccessorImpl.invoke0(Native Method)
        at java.base/jdk.internal.reflect.NativeMethodAccessorImpl.invoke(NativeMethodAccessorImpl.java:62)
        at java.base/jdk.internal.reflect.DelegatingMethodAccessorImpl.invoke(DelegatingMethodAccessorImpl.java:43)
        at java.base/java.lang.reflect.Method.invoke(Method.java:567)
        at com.carrotsearch.randomizedtesting.RandomizedRunner.invoke(RandomizedRunner.java:1750)
        at com.carrotsearch.randomizedtesting.RandomizedRunner$8.evaluate(RandomizedRunner.java:938)
        at com.carrotsearch.randomizedtesting.RandomizedRunner$9.evaluate(RandomizedRunner.java:974)
        at com.carrotsearch.randomizedtesting.RandomizedRunner$10.evaluate(RandomizedRunner.java:988)
        at com.carrotsearch.randomizedtesting.rules.SystemPropertiesRestoreRule$1.evaluate(SystemPropertiesRestoreRule.java:57)
        at org.apache.lucene.util.TestRuleSetupTeardownChained$1.evaluate(TestRuleSetupTeardownChained.java:49)
        at org.apache.lucene.util.AbstractBeforeAfterRule$1.evaluate(AbstractBeforeAfterRule.java:45)
        at org.apache.lucene.util.TestRuleThreadAndTestName$1.evaluate(TestRuleThreadAndTestName.java:48)
        at org.apache.lucene.util.TestRuleIgnoreAfterMaxFailures$1.evaluate(TestRuleIgnoreAfterMaxFailures.java:64)
        at org.apache.lucene.util.TestRuleMarkFailure$1.evaluate(TestRuleMarkFailure.java:47)
        at com.carrotsearch.randomizedtesting.rules.StatementAdapter.evaluate(StatementAdapter.java:36)
        at com.carrotsearch.randomizedtesting.ThreadLeakControl$StatementRunner.run(ThreadLeakControl.java:368)
        at com.carrotsearch.randomizedtesting.ThreadLeakControl.forkTimeoutingTask(ThreadLeakControl.java:817)
        at com.carrotsearch.randomizedtesting.ThreadLeakControl$3.evaluate(ThreadLeakControl.java:468)
        at com.carrotsearch.randomizedtesting.RandomizedRunner.runSingleTest(RandomizedRunner.java:947)
        at com.carrotsearch.randomizedtesting.RandomizedRunner$5.evaluate(RandomizedRunner.java:832)
        at com.carrotsearch.randomizedtesting.RandomizedRunner$6.evaluate(RandomizedRunner.java:883)
        at com.carrotsearch.randomizedtesting.RandomizedRunner$7.evaluate(RandomizedRunner.java:894)
        at com.carrotsearch.randomizedtesting.rules.StatementAdapter.evaluate(StatementAdapter.java:36)
        at com.carrotsearch.randomizedtesting.rules.SystemPropertiesRestoreRule$1.evaluate(SystemPropertiesRestoreRule.java:57)
        at org.apache.lucene.util.AbstractBeforeAfterRule$1.evaluate(AbstractBeforeAfterRule.java:45)
        at com.carrotsearch.randomizedtesting.rules.StatementAdapter.evaluate(StatementAdapter.java:36)
        at org.apache.lucene.util.TestRuleStoreClassName$1.evaluate(TestRuleStoreClassName.java:41)
        at com.carrotsearch.randomizedtesting.rules.NoShadowingOrOverridesOnMethodsRule$1.evaluate(NoShadowingOrOverridesOnMethodsRule.java:40)
        at com.carrotsearch.randomizedtesting.rules.NoShadowingOrOverridesOnMethodsRule$1.evaluate(NoShadowingOrOverridesOnMethodsRule.java:40)
        at com.carrotsearch.randomizedtesting.rules.StatementAdapter.evaluate(StatementAdapter.java:36)
        at com.carrotsearch.randomizedtesting.rules.StatementAdapter.evaluate(StatementAdapter.java:36)
        at org.apache.lucene.util.TestRuleAssertionsRequired$1.evaluate(TestRuleAssertionsRequired.java:53)
        at org.apache.lucene.util.TestRuleMarkFailure$1.evaluate(TestRuleMarkFailure.java:47)
        at org.apache.lucene.util.TestRuleIgnoreAfterMaxFailures$1.evaluate(TestRuleIgnoreAfterMaxFailures.java:64)
        at org.apache.lucene.util.TestRuleIgnoreTestSuites$1.evaluate(TestRuleIgnoreTestSuites.java:54)
        at com.carrotsearch.randomizedtesting.rules.StatementAdapter.evaluate(StatementAdapter.java:36)
        at com.carrotsearch.randomizedtesting.ThreadLeakControl$StatementRunner.run(ThreadLeakControl.java:368)
        at java.base/java.lang.Thread.run(Thread.java:835)


FAILED:  org.apache.solr.ltr.store.rest.TestModelManagerPersistence.testFilePersistence

Error Message:
Software caused connection abort: recv failed

Stack Trace:
javax.net.ssl.SSLException: Software caused connection abort: recv failed
        at __randomizedtesting.SeedInfo.seed([8DEEF5F94E5FF5D1:AF4F9184EB339394]:0)
        at java.base/sun.security.ssl.Alert.createSSLException(Alert.java:127)
        at java.base/sun.security.ssl.TransportContext.fatal(TransportContext.java:320)
        at java.base/sun.security.ssl.TransportContext.fatal(TransportContext.java:263)
        at java.base/sun.security.ssl.TransportContext.fatal(TransportContext.java:258)
        at java.base/sun.security.ssl.SSLSocketImpl.handleException(SSLSocketImpl.java:1342)
        at java.base/sun.security.ssl.SSLSocketImpl$AppInputStream.read(SSLSocketImpl.java:844)
        at org.apache.http.impl.io.SessionInputBufferImpl.streamRead(SessionInputBufferImpl.java:137)
        at org.apache.http.impl.io.SessionInputBufferImpl.fillBuffer(SessionInputBufferImpl.java:153)
        at org.apache.http.impl.io.SessionInputBufferImpl.readLine(SessionInputBufferImpl.java:282)
        at org.apache.http.impl.conn.DefaultHttpResponseParser.parseHead(DefaultHttpResponseParser.java:138)
        at org.apache.http.impl.conn.DefaultHttpResponseParser.parseHead(DefaultHttpResponseParser.java:56)
        at org.apache.http.impl.io.AbstractMessageParser.parse(AbstractMessageParser.java:259)
        at org.apache.http.impl.DefaultBHttpClientConnection.receiveResponseHeader(DefaultBHttpClientConnection.java:163)
        at org.apache.http.impl.conn.CPoolProxy.receiveResponseHeader(CPoolProxy.java:165)
        at org.apache.http.protocol.HttpRequestExecutor.doReceiveResponse(HttpRequestExecutor.java:273)
        at org.apache.http.protocol.HttpRequestExecutor.execute(HttpRequestExecutor.java:125)
        at org.apache.http.impl.execchain.MainClientExec.execute(MainClientExec.java:272)
        at org.apache.http.impl.execchain.ProtocolExec.execute(ProtocolExec.java:185)
        at org.apache.http.impl.execchain.RetryExec.execute(RetryExec.java:89)
        at org.apache.http.impl.execchain.RedirectExec.execute(RedirectExec.java:110)
        at org.apache.http.impl.client.InternalHttpClient.doExecute(InternalHttpClient.java:185)
        at org.apache.http.impl.client.CloseableHttpClient.execute(CloseableHttpClient.java:83)
        at org.apache.solr.util.RestTestHarness.getResponse(RestTestHarness.java:215)
        at org.apache.solr.util.RestTestHarness.query(RestTestHarness.java:107)
        at org.apache.solr.util.RestTestBase.assertJQ(RestTestBase.java:226)
        at org.apache.solr.util.RestTestBase.assertJQ(RestTestBase.java:192)
        at org.apache.solr.ltr.store.rest.TestModelManagerPersistence.testFilePersistence(TestModelManagerPersistence.java:168)
        at java.base/jdk.internal.reflect.NativeMethodAccessorImpl.invoke0(Native Method)
        at java.base/jdk.internal.reflect.NativeMethodAccessorImpl.invoke(NativeMethodAccessorImpl.java:62)
        at java.base/jdk.internal.reflect.DelegatingMethodAccessorImpl.invoke(DelegatingMethodAccessorImpl.java:43)
        at java.base/java.lang.reflect.Method.invoke(Method.java:567)
        at com.carrotsearch.randomizedtesting.RandomizedRunner.invoke(RandomizedRunner.java:1750)
        at com.carrotsearch.randomizedtesting.RandomizedRunner$8.evaluate(RandomizedRunner.java:938)
        at com.carrotsearch.randomizedtesting.RandomizedRunner$9.evaluate(RandomizedRunner.java:974)
        at com.carrotsearch.randomizedtesting.RandomizedRunner$10.evaluate(RandomizedRunner.java:988)
        at com.carrotsearch.randomizedtesting.rules.SystemPropertiesRestoreRule$1.evaluate(SystemPropertiesRestoreRule.java:57)
        at org.apache.lucene.util.TestRuleSetupTeardownChained$1.evaluate(TestRuleSetupTeardownChained.java:49)
        at org.apache.lucene.util.AbstractBeforeAfterRule$1.evaluate(AbstractBeforeAfterRule.java:45)
        at org.apache.lucene.util.TestRuleThreadAndTestName$1.evaluate(TestRuleThreadAndTestName.java:48)
        at org.apache.lucene.util.TestRuleIgnoreAfterMaxFailures$1.evaluate(TestRuleIgnoreAfterMaxFailures.java:64)
        at org.apache.lucene.util.TestRuleMarkFailure$1.evaluate(TestRuleMarkFailure.java:47)
        at com.carrotsearch.randomizedtesting.rules.StatementAdapter.evaluate(StatementAdapter.java:36)
        at com.carrotsearch.randomizedtesting.ThreadLeakControl$StatementRunner.run(ThreadLeakControl.java:368)
        at com.carrotsearch.randomizedtesting.ThreadLeakControl.forkTimeoutingTask(ThreadLeakControl.java:817)
        at com.carrotsearch.randomizedtesting.ThreadLeakControl$3.evaluate(ThreadLeakControl.java:468)
        at com.carrotsearch.randomizedtesting.RandomizedRunner.runSingleTest(RandomizedRunner.java:947)
        at com.carrotsearch.randomizedtesting.RandomizedRunner$5.evaluate(RandomizedRunner.java:832)
        at com.carrotsearch.randomizedtesting.RandomizedRunner$6.evaluate(RandomizedRunner.java:883)
        at com.carrotsearch.randomizedtesting.RandomizedRunner$7.evaluate(RandomizedRunner.java:894)
        at com.carrotsearch.randomizedtesting.rules.StatementAdapter.evaluate(StatementAdapter.java:36)
        at com.carrotsearch.randomizedtesting.rules.SystemPropertiesRestoreRule$1.evaluate(SystemPropertiesRestoreRule.java:57)
        at org.apache.lucene.util.AbstractBeforeAfterRule$1.evaluate(AbstractBeforeAfterRule.java:45)
        at com.carrotsearch.randomizedtesting.rules.StatementAdapter.evaluate(StatementAdapter.java:36)
        at org.apache.lucene.util.TestRuleStoreClassName$1.evaluate(TestRuleStoreClassName.java:41)
        at com.carrotsearch.randomizedtesting.rules.NoShadowingOrOverridesOnMethodsRule$1.evaluate(NoShadowingOrOverridesOnMethodsRule.java:40)
        at com.carrotsearch.randomizedtesting.rules.NoShadowingOrOverridesOnMethodsRule$1.evaluate(NoShadowingOrOverridesOnMethodsRule.java:40)
        at com.carrotsearch.randomizedtesting.rules.StatementAdapter.evaluate(StatementAdapter.java:36)
        at com.carrotsearch.randomizedtesting.rules.StatementAdapter.evaluate(StatementAdapter.java:36)
        at org.apache.lucene.util.TestRuleAssertionsRequired$1.evaluate(TestRuleAssertionsRequired.java:53)
        at org.apache.lucene.util.TestRuleMarkFailure$1.evaluate(TestRuleMarkFailure.java:47)
        at org.apache.lucene.util.TestRuleIgnoreAfterMaxFailures$1.evaluate(TestRuleIgnoreAfterMaxFailures.java:64)
        at org.apache.lucene.util.TestRuleIgnoreTestSuites$1.evaluate(TestRuleIgnoreTestSuites.java:54)
        at com.carrotsearch.randomizedtesting.rules.StatementAdapter.evaluate(StatementAdapter.java:36)
        at com.carrotsearch.randomizedtesting.ThreadLeakControl$StatementRunner.run(ThreadLeakControl.java:368)
        at java.base/java.lang.Thread.run(Thread.java:835)
        Suppressed: java.net.SocketException: Software caused connection abort: socket write error
                at java.base/java.net.SocketOutputStream.socketWrite0(Native Method)
                at java.base/java.net.SocketOutputStream.socketWrite(SocketOutputStream.java:110)
                at java.base/java.net.SocketOutputStream.write(SocketOutputStream.java:150)
                at java.base/sun.security.ssl.SSLSocketOutputRecord.encodeAlert(SSLSocketOutputRecord.java:81)
                at java.base/sun.security.ssl.TransportContext.fatal(TransportContext.java:351)
                ... 63 more
Caused by: java.net.SocketException: Software caused connection abort: recv failed
        at java.base/java.net.SocketInputStream.socketRead0(Native Method)
        at java.base/java.net.SocketInputStream.socketRead(SocketInputStream.java:115)
        at java.base/java.net.SocketInputStream.read(SocketInputStream.java:168)
        at java.base/java.net.SocketInputStream.read(SocketInputStream.java:140)
        at java.base/sun.security.ssl.SSLSocketInputRecord.read(SSLSocketInputRecord.java:448)
        at java.base/sun.security.ssl.SSLSocketInputRecord.bytesInCompletePacket(SSLSocketInputRecord.java:68)
        at java.base/sun.security.ssl.SSLSocketImpl.readApplicationRecord(SSLSocketImpl.java:1132)
        at java.base/sun.security.ssl.SSLSocketImpl$AppInputStream.read(SSLSocketImpl.java:828)
        ... 59 more


FAILED:  org.apache.solr.ltr.store.rest.TestModelManagerPersistence.testWrapperModelPersistence

Error Message:
List size mismatch @ models

Stack Trace:
java.lang.RuntimeException: List size mismatch @ models
        at __randomizedtesting.SeedInfo.seed([8DEEF5F94E5FF5D1:F8848627F1A38C94]:0)
        at org.apache.solr.util.RestTestBase.assertJQ(RestTestBase.java:248)
        at org.apache.solr.util.RestTestBase.assertJQ(RestTestBase.java:192)
        at org.apache.solr.ltr.store.rest.TestModelManagerPersistence.testWrapperModelPersistence(TestModelManagerPersistence.java:221)
        at java.base/jdk.internal.reflect.NativeMethodAccessorImpl.invoke0(Native Method)
        at java.base/jdk.internal.reflect.NativeMethodAccessorImpl.invoke(NativeMethodAccessorImpl.java:62)
        at java.base/jdk.internal.reflect.DelegatingMethodAccessorImpl.invoke(DelegatingMethodAccessorImpl.java:43)
        at java.base/java.lang.reflect.Method.invoke(Method.java:567)
        at com.carrotsearch.randomizedtesting.RandomizedRunner.invoke(RandomizedRunner.java:1750)
        at com.carrotsearch.randomizedtesting.RandomizedRunner$8.evaluate(RandomizedRunner.java:938)
        at com.carrotsearch.randomizedtesting.RandomizedRunner$9.evaluate(RandomizedRunner.java:974)
        at com.carrotsearch.randomizedtesting.RandomizedRunner$10.evaluate(RandomizedRunner.java:988)
        at com.carrotsearch.randomizedtesting.rules.SystemPropertiesRestoreRule$1.evaluate(SystemPropertiesRestoreRule.java:57)
        at org.apache.lucene.util.TestRuleSetupTeardownChained$1.evaluate(TestRuleSetupTeardownChained.java:49)
        at org.apache.lucene.util.AbstractBeforeAfterRule$1.evaluate(AbstractBeforeAfterRule.java:45)
        at org.apache.lucene.util.TestRuleThreadAndTestName$1.evaluate(TestRuleThreadAndTestName.java:48)
        at org.apache.lucene.util.TestRuleIgnoreAfterMaxFailures$1.evaluate(TestRuleIgnoreAfterMaxFailures.java:64)
        at org.apache.lucene.util.TestRuleMarkFailure$1.evaluate(TestRuleMarkFailure.java:47)
        at com.carrotsearch.randomizedtesting.rules.StatementAdapter.evaluate(StatementAdapter.java:36)
        at com.carrotsearch.randomizedtesting.ThreadLeakControl$StatementRunner.run(ThreadLeakControl.java:368)
        at com.carrotsearch.randomizedtesting.ThreadLeakControl.forkTimeoutingTask(ThreadLeakControl.java:817)
        at com.carrotsearch.randomizedtesting.ThreadLeakControl$3.evaluate(ThreadLeakControl.java:468)
        at com.carrotsearch.randomizedtesting.RandomizedRunner.runSingleTest(RandomizedRunner.java:947)
        at com.carrotsearch.randomizedtesting.RandomizedRunner$5.evaluate(RandomizedRunner.java:832)
        at com.carrotsearch.randomizedtesting.RandomizedRunner$6.evaluate(RandomizedRunner.java:883)
        at com.carrotsearch.randomizedtesting.RandomizedRunner$7.evaluate(RandomizedRunner.java:894)
        at com.carrotsearch.randomizedtesting.rules.StatementAdapter.evaluate(StatementAdapter.java:36)
        at com.carrotsearch.randomizedtesting.rules.SystemPropertiesRestoreRule$1.evaluate(SystemPropertiesRestoreRule.java:57)
        at org.apache.lucene.util.AbstractBeforeAfterRule$1.evaluate(AbstractBeforeAfterRule.java:45)
        at com.carrotsearch.randomizedtesting.rules.StatementAdapter.evaluate(StatementAdapter.java:36)
        at org.apache.lucene.util.TestRuleStoreClassName$1.evaluate(TestRuleStoreClassName.java:41)
        at com.carrotsearch.randomizedtesting.rules.NoShadowingOrOverridesOnMethodsRule$1.evaluate(NoShadowingOrOverridesOnMethodsRule.java:40)
        at com.carrotsearch.randomizedtesting.rules.NoShadowingOrOverridesOnMethodsRule$1.evaluate(NoShadowingOrOverridesOnMethodsRule.java:40)
        at com.carrotsearch.randomizedtesting.rules.StatementAdapter.evaluate(StatementAdapter.java:36)
        at com.carrotsearch.randomizedtesting.rules.StatementAdapter.evaluate(StatementAdapter.java:36)
        at org.apache.lucene.util.TestRuleAssertionsRequired$1.evaluate(TestRuleAssertionsRequired.java:53)
        at org.apache.lucene.util.TestRuleMarkFailure$1.evaluate(TestRuleMarkFailure.java:47)
        at org.apache.lucene.util.TestRuleIgnoreAfterMaxFailures$1.evaluate(TestRuleIgnoreAfterMaxFailures.java:64)
        at org.apache.lucene.util.TestRuleIgnoreTestSuites$1.evaluate(TestRuleIgnoreTestSuites.java:54)
        at com.carrotsearch.randomizedtesting.rules.StatementAdapter.evaluate(StatementAdapter.java:36)
        at com.carrotsearch.randomizedtesting.ThreadLeakControl$StatementRunner.run(ThreadLeakControl.java:368)
        at java.base/java.lang.Thread.run(Thread.java:835)


FAILED:  org.apache.solr.ltr.store.rest.TestModelManagerPersistence.testFilePersistence

Error Message:
Software caused connection abort: recv failed

Stack Trace:
javax.net.ssl.SSLException: Software caused connection abort: recv failed
        at __randomizedtesting.SeedInfo.seed([8DEEF5F94E5FF5D1:AF4F9184EB339394]:0)
        at java.base/sun.security.ssl.Alert.createSSLException(Alert.java:127)
        at java.base/sun.security.ssl.TransportContext.fatal(TransportContext.java:320)
        at java.base/sun.security.ssl.TransportContext.fatal(TransportContext.java:263)
        at java.base/sun.security.ssl.TransportContext.fatal(TransportContext.java:258)
        at java.base/sun.security.ssl.SSLSocketImpl.handleException(SSLSocketImpl.java:1342)
        at java.base/sun.security.ssl.SSLSocketImpl$AppInputStream.read(SSLSocketImpl.java:844)
        at org.apache.http.impl.io.SessionInputBufferImpl.streamRead(SessionInputBufferImpl.java:137)
        at org.apache.http.impl.io.SessionInputBufferImpl.fillBuffer(SessionInputBufferImpl.java:153)
        at org.apache.http.impl.io.SessionInputBufferImpl.readLine(SessionInputBufferImpl.java:282)
        at org.apache.http.impl.conn.DefaultHttpResponseParser.parseHead(DefaultHttpResponseParser.java:138)
        at org.apache.http.impl.conn.DefaultHttpResponseParser.parseHead(DefaultHttpResponseParser.java:56)
        at org.apache.http.impl.io.AbstractMessageParser.parse(AbstractMessageParser.java:259)
        at org.apache.http.impl.DefaultBHttpClientConnection.receiveResponseHeader(DefaultBHttpClientConnection.java:163)
        at org.apache.http.impl.conn.CPoolProxy.receiveResponseHeader(CPoolProxy.java:165)
        at org.apache.http.protocol.HttpRequestExecutor.doReceiveResponse(HttpRequestExecutor.java:273)
        at org.apache.http.protocol.HttpRequestExecutor.execute(HttpRequestExecutor.java:125)
        at org.apache.http.impl.execchain.MainClientExec.execute(MainClientExec.java:272)
        at org.apache.http.impl.execchain.ProtocolExec.execute(ProtocolExec.java:185)
        at org.apache.http.impl.execchain.RetryExec.execute(RetryExec.java:89)
        at org.apache.http.impl.execchain.RedirectExec.execute(RedirectExec.java:110)
        at org.apache.http.impl.client.InternalHttpClient.doExecute(InternalHttpClient.java:185)
        at org.apache.http.impl.client.CloseableHttpClient.execute(CloseableHttpClient.java:83)
        at org.apache.solr.util.RestTestHarness.getResponse(RestTestHarness.java:215)
        at org.apache.solr.util.RestTestHarness.query(RestTestHarness.java:107)
        at org.apache.solr.util.RestTestBase.assertJQ(RestTestBase.java:226)
        at org.apache.solr.util.RestTestBase.assertJQ(RestTestBase.java:192)
        at org.apache.solr.ltr.store.rest.TestModelManagerPersistence.testFilePersistence(TestModelManagerPersistence.java:168)
        at java.base/jdk.internal.reflect.NativeMethodAccessorImpl.invoke0(Native Method)
        at java.base/jdk.internal.reflect.NativeMethodAccessorImpl.invoke(NativeMethodAccessorImpl.java:62)
        at java.base/jdk.internal.reflect.DelegatingMethodAccessorImpl.invoke(DelegatingMethodAccessorImpl.java:43)
        at java.base/java.lang.reflect.Method.invoke(Method.java:567)
        at com.carrotsearch.randomizedtesting.RandomizedRunner.invoke(RandomizedRunner.java:1750)
        at com.carrotsearch.randomizedtesting.RandomizedRunner$8.evaluate(RandomizedRunner.java:938)
        at com.carrotsearch.randomizedtesting.RandomizedRunner$9.evaluate(RandomizedRunner.java:974)
        at com.carrotsearch.randomizedtesting.RandomizedRunner$10.evaluate(RandomizedRunner.java:988)
        at com.carrotsearch.randomizedtesting.rules.SystemPropertiesRestoreRule$1.evaluate(SystemPropertiesRestoreRule.java:57)
        at org.apache.lucene.util.TestRuleSetupTeardownChained$1.evaluate(TestRuleSetupTeardownChained.java:49)
        at org.apache.lucene.util.AbstractBeforeAfterRule$1.evaluate(AbstractBeforeAfterRule.java:45)
        at org.apache.lucene.util.TestRuleThreadAndTestName$1.evaluate(TestRuleThreadAndTestName.java:48)
        at org.apache.lucene.util.TestRuleIgnoreAfterMaxFailures$1.evaluate(TestRuleIgnoreAfterMaxFailures.java:64)
        at org.apache.lucene.util.TestRuleMarkFailure$1.evaluate(TestRuleMarkFailure.java:47)
        at com.carrotsearch.randomizedtesting.rules.StatementAdapter.evaluate(StatementAdapter.java:36)
        at com.carrotsearch.randomizedtesting.ThreadLeakControl$StatementRunner.run(ThreadLeakControl.java:368)
        at com.carrotsearch.randomizedtesting.ThreadLeakControl.forkTimeoutingTask(ThreadLeakControl.java:817)
        at com.carrotsearch.randomizedtesting.ThreadLeakControl$3.evaluate(ThreadLeakControl.java:468)
        at com.carrotsearch.randomizedtesting.RandomizedRunner.runSingleTest(RandomizedRunner.java:947)
        at com.carrotsearch.randomizedtesting.RandomizedRunner$5.evaluate(RandomizedRunner.java:832)
        at com.carrotsearch.randomizedtesting.RandomizedRunner$6.evaluate(RandomizedRunner.java:883)
        at com.carrotsearch.randomizedtesting.RandomizedRunner$7.evaluate(RandomizedRunner.java:894)
        at com.carrotsearch.randomizedtesting.rules.StatementAdapter.evaluate(StatementAdapter.java:36)
        at com.carrotsearch.randomizedtesting.rules.SystemPropertiesRestoreRule$1.evaluate(SystemPropertiesRestoreRule.java:57)
        at org.apache.lucene.util.AbstractBeforeAfterRule$1.evaluate(AbstractBeforeAfterRule.java:45)
        at com.carrotsearch.randomizedtesting.rules.StatementAdapter.evaluate(StatementAdapter.java:36)
        at org.apache.lucene.util.TestRuleStoreClassName$1.evaluate(TestRuleStoreClassName.java:41)
        at com.carrotsearch.randomizedtesting.rules.NoShadowingOrOverridesOnMethodsRule$1.evaluate(NoShadowingOrOverridesOnMethodsRule.java:40)
        at com.carrotsearch.randomizedtesting.rules.NoShadowingOrOverridesOnMethodsRule$1.evaluate(NoShadowingOrOverridesOnMethodsRule.java:40)
        at com.carrotsearch.randomizedtesting.rules.StatementAdapter.evaluate(StatementAdapter.java:36)
        at com.carrotsearch.randomizedtesting.rules.StatementAdapter.evaluate(StatementAdapter.java:36)
        at org.apache.lucene.util.TestRuleAssertionsRequired$1.evaluate(TestRuleAssertionsRequired.java:53)
        at org.apache.lucene.util.TestRuleMarkFailure$1.evaluate(TestRuleMarkFailure.java:47)
        at org.apache.lucene.util.TestRuleIgnoreAfterMaxFailures$1.evaluate(TestRuleIgnoreAfterMaxFailures.java:64)
        at org.apache.lucene.util.TestRuleIgnoreTestSuites$1.evaluate(TestRuleIgnoreTestSuites.java:54)
        at com.carrotsearch.randomizedtesting.rules.StatementAdapter.evaluate(StatementAdapter.java:36)
        at com.carrotsearch.randomizedtesting.ThreadLeakControl$StatementRunner.run(ThreadLeakControl.java:368)
        at java.base/java.lang.Thread.run(Thread.java:835)
        Suppressed: java.net.SocketException: Software caused connection abort: socket write error
                at java.base/java.net.SocketOutputStream.socketWrite0(Native Method)
                at java.base/java.net.SocketOutputStream.socketWrite(SocketOutputStream.java:110)
                at java.base/java.net.SocketOutputStream.write(SocketOutputStream.java:150)
                at java.base/sun.security.ssl.SSLSocketOutputRecord.encodeAlert(SSLSocketOutputRecord.java:81)
                at java.base/sun.security.ssl.TransportContext.fatal(TransportContext.java:351)
                ... 63 more
Caused by: java.net.SocketException: Software caused connection abort: recv failed
        at java.base/java.net.SocketInputStream.socketRead0(Native Method)
        at java.base/java.net.SocketInputStream.socketRead(SocketInputStream.java:115)
        at java.base/java.net.SocketInputStream.read(SocketInputStream.java:168)
        at java.base/java.net.SocketInputStream.read(SocketInputStream.java:140)
        at java.base/sun.security.ssl.SSLSocketInputRecord.read(SSLSocketInputRecord.java:448)
        at java.base/sun.security.ssl.SSLSocketInputRecord.bytesInCompletePacket(SSLSocketInputRecord.java:68)
        at java.base/sun.security.ssl.SSLSocketImpl.readApplicationRecord(SSLSocketImpl.java:1132)
        at java.base/sun.security.ssl.SSLSocketImpl$AppInputStream.read(SSLSocketImpl.java:828)
        ... 59 more


FAILED:  org.apache.solr.ltr.store.rest.TestModelManagerPersistence.testWrapperModelPersistence

Error Message:
List size mismatch @ models

Stack Trace:
java.lang.RuntimeException: List size mismatch @ models
        at __randomizedtesting.SeedInfo.seed([8DEEF5F94E5FF5D1:F8848627F1A38C94]:0)
        at org.apache.solr.util.RestTestBase.assertJQ(RestTestBase.java:248)
        at org.apache.solr.util.RestTestBase.assertJQ(RestTestBase.java:192)
        at org.apache.solr.ltr.store.rest.TestModelManagerPersistence.testWrapperModelPersistence(TestModelManagerPersistence.java:221)
        at java.base/jdk.internal.reflect.NativeMethodAccessorImpl.invoke0(Native Method)
        at java.base/jdk.internal.reflect.NativeMethodAccessorImpl.invoke(NativeMethodAccessorImpl.java:62)
        at java.base/jdk.internal.reflect.DelegatingMethodAccessorImpl.invoke(DelegatingMethodAccessorImpl.java:43)
        at java.base/java.lang.reflect.Method.invoke(Method.java:567)
        at com.carrotsearch.randomizedtesting.RandomizedRunner.invoke(RandomizedRunner.java:1750)
        at com.carrotsearch.randomizedtesting.RandomizedRunner$8.evaluate(RandomizedRunner.java:938)
        at com.carrotsearch.randomizedtesting.RandomizedRunner$9.evaluate(RandomizedRunner.java:974)
        at com.carrotsearch.randomizedtesting.RandomizedRunner$10.evaluate(RandomizedRunner.java:988)
        at com.carrotsearch.randomizedtesting.rules.SystemPropertiesRestoreRule$1.evaluate(SystemPropertiesRestoreRule.java:57)
        at org.apache.lucene.util.TestRuleSetupTeardownChained$1.evaluate(TestRuleSetupTeardownChained.java:49)
        at org.apache.lucene.util.AbstractBeforeAfterRule$1.evaluate(AbstractBeforeAfterRule.java:45)
        at org.apache.lucene.util.TestRuleThreadAndTestName$1.evaluate(TestRuleThreadAndTestName.java:48)
        at org.apache.lucene.util.TestRuleIgnoreAfterMaxFailures$1.evaluate(TestRuleIgnoreAfterMaxFailures.java:64)
        at org.apache.lucene.util.TestRuleMarkFailure$1.evaluate(TestRuleMarkFailure.java:47)
        at com.carrotsearch.randomizedtesting.rules.StatementAdapter.evaluate(StatementAdapter.java:36)
        at com.carrotsearch.randomizedtesting.ThreadLeakControl$StatementRunner.run(ThreadLeakControl.java:368)
        at com.carrotsearch.randomizedtesting.ThreadLeakControl.forkTimeoutingTask(ThreadLeakControl.java:817)
        at com.carrotsearch.randomizedtesting.ThreadLeakControl$3.evaluate(ThreadLeakControl.java:468)
        at com.carrotsearch.randomizedtesting.RandomizedRunner.runSingleTest(RandomizedRunner.java:947)
        at com.carrotsearch.randomizedtesting.RandomizedRunner$5.evaluate(RandomizedRunner.java:832)
        at com.carrotsearch.randomizedtesting.RandomizedRunner$6.evaluate(RandomizedRunner.java:883)
        at com.carrotsearch.randomizedtesting.RandomizedRunner$7.evaluate(RandomizedRunner.java:894)
        at com.carrotsearch.randomizedtesting.rules.StatementAdapter.evaluate(StatementAdapter.java:36)
        at com.carrotsearch.randomizedtesting.rules.SystemPropertiesRestoreRule$1.evaluate(SystemPropertiesRestoreRule.java:57)
        at org.apache.lucene.util.AbstractBeforeAfterRule$1.evaluate(AbstractBeforeAfterRule.java:45)
        at com.carrotsearch.randomizedtesting.rules.StatementAdapter.evaluate(StatementAdapter.java:36)
        at org.apache.lucene.util.TestRuleStoreClassName$1.evaluate(TestRuleStoreClassName.java:41)
        at com.carrotsearch.randomizedtesting.rules.NoShadowingOrOverridesOnMethodsRule$1.evaluate(NoShadowingOrOverridesOnMethodsRule.java:40)
        at com.carrotsearch.randomizedtesting.rules.NoShadowingOrOverridesOnMethodsRule$1.evaluate(NoShadowingOrOverridesOnMethodsRule.java:40)
        at com.carrotsearch.randomizedtesting.rules.StatementAdapter.evaluate(StatementAdapter.java:36)
        at com.carrotsearch.randomizedtesting.rules.StatementAdapter.evaluate(StatementAdapter.java:36)
        at org.apache.lucene.util.TestRuleAssertionsRequired$1.evaluate(TestRuleAssertionsRequired.java:53)
        at org.apache.lucene.util.TestRuleMarkFailure$1.evaluate(TestRuleMarkFailure.java:47)
        at org.apache.lucene.util.TestRuleIgnoreAfterMaxFailures$1.evaluate(TestRuleIgnoreAfterMaxFailures.java:64)
        at org.apache.lucene.util.TestRuleIgnoreTestSuites$1.evaluate(TestRuleIgnoreTestSuites.java:54)
        at com.carrotsearch.randomizedtesting.rules.StatementAdapter.evaluate(StatementAdapter.java:36)
        at com.carrotsearch.randomizedtesting.ThreadLeakControl$StatementRunner.run(ThreadLeakControl.java:368)
        at java.base/java.lang.Thread.run(Thread.java:835)


FAILED:  org.apache.solr.ltr.store.rest.TestModelManagerPersistence.testFilePersistence

Error Message:
Software caused connection abort: recv failed

Stack Trace:
javax.net.ssl.SSLException: Software caused connection abort: recv failed
        at __randomizedtesting.SeedInfo.seed([8DEEF5F94E5FF5D1:AF4F9184EB339394]:0)
        at java.base/sun.security.ssl.Alert.createSSLException(Alert.java:127)
        at java.base/sun.security.ssl.TransportContext.fatal(TransportContext.java:320)
        at java.base/sun.security.ssl.TransportContext.fatal(TransportContext.java:263)
        at java.base/sun.security.ssl.TransportContext.fatal(TransportContext.java:258)
        at java.base/sun.security.ssl.SSLSocketImpl.handleException(SSLSocketImpl.java:1342)
        at java.base/sun.security.ssl.SSLSocketImpl$AppInputStream.read(SSLSocketImpl.java:844)
        at org.apache.http.impl.io.SessionInputBufferImpl.streamRead(SessionInputBufferImpl.java:137)
        at org.apache.http.impl.io.SessionInputBufferImpl.fillBuffer(SessionInputBufferImpl.java:153)
        at org.apache.http.impl.io.SessionInputBufferImpl.readLine(SessionInputBufferImpl.java:282)
        at org.apache.http.impl.conn.DefaultHttpResponseParser.parseHead(DefaultHttpResponseParser.java:138)
        at org.apache.http.impl.conn.DefaultHttpResponseParser.parseHead(DefaultHttpResponseParser.java:56)
        at org.apache.http.impl.io.AbstractMessageParser.parse(AbstractMessageParser.java:259)
        at org.apache.http.impl.DefaultBHttpClientConnection.receiveResponseHeader(DefaultBHttpClientConnection.java:163)
        at org.apache.http.impl.conn.CPoolProxy.receiveResponseHeader(CPoolProxy.java:165)
        at org.apache.http.protocol.HttpRequestExecutor.doReceiveResponse(HttpRequestExecutor.java:273)
        at org.apache.http.protocol.HttpRequestExecutor.execute(HttpRequestExecutor.java:125)
        at org.apache.http.impl.execchain.MainClientExec.execute(MainClientExec.java:272)
        at org.apache.http.impl.execchain.ProtocolExec.execute(ProtocolExec.java:185)
        at org.apache.http.impl.execchain.RetryExec.execute(RetryExec.java:89)
        at org.apache.http.impl.execchain.RedirectExec.execute(RedirectExec.java:110)
        at org.apache.http.impl.client.InternalHttpClient.doExecute(InternalHttpClient.java:185)
        at org.apache.http.impl.client.CloseableHttpClient.execute(CloseableHttpClient.java:83)
        at org.apache.solr.util.RestTestHarness.getResponse(RestTestHarness.java:215)
        at org.apache.solr.util.RestTestHarness.query(RestTestHarness.java:107)
        at org.apache.solr.util.RestTestBase.assertJQ(RestTestBase.java:226)
        at org.apache.solr.util.RestTestBase.assertJQ(RestTestBase.java:192)
        at org.apache.solr.ltr.store.rest.TestModelManagerPersistence.testFilePersistence(TestModelManagerPersistence.java:168)
        at java.base/jdk.internal.reflect.NativeMethodAccessorImpl.invoke0(Native Method)
        at java.base/jdk.internal.reflect.NativeMethodAccessorImpl.invoke(NativeMethodAccessorImpl.java:62)
        at java.base/jdk.internal.reflect.DelegatingMethodAccessorImpl.invoke(DelegatingMethodAccessorImpl.java:43)
        at java.base/java.lang.reflect.Method.invoke(Method.java:567)
        at com.carrotsearch.randomizedtesting.RandomizedRunner.invoke(RandomizedRunner.java:1750)
        at com.carrotsearch.randomizedtesting.RandomizedRunner$8.evaluate(RandomizedRunner.java:938)
        at com.carrotsearch.randomizedtesting.RandomizedRunner$9.evaluate(RandomizedRunner.java:974)
        at com.carrotsearch.randomizedtesting.RandomizedRunner$10.evaluate(RandomizedRunner.java:988)
        at com.carrotsearch.randomizedtesting.rules.SystemPropertiesRestoreRule$1.evaluate(SystemPropertiesRestoreRule.java:57)
        at org.apache.lucene.util.TestRuleSetupTeardownChained$1.evaluate(TestRuleSetupTeardownChained.java:49)
        at org.apache.lucene.util.AbstractBeforeAfterRule$1.evaluate(AbstractBeforeAfterRule.java:45)
        at org.apache.lucene.util.TestRuleThreadAndTestName$1.evaluate(TestRuleThreadAndTestName.java:48)
        at org.apache.lucene.util.TestRuleIgnoreAfterMaxFailures$1.evaluate(TestRuleIgnoreAfterMaxFailures.java:64)
        at org.apache.lucene.util.TestRuleMarkFailure$1.evaluate(TestRuleMarkFailure.java:47)
        at com.carrotsearch.randomizedtesting.rules.StatementAdapter.evaluate(StatementAdapter.java:36)
        at com.carrotsearch.randomizedtesting.ThreadLeakControl$StatementRunner.run(ThreadLeakControl.java:368)
        at com.carrotsearch.randomizedtesting.ThreadLeakControl.forkTimeoutingTask(ThreadLeakControl.java:817)
        at com.carrotsearch.randomizedtesting.ThreadLeakControl$3.evaluate(ThreadLeakControl.java:468)
        at com.carrotsearch.randomizedtesting.RandomizedRunner.runSingleTest(RandomizedRunner.java:947)
        at com.carrotsearch.randomizedtesting.RandomizedRunner$5.evaluate(RandomizedRunner.java:832)
        at com.carrotsearch.randomizedtesting.RandomizedRunner$6.evaluate(RandomizedRunner.java:883)
        at com.carrotsearch.randomizedtesting.RandomizedRunner$7.evaluate(RandomizedRunner.java:894)
        at com.carrotsearch.randomizedtesting.rules.StatementAdapter.evaluate(StatementAdapter.java:36)
        at com.carrotsearch.randomizedtesting.rules.SystemPropertiesRestoreRule$1.evaluate(SystemPropertiesRestoreRule.java:57)
        at org.apache.lucene.util.AbstractBeforeAfterRule$1.evaluate(AbstractBeforeAfterRule.java:45)
        at com.carrotsearch.randomizedtesting.rules.StatementAdapter.evaluate(StatementAdapter.java:36)
        at org.apache.lucene.util.TestRuleStoreClassName$1.evaluate(TestRuleStoreClassName.java:41)
        at com.carrotsearch.randomizedtesting.rules.NoShadowingOrOverridesOnMethodsRule$1.evaluate(NoShadowingOrOverridesOnMethodsRule.java:40)
        at com.carrotsearch.randomizedtesting.rules.NoShadowingOrOverridesOnMethodsRule$1.evaluate(NoShadowingOrOverridesOnMethodsRule.java:40)
        at com.carrotsearch.randomizedtesting.rules.StatementAdapter.evaluate(StatementAdapter.java:36)
        at com.carrotsearch.randomizedtesting.rules.StatementAdapter.evaluate(StatementAdapter.java:36)
        at org.apache.lucene.util.TestRuleAssertionsRequired$1.evaluate(TestRuleAssertionsRequired.java:53)
        at org.apache.lucene.util.TestRuleMarkFailure$1.evaluate(TestRuleMarkFailure.java:47)
        at org.apache.lucene.util.TestRuleIgnoreAfterMaxFailures$1.evaluate(TestRuleIgnoreAfterMaxFailures.java:64)
        at org.apache.lucene.util.TestRuleIgnoreTestSuites$1.evaluate(TestRuleIgnoreTestSuites.java:54)
        at com.carrotsearch.randomizedtesting.rules.StatementAdapter.evaluate(StatementAdapter.java:36)
        at com.carrotsearch.randomizedtesting.ThreadLeakControl$StatementRunner.run(ThreadLeakControl.java:368)
        at java.base/java.lang.Thread.run(Thread.java:835)
        Suppressed: java.net.SocketException: Software caused connection abort: socket write error
                at java.base/java.net.SocketOutputStream.socketWrite0(Native Method)
                at java.base/java.net.SocketOutputStream.socketWrite(SocketOutputStream.java:110)
                at java.base/java.net.SocketOutputStream.write(SocketOutputStream.java:150)
                at java.base/sun.security.ssl.SSLSocketOutputRecord.encodeAlert(SSLSocketOutputRecord.java:81)
                at java.base/sun.security.ssl.TransportContext.fatal(TransportContext.java:351)
                ... 63 more
Caused by: java.net.SocketException: Software caused connection abort: recv failed
        at java.base/java.net.SocketInputStream.socketRead0(Native Method)
        at java.base/java.net.SocketInputStream.socketRead(SocketInputStream.java:115)
        at java.base/java.net.SocketInputStream.read(SocketInputStream.java:168)
        at java.base/java.net.SocketInputStream.read(SocketInputStream.java:140)
        at java.base/sun.security.ssl.SSLSocketInputRecord.read(SSLSocketInputRecord.java:448)
        at java.base/sun.security.ssl.SSLSocketInputRecord.bytesInCompletePacket(SSLSocketInputRecord.java:68)
        at java.base/sun.security.ssl.SSLSocketImpl.readApplicationRecord(SSLSocketImpl.java:1132)
        at java.base/sun.security.ssl.SSLSocketImpl$AppInputStream.read(SSLSocketImpl.java:828)
        ... 59 more


FAILED:  org.apache.solr.ltr.store.rest.TestModelManagerPersistence.testWrapperModelPersistence

Error Message:
List size mismatch @ models

Stack Trace:
java.lang.RuntimeException: List size mismatch @ models
        at __randomizedtesting.SeedInfo.seed([8DEEF5F94E5FF5D1:F8848627F1A38C94]:0)
        at org.apache.solr.util.RestTestBase.assertJQ(RestTestBase.java:248)
        at org.apache.solr.util.RestTestBase.assertJQ(RestTestBase.java:192)
        at org.apache.solr.ltr.store.rest.TestModelManagerPersistence.testWrapperModelPersistence(TestModelManagerPersistence.java:221)
        at java.base/jdk.internal.reflect.NativeMethodAccessorImpl.invoke0(Native Method)
        at java.base/jdk.internal.reflect.NativeMethodAccessorImpl.invoke(NativeMethodAccessorImpl.java:62)
        at java.base/jdk.internal.reflect.DelegatingMethodAccessorImpl.invoke(DelegatingMethodAccessorImpl.java:43)
        at java.base/java.lang.reflect.Method.invoke(Method.java:567)
        at com.carrotsearch.randomizedtesting.RandomizedRunner.invoke(RandomizedRunner.java:1750)
        at com.carrotsearch.randomizedtesting.RandomizedRunner$8.evaluate(RandomizedRunner.java:938)
        at com.carrotsearch.randomizedtesting.RandomizedRunner$9.evaluate(RandomizedRunner.java:974)
        at com.carrotsearch.randomizedtesting.RandomizedRunner$10.evaluate(RandomizedRunner.java:988)
        at com.carrotsearch.randomizedtesting.rules.SystemPropertiesRestoreRule$1.evaluate(SystemPropertiesRestoreRule.java:57)
        at org.apache.lucene.util.TestRuleSetupTeardownChained$1.evaluate(TestRuleSetupTeardownChained.java:49)
        at org.apache.lucene.util.AbstractBeforeAfterRule$1.evaluate(AbstractBeforeAfterRule.java:45)
        at org.apache.lucene.util.TestRuleThreadAndTestName$1.evaluate(TestRuleThreadAndTestName.java:48)
        at org.apache.lucene.util.TestRuleIgnoreAfterMaxFailures$1.evaluate(TestRuleIgnoreAfterMaxFailures.java:64)
        at org.apache.lucene.util.TestRuleMarkFailure$1.evaluate(TestRuleMarkFailure.java:47)
        at com.carrotsearch.randomizedtesting.rules.StatementAdapter.evaluate(StatementAdapter.java:36)
        at com.carrotsearch.randomizedtesting.ThreadLeakControl$StatementRunner.run(ThreadLeakControl.java:368)
        at com.carrotsearch.randomizedtesting.ThreadLeakControl.forkTimeoutingTask(ThreadLeakControl.java:817)
        at com.carrotsearch.randomizedtesting.ThreadLeakControl$3.evaluate(ThreadLeakControl.java:468)
        at com.carrotsearch.randomizedtesting.RandomizedRunner.runSingleTest(RandomizedRunner.java:947)
        at com.carrotsearch.randomizedtesting.RandomizedRunner$5.evaluate(RandomizedRunner.java:832)
        at com.carrotsearch.randomizedtesting.RandomizedRunner$6.evaluate(RandomizedRunner.java:883)
        at com.carrotsearch.randomizedtesting.RandomizedRunner$7.evaluate(RandomizedRunner.java:894)
        at com.carrotsearch.randomizedtesting.rules.StatementAdapter.evaluate(StatementAdapter.java:36)
        at com.carrotsearch.randomizedtesting.rules.SystemPropertiesRestoreRule$1.evaluate(SystemPropertiesRestoreRule.java:57)
        at org.apache.lucene.util.AbstractBeforeAfterRule$1.evaluate(AbstractBeforeAfterRule.java:45)
        at com.carrotsearch.randomizedtesting.rules.StatementAdapter.evaluate(StatementAdapter.java:36)
        at org.apache.lucene.util.TestRuleStoreClassName$1.evaluate(TestRuleStoreClassName.java:41)
        at com.carrotsearch.randomizedtesting.rules.NoShadowingOrOverridesOnMethodsRule$1.evaluate(NoShadowingOrOverridesOnMethodsRule.java:40)
        at com.carrotsearch.randomizedtesting.rules.NoShadowingOrOverridesOnMethodsRule$1.evaluate(NoShadowingOrOverridesOnMethodsRule.java:40)
        at com.carrotsearch.randomizedtesting.rules.StatementAdapter.evaluate(StatementAdapter.java:36)
        at com.carrotsearch.randomizedtesting.rules.StatementAdapter.evaluate(StatementAdapter.java:36)
        at org.apache.lucene.util.TestRuleAssertionsRequired$1.evaluate(TestRuleAssertionsRequired.java:53)
        at org.apache.lucene.util.TestRuleMarkFailure$1.evaluate(TestRuleMarkFailure.java:47)
        at org.apache.lucene.util.TestRuleIgnoreAfterMaxFailures$1.evaluate(TestRuleIgnoreAfterMaxFailures.java:64)
        at org.apache.lucene.util.TestRuleIgnoreTestSuites$1.evaluate(TestRuleIgnoreTestSuites.java:54)
        at com.carrotsearch.randomizedtesting.rules.StatementAdapter.evaluate(StatementAdapter.java:36)
        at com.carrotsearch.randomizedtesting.ThreadLeakControl$StatementRunner.run(ThreadLeakControl.java:368)
        at java.base/java.lang.Thread.run(Thread.java:835)


FAILED:  org.apache.solr.ltr.store.rest.TestModelManagerPersistence.testInnerCustomClassesPersistence

Error Message:
mismatch: 'model42'!='6029760550880411648' @ models/[0]/name

Stack Trace:
java.lang.RuntimeException: mismatch: 'model42'!='6029760550880411648' @ models/[0]/name
        at __randomizedtesting.SeedInfo.seed([8DEEF5F94E5FF5D1:A4EBDECC88B3D3BD]:0)
        at org.apache.solr.util.RestTestBase.assertJQ(RestTestBase.java:248)
        at org.apache.solr.util.RestTestBase.assertJQ(RestTestBase.java:192)
        at org.apache.solr.ltr.store.rest.TestModelManagerPersistence.testInnerCustomClassesPersistence(TestModelManagerPersistence.java:310)
        at java.base/jdk.internal.reflect.NativeMethodAccessorImpl.invoke0(Native Method)
        at java.base/jdk.internal.reflect.NativeMethodAccessorImpl.invoke(NativeMethodAccessorImpl.java:62)
        at java.base/jdk.internal.reflect.DelegatingMethodAccessorImpl.invoke(DelegatingMethodAccessorImpl.java:43)
        at java.base/java.lang.reflect.Method.invoke(Method.java:567)
        at com.carrotsearch.randomizedtesting.RandomizedRunner.invoke(RandomizedRunner.java:1750)
        at com.carrotsearch.randomizedtesting.RandomizedRunner$8.evaluate(RandomizedRunner.java:938)
        at com.carrotsearch.randomizedtesting.RandomizedRunner$9.evaluate(RandomizedRunner.java:974)
        at com.carrotsearch.randomizedtesting.RandomizedRunner$10.evaluate(RandomizedRunner.java:988)
        at com.carrotsearch.randomizedtesting.rules.SystemPropertiesRestoreRule$1.evaluate(SystemPropertiesRestoreRule.java:57)
        at org.apache.lucene.util.TestRuleSetupTeardownChained$1.evaluate(TestRuleSetupTeardownChained.java:49)
        at org.apache.lucene.util.AbstractBeforeAfterRule$1.evaluate(AbstractBeforeAfterRule.java:45)
        at org.apache.lucene.util.TestRuleThreadAndTestName$1.evaluate(TestRuleThreadAndTestName.java:48)
        at org.apache.lucene.util.TestRuleIgnoreAfterMaxFailures$1.evaluate(TestRuleIgnoreAfterMaxFailures.java:64)
        at org.apache.lucene.util.TestRuleMarkFailure$1.evaluate(TestRuleMarkFailure.java:47)
        at com.carrotsearch.randomizedtesting.rules.StatementAdapter.evaluate(StatementAdapter.java:36)
        at com.carrotsearch.randomizedtesting.ThreadLeakControl$StatementRunner.run(ThreadLeakControl.java:368)
        at com.carrotsearch.randomizedtesting.ThreadLeakControl.forkTimeoutingTask(ThreadLeakControl.java:817)
        at com.carrotsearch.randomizedtesting.ThreadLeakControl$3.evaluate(ThreadLeakControl.java:468)
        at com.carrotsearch.randomizedtesting.RandomizedRunner.runSingleTest(RandomizedRunner.java:947)
        at com.carrotsearch.randomizedtesting.RandomizedRunner$5.evaluate(RandomizedRunner.java:832)
        at com.carrotsearch.randomizedtesting.RandomizedRunner$6.evaluate(RandomizedRunner.java:883)
        at com.carrotsearch.randomizedtesting.RandomizedRunner$7.evaluate(RandomizedRunner.java:894)
        at com.carrotsearch.randomizedtesting.rules.StatementAdapter.evaluate(StatementAdapter.java:36)
        at com.carrotsearch.randomizedtesting.rules.SystemPropertiesRestoreRule$1.evaluate(SystemPropertiesRestoreRule.java:57)
        at org.apache.lucene.util.AbstractBeforeAfterRule$1.evaluate(AbstractBeforeAfterRule.java:45)
        at com.carrotsearch.randomizedtesting.rules.StatementAdapter.evaluate(StatementAdapter.java:36)
        at org.apache.lucene.util.TestRuleStoreClassName$1.evaluate(TestRuleStoreClassName.java:41)
        at com.carrotsearch.randomizedtesting.rules.NoShadowingOrOverridesOnMethodsRule$1.evaluate(NoShadowingOrOverridesOnMethodsRule.java:40)
        at com.carrotsearch.randomizedtesting.rules.NoShadowingOrOverridesOnMethodsRule$1.evaluate(NoShadowingOrOverridesOnMethodsRule.java:40)
        at com.carrotsearch.randomizedtesting.rules.StatementAdapter.evaluate(StatementAdapter.java:36)
        at com.carrotsearch.randomizedtesting.rules.StatementAdapter.evaluate(StatementAdapter.java:36)
        at org.apache.lucene.util.TestRuleAssertionsRequired$1.evaluate(TestRuleAssertionsRequired.java:53)
        at org.apache.lucene.util.TestRuleMarkFailure$1.evaluate(TestRuleMarkFailure.java:47)
        at org.apache.lucene.util.TestRuleIgnoreAfterMaxFailures$1.evaluate(TestRuleIgnoreAfterMaxFailures.java:64)
        at org.apache.lucene.util.TestRuleIgnoreTestSuites$1.evaluate(TestRuleIgnoreTestSuites.java:54)
        at com.carrotsearch.randomizedtesting.rules.StatementAdapter.evaluate(StatementAdapter.java:36)
        at com.carrotsearch.randomizedtesting.ThreadLeakControl$StatementRunner.run(ThreadLeakControl.java:368)
        at java.base/java.lang.Thread.run(Thread.java:835)


FAILED:  org.apache.solr.ltr.store.rest.TestModelManagerPersistence.testFilePersistence

Error Message:
Software caused connection abort: recv failed

Stack Trace:
javax.net.ssl.SSLException: Software caused connection abort: recv failed
        at __randomizedtesting.SeedInfo.seed([8DEEF5F94E5FF5D1:AF4F9184EB339394]:0)
        at java.base/sun.security.ssl.Alert.createSSLException(Alert.java:127)
        at java.base/sun.security.ssl.TransportContext.fatal(TransportContext.java:320)
        at java.base/sun.security.ssl.TransportContext.fatal(TransportContext.java:263)
        at java.base/sun.security.ssl.TransportContext.fatal(TransportContext.java:258)
        at java.base/sun.security.ssl.SSLSocketImpl.handleException(SSLSocketImpl.java:1342)
        at java.base/sun.security.ssl.SSLSocketImpl$AppInputStream.read(SSLSocketImpl.java:844)
        at org.apache.http.impl.io.SessionInputBufferImpl.streamRead(SessionInputBufferImpl.java:137)
        at org.apache.http.impl.io.SessionInputBufferImpl.fillBuffer(SessionInputBufferImpl.java:153)
        at org.apache.http.impl.io.SessionInputBufferImpl.readLine(SessionInputBufferImpl.java:282)
        at org.apache.http.impl.conn.DefaultHttpResponseParser.parseHead(DefaultHttpResponseParser.java:138)
        at org.apache.http.impl.conn.DefaultHttpResponseParser.parseHead(DefaultHttpResponseParser.java:56)
        at org.apache.http.impl.io.AbstractMessageParser.parse(AbstractMessageParser.java:259)
        at org.apache.http.impl.DefaultBHttpClientConnection.receiveResponseHeader(DefaultBHttpClientConnection.java:163)
        at org.apache.http.impl.conn.CPoolProxy.receiveResponseHeader(CPoolProxy.java:165)
        at org.apache.http.protocol.HttpRequestExecutor.doReceiveResponse(HttpRequestExecutor.java:273)
        at org.apache.http.protocol.HttpRequestExecutor.execute(HttpRequestExecutor.java:125)
        at org.apache.http.impl.execchain.MainClientExec.execute(MainClientExec.java:272)
        at org.apache.http.impl.execchain.ProtocolExec.execute(ProtocolExec.java:185)
        at org.apache.http.impl.execchain.RetryExec.execute(RetryExec.java:89)
        at org.apache.http.impl.execchain.RedirectExec.execute(RedirectExec.java:110)
        at org.apache.http.impl.client.InternalHttpClient.doExecute(InternalHttpClient.java:185)
        at org.apache.http.impl.client.CloseableHttpClient.execute(CloseableHttpClient.java:83)
        at org.apache.solr.util.RestTestHarness.getResponse(RestTestHarness.java:215)
        at org.apache.solr.util.RestTestHarness.query(RestTestHarness.java:107)
        at org.apache.solr.util.RestTestBase.assertJQ(RestTestBase.java:226)
        at org.apache.solr.util.RestTestBase.assertJQ(RestTestBase.java:192)
        at org.apache.solr.ltr.store.rest.TestModelManagerPersistence.testFilePersistence(TestModelManagerPersistence.java:168)
        at java.base/jdk.internal.reflect.NativeMethodAccessorImpl.invoke0(Native Method)
        at java.base/jdk.internal.reflect.NativeMethodAccessorImpl.invoke(NativeMethodAccessorImpl.java:62)
        at java.base/jdk.internal.reflect.DelegatingMethodAccessorImpl.invoke(DelegatingMethodAccessorImpl.java:43)
        at java.base/java.lang.reflect.Method.invoke(Method.java:567)
        at com.carrotsearch.randomizedtesting.RandomizedRunner.invoke(RandomizedRunner.java:1750)
        at com.carrotsearch.randomizedtesting.RandomizedRunner$8.evaluate(RandomizedRunner.java:938)
        at com.carrotsearch.randomizedtesting.RandomizedRunner$9.evaluate(RandomizedRunner.java:974)
        at com.carrotsearch.randomizedtesting.RandomizedRunner$10.evaluate(RandomizedRunner.java:988)
        at com.carrotsearch.randomizedtesting.rules.SystemPropertiesRestoreRule$1.evaluate(SystemPropertiesRestoreRule.java:57)
        at org.apache.lucene.util.TestRuleSetupTeardownChained$1.evaluate(TestRuleSetupTeardownChained.java:49)
        at org.apache.lucene.util.AbstractBeforeAfterRule$1.evaluate(AbstractBeforeAfterRule.java:45)
        at org.apache.lucene.util.TestRuleThreadAndTestName$1.evaluate(TestRuleThreadAndTestName.java:48)
        at org.apache.lucene.util.TestRuleIgnoreAfterMaxFailures$1.evaluate(TestRuleIgnoreAfterMaxFailures.java:64)
        at org.apache.lucene.util.TestRuleMarkFailure$1.evaluate(TestRuleMarkFailure.java:47)
        at com.carrotsearch.randomizedtesting.rules.StatementAdapter.evaluate(StatementAdapter.java:36)
        at com.carrotsearch.randomizedtesting.ThreadLeakControl$StatementRunner.run(ThreadLeakControl.java:368)
        at com.carrotsearch.randomizedtesting.ThreadLeakControl.forkTimeoutingTask(ThreadLeakControl.java:817)
        at com.carrotsearch.randomizedtesting.ThreadLeakControl$3.evaluate(ThreadLeakControl.java:468)
        at com.carrotsearch.randomizedtesting.RandomizedRunner.runSingleTest(RandomizedRunner.java:947)
        at com.carrotsearch.randomizedtesting.RandomizedRunner$5.evaluate(RandomizedRunner.java:832)
        at com.carrotsearch.randomizedtesting.RandomizedRunner$6.evaluate(RandomizedRunner.java:883)
        at com.carrotsearch.randomizedtesting.RandomizedRunner$7.evaluate(RandomizedRunner.java:894)
        at com.carrotsearch.randomizedtesting.rules.StatementAdapter.evaluate(StatementAdapter.java:36)
        at com.carrotsearch.randomizedtesting.rules.SystemPropertiesRestoreRule$1.evaluate(SystemPropertiesRestoreRule.java:57)
        at org.apache.lucene.util.AbstractBeforeAfterRule$1.evaluate(AbstractBeforeAfterRule.java:45)
        at com.carrotsearch.randomizedtesting.rules.StatementAdapter.evaluate(StatementAdapter.java:36)
        at org.apache.lucene.util.TestRuleStoreClassName$1.evaluate(TestRuleStoreClassName.java:41)
        at com.carrotsearch.randomizedtesting.rules.NoShadowingOrOverridesOnMethodsRule$1.evaluate(NoShadowingOrOverridesOnMethodsRule.java:40)
        at com.carrotsearch.randomizedtesting.rules.NoShadowingOrOverridesOnMethodsRule$1.evaluate(NoShadowingOrOverridesOnMethodsRule.java:40)
        at com.carrotsearch.randomizedtesting.rules.StatementAdapter.evaluate(StatementAdapter.java:36)
        at com.carrotsearch.randomizedtesting.rules.StatementAdapter.evaluate(StatementAdapter.java:36)
        at org.apache.lucene.util.TestRuleAssertionsRequired$1.evaluate(TestRuleAssertionsRequired.java:53)
        at org.apache.lucene.util.TestRuleMarkFailure$1.evaluate(TestRuleMarkFailure.java:47)
        at org.apache.lucene.util.TestRuleIgnoreAfterMaxFailures$1.evaluate(TestRuleIgnoreAfterMaxFailures.java:64)
        at org.apache.lucene.util.TestRuleIgnoreTestSuites$1.evaluate(TestRuleIgnoreTestSuites.java:54)
        at com.carrotsearch.randomizedtesting.rules.StatementAdapter.evaluate(StatementAdapter.java:36)
        at com.carrotsearch.randomizedtesting.ThreadLeakControl$StatementRunner.run(ThreadLeakControl.java:368)
        at java.base/java.lang.Thread.run(Thread.java:835)
        Suppressed: java.net.SocketException: Software caused connection abort: socket write error
                at java.base/java.net.SocketOutputStream.socketWrite0(Native Method)
                at java.base/java.net.SocketOutputStream.socketWrite(SocketOutputStream.java:110)
                at java.base/java.net.SocketOutputStream.write(SocketOutputStream.java:150)
                at java.base/sun.security.ssl.SSLSocketOutputRecord.encodeAlert(SSLSocketOutputRecord.java:81)
                at java.base/sun.security.ssl.TransportContext.fatal(TransportContext.java:351)
                ... 63 more
Caused by: java.net.SocketException: Software caused connection abort: recv failed
        at java.base/java.net.SocketInputStream.socketRead0(Native Method)
        at java.base/java.net.SocketInputStream.socketRead(SocketInputStream.java:115)
        at java.base/java.net.SocketInputStream.read(SocketInputStream.java:168)
        at java.base/java.net.SocketInputStream.read(SocketInputStream.java:140)
        at java.base/sun.security.ssl.SSLSocketInputRecord.read(SSLSocketInputRecord.java:448)
        at java.base/sun.security.ssl.SSLSocketInputRecord.bytesInCompletePacket(SSLSocketInputRecord.java:68)
        at java.base/sun.security.ssl.SSLSocketImpl.readApplicationRecord(SSLSocketImpl.java:1132)
        at java.base/sun.security.ssl.SSLSocketImpl$AppInputStream.read(SSLSocketImpl.java:828)
        ... 59 more


FAILED:  org.apache.solr.ltr.store.rest.TestModelManagerPersistence.testWrapperModelPersistence

Error Message:
List size mismatch @ models

Stack Trace:
java.lang.RuntimeException: List size mismatch @ models
        at __randomizedtesting.SeedInfo.seed([8DEEF5F94E5FF5D1:F8848627F1A38C94]:0)
        at org.apache.solr.util.RestTestBase.assertJQ(RestTestBase.java:248)
        at org.apache.solr.util.RestTestBase.assertJQ(RestTestBase.java:192)
        at org.apache.solr.ltr.store.rest.TestModelManagerPersistence.testWrapperModelPersistence(TestModelManagerPersistence.java:221)
        at java.base/jdk.internal.reflect.NativeMethodAccessorImpl.invoke0(Native Method)
        at java.base/jdk.internal.reflect.NativeMethodAccessorImpl.invoke(NativeMethodAccessorImpl.java:62)
        at java.base/jdk.internal.reflect.DelegatingMethodAccessorImpl.invoke(DelegatingMethodAccessorImpl.java:43)
        at java.base/java.lang.reflect.Method.invoke(Method.java:567)
        at com.carrotsearch.randomizedtesting.RandomizedRunner.invoke(RandomizedRunner.java:1750)
        at com.carrotsearch.randomizedtesting.RandomizedRunner$8.evaluate(RandomizedRunner.java:938)
        at com.carrotsearch.randomizedtesting.RandomizedRunner$9.evaluate(RandomizedRunner.java:974)
        at com.carrotsearch.randomizedtesting.RandomizedRunner$10.evaluate(RandomizedRunner.java:988)
        at com.carrotsearch.randomizedtesting.rules.SystemPropertiesRestoreRule$1.evaluate(SystemPropertiesRestoreRule.java:57)
        at org.apache.lucene.util.TestRuleSetupTeardownChained$1.evaluate(TestRuleSetupTeardownChained.java:49)
        at org.apache.lucene.util.AbstractBeforeAfterRule$1.evaluate(AbstractBeforeAfterRule.java:45)
        at org.apache.lucene.util.TestRuleThreadAndTestName$1.evaluate(TestRuleThreadAndTestName.java:48)
        at org.apache.lucene.util.TestRuleIgnoreAfterMaxFailures$1.evaluate(TestRuleIgnoreAfterMaxFailures.java:64)
        at org.apache.lucene.util.TestRuleMarkFailure$1.evaluate(TestRuleMarkFailure.java:47)
        at com.carrotsearch.randomizedtesting.rules.StatementAdapter.evaluate(StatementAdapter.java:36)
        at com.carrotsearch.randomizedtesting.ThreadLeakControl$StatementRunner.run(ThreadLeakControl.java:368)
        at com.carrotsearch.randomizedtesting.ThreadLeakControl.forkTimeoutingTask(ThreadLeakControl.java:817)
        at com.carrotsearch.randomizedtesting.ThreadLeakControl$3.evaluate(ThreadLeakControl.java:468)
        at com.carrotsearch.randomizedtesting.RandomizedRunner.runSingleTest(RandomizedRunner.java:947)
        at com.carrotsearch.randomizedtesting.RandomizedRunner$5.evaluate(RandomizedRunner.java:832)
        at com.carrotsearch.randomizedtesting.RandomizedRunner$6.evaluate(RandomizedRunner.java:883)
        at com.carrotsearch.randomizedtesting.RandomizedRunner$7.evaluate(RandomizedRunner.java:894)
        at com.carrotsearch.randomizedtesting.rules.StatementAdapter.evaluate(StatementAdapter.java:36)
        at com.carrotsearch.randomizedtesting.rules.SystemPropertiesRestoreRule$1.evaluate(SystemPropertiesRestoreRule.java:57)
        at org.apache.lucene.util.AbstractBeforeAfterRule$1.evaluate(AbstractBeforeAfterRule.java:45)
        at com.carrotsearch.randomizedtesting.rules.StatementAdapter.evaluate(StatementAdapter.java:36)
        at org.apache.lucene.util.TestRuleStoreClassName$1.evaluate(TestRuleStoreClassName.java:41)
        at com.carrotsearch.randomizedtesting.rules.NoShadowingOrOverridesOnMethodsRule$1.evaluate(NoShadowingOrOverridesOnMethodsRule.java:40)
        at com.carrotsearch.randomizedtesting.rules.NoShadowingOrOverridesOnMethodsRule$1.evaluate(NoShadowingOrOverridesOnMethodsRule.java:40)
        at com.carrotsearch.randomizedtesting.rules.StatementAdapter.evaluate(StatementAdapter.java:36)
        at com.carrotsearch.randomizedtesting.rules.StatementAdapter.evaluate(StatementAdapter.java:36)
        at org.apache.lucene.util.TestRuleAssertionsRequired$1.evaluate(TestRuleAssertionsRequired.java:53)
        at org.apache.lucene.util.TestRuleMarkFailure$1.evaluate(TestRuleMarkFailure.java:47)
        at org.apache.lucene.util.TestRuleIgnoreAfterMaxFailures$1.evaluate(TestRuleIgnoreAfterMaxFailures.java:64)
        at org.apache.lucene.util.TestRuleIgnoreTestSuites$1.evaluate(TestRuleIgnoreTestSuites.java:54)
        at com.carrotsearch.randomizedtesting.rules.StatementAdapter.evaluate(StatementAdapter.java:36)
        at com.carrotsearch.randomizedtesting.ThreadLeakControl$StatementRunner.run(ThreadLeakControl.java:368)
        at java.base/java.lang.Thread.run(Thread.java:835)


FAILED:  org.apache.solr.ltr.store.rest.TestModelManagerPersistence.testInnerCustomClassesPersistence

Error Message:
mismatch: 'model42'!='6029760550880411648' @ models/[0]/name

Stack Trace:
java.lang.RuntimeException: mismatch: 'model42'!='6029760550880411648' @ models/[0]/name
        at __randomizedtesting.SeedInfo.seed([8DEEF5F94E5FF5D1:A4EBDECC88B3D3BD]:0)
        at org.apache.solr.util.RestTestBase.assertJQ(RestTestBase.java:248)
        at org.apache.solr.util.RestTestBase.assertJQ(RestTestBase.java:192)
        at org.apache.solr.ltr.store.rest.TestModelManagerPersistence.testInnerCustomClassesPersistence(TestModelManagerPersistence.java:310)
        at java.base/jdk.internal.reflect.NativeMethodAccessorImpl.invoke0(Native Method)
        at java.base/jdk.internal.reflect.NativeMethodAccessorImpl.invoke(NativeMethodAccessorImpl.java:62)
        at java.base/jdk.internal.reflect.DelegatingMethodAccessorImpl.invoke(DelegatingMethodAccessorImpl.java:43)
        at java.base/java.lang.reflect.Method.invoke(Method.java:567)
        at com.carrotsearch.randomizedtesting.RandomizedRunner.invoke(RandomizedRunner.java:1750)
        at com.carrotsearch.randomizedtesting.RandomizedRunner$8.evaluate(RandomizedRunner.java:938)
        at com.carrotsearch.randomizedtesting.RandomizedRunner$9.evaluate(RandomizedRunner.java:974)
        at com.carrotsearch.randomizedtesting.RandomizedRunner$10.evaluate(RandomizedRunner.java:988)
        at com.carrotsearch.randomizedtesting.rules.SystemPropertiesRestoreRule$1.evaluate(SystemPropertiesRestoreRule.java:57)
        at org.apache.lucene.util.TestRuleSetupTeardownChained$1.evaluate(TestRuleSetupTeardownChained.java:49)
        at org.apache.lucene.util.AbstractBeforeAfterRule$1.evaluate(AbstractBeforeAfterRule.java:45)
        at org.apache.lucene.util.TestRuleThreadAndTestName$1.evaluate(TestRuleThreadAndTestName.java:48)
        at org.apache.lucene.util.TestRuleIgnoreAfterMaxFailures$1.evaluate(TestRuleIgnoreAfterMaxFailures.java:64)
        at org.apache.lucene.util.TestRuleMarkFailure$1.evaluate(TestRuleMarkFailure.java:47)
        at com.carrotsearch.randomizedtesting.rules.StatementAdapter.evaluate(StatementAdapter.java:36)
        at com.carrotsearch.randomizedtesting.ThreadLeakControl$StatementRunner.run(ThreadLeakControl.java:368)
        at com.carrotsearch.randomizedtesting.ThreadLeakControl.forkTimeoutingTask(ThreadLeakControl.java:817)
        at com.carrotsearch.randomizedtesting.ThreadLeakControl$3.evaluate(ThreadLeakControl.java:468)
        at com.carrotsearch.randomizedtesting.RandomizedRunner.runSingleTest(RandomizedRunner.java:947)
        at com.carrotsearch.randomizedtesting.RandomizedRunner$5.evaluate(RandomizedRunner.java:832)
        at com.carrotsearch.randomizedtesting.RandomizedRunner$6.evaluate(RandomizedRunner.java:883)
        at com.carrotsearch.randomizedtesting.RandomizedRunner$7.evaluate(RandomizedRunner.java:894)
        at com.carrotsearch.randomizedtesting.rules.StatementAdapter.evaluate(StatementAdapter.java:36)
        at com.carrotsearch.randomizedtesting.rules.SystemPropertiesRestoreRule$1.evaluate(SystemPropertiesRestoreRule.java:57)
        at org.apache.lucene.util.AbstractBeforeAfterRule$1.evaluate(AbstractBeforeAfterRule.java:45)
        at com.carrotsearch.randomizedtesting.rules.StatementAdapter.evaluate(StatementAdapter.java:36)
        at org.apache.lucene.util.TestRuleStoreClassName$1.evaluate(TestRuleStoreClassName.java:41)
        at com.carrotsearch.randomizedtesting.rules.NoShadowingOrOverridesOnMethodsRule$1.evaluate(NoShadowingOrOverridesOnMethodsRule.java:40)
        at com.carrotsearch.randomizedtesting.rules.NoShadowingOrOverridesOnMethodsRule$1.evaluate(NoShadowingOrOverridesOnMethodsRule.java:40)
        at com.carrotsearch.randomizedtesting.rules.StatementAdapter.evaluate(StatementAdapter.java:36)
        at com.carrotsearch.randomizedtesting.rules.StatementAdapter.evaluate(StatementAdapter.java:36)
        at org.apache.lucene.util.TestRuleAssertionsRequired$1.evaluate(TestRuleAssertionsRequired.java:53)
        at org.apache.lucene.util.TestRuleMarkFailure$1.evaluate(TestRuleMarkFailure.java:47)
        at org.apache.lucene.util.TestRuleIgnoreAfterMaxFailures$1.evaluate(TestRuleIgnoreAfterMaxFailures.java:64)
        at org.apache.lucene.util.TestRuleIgnoreTestSuites$1.evaluate(TestRuleIgnoreTestSuites.java:54)
        at com.carrotsearch.randomizedtesting.rules.StatementAdapter.evaluate(StatementAdapter.java:36)
        at com.carrotsearch.randomizedtesting.ThreadLeakControl$StatementRunner.run(ThreadLeakControl.java:368)
        at java.base/java.lang.Thread.run(Thread.java:835)


FAILED:  org.apache.solr.cloud.LegacyCloudClusterPropTest.testCreateCollectionSwitchLegacyCloud

Error Message:
IOException occurred when talking to server at: https://127.0.0.1:52630/solr

Stack Trace:
org.apache.solr.client.solrj.SolrServerException: IOException occurred when talking to server at: https://127.0.0.1:52630/solr
        at __randomizedtesting.SeedInfo.seed([A69B6BC57242820:DB6E4439F32BA312]:0)
        at org.apache.solr.client.solrj.impl.HttpSolrClient.executeMethod(HttpSolrClient.java:670)
        at org.apache.solr.client.solrj.impl.HttpSolrClient.request(HttpSolrClient.java:262)
        at org.apache.solr.client.solrj.impl.HttpSolrClient.request(HttpSolrClient.java:245)
        at org.apache.solr.client.solrj.impl.LBSolrClient.doRequest(LBSolrClient.java:368)
        at org.apache.solr.client.solrj.impl.LBSolrClient.request(LBSolrClient.java:296)
        at org.apache.solr.client.solrj.impl.BaseCloudSolrClient.sendRequest(BaseCloudSolrClient.java:1128)
        at org.apache.solr.client.solrj.impl.BaseCloudSolrClient.requestWithRetryOnStaleState(BaseCloudSolrClient.java:897)
        at org.apache.solr.client.solrj.impl.BaseCloudSolrClient.request(BaseCloudSolrClient.java:829)
        at org.apache.solr.client.solrj.SolrRequest.process(SolrRequest.java:211)
        at org.apache.solr.client.solrj.SolrRequest.process(SolrRequest.java:228)
        at org.apache.solr.cloud.LegacyCloudClusterPropTest.createAndTest(LegacyCloudClusterPropTest.java:87)
        at org.apache.solr.cloud.LegacyCloudClusterPropTest.testCreateCollectionSwitchLegacyCloud(LegacyCloudClusterPropTest.java:79)
        at java.base/jdk.internal.reflect.NativeMethodAccessorImpl.invoke0(Native Method)
        at java.base/jdk.internal.reflect.NativeMethodAccessorImpl.invoke(NativeMethodAccessorImpl.java:62)
        at java.base/jdk.internal.reflect.DelegatingMethodAccessorImpl.invoke(DelegatingMethodAccessorImpl.java:43)
        at java.base/java.lang.reflect.Method.invoke(Method.java:567)
        at com.carrotsearch.randomizedtesting.RandomizedRunner.invoke(RandomizedRunner.java:1750)
        at com.carrotsearch.randomizedtesting.RandomizedRunner$8.evaluate(RandomizedRunner.java:938)
        at com.carrotsearch.randomizedtesting.RandomizedRunner$9.evaluate(RandomizedRunner.java:974)
        at com.carrotsearch.randomizedtesting.RandomizedRunner$10.evaluate(RandomizedRunner.java:988)
        at com.carrotsearch.randomizedtesting.rules.SystemPropertiesRestoreRule$1.evaluate(SystemPropertiesRestoreRule.java:57)
        at org.apache.lucene.util.TestRuleSetupTeardownChained$1.evaluate(TestRuleSetupTeardownChained.java:49)
        at org.apache.lucene.util.AbstractBeforeAfterRule$1.evaluate(AbstractBeforeAfterRule.java:45)
        at org.apache.lucene.util.TestRuleThreadAndTestName$1.evaluate(TestRuleThreadAndTestName.java:48)
        at org.apache.lucene.util.TestRuleIgnoreAfterMaxFailures$1.evaluate(TestRuleIgnoreAfterMaxFailures.java:64)
        at org.apache.lucene.util.TestRuleMarkFailure$1.evaluate(TestRuleMarkFailure.java:47)
        at com.carrotsearch.randomizedtesting.rules.StatementAdapter.evaluate(StatementAdapter.java:36)
        at com.carrotsearch.randomizedtesting.ThreadLeakControl$StatementRunner.run(ThreadLeakControl.java:368)
        at com.carrotsearch.randomizedtesting.ThreadLeakControl.forkTimeoutingTask(ThreadLeakControl.java:817)
        at com.carrotsearch.randomizedtesting.ThreadLeakControl$3.evaluate(ThreadLeakControl.java:468)
        at com.carrotsearch.randomizedtesting.RandomizedRunner.runSingleTest(RandomizedRunner.java:947)
        at com.carrotsearch.randomizedtesting.RandomizedRunner$5.evaluate(RandomizedRunner.java:832)
        at com.carrotsearch.randomizedtesting.RandomizedRunner$6.evaluate(RandomizedRunner.java:883)
        at com.carrotsearch.randomizedtesting.RandomizedRunner$7.evaluate(RandomizedRunner.java:894)
        at com.carrotsearch.randomizedtesting.rules.StatementAdapter.evaluate(StatementAdapter.java:36)
        at com.carrotsearch.randomizedtesting.rules.SystemPropertiesRestoreRule$1.evaluate(SystemPropertiesRestoreRule.java:57)
        at org.apache.lucene.util.AbstractBeforeAfterRule$1.evaluate(AbstractBeforeAfterRule.java:45)
        at com.carrotsearch.randomizedtesting.rules.StatementAdapter.evaluate(StatementAdapter.java:36)
        at org.apache.lucene.util.TestRuleStoreClassName$1.evaluate(TestRuleStoreClassName.java:41)
        at com.carrotsearch.randomizedtesting.rules.NoShadowingOrOverridesOnMethodsRule$1.evaluate(NoShadowingOrOverridesOnMethodsRule.java:40)
        at com.carrotsearch.randomizedtesting.rules.NoShadowingOrOverridesOnMethodsRule$1.evaluate(NoShadowingOrOverridesOnMethodsRule.java:40)
        at com.carrotsearch.randomizedtesting.rules.StatementAdapter.evaluate(StatementAdapter.java:36)
        at com.carrotsearch.randomizedtesting.rules.StatementAdapter.evaluate(StatementAdapter.java:36)
        at org.apache.lucene.util.TestRuleAssertionsRequired$1.evaluate(TestRuleAssertionsRequired.java:53)
        at org.apache.lucene.util.TestRuleMarkFailure$1.evaluate(TestRuleMarkFailure.java:47)
        at org.apache.lucene.util.TestRuleIgnoreAfterMaxFailures$1.evaluate(TestRuleIgnoreAfterMaxFailures.java:64)
        at org.apache.lucene.util.TestRuleIgnoreTestSuites$1.evaluate(TestRuleIgnoreTestSuites.java:54)
        at com.carrotsearch.randomizedtesting.rules.StatementAdapter.evaluate(StatementAdapter.java:36)
        at com.carrotsearch.randomizedtesting.ThreadLeakControl$StatementRunner.run(ThreadLeakControl.java:368)
        at java.base/java.lang.Thread.run(Thread.java:835)
Caused by: javax.net.ssl.SSLException: Software caused connection abort: recv failed
        at java.base/sun.security.ssl.Alert.createSSLException(Alert.java:127)
        at java.base/sun.security.ssl.TransportContext.fatal(TransportContext.java:320)
        at java.base/sun.security.ssl.TransportContext.fatal(TransportContext.java:263)
        at java.base/sun.security.ssl.TransportContext.fatal(TransportContext.java:258)
        at java.base/sun.security.ssl.SSLSocketImpl.handleException(SSLSocketImpl.java:1342)
        at java.base/sun.security.ssl.SSLSocketImpl$AppInputStream.read(SSLSocketImpl.java:844)
        at org.apache.http.impl.io.SessionInputBufferImpl.streamRead(SessionInputBufferImpl.java:137)
        at org.apache.http.impl.io.SessionInputBufferImpl.fillBuffer(SessionInputBufferImpl.java:153)
        at org.apache.http.impl.io.SessionInputBufferImpl.readLine(SessionInputBufferImpl.java:282)
        at org.apache.http.impl.conn.DefaultHttpResponseParser.parseHead(DefaultHttpResponseParser.java:138)
        at org.apache.http.impl.conn.DefaultHttpResponseParser.parseHead(DefaultHttpResponseParser.java:56)
        at org.apache.http.impl.io.AbstractMessageParser.parse(AbstractMessageParser.java:259)
        at org.apache.http.impl.DefaultBHttpClientConnection.receiveResponseHeader(DefaultBHttpClientConnection.java:163)
        at org.apache.http.impl.conn.CPoolProxy.receiveResponseHeader(CPoolProxy.java:165)
        at org.apache.http.protocol.HttpRequestExecutor.doReceiveResponse(HttpRequestExecutor.java:273)
        at org.apache.http.protocol.HttpRequestExecutor.execute(HttpRequestExecutor.java:125)
        at org.apache.http.impl.execchain.MainClientExec.execute(MainClientExec.java:272)
        at org.apache.http.impl.execchain.ProtocolExec.execute(ProtocolExec.java:185)
        at org.apache.http.impl.execchain.RetryExec.execute(RetryExec.java:89)
        at org.apache.http.impl.execchain.RedirectExec.execute(RedirectExec.java:110)
        at org.apache.http.impl.client.InternalHttpClient.doExecute(InternalHttpClient.java:185)
        at org.apache.http.impl.client.CloseableHttpClient.execute(CloseableHttpClient.java:83)
        at org.apache.http.impl.client.CloseableHttpClient.execute(CloseableHttpClient.java:56)
        at org.apache.solr.client.solrj.impl.HttpSolrClient.executeMethod(HttpSolrClient.java:555)
        ... 49 more
        Suppressed: java.net.SocketException: Software caused connection abort: socket write error
                at java.base/java.net.SocketOutputStream.socketWrite0(Native Method)
                at java.base/java.net.SocketOutputStream.socketWrite(SocketOutputStream.java:110)
                at java.base/java.net.SocketOutputStream.write(SocketOutputStream.java:150)
                at java.base/sun.security.ssl.SSLSocketOutputRecord.encodeAlert(SSLSocketOutputRecord.java:81)
                at java.base/sun.security.ssl.TransportContext.fatal(TransportContext.java:351)
                ... 71 more
Caused by: java.net.SocketException: Software caused connection abort: recv failed
        at java.base/java.net.SocketInputStream.socketRead0(Native Method)
        at java.base/java.net.SocketInputStream.socketRead(SocketInputStream.java:115)
        at java.base/java.net.SocketInputStream.read(SocketInputStream.java:168)
        at java.base/java.net.SocketInputStream.read(SocketInputStream.java:140)
        at java.base/sun.security.ssl.SSLSocketInputRecord.read(SSLSocketInputRecord.java:448)
        at java.base/sun.security.ssl.SSLSocketInputRecord.bytesInCompletePacket(SSLSocketInputRecord.java:68)
        at java.base/sun.security.ssl.SSLSocketImpl.readApplicationRecord(SSLSocketImpl.java:1132)
        at java.base/sun.security.ssl.SSLSocketImpl$AppInputStream.read(SSLSocketImpl.java:828)
        ... 67 more


FAILED:  org.apache.solr.cloud.LegacyCloudClusterPropTest.testCreateCollectionSwitchLegacyCloud

Error Message:
IOException occurred when talking to server at: https://127.0.0.1:52725/solr

Stack Trace:
org.apache.solr.client.solrj.SolrServerException: IOException occurred when talking to server at: https://127.0.0.1:52725/solr
        at __randomizedtesting.SeedInfo.seed([A69B6BC57242820:DB6E4439F32BA312]:0)
        at org.apache.solr.client.solrj.impl.HttpSolrClient.executeMethod(HttpSolrClient.java:670)
        at org.apache.solr.client.solrj.impl.HttpSolrClient.request(HttpSolrClient.java:262)
        at org.apache.solr.client.solrj.impl.HttpSolrClient.request(HttpSolrClient.java:245)
        at org.apache.solr.client.solrj.impl.LBSolrClient.doRequest(LBSolrClient.java:368)
        at org.apache.solr.client.solrj.impl.LBSolrClient.request(LBSolrClient.java:296)
        at org.apache.solr.client.solrj.impl.BaseCloudSolrClient.sendRequest(BaseCloudSolrClient.java:1128)
        at org.apache.solr.client.solrj.impl.BaseCloudSolrClient.requestWithRetryOnStaleState(BaseCloudSolrClient.java:897)
        at org.apache.solr.client.solrj.impl.BaseCloudSolrClient.request(BaseCloudSolrClient.java:829)
        at org.apache.solr.client.solrj.SolrRequest.process(SolrRequest.java:211)
        at org.apache.solr.client.solrj.SolrRequest.process(SolrRequest.java:228)
        at org.apache.solr.cloud.LegacyCloudClusterPropTest.createAndTest(LegacyCloudClusterPropTest.java:87)
        at org.apache.solr.cloud.LegacyCloudClusterPropTest.testCreateCollectionSwitchLegacyCloud(LegacyCloudClusterPropTest.java:79)
        at java.base/jdk.internal.reflect.NativeMethodAccessorImpl.invoke0(Native Method)
        at java.base/jdk.internal.reflect.NativeMethodAccessorImpl.invoke(NativeMethodAccessorImpl.java:62)
        at java.base/jdk.internal.reflect.DelegatingMethodAccessorImpl.invoke(DelegatingMethodAccessorImpl.java:43)
        at java.base/java.lang.reflect.Method.invoke(Method.java:567)
        at com.carrotsearch.randomizedtesting.RandomizedRunner.invoke(RandomizedRunner.java:1750)
        at com.carrotsearch.randomizedtesting.RandomizedRunner$8.evaluate(RandomizedRunner.java:938)
        at com.carrotsearch.randomizedtesting.RandomizedRunner$9.evaluate(RandomizedRunner.java:974)
        at com.carrotsearch.randomizedtesting.RandomizedRunner$10.evaluate(RandomizedRunner.java:988)
        at com.carrotsearch.randomizedtesting.rules.SystemPropertiesRestoreRule$1.evaluate(SystemPropertiesRestoreRule.java:57)
        at org.apache.lucene.util.TestRuleSetupTeardownChained$1.evaluate(TestRuleSetupTeardownChained.java:49)
        at org.apache.lucene.util.AbstractBeforeAfterRule$1.evaluate(AbstractBeforeAfterRule.java:45)
        at org.apache.lucene.util.TestRuleThreadAndTestName$1.evaluate(TestRuleThreadAndTestName.java:48)
        at org.apache.lucene.util.TestRuleIgnoreAfterMaxFailures$1.evaluate(TestRuleIgnoreAfterMaxFailures.java:64)
        at org.apache.lucene.util.TestRuleMarkFailure$1.evaluate(TestRuleMarkFailure.java:47)
        at com.carrotsearch.randomizedtesting.rules.StatementAdapter.evaluate(StatementAdapter.java:36)
        at com.carrotsearch.randomizedtesting.ThreadLeakControl$StatementRunner.run(ThreadLeakControl.java:368)
        at com.carrotsearch.randomizedtesting.ThreadLeakControl.forkTimeoutingTask(ThreadLeakControl.java:817)
        at com.carrotsearch.randomizedtesting.ThreadLeakControl$3.evaluate(ThreadLeakControl.java:468)
        at com.carrotsearch.randomizedtesting.RandomizedRunner.runSingleTest(RandomizedRunner.java:947)
        at com.carrotsearch.randomizedtesting.RandomizedRunner$5.evaluate(RandomizedRunner.java:832)
        at com.carrotsearch.randomizedtesting.RandomizedRunner$6.evaluate(RandomizedRunner.java:883)
        at com.carrotsearch.randomizedtesting.RandomizedRunner$7.evaluate(RandomizedRunner.java:894)
        at com.carrotsearch.randomizedtesting.rules.StatementAdapter.evaluate(StatementAdapter.java:36)
        at com.carrotsearch.randomizedtesting.rules.SystemPropertiesRestoreRule$1.evaluate(SystemPropertiesRestoreRule.java:57)
        at org.apache.lucene.util.AbstractBeforeAfterRule$1.evaluate(AbstractBeforeAfterRule.java:45)
        at com.carrotsearch.randomizedtesting.rules.StatementAdapter.evaluate(StatementAdapter.java:36)
        at org.apache.lucene.util.TestRuleStoreClassName$1.evaluate(TestRuleStoreClassName.java:41)
        at com.carrotsearch.randomizedtesting.rules.NoShadowingOrOverridesOnMethodsRule$1.evaluate(NoShadowingOrOverridesOnMethodsRule.java:40)
        at com.carrotsearch.randomizedtesting.rules.NoShadowingOrOverridesOnMethodsRule$1.evaluate(NoShadowingOrOverridesOnMethodsRule.java:40)
        at com.carrotsearch.randomizedtesting.rules.StatementAdapter.evaluate(StatementAdapter.java:36)
        at com.carrotsearch.randomizedtesting.rules.StatementAdapter.evaluate(StatementAdapter.java:36)
        at org.apache.lucene.util.TestRuleAssertionsRequired$1.evaluate(TestRuleAssertionsRequired.java:53)
        at org.apache.lucene.util.TestRuleMarkFailure$1.evaluate(TestRuleMarkFailure.java:47)
        at org.apache.lucene.util.TestRuleIgnoreAfterMaxFailures$1.evaluate(TestRuleIgnoreAfterMaxFailures.java:64)
        at org.apache.lucene.util.TestRuleIgnoreTestSuites$1.evaluate(TestRuleIgnoreTestSuites.java:54)
        at com.carrotsearch.randomizedtesting.rules.StatementAdapter.evaluate(StatementAdapter.java:36)
        at com.carrotsearch.randomizedtesting.ThreadLeakControl$StatementRunner.run(ThreadLeakControl.java:368)
        at java.base/java.lang.Thread.run(Thread.java:835)
Caused by: javax.net.ssl.SSLException: Software caused connection abort: recv failed
        at java.base/sun.security.ssl.Alert.createSSLException(Alert.java:127)
        at java.base/sun.security.ssl.TransportContext.fatal(TransportContext.java:320)
        at java.base/sun.security.ssl.TransportContext.fatal(TransportContext.java:263)
        at java.base/sun.security.ssl.TransportContext.fatal(TransportContext.java:258)
        at java.base/sun.security.ssl.SSLSocketImpl.handleException(SSLSocketImpl.java:1342)
        at java.base/sun.security.ssl.SSLSocketImpl$AppInputStream.read(SSLSocketImpl.java:844)
        at org.apache.http.impl.io.SessionInputBufferImpl.streamRead(SessionInputBufferImpl.java:137)
        at org.apache.http.impl.io.SessionInputBufferImpl.fillBuffer(SessionInputBufferImpl.java:153)
        at org.apache.http.impl.io.SessionInputBufferImpl.readLine(SessionInputBufferImpl.java:282)
        at org.apache.http.impl.conn.DefaultHttpResponseParser.parseHead(DefaultHttpResponseParser.java:138)
        at org.apache.http.impl.conn.DefaultHttpResponseParser.parseHead(DefaultHttpResponseParser.java:56)
        at org.apache.http.impl.io.AbstractMessageParser.parse(AbstractMessageParser.java:259)
        at org.apache.http.impl.DefaultBHttpClientConnection.receiveResponseHeader(DefaultBHttpClientConnection.java:163)
        at org.apache.http.impl.conn.CPoolProxy.receiveResponseHeader(CPoolProxy.java:165)
        at org.apache.http.protocol.HttpRequestExecutor.doReceiveResponse(HttpRequestExecutor.java:273)
        at org.apache.http.protocol.HttpRequestExecutor.execute(HttpRequestExecutor.java:125)
        at org.apache.http.impl.execchain.MainClientExec.execute(MainClientExec.java:272)
        at org.apache.http.impl.execchain.ProtocolExec.execute(ProtocolExec.java:185)
        at org.apache.http.impl.execchain.RetryExec.execute(RetryExec.java:89)
        at org.apache.http.impl.execchain.RedirectExec.execute(RedirectExec.java:110)
        at org.apache.http.impl.client.InternalHttpClient.doExecute(InternalHttpClient.java:185)
        at org.apache.http.impl.client.CloseableHttpClient.execute(CloseableHttpClient.java:83)
        at org.apache.http.impl.client.CloseableHttpClient.execute(CloseableHttpClient.java:56)
        at org.apache.solr.client.solrj.impl.HttpSolrClient.executeMethod(HttpSolrClient.java:555)
        ... 49 more
        Suppressed: java.net.SocketException: Software caused connection abort: socket write error
                at java.base/java.net.SocketOutputStream.socketWrite0(Native Method)
                at java.base/java.net.SocketOutputStream.socketWrite(SocketOutputStream.java:110)
                at java.base/java.net.SocketOutputStream.write(SocketOutputStream.java:150)
                at java.base/sun.security.ssl.SSLSocketOutputRecord.encodeAlert(SSLSocketOutputRecord.ja

[...truncated too long message...]

 61813 INFO  (jetty-closer-175-thread-1) [     ] o.a.s.c.CoreContainer Shutting down CoreContainer instance=1248248589
   [junit4]   2> 61813 INFO  (jetty-closer-175-thread-1) [     ] o.a.s.c.ZkController Remove node as live in ZooKeeper:/live_nodes/127.0.0.1:52851_solr
   [junit4]   2> 61814 INFO  (jetty-closer-175-thread-1) [     ] o.a.s.c.ZkController Publish this node as DOWN...
   [junit4]   2> 61814 INFO  (jetty-closer-175-thread-1) [     ] o.a.s.c.ZkController Publish node=127.0.0.1:52851_solr as DOWN
   [junit4]   2> 61820 INFO  (jetty-closer-175-thread-1) [     ] o.a.s.m.SolrMetricManager Closing metric reporters for registry=solr.node, tag=null
   [junit4]   2> 61820 INFO  (jetty-closer-175-thread-1) [     ] o.a.s.m.r.SolrJmxReporter Closing reporter [org.apache.solr.metrics.reporters.SolrJmxReporter@39c59e73: rootName = solr_52851, domain = solr.node, service url = null, agent id = null] for registry solr.node / com.codahale.metrics.MetricRegistry@1dbbc849
   [junit4]   2> 61824 INFO  (jetty-closer-175-thread-1) [     ] o.a.s.m.SolrMetricManager Closing metric reporters for registry=solr.jvm, tag=null
   [junit4]   2> 61825 INFO  (jetty-closer-175-thread-1) [     ] o.a.s.m.r.SolrJmxReporter Closing reporter [org.apache.solr.metrics.reporters.SolrJmxReporter@3e9d3888: rootName = solr_52851, domain = solr.jvm, service url = null, agent id = null] for registry solr.jvm / com.codahale.metrics.MetricRegistry@6a346f8b
   [junit4]   2> 61828 INFO  (jetty-closer-175-thread-1) [     ] o.a.s.m.SolrMetricManager Closing metric reporters for registry=solr.jetty, tag=null
   [junit4]   2> 61828 INFO  (jetty-closer-175-thread-1) [     ] o.a.s.m.r.SolrJmxReporter Closing reporter [org.apache.solr.metrics.reporters.SolrJmxReporter@7e74174a: rootName = solr_52851, domain = solr.jetty, service url = null, agent id = null] for registry solr.jetty / com.codahale.metrics.MetricRegistry@2c2c250a
   [junit4]   2> 61828 INFO  (jetty-closer-175-thread-1) [     ] o.a.s.m.SolrMetricManager Closing metric reporters for registry=solr.cluster, tag=null
   [junit4]   2> 61832 INFO  (closeThreadPool-179-thread-2) [     ] o.a.s.c.Overseer Overseer (id=72103296070778890-127.0.0.1:52851_solr-n_0000000001) closing
   [junit4]   2> 61832 INFO  (OverseerStateUpdate-72103296070778890-127.0.0.1:52851_solr-n_0000000001) [n:127.0.0.1:52851_solr     ] o.a.s.c.Overseer Overseer Loop exiting : 127.0.0.1:52851_solr
   [junit4]   2> 61834 INFO  (OverseerAutoScalingTriggerThread-72103296070778890-127.0.0.1:52851_solr-n_0000000001) [     ] o.a.s.c.a.OverseerTriggerThread OverseerTriggerThread woken up but we are closed, exiting.
   [junit4]   2> 61838 INFO  (zkCallback-169-thread-1) [     ] o.a.s.c.c.ZkStateReader Updated live nodes from ZooKeeper... (1) -> (0)
   [junit4]   2> 61838 INFO  (closeThreadPool-179-thread-1) [     ] o.a.s.c.Overseer Overseer (id=72103296070778890-127.0.0.1:52851_solr-n_0000000001) closing
   [junit4]   2> 61969 INFO  (jetty-closer-175-thread-1) [     ] o.a.s.c.Overseer Overseer (id=72103296070778890-127.0.0.1:52851_solr-n_0000000001) closing
   [junit4]   2> 61974 INFO  (jetty-closer-175-thread-1) [     ] o.e.j.s.AbstractConnector Stopped ServerConnector@1de667c1{ssl,[ssl, alpn, http/1.1, h2]}{127.0.0.1:52851}
   [junit4]   2> 61974 INFO  (jetty-closer-175-thread-1) [     ] o.e.j.s.h.ContextHandler Stopped o.e.j.s.ServletContextHandler@31a0e23c{/solr,null,UNAVAILABLE}
   [junit4]   2> 61974 INFO  (jetty-closer-175-thread-1) [     ] o.e.j.s.session node0 Stopped scavenging
   [junit4]   2> 61976 INFO  (SUITE-LegacyCloudClusterPropTest-seed#[A69B6BC57242820]-worker) [     ] o.a.s.c.ZkTestServer Shutting down ZkTestServer.
   [junit4]   2> 62247 WARN  (ZkTestServer Run Thread) [     ] o.a.s.c.ZkTestServer Watch limit violations:
   [junit4]   2> Maximum concurrent create/delete watches above limit:
   [junit4]   2>
   [junit4]   2> 6 /solr/aliases.json
   [junit4]   2> 4 /solr/collections/legacyTrue/terms/shard1
   [junit4]   2> 3 /solr/collections/legacyTrue/state.json
   [junit4]   2> 2 /solr/security.json
   [junit4]   2> 2 /solr/configs/conf
   [junit4]   2>
   [junit4]   2> Maximum concurrent data watches above limit:
   [junit4]   2>
   [junit4]   2> 13 /solr/collections/legacyTrue/state.json
   [junit4]   2> 9 /solr/clusterprops.json
   [junit4]   2> 6 /solr/clusterstate.json
   [junit4]   2> 4 /solr/aliases.json
   [junit4]   2> 2 /solr/autoscaling.json
   [junit4]   2>
   [junit4]   2> Maximum concurrent children watches above limit:
   [junit4]   2>
   [junit4]   2> 19 /solr/overseer/queue
   [junit4]   2> 13 /solr/live_nodes
   [junit4]   2> 13 /solr/collections
   [junit4]   2> 9 /solr/overseer/collection-queue-work
   [junit4]   2> 2 /solr/autoscaling/events/.scheduled_maintenance
   [junit4]   2> 2 /solr/autoscaling/events/.auto_add_replicas
   [junit4]   2> 2 /solr/overseer/queue-work
   [junit4]   2>
   [junit4]   2> 62253 INFO  (SUITE-LegacyCloudClusterPropTest-seed#[A69B6BC57242820]-worker) [     ] o.a.s.c.ZkTestServer waitForServerDown: 127.0.0.1:52838
   [junit4]   2> 62253 INFO  (SUITE-LegacyCloudClusterPropTest-seed#[A69B6BC57242820]-worker) [     ] o.a.s.c.ZkTestServer parse host and port list: 127.0.0.1:52838
   [junit4]   2> 62253 INFO  (SUITE-LegacyCloudClusterPropTest-seed#[A69B6BC57242820]-worker) [     ] o.a.s.c.ZkTestServer connecting to 127.0.0.1 52838
   [junit4]   2> NOTE: leaving temporary files on disk at: C:\Users\jenkins\workspace\Lucene-Solr-master-Windows\solr\build\solr-core\test\J0\temp\solr.cloud.LegacyCloudClusterPropTest_A69B6BC57242820-002
   [junit4]   2> NOTE: test params are: codec=Asserting(Lucene80): {}, docValues:{}, maxPointsInLeafNode=1607, maxMBSortInHeap=5.064942905671114, sim=Asserting(org.apache.lucene.search.similarities.AssertingSimilarity@3af9e082), locale=fi-FI, timezone=Antarctica/Macquarie
   [junit4]   2> NOTE: Windows 10 10.0 amd64/AdoptOpenJDK 12.0.1 (64-bit)/cpus=3,threads=1,free=22549648,total=97452032
   [junit4]   2> NOTE: All tests run in this JVM: [TestReplicationHandlerBackup, TestReplicationHandlerBackup, TestReplicationHandlerBackup, LegacyCloudClusterPropTest, LegacyCloudClusterPropTest]
   [junit4] Completed [10/10 (5!)] on J0 in 9.39s, 1 test, 1 error <<< FAILURES!
   [junit4]
   [junit4]
   [junit4] Tests with failures [seed: A69B6BC57242820]:
   [junit4]   - org.apache.solr.cloud.LegacyCloudClusterPropTest.testCreateCollectionSwitchLegacyCloud
   [junit4]   - org.apache.solr.cloud.LegacyCloudClusterPropTest.testCreateCollectionSwitchLegacyCloud
   [junit4]   - org.apache.solr.cloud.LegacyCloudClusterPropTest.testCreateCollectionSwitchLegacyCloud
   [junit4]   - org.apache.solr.cloud.LegacyCloudClusterPropTest.testCreateCollectionSwitchLegacyCloud
   [junit4]   - org.apache.solr.cloud.LegacyCloudClusterPropTest.testCreateCollectionSwitchLegacyCloud
   [junit4]
   [junit4]
   [junit4] JVM J0:     0.70 ..    65.94 =    65.24s
   [junit4] JVM J1:     0.71 ..    60.08 =    59.37s
   [junit4] Execution time total: 1 minute 5 seconds
   [junit4] Tests summary: 10 suites, 15 tests, 5 errors

BUILD FAILED
C:\Users\jenkins\workspace\Lucene-Solr-master-Windows\lucene\common-build.xml:1492: The following error occurred while executing this line:
C:\Users\jenkins\workspace\Lucene-Solr-master-Windows\lucene\common-build.xml:1019: There were test failures: 10 suites, 15 tests, 5 errors [seed: A69B6BC57242820]

Total time: 1 minute 7 seconds

[repro] Setting last failure code to 1

[repro] Failures:
[repro]   0/5 failed: org.apache.solr.handler.TestReplicationHandlerBackup
[repro]   4/5 failed: org.apache.solr.ltr.store.rest.TestModelManagerPersistence
[repro]   5/5 failed: org.apache.solr.cloud.LegacyCloudClusterPropTest
[repro] Exiting with code 1

C:\Users\jenkins\workspace\Lucene-Solr-master-Windows>IF EXIST lucene\build move /y lucene\build lucene\build.repro
        1 dir(s) moved.

C:\Users\jenkins\workspace\Lucene-Solr-master-Windows>IF EXIST solr\build move /y solr\build solr\build.repro
        1 dir(s) moved.

C:\Users\jenkins\workspace\Lucene-Solr-master-Windows>IF EXIST lucene\build.orig move /y lucene\build.orig lucene\build
        1 dir(s) moved.

C:\Users\jenkins\workspace\Lucene-Solr-master-Windows>IF EXIST solr\build.orig move /y solr\build.orig solr\build
        1 dir(s) moved.

C:\Users\jenkins\workspace\Lucene-Solr-master-Windows>exit 0
Archiving artifacts
Setting ANT_1_8_2_HOME=C:\Users\jenkins\tools\hudson.tasks.Ant_AntInstallation\ANT_1.8.2
[WARNINGS] Parsing warnings in console log with parser Java Compiler (javac)
Setting ANT_1_8_2_HOME=C:\Users\jenkins\tools\hudson.tasks.Ant_AntInstallation\ANT_1.8.2
No credentials specified
Setting ANT_1_8_2_HOME=C:\Users\jenkins\tools\hudson.tasks.Ant_AntInstallation\ANT_1.8.2
<Git Blamer> Using GitBlamer to create author and commit information for all warnings.
<Git Blamer> GIT_COMMIT=0aa3654802fa8fd7da27c80619248b92b3ac6af5, workspace=C:\Users\jenkins\workspace\Lucene-Solr-master-Windows
[WARNINGS] Computing warning deltas based on reference build #8103
Recording test results
Setting ANT_1_8_2_HOME=C:\Users\jenkins\tools\hudson.tasks.Ant_AntInstallation\ANT_1.8.2
Build step 'Publish JUnit test result report' changed build result to UNSTABLE
Email was triggered for: Unstable (Test Failures)
Sending email for trigger: Unstable (Test Failures)
Setting ANT_1_8_2_HOME=C:\Users\jenkins\tools\hudson.tasks.Ant_AntInstallation\ANT_1.8.2
Setting ANT_1_8_2_HOME=C:\Users\jenkins\tools\hudson.tasks.Ant_AntInstallation\ANT_1.8.2
Setting ANT_1_8_2_HOME=C:\Users\jenkins\tools\hudson.tasks.Ant_AntInstallation\ANT_1.8.2
Setting ANT_1_8_2_HOME=C:\Users\jenkins\tools\hudson.tasks.Ant_AntInstallation\ANT_1.8.2
Setting ANT_1_8_2_HOME=C:\Users\jenkins\tools\hudson.tasks.Ant_AntInstallation\ANT_1.8.2
Setting ANT_1_8_2_HOME=C:\Users\jenkins\tools\hudson.tasks.Ant_AntInstallation\ANT_1.8.2


---------------------------------------------------------------------
To unsubscribe, e-mail: [hidden email]
For additional commands, e-mail: [hidden email]