[JENKINS] Lucene-Solr-master-Windows (64bit/jdk-9.0.4) - Build # 7841 - Unstable!

classic Classic list List threaded Threaded
2 messages Options
Reply | Threaded
Open this post in threaded view
|

[JENKINS] Lucene-Solr-master-Windows (64bit/jdk-9.0.4) - Build # 7841 - Unstable!

Policeman Jenkins Server-2
Build: https://jenkins.thetaphi.de/job/Lucene-Solr-master-Windows/7841/
Java: 64bit/jdk-9.0.4 -XX:+UseCompressedOops -XX:+UseParallelGC

5 tests failed.
FAILED:  org.apache.solr.handler.TestSQLHandler.doTest

Error Message:
--> http://127.0.0.1:56660/collection1_shard2_replica_n2:Failed to execute sqlQuery 'select id, field_i, str_s, field_i_p, field_f_p, field_d_p, field_l_p from collection1 where (text='(XXXX)' OR text='XXXX') AND text='XXXX' order by field_i desc' against JDBC connection 'jdbc:calcitesolr:'. Error while executing SQL "select id, field_i, str_s, field_i_p, field_f_p, field_d_p, field_l_p from collection1 where (text='(XXXX)' OR text='XXXX') AND text='XXXX' order by field_i desc": java.io.IOException: java.util.concurrent.ExecutionException: java.io.IOException: --> http://127.0.0.1:56710/collection1_shard2_replica_n5/:id{type=string,properties=indexed,stored,sortMissingLast,uninvertible} must have DocValues to use this feature.

Stack Trace:
java.io.IOException: --> http://127.0.0.1:56660/collection1_shard2_replica_n2:Failed to execute sqlQuery 'select id, field_i, str_s, field_i_p, field_f_p, field_d_p, field_l_p from collection1 where (text='(XXXX)' OR text='XXXX') AND text='XXXX' order by field_i desc' against JDBC connection 'jdbc:calcitesolr:'.
Error while executing SQL "select id, field_i, str_s, field_i_p, field_f_p, field_d_p, field_l_p from collection1 where (text='(XXXX)' OR text='XXXX') AND text='XXXX' order by field_i desc": java.io.IOException: java.util.concurrent.ExecutionException: java.io.IOException: --> http://127.0.0.1:56710/collection1_shard2_replica_n5/:id{type=string,properties=indexed,stored,sortMissingLast,uninvertible} must have DocValues to use this feature.
        at __randomizedtesting.SeedInfo.seed([20D481020EF9F2E8:879039A66342E151]:0)
        at org.apache.solr.client.solrj.io.stream.SolrStream.read(SolrStream.java:215)
        at org.apache.solr.handler.TestSQLHandler.getTuples(TestSQLHandler.java:2517)
        at org.apache.solr.handler.TestSQLHandler.testBasicSelect(TestSQLHandler.java:148)
        at org.apache.solr.handler.TestSQLHandler.doTest(TestSQLHandler.java:99)
        at java.base/jdk.internal.reflect.NativeMethodAccessorImpl.invoke0(Native Method)
        at java.base/jdk.internal.reflect.NativeMethodAccessorImpl.invoke(NativeMethodAccessorImpl.java:62)
        at java.base/jdk.internal.reflect.DelegatingMethodAccessorImpl.invoke(DelegatingMethodAccessorImpl.java:43)
        at java.base/java.lang.reflect.Method.invoke(Method.java:564)
        at com.carrotsearch.randomizedtesting.RandomizedRunner.invoke(RandomizedRunner.java:1750)
        at com.carrotsearch.randomizedtesting.RandomizedRunner$8.evaluate(RandomizedRunner.java:938)
        at com.carrotsearch.randomizedtesting.RandomizedRunner$9.evaluate(RandomizedRunner.java:974)
        at com.carrotsearch.randomizedtesting.RandomizedRunner$10.evaluate(RandomizedRunner.java:988)
        at org.apache.solr.BaseDistributedSearchTestCase$ShardsRepeatRule$ShardsFixedStatement.callStatement(BaseDistributedSearchTestCase.java:1082)
        at org.apache.solr.BaseDistributedSearchTestCase$ShardsRepeatRule$ShardsStatement.evaluate(BaseDistributedSearchTestCase.java:1054)
        at com.carrotsearch.randomizedtesting.rules.SystemPropertiesRestoreRule$1.evaluate(SystemPropertiesRestoreRule.java:57)
        at org.apache.lucene.util.TestRuleSetupTeardownChained$1.evaluate(TestRuleSetupTeardownChained.java:49)
        at org.apache.lucene.util.AbstractBeforeAfterRule$1.evaluate(AbstractBeforeAfterRule.java:45)
        at org.apache.lucene.util.TestRuleThreadAndTestName$1.evaluate(TestRuleThreadAndTestName.java:48)
        at org.apache.lucene.util.TestRuleIgnoreAfterMaxFailures$1.evaluate(TestRuleIgnoreAfterMaxFailures.java:64)
        at org.apache.lucene.util.TestRuleMarkFailure$1.evaluate(TestRuleMarkFailure.java:47)
        at com.carrotsearch.randomizedtesting.rules.StatementAdapter.evaluate(StatementAdapter.java:36)
        at com.carrotsearch.randomizedtesting.ThreadLeakControl$StatementRunner.run(ThreadLeakControl.java:368)
        at com.carrotsearch.randomizedtesting.ThreadLeakControl.forkTimeoutingTask(ThreadLeakControl.java:817)
        at com.carrotsearch.randomizedtesting.ThreadLeakControl$3.evaluate(ThreadLeakControl.java:468)
        at com.carrotsearch.randomizedtesting.RandomizedRunner.runSingleTest(RandomizedRunner.java:947)
        at com.carrotsearch.randomizedtesting.RandomizedRunner$5.evaluate(RandomizedRunner.java:832)
        at com.carrotsearch.randomizedtesting.RandomizedRunner$6.evaluate(RandomizedRunner.java:883)
        at com.carrotsearch.randomizedtesting.RandomizedRunner$7.evaluate(RandomizedRunner.java:894)
        at com.carrotsearch.randomizedtesting.rules.StatementAdapter.evaluate(StatementAdapter.java:36)
        at com.carrotsearch.randomizedtesting.rules.SystemPropertiesRestoreRule$1.evaluate(SystemPropertiesRestoreRule.java:57)
        at org.apache.lucene.util.AbstractBeforeAfterRule$1.evaluate(AbstractBeforeAfterRule.java:45)
        at com.carrotsearch.randomizedtesting.rules.StatementAdapter.evaluate(StatementAdapter.java:36)
        at org.apache.lucene.util.TestRuleStoreClassName$1.evaluate(TestRuleStoreClassName.java:41)
        at com.carrotsearch.randomizedtesting.rules.NoShadowingOrOverridesOnMethodsRule$1.evaluate(NoShadowingOrOverridesOnMethodsRule.java:40)
        at com.carrotsearch.randomizedtesting.rules.NoShadowingOrOverridesOnMethodsRule$1.evaluate(NoShadowingOrOverridesOnMethodsRule.java:40)
        at com.carrotsearch.randomizedtesting.rules.StatementAdapter.evaluate(StatementAdapter.java:36)
        at com.carrotsearch.randomizedtesting.rules.StatementAdapter.evaluate(StatementAdapter.java:36)
        at org.apache.lucene.util.TestRuleAssertionsRequired$1.evaluate(TestRuleAssertionsRequired.java:53)
        at org.apache.lucene.util.TestRuleMarkFailure$1.evaluate(TestRuleMarkFailure.java:47)
        at org.apache.lucene.util.TestRuleIgnoreAfterMaxFailures$1.evaluate(TestRuleIgnoreAfterMaxFailures.java:64)
        at org.apache.lucene.util.TestRuleIgnoreTestSuites$1.evaluate(TestRuleIgnoreTestSuites.java:54)
        at com.carrotsearch.randomizedtesting.rules.StatementAdapter.evaluate(StatementAdapter.java:36)
        at com.carrotsearch.randomizedtesting.ThreadLeakControl$StatementRunner.run(ThreadLeakControl.java:368)
        at java.base/java.lang.Thread.run(Thread.java:844)


FAILED:  org.apache.solr.handler.TestSQLHandler.doTest

Error Message:
--> http://127.0.0.1:56687/collection1_shard2_replica_n2:Failed to execute sqlQuery 'select id, field_i, str_s, field_i_p, field_f_p, field_d_p, field_l_p from collection1 where (text='(XXXX)' OR text='XXXX') AND text='XXXX' order by field_i desc' against JDBC connection 'jdbc:calcitesolr:'. Error while executing SQL "select id, field_i, str_s, field_i_p, field_f_p, field_d_p, field_l_p from collection1 where (text='(XXXX)' OR text='XXXX') AND text='XXXX' order by field_i desc": java.io.IOException: java.util.concurrent.ExecutionException: java.io.IOException: --> http://127.0.0.1:56687/collection1_shard2_replica_n2/:id{type=string,properties=indexed,stored,sortMissingLast,uninvertible} must have DocValues to use this feature.

Stack Trace:
java.io.IOException: --> http://127.0.0.1:56687/collection1_shard2_replica_n2:Failed to execute sqlQuery 'select id, field_i, str_s, field_i_p, field_f_p, field_d_p, field_l_p from collection1 where (text='(XXXX)' OR text='XXXX') AND text='XXXX' order by field_i desc' against JDBC connection 'jdbc:calcitesolr:'.
Error while executing SQL "select id, field_i, str_s, field_i_p, field_f_p, field_d_p, field_l_p from collection1 where (text='(XXXX)' OR text='XXXX') AND text='XXXX' order by field_i desc": java.io.IOException: java.util.concurrent.ExecutionException: java.io.IOException: --> http://127.0.0.1:56687/collection1_shard2_replica_n2/:id{type=string,properties=indexed,stored,sortMissingLast,uninvertible} must have DocValues to use this feature.
        at __randomizedtesting.SeedInfo.seed([20D481020EF9F2E8:879039A66342E151]:0)
        at org.apache.solr.client.solrj.io.stream.SolrStream.read(SolrStream.java:215)
        at org.apache.solr.handler.TestSQLHandler.getTuples(TestSQLHandler.java:2517)
        at org.apache.solr.handler.TestSQLHandler.testBasicSelect(TestSQLHandler.java:148)
        at org.apache.solr.handler.TestSQLHandler.doTest(TestSQLHandler.java:99)
        at java.base/jdk.internal.reflect.NativeMethodAccessorImpl.invoke0(Native Method)
        at java.base/jdk.internal.reflect.NativeMethodAccessorImpl.invoke(NativeMethodAccessorImpl.java:62)
        at java.base/jdk.internal.reflect.DelegatingMethodAccessorImpl.invoke(DelegatingMethodAccessorImpl.java:43)
        at java.base/java.lang.reflect.Method.invoke(Method.java:564)
        at com.carrotsearch.randomizedtesting.RandomizedRunner.invoke(RandomizedRunner.java:1750)
        at com.carrotsearch.randomizedtesting.RandomizedRunner$8.evaluate(RandomizedRunner.java:938)
        at com.carrotsearch.randomizedtesting.RandomizedRunner$9.evaluate(RandomizedRunner.java:974)
        at com.carrotsearch.randomizedtesting.RandomizedRunner$10.evaluate(RandomizedRunner.java:988)
        at org.apache.solr.BaseDistributedSearchTestCase$ShardsRepeatRule$ShardsFixedStatement.callStatement(BaseDistributedSearchTestCase.java:1082)
        at org.apache.solr.BaseDistributedSearchTestCase$ShardsRepeatRule$ShardsStatement.evaluate(BaseDistributedSearchTestCase.java:1054)
        at com.carrotsearch.randomizedtesting.rules.SystemPropertiesRestoreRule$1.evaluate(SystemPropertiesRestoreRule.java:57)
        at org.apache.lucene.util.TestRuleSetupTeardownChained$1.evaluate(TestRuleSetupTeardownChained.java:49)
        at org.apache.lucene.util.AbstractBeforeAfterRule$1.evaluate(AbstractBeforeAfterRule.java:45)
        at org.apache.lucene.util.TestRuleThreadAndTestName$1.evaluate(TestRuleThreadAndTestName.java:48)
        at org.apache.lucene.util.TestRuleIgnoreAfterMaxFailures$1.evaluate(TestRuleIgnoreAfterMaxFailures.java:64)
        at org.apache.lucene.util.TestRuleMarkFailure$1.evaluate(TestRuleMarkFailure.java:47)
        at com.carrotsearch.randomizedtesting.rules.StatementAdapter.evaluate(StatementAdapter.java:36)
        at com.carrotsearch.randomizedtesting.ThreadLeakControl$StatementRunner.run(ThreadLeakControl.java:368)
        at com.carrotsearch.randomizedtesting.ThreadLeakControl.forkTimeoutingTask(ThreadLeakControl.java:817)
        at com.carrotsearch.randomizedtesting.ThreadLeakControl$3.evaluate(ThreadLeakControl.java:468)
        at com.carrotsearch.randomizedtesting.RandomizedRunner.runSingleTest(RandomizedRunner.java:947)
        at com.carrotsearch.randomizedtesting.RandomizedRunner$5.evaluate(RandomizedRunner.java:832)
        at com.carrotsearch.randomizedtesting.RandomizedRunner$6.evaluate(RandomizedRunner.java:883)
        at com.carrotsearch.randomizedtesting.RandomizedRunner$7.evaluate(RandomizedRunner.java:894)
        at com.carrotsearch.randomizedtesting.rules.StatementAdapter.evaluate(StatementAdapter.java:36)
        at com.carrotsearch.randomizedtesting.rules.SystemPropertiesRestoreRule$1.evaluate(SystemPropertiesRestoreRule.java:57)
        at org.apache.lucene.util.AbstractBeforeAfterRule$1.evaluate(AbstractBeforeAfterRule.java:45)
        at com.carrotsearch.randomizedtesting.rules.StatementAdapter.evaluate(StatementAdapter.java:36)
        at org.apache.lucene.util.TestRuleStoreClassName$1.evaluate(TestRuleStoreClassName.java:41)
        at com.carrotsearch.randomizedtesting.rules.NoShadowingOrOverridesOnMethodsRule$1.evaluate(NoShadowingOrOverridesOnMethodsRule.java:40)
        at com.carrotsearch.randomizedtesting.rules.NoShadowingOrOverridesOnMethodsRule$1.evaluate(NoShadowingOrOverridesOnMethodsRule.java:40)
        at com.carrotsearch.randomizedtesting.rules.StatementAdapter.evaluate(StatementAdapter.java:36)
        at com.carrotsearch.randomizedtesting.rules.StatementAdapter.evaluate(StatementAdapter.java:36)
        at org.apache.lucene.util.TestRuleAssertionsRequired$1.evaluate(TestRuleAssertionsRequired.java:53)
        at org.apache.lucene.util.TestRuleMarkFailure$1.evaluate(TestRuleMarkFailure.java:47)
        at org.apache.lucene.util.TestRuleIgnoreAfterMaxFailures$1.evaluate(TestRuleIgnoreAfterMaxFailures.java:64)
        at org.apache.lucene.util.TestRuleIgnoreTestSuites$1.evaluate(TestRuleIgnoreTestSuites.java:54)
        at com.carrotsearch.randomizedtesting.rules.StatementAdapter.evaluate(StatementAdapter.java:36)
        at com.carrotsearch.randomizedtesting.ThreadLeakControl$StatementRunner.run(ThreadLeakControl.java:368)
        at java.base/java.lang.Thread.run(Thread.java:844)


FAILED:  org.apache.solr.handler.TestSQLHandler.doTest

Error Message:
--> http://127.0.0.1:56996/collection1_shard2_replica_n2:Failed to execute sqlQuery 'select id, field_i, str_s, field_i_p, field_f_p, field_d_p, field_l_p from collection1 where (text='(XXXX)' OR text='XXXX') AND text='XXXX' order by field_i desc' against JDBC connection 'jdbc:calcitesolr:'. Error while executing SQL "select id, field_i, str_s, field_i_p, field_f_p, field_d_p, field_l_p from collection1 where (text='(XXXX)' OR text='XXXX') AND text='XXXX' order by field_i desc": java.io.IOException: java.util.concurrent.ExecutionException: java.io.IOException: --> http://127.0.0.1:56996/collection1_shard2_replica_n2/:id{type=string,properties=indexed,stored,sortMissingLast,uninvertible} must have DocValues to use this feature.

Stack Trace:
java.io.IOException: --> http://127.0.0.1:56996/collection1_shard2_replica_n2:Failed to execute sqlQuery 'select id, field_i, str_s, field_i_p, field_f_p, field_d_p, field_l_p from collection1 where (text='(XXXX)' OR text='XXXX') AND text='XXXX' order by field_i desc' against JDBC connection 'jdbc:calcitesolr:'.
Error while executing SQL "select id, field_i, str_s, field_i_p, field_f_p, field_d_p, field_l_p from collection1 where (text='(XXXX)' OR text='XXXX') AND text='XXXX' order by field_i desc": java.io.IOException: java.util.concurrent.ExecutionException: java.io.IOException: --> http://127.0.0.1:56996/collection1_shard2_replica_n2/:id{type=string,properties=indexed,stored,sortMissingLast,uninvertible} must have DocValues to use this feature.
        at __randomizedtesting.SeedInfo.seed([20D481020EF9F2E8:879039A66342E151]:0)
        at org.apache.solr.client.solrj.io.stream.SolrStream.read(SolrStream.java:215)
        at org.apache.solr.handler.TestSQLHandler.getTuples(TestSQLHandler.java:2517)
        at org.apache.solr.handler.TestSQLHandler.testBasicSelect(TestSQLHandler.java:148)
        at org.apache.solr.handler.TestSQLHandler.doTest(TestSQLHandler.java:99)
        at java.base/jdk.internal.reflect.NativeMethodAccessorImpl.invoke0(Native Method)
        at java.base/jdk.internal.reflect.NativeMethodAccessorImpl.invoke(NativeMethodAccessorImpl.java:62)
        at java.base/jdk.internal.reflect.DelegatingMethodAccessorImpl.invoke(DelegatingMethodAccessorImpl.java:43)
        at java.base/java.lang.reflect.Method.invoke(Method.java:564)
        at com.carrotsearch.randomizedtesting.RandomizedRunner.invoke(RandomizedRunner.java:1750)
        at com.carrotsearch.randomizedtesting.RandomizedRunner$8.evaluate(RandomizedRunner.java:938)
        at com.carrotsearch.randomizedtesting.RandomizedRunner$9.evaluate(RandomizedRunner.java:974)
        at com.carrotsearch.randomizedtesting.RandomizedRunner$10.evaluate(RandomizedRunner.java:988)
        at org.apache.solr.BaseDistributedSearchTestCase$ShardsRepeatRule$ShardsFixedStatement.callStatement(BaseDistributedSearchTestCase.java:1082)
        at org.apache.solr.BaseDistributedSearchTestCase$ShardsRepeatRule$ShardsStatement.evaluate(BaseDistributedSearchTestCase.java:1054)
        at com.carrotsearch.randomizedtesting.rules.SystemPropertiesRestoreRule$1.evaluate(SystemPropertiesRestoreRule.java:57)
        at org.apache.lucene.util.TestRuleSetupTeardownChained$1.evaluate(TestRuleSetupTeardownChained.java:49)
        at org.apache.lucene.util.AbstractBeforeAfterRule$1.evaluate(AbstractBeforeAfterRule.java:45)
        at org.apache.lucene.util.TestRuleThreadAndTestName$1.evaluate(TestRuleThreadAndTestName.java:48)
        at org.apache.lucene.util.TestRuleIgnoreAfterMaxFailures$1.evaluate(TestRuleIgnoreAfterMaxFailures.java:64)
        at org.apache.lucene.util.TestRuleMarkFailure$1.evaluate(TestRuleMarkFailure.java:47)
        at com.carrotsearch.randomizedtesting.rules.StatementAdapter.evaluate(StatementAdapter.java:36)
        at com.carrotsearch.randomizedtesting.ThreadLeakControl$StatementRunner.run(ThreadLeakControl.java:368)
        at com.carrotsearch.randomizedtesting.ThreadLeakControl.forkTimeoutingTask(ThreadLeakControl.java:817)
        at com.carrotsearch.randomizedtesting.ThreadLeakControl$3.evaluate(ThreadLeakControl.java:468)
        at com.carrotsearch.randomizedtesting.RandomizedRunner.runSingleTest(RandomizedRunner.java:947)
        at com.carrotsearch.randomizedtesting.RandomizedRunner$5.evaluate(RandomizedRunner.java:832)
        at com.carrotsearch.randomizedtesting.RandomizedRunner$6.evaluate(RandomizedRunner.java:883)
        at com.carrotsearch.randomizedtesting.RandomizedRunner$7.evaluate(RandomizedRunner.java:894)
        at com.carrotsearch.randomizedtesting.rules.StatementAdapter.evaluate(StatementAdapter.java:36)
        at com.carrotsearch.randomizedtesting.rules.SystemPropertiesRestoreRule$1.evaluate(SystemPropertiesRestoreRule.java:57)
        at org.apache.lucene.util.AbstractBeforeAfterRule$1.evaluate(AbstractBeforeAfterRule.java:45)
        at com.carrotsearch.randomizedtesting.rules.StatementAdapter.evaluate(StatementAdapter.java:36)
        at org.apache.lucene.util.TestRuleStoreClassName$1.evaluate(TestRuleStoreClassName.java:41)
        at com.carrotsearch.randomizedtesting.rules.NoShadowingOrOverridesOnMethodsRule$1.evaluate(NoShadowingOrOverridesOnMethodsRule.java:40)
        at com.carrotsearch.randomizedtesting.rules.NoShadowingOrOverridesOnMethodsRule$1.evaluate(NoShadowingOrOverridesOnMethodsRule.java:40)
        at com.carrotsearch.randomizedtesting.rules.StatementAdapter.evaluate(StatementAdapter.java:36)
        at com.carrotsearch.randomizedtesting.rules.StatementAdapter.evaluate(StatementAdapter.java:36)
        at org.apache.lucene.util.TestRuleAssertionsRequired$1.evaluate(TestRuleAssertionsRequired.java:53)
        at org.apache.lucene.util.TestRuleMarkFailure$1.evaluate(TestRuleMarkFailure.java:47)
        at org.apache.lucene.util.TestRuleIgnoreAfterMaxFailures$1.evaluate(TestRuleIgnoreAfterMaxFailures.java:64)
        at org.apache.lucene.util.TestRuleIgnoreTestSuites$1.evaluate(TestRuleIgnoreTestSuites.java:54)
        at com.carrotsearch.randomizedtesting.rules.StatementAdapter.evaluate(StatementAdapter.java:36)
        at com.carrotsearch.randomizedtesting.ThreadLeakControl$StatementRunner.run(ThreadLeakControl.java:368)
        at java.base/java.lang.Thread.run(Thread.java:844)


FAILED:  org.apache.solr.handler.TestSQLHandler.doTest

Error Message:


Stack Trace:
java.lang.AssertionError
        at __randomizedtesting.SeedInfo.seed([20D481020EF9F2E8:879039A66342E151]:0)
        at org.apache.solr.handler.TestSQLHandler.testBasicSelect(TestSQLHandler.java:238)
        at org.apache.solr.handler.TestSQLHandler.doTest(TestSQLHandler.java:99)
        at java.base/jdk.internal.reflect.NativeMethodAccessorImpl.invoke0(Native Method)
        at java.base/jdk.internal.reflect.NativeMethodAccessorImpl.invoke(NativeMethodAccessorImpl.java:62)
        at java.base/jdk.internal.reflect.DelegatingMethodAccessorImpl.invoke(DelegatingMethodAccessorImpl.java:43)
        at java.base/java.lang.reflect.Method.invoke(Method.java:564)
        at com.carrotsearch.randomizedtesting.RandomizedRunner.invoke(RandomizedRunner.java:1750)
        at com.carrotsearch.randomizedtesting.RandomizedRunner$8.evaluate(RandomizedRunner.java:938)
        at com.carrotsearch.randomizedtesting.RandomizedRunner$9.evaluate(RandomizedRunner.java:974)
        at com.carrotsearch.randomizedtesting.RandomizedRunner$10.evaluate(RandomizedRunner.java:988)
        at org.apache.solr.BaseDistributedSearchTestCase$ShardsRepeatRule$ShardsFixedStatement.callStatement(BaseDistributedSearchTestCase.java:1082)
        at org.apache.solr.BaseDistributedSearchTestCase$ShardsRepeatRule$ShardsStatement.evaluate(BaseDistributedSearchTestCase.java:1054)
        at com.carrotsearch.randomizedtesting.rules.SystemPropertiesRestoreRule$1.evaluate(SystemPropertiesRestoreRule.java:57)
        at org.apache.lucene.util.TestRuleSetupTeardownChained$1.evaluate(TestRuleSetupTeardownChained.java:49)
        at org.apache.lucene.util.AbstractBeforeAfterRule$1.evaluate(AbstractBeforeAfterRule.java:45)
        at org.apache.lucene.util.TestRuleThreadAndTestName$1.evaluate(TestRuleThreadAndTestName.java:48)
        at org.apache.lucene.util.TestRuleIgnoreAfterMaxFailures$1.evaluate(TestRuleIgnoreAfterMaxFailures.java:64)
        at org.apache.lucene.util.TestRuleMarkFailure$1.evaluate(TestRuleMarkFailure.java:47)
        at com.carrotsearch.randomizedtesting.rules.StatementAdapter.evaluate(StatementAdapter.java:36)
        at com.carrotsearch.randomizedtesting.ThreadLeakControl$StatementRunner.run(ThreadLeakControl.java:368)
        at com.carrotsearch.randomizedtesting.ThreadLeakControl.forkTimeoutingTask(ThreadLeakControl.java:817)
        at com.carrotsearch.randomizedtesting.ThreadLeakControl$3.evaluate(ThreadLeakControl.java:468)
        at com.carrotsearch.randomizedtesting.RandomizedRunner.runSingleTest(RandomizedRunner.java:947)
        at com.carrotsearch.randomizedtesting.RandomizedRunner$5.evaluate(RandomizedRunner.java:832)
        at com.carrotsearch.randomizedtesting.RandomizedRunner$6.evaluate(RandomizedRunner.java:883)
        at com.carrotsearch.randomizedtesting.RandomizedRunner$7.evaluate(RandomizedRunner.java:894)
        at com.carrotsearch.randomizedtesting.rules.StatementAdapter.evaluate(StatementAdapter.java:36)
        at com.carrotsearch.randomizedtesting.rules.SystemPropertiesRestoreRule$1.evaluate(SystemPropertiesRestoreRule.java:57)
        at org.apache.lucene.util.AbstractBeforeAfterRule$1.evaluate(AbstractBeforeAfterRule.java:45)
        at com.carrotsearch.randomizedtesting.rules.StatementAdapter.evaluate(StatementAdapter.java:36)
        at org.apache.lucene.util.TestRuleStoreClassName$1.evaluate(TestRuleStoreClassName.java:41)
        at com.carrotsearch.randomizedtesting.rules.NoShadowingOrOverridesOnMethodsRule$1.evaluate(NoShadowingOrOverridesOnMethodsRule.java:40)
        at com.carrotsearch.randomizedtesting.rules.NoShadowingOrOverridesOnMethodsRule$1.evaluate(NoShadowingOrOverridesOnMethodsRule.java:40)
        at com.carrotsearch.randomizedtesting.rules.StatementAdapter.evaluate(StatementAdapter.java:36)
        at com.carrotsearch.randomizedtesting.rules.StatementAdapter.evaluate(StatementAdapter.java:36)
        at org.apache.lucene.util.TestRuleAssertionsRequired$1.evaluate(TestRuleAssertionsRequired.java:53)
        at org.apache.lucene.util.TestRuleMarkFailure$1.evaluate(TestRuleMarkFailure.java:47)
        at org.apache.lucene.util.TestRuleIgnoreAfterMaxFailures$1.evaluate(TestRuleIgnoreAfterMaxFailures.java:64)
        at org.apache.lucene.util.TestRuleIgnoreTestSuites$1.evaluate(TestRuleIgnoreTestSuites.java:54)
        at com.carrotsearch.randomizedtesting.rules.StatementAdapter.evaluate(StatementAdapter.java:36)
        at com.carrotsearch.randomizedtesting.ThreadLeakControl$StatementRunner.run(ThreadLeakControl.java:368)
        at java.base/java.lang.Thread.run(Thread.java:844)


FAILED:  junit.framework.TestSuite.org.apache.solr.client.solrj.impl.CloudSolrClientTest

Error Message:
ObjectTracker found 4 object(s) that were not released!!! [MockDirectoryWrapper, MockDirectoryWrapper, MockDirectoryWrapper, SolrCore] org.apache.solr.common.util.ObjectReleaseTracker$ObjectTrackerException: org.apache.lucene.store.MockDirectoryWrapper  at org.apache.solr.common.util.ObjectReleaseTracker.track(ObjectReleaseTracker.java:42)  at org.apache.solr.core.CachingDirectoryFactory.get(CachingDirectoryFactory.java:348)  at org.apache.solr.update.SolrIndexWriter.create(SolrIndexWriter.java:99)  at org.apache.solr.core.SolrCore.initIndex(SolrCore.java:779)  at org.apache.solr.core.SolrCore.<init>(SolrCore.java:976)  at org.apache.solr.core.SolrCore.<init>(SolrCore.java:883)  at org.apache.solr.core.CoreContainer.createFromDescriptor(CoreContainer.java:1193)  at org.apache.solr.core.CoreContainer.create(CoreContainer.java:1103)  at org.apache.solr.handler.admin.CoreAdminOperation.lambda$static$0(CoreAdminOperation.java:92)  at org.apache.solr.handler.admin.CoreAdminOperation.execute(CoreAdminOperation.java:360)  at org.apache.solr.handler.admin.CoreAdminHandler$CallInfo.call(CoreAdminHandler.java:396)  at org.apache.solr.handler.admin.CoreAdminHandler.lambda$handleRequestBody$0(CoreAdminHandler.java:188)  at com.codahale.metrics.InstrumentedExecutorService$InstrumentedRunnable.run(InstrumentedExecutorService.java:176)  at org.apache.solr.common.util.ExecutorUtil$MDCAwareThreadPoolExecutor.lambda$execute$0(ExecutorUtil.java:209)  at java.base/java.util.concurrent.ThreadPoolExecutor.runWorker(ThreadPoolExecutor.java:1167)  at java.base/java.util.concurrent.ThreadPoolExecutor$Worker.run(ThreadPoolExecutor.java:641)  at java.base/java.lang.Thread.run(Thread.java:844)  org.apache.solr.common.util.ObjectReleaseTracker$ObjectTrackerException: org.apache.lucene.store.MockDirectoryWrapper  at org.apache.solr.common.util.ObjectReleaseTracker.track(ObjectReleaseTracker.java:42)  at org.apache.solr.core.CachingDirectoryFactory.get(CachingDirectoryFactory.java:348)  at org.apache.solr.handler.IndexFetcher.fetchLatestIndex(IndexFetcher.java:509)  at org.apache.solr.handler.IndexFetcher.fetchLatestIndex(IndexFetcher.java:351)  at org.apache.solr.handler.ReplicationHandler.doFetch(ReplicationHandler.java:422)  at org.apache.solr.handler.ReplicationHandler.lambda$setupPolling$13(ReplicationHandler.java:1191)  at java.base/java.util.concurrent.Executors$RunnableAdapter.call(Executors.java:514)  at java.base/java.util.concurrent.FutureTask.runAndReset(FutureTask.java:305)  at java.base/java.util.concurrent.ScheduledThreadPoolExecutor$ScheduledFutureTask.run(ScheduledThreadPoolExecutor.java:300)  at java.base/java.util.concurrent.ThreadPoolExecutor.runWorker(ThreadPoolExecutor.java:1167)  at java.base/java.util.concurrent.ThreadPoolExecutor$Worker.run(ThreadPoolExecutor.java:641)  at java.base/java.lang.Thread.run(Thread.java:844)  org.apache.solr.common.util.ObjectReleaseTracker$ObjectTrackerException: org.apache.lucene.store.MockDirectoryWrapper  at org.apache.solr.common.util.ObjectReleaseTracker.track(ObjectReleaseTracker.java:42)  at org.apache.solr.core.CachingDirectoryFactory.get(CachingDirectoryFactory.java:348)  at org.apache.solr.core.SolrCore.initSnapshotMetaDataManager(SolrCore.java:517)  at org.apache.solr.core.SolrCore.<init>(SolrCore.java:968)  at org.apache.solr.core.SolrCore.<init>(SolrCore.java:883)  at org.apache.solr.core.CoreContainer.createFromDescriptor(CoreContainer.java:1193)  at org.apache.solr.core.CoreContainer.create(CoreContainer.java:1103)  at org.apache.solr.handler.admin.CoreAdminOperation.lambda$static$0(CoreAdminOperation.java:92)  at org.apache.solr.handler.admin.CoreAdminOperation.execute(CoreAdminOperation.java:360)  at org.apache.solr.handler.admin.CoreAdminHandler$CallInfo.call(CoreAdminHandler.java:396)  at org.apache.solr.handler.admin.CoreAdminHandler.lambda$handleRequestBody$0(CoreAdminHandler.java:188)  at com.codahale.metrics.InstrumentedExecutorService$InstrumentedRunnable.run(InstrumentedExecutorService.java:176)  at org.apache.solr.common.util.ExecutorUtil$MDCAwareThreadPoolExecutor.lambda$execute$0(ExecutorUtil.java:209)  at java.base/java.util.concurrent.ThreadPoolExecutor.runWorker(ThreadPoolExecutor.java:1167)  at java.base/java.util.concurrent.ThreadPoolExecutor$Worker.run(ThreadPoolExecutor.java:641)  at java.base/java.lang.Thread.run(Thread.java:844)  org.apache.solr.common.util.ObjectReleaseTracker$ObjectTrackerException: org.apache.solr.core.SolrCore  at org.apache.solr.common.util.ObjectReleaseTracker.track(ObjectReleaseTracker.java:42)  at org.apache.solr.core.SolrCore.<init>(SolrCore.java:1063)  at org.apache.solr.core.SolrCore.<init>(SolrCore.java:883)  at org.apache.solr.core.CoreContainer.createFromDescriptor(CoreContainer.java:1193)  at org.apache.solr.core.CoreContainer.create(CoreContainer.java:1103)  at org.apache.solr.handler.admin.CoreAdminOperation.lambda$static$0(CoreAdminOperation.java:92)  at org.apache.solr.handler.admin.CoreAdminOperation.execute(CoreAdminOperation.java:360)  at org.apache.solr.handler.admin.CoreAdminHandler$CallInfo.call(CoreAdminHandler.java:396)  at org.apache.solr.handler.admin.CoreAdminHandler.lambda$handleRequestBody$0(CoreAdminHandler.java:188)  at com.codahale.metrics.InstrumentedExecutorService$InstrumentedRunnable.run(InstrumentedExecutorService.java:176)  at org.apache.solr.common.util.ExecutorUtil$MDCAwareThreadPoolExecutor.lambda$execute$0(ExecutorUtil.java:209)  at java.base/java.util.concurrent.ThreadPoolExecutor.runWorker(ThreadPoolExecutor.java:1167)  at java.base/java.util.concurrent.ThreadPoolExecutor$Worker.run(ThreadPoolExecutor.java:641)  at java.base/java.lang.Thread.run(Thread.java:844)   expected null, but was:<ObjectTracker found 4 object(s) that were not released!!! [MockDirectoryWrapper, MockDirectoryWrapper, MockDirectoryWrapper, SolrCore] org.apache.solr.common.util.ObjectReleaseTracker$ObjectTrackerException: org.apache.lucene.store.MockDirectoryWrapper  at org.apache.solr.common.util.ObjectReleaseTracker.track(ObjectReleaseTracker.java:42)  at org.apache.solr.core.CachingDirectoryFactory.get(CachingDirectoryFactory.java:348)  at org.apache.solr.update.SolrIndexWriter.create(SolrIndexWriter.java:99)  at org.apache.solr.core.SolrCore.initIndex(SolrCore.java:779)  at org.apache.solr.core.SolrCore.<init>(SolrCore.java:976)  at org.apache.solr.core.SolrCore.<init>(SolrCore.java:883)  at org.apache.solr.core.CoreContainer.createFromDescriptor(CoreContainer.java:1193)  at org.apache.solr.core.CoreContainer.create(CoreContainer.java:1103)  at org.apache.solr.handler.admin.CoreAdminOperation.lambda$static$0(CoreAdminOperation.java:92)  at org.apache.solr.handler.admin.CoreAdminOperation.execute(CoreAdminOperation.java:360)  at org.apache.solr.handler.admin.CoreAdminHandler$CallInfo.call(CoreAdminHandler.java:396)  at org.apache.solr.handler.admin.CoreAdminHandler.lambda$handleRequestBody$0(CoreAdminHandler.java:188)  at com.codahale.metrics.InstrumentedExecutorService$InstrumentedRunnable.run(InstrumentedExecutorService.java:176)  at org.apache.solr.common.util.ExecutorUtil$MDCAwareThreadPoolExecutor.lambda$execute$0(ExecutorUtil.java:209)  at java.base/java.util.concurrent.ThreadPoolExecutor.runWorker(ThreadPoolExecutor.java:1167)  at java.base/java.util.concurrent.ThreadPoolExecutor$Worker.run(ThreadPoolExecutor.java:641)  at java.base/java.lang.Thread.run(Thread.java:844)  org.apache.solr.common.util.ObjectReleaseTracker$ObjectTrackerException: org.apache.lucene.store.MockDirectoryWrapper  at org.apache.solr.common.util.ObjectReleaseTracker.track(ObjectReleaseTracker.java:42)  at org.apache.solr.core.CachingDirectoryFactory.get(CachingDirectoryFactory.java:348)  at org.apache.solr.handler.IndexFetcher.fetchLatestIndex(IndexFetcher.java:509)  at org.apache.solr.handler.IndexFetcher.fetchLatestIndex(IndexFetcher.java:351)  at org.apache.solr.handler.ReplicationHandler.doFetch(ReplicationHandler.java:422)  at org.apache.solr.handler.ReplicationHandler.lambda$setupPolling$13(ReplicationHandler.java:1191)  at java.base/java.util.concurrent.Executors$RunnableAdapter.call(Executors.java:514)  at java.base/java.util.concurrent.FutureTask.runAndReset(FutureTask.java:305)  at java.base/java.util.concurrent.ScheduledThreadPoolExecutor$ScheduledFutureTask.run(ScheduledThreadPoolExecutor.java:300)  at java.base/java.util.concurrent.ThreadPoolExecutor.runWorker(ThreadPoolExecutor.java:1167)  at java.base/java.util.concurrent.ThreadPoolExecutor$Worker.run(ThreadPoolExecutor.java:641)  at java.base/java.lang.Thread.run(Thread.java:844)  org.apache.solr.common.util.ObjectReleaseTracker$ObjectTrackerException: org.apache.lucene.store.MockDirectoryWrapper  at org.apache.solr.common.util.ObjectReleaseTracker.track(ObjectReleaseTracker.java:42)  at org.apache.solr.core.CachingDirectoryFactory.get(CachingDirectoryFactory.java:348)  at org.apache.solr.core.SolrCore.initSnapshotMetaDataManager(SolrCore.java:517)  at org.apache.solr.core.SolrCore.<init>(SolrCore.java:968)  at org.apache.solr.core.SolrCore.<init>(SolrCore.java:883)  at org.apache.solr.core.CoreContainer.createFromDescriptor(CoreContainer.java:1193)  at org.apache.solr.core.CoreContainer.create(CoreContainer.java:1103)  at org.apache.solr.handler.admin.CoreAdminOperation.lambda$static$0(CoreAdminOperation.java:92)  at org.apache.solr.handler.admin.CoreAdminOperation.execute(CoreAdminOperation.java:360)  at org.apache.solr.handler.admin.CoreAdminHandler$CallInfo.call(CoreAdminHandler.java:396)  at org.apache.solr.handler.admin.CoreAdminHandler.lambda$handleRequestBody$0(CoreAdminHandler.java:188)  at com.codahale.metrics.InstrumentedExecutorService$InstrumentedRunnable.run(InstrumentedExecutorService.java:176)  at org.apache.solr.common.util.ExecutorUtil$MDCAwareThreadPoolExecutor.lambda$execute$0(ExecutorUtil.java:209)  at java.base/java.util.concurrent.ThreadPoolExecutor.runWorker(ThreadPoolExecutor.java:1167)  at java.base/java.util.concurrent.ThreadPoolExecutor$Worker.run(ThreadPoolExecutor.java:641)  at java.base/java.lang.Thread.run(Thread.java:844)  org.apache.solr.common.util.ObjectReleaseTracker$ObjectTrackerException: org.apache.solr.core.SolrCore  at org.apache.solr.common.util.ObjectReleaseTracker.track(ObjectReleaseTracker.java:42)  at org.apache.solr.core.SolrCore.<init>(SolrCore.java:1063)  at org.apache.solr.core.SolrCore.<init>(SolrCore.java:883)  at org.apache.solr.core.CoreContainer.createFromDescriptor(CoreContainer.java:1193)  at org.apache.solr.core.CoreContainer.create(CoreContainer.java:1103)  at org.apache.solr.handler.admin.CoreAdminOperation.lambda$static$0(CoreAdminOperation.java:92)  at org.apache.solr.handler.admin.CoreAdminOperation.execute(CoreAdminOperation.java:360)  at org.apache.solr.handler.admin.CoreAdminHandler$CallInfo.call(CoreAdminHandler.java:396)  at org.apache.solr.handler.admin.CoreAdminHandler.lambda$handleRequestBody$0(CoreAdminHandler.java:188)  at com.codahale.metrics.InstrumentedExecutorService$InstrumentedRunnable.run(InstrumentedExecutorService.java:176)  at org.apache.solr.common.util.ExecutorUtil$MDCAwareThreadPoolExecutor.lambda$execute$0(ExecutorUtil.java:209)  at java.base/java.util.concurrent.ThreadPoolExecutor.runWorker(ThreadPoolExecutor.java:1167)  at java.base/java.util.concurrent.ThreadPoolExecutor$Worker.run(ThreadPoolExecutor.java:641)  at java.base/java.lang.Thread.run(Thread.java:844)  >

Stack Trace:
java.lang.AssertionError: ObjectTracker found 4 object(s) that were not released!!! [MockDirectoryWrapper, MockDirectoryWrapper, MockDirectoryWrapper, SolrCore]
org.apache.solr.common.util.ObjectReleaseTracker$ObjectTrackerException: org.apache.lucene.store.MockDirectoryWrapper
        at org.apache.solr.common.util.ObjectReleaseTracker.track(ObjectReleaseTracker.java:42)
        at org.apache.solr.core.CachingDirectoryFactory.get(CachingDirectoryFactory.java:348)
        at org.apache.solr.update.SolrIndexWriter.create(SolrIndexWriter.java:99)
        at org.apache.solr.core.SolrCore.initIndex(SolrCore.java:779)
        at org.apache.solr.core.SolrCore.<init>(SolrCore.java:976)
        at org.apache.solr.core.SolrCore.<init>(SolrCore.java:883)
        at org.apache.solr.core.CoreContainer.createFromDescriptor(CoreContainer.java:1193)
        at org.apache.solr.core.CoreContainer.create(CoreContainer.java:1103)
        at org.apache.solr.handler.admin.CoreAdminOperation.lambda$static$0(CoreAdminOperation.java:92)
        at org.apache.solr.handler.admin.CoreAdminOperation.execute(CoreAdminOperation.java:360)
        at org.apache.solr.handler.admin.CoreAdminHandler$CallInfo.call(CoreAdminHandler.java:396)
        at org.apache.solr.handler.admin.CoreAdminHandler.lambda$handleRequestBody$0(CoreAdminHandler.java:188)
        at com.codahale.metrics.InstrumentedExecutorService$InstrumentedRunnable.run(InstrumentedExecutorService.java:176)
        at org.apache.solr.common.util.ExecutorUtil$MDCAwareThreadPoolExecutor.lambda$execute$0(ExecutorUtil.java:209)
        at java.base/java.util.concurrent.ThreadPoolExecutor.runWorker(ThreadPoolExecutor.java:1167)
        at java.base/java.util.concurrent.ThreadPoolExecutor$Worker.run(ThreadPoolExecutor.java:641)
        at java.base/java.lang.Thread.run(Thread.java:844)

org.apache.solr.common.util.ObjectReleaseTracker$ObjectTrackerException: org.apache.lucene.store.MockDirectoryWrapper
        at org.apache.solr.common.util.ObjectReleaseTracker.track(ObjectReleaseTracker.java:42)
        at org.apache.solr.core.CachingDirectoryFactory.get(CachingDirectoryFactory.java:348)
        at org.apache.solr.handler.IndexFetcher.fetchLatestIndex(IndexFetcher.java:509)
        at org.apache.solr.handler.IndexFetcher.fetchLatestIndex(IndexFetcher.java:351)
        at org.apache.solr.handler.ReplicationHandler.doFetch(ReplicationHandler.java:422)
        at org.apache.solr.handler.ReplicationHandler.lambda$setupPolling$13(ReplicationHandler.java:1191)
        at java.base/java.util.concurrent.Executors$RunnableAdapter.call(Executors.java:514)
        at java.base/java.util.concurrent.FutureTask.runAndReset(FutureTask.java:305)
        at java.base/java.util.concurrent.ScheduledThreadPoolExecutor$ScheduledFutureTask.run(ScheduledThreadPoolExecutor.java:300)
        at java.base/java.util.concurrent.ThreadPoolExecutor.runWorker(ThreadPoolExecutor.java:1167)
        at java.base/java.util.concurrent.ThreadPoolExecutor$Worker.run(ThreadPoolExecutor.java:641)
        at java.base/java.lang.Thread.run(Thread.java:844)

org.apache.solr.common.util.ObjectReleaseTracker$ObjectTrackerException: org.apache.lucene.store.MockDirectoryWrapper
        at org.apache.solr.common.util.ObjectReleaseTracker.track(ObjectReleaseTracker.java:42)
        at org.apache.solr.core.CachingDirectoryFactory.get(CachingDirectoryFactory.java:348)
        at org.apache.solr.core.SolrCore.initSnapshotMetaDataManager(SolrCore.java:517)
        at org.apache.solr.core.SolrCore.<init>(SolrCore.java:968)
        at org.apache.solr.core.SolrCore.<init>(SolrCore.java:883)
        at org.apache.solr.core.CoreContainer.createFromDescriptor(CoreContainer.java:1193)
        at org.apache.solr.core.CoreContainer.create(CoreContainer.java:1103)
        at org.apache.solr.handler.admin.CoreAdminOperation.lambda$static$0(CoreAdminOperation.java:92)
        at org.apache.solr.handler.admin.CoreAdminOperation.execute(CoreAdminOperation.java:360)
        at org.apache.solr.handler.admin.CoreAdminHandler$CallInfo.call(CoreAdminHandler.java:396)
        at org.apache.solr.handler.admin.CoreAdminHandler.lambda$handleRequestBody$0(CoreAdminHandler.java:188)
        at com.codahale.metrics.InstrumentedExecutorService$InstrumentedRunnable.run(InstrumentedExecutorService.java:176)
        at org.apache.solr.common.util.ExecutorUtil$MDCAwareThreadPoolExecutor.lambda$execute$0(ExecutorUtil.java:209)
        at java.base/java.util.concurrent.ThreadPoolExecutor.runWorker(ThreadPoolExecutor.java:1167)
        at java.base/java.util.concurrent.ThreadPoolExecutor$Worker.run(ThreadPoolExecutor.java:641)
        at java.base/java.lang.Thread.run(Thread.java:844)

org.apache.solr.common.util.ObjectReleaseTracker$ObjectTrackerException: org.apache.solr.core.SolrCore
        at org.apache.solr.common.util.ObjectReleaseTracker.track(ObjectReleaseTracker.java:42)
        at org.apache.solr.core.SolrCore.<init>(SolrCore.java:1063)
        at org.apache.solr.core.SolrCore.<init>(SolrCore.java:883)
        at org.apache.solr.core.CoreContainer.createFromDescriptor(CoreContainer.java:1193)
        at org.apache.solr.core.CoreContainer.create(CoreContainer.java:1103)
        at org.apache.solr.handler.admin.CoreAdminOperation.lambda$static$0(CoreAdminOperation.java:92)
        at org.apache.solr.handler.admin.CoreAdminOperation.execute(CoreAdminOperation.java:360)
        at org.apache.solr.handler.admin.CoreAdminHandler$CallInfo.call(CoreAdminHandler.java:396)
        at org.apache.solr.handler.admin.CoreAdminHandler.lambda$handleRequestBody$0(CoreAdminHandler.java:188)
        at com.codahale.metrics.InstrumentedExecutorService$InstrumentedRunnable.run(InstrumentedExecutorService.java:176)
        at org.apache.solr.common.util.ExecutorUtil$MDCAwareThreadPoolExecutor.lambda$execute$0(ExecutorUtil.java:209)
        at java.base/java.util.concurrent.ThreadPoolExecutor.runWorker(ThreadPoolExecutor.java:1167)
        at java.base/java.util.concurrent.ThreadPoolExecutor$Worker.run(ThreadPoolExecutor.java:641)
        at java.base/java.lang.Thread.run(Thread.java:844)

 expected null, but was:<ObjectTracker found 4 object(s) that were not released!!! [MockDirectoryWrapper, MockDirectoryWrapper, MockDirectoryWrapper, SolrCore]
org.apache.solr.common.util.ObjectReleaseTracker$ObjectTrackerException: org.apache.lucene.store.MockDirectoryWrapper
        at org.apache.solr.common.util.ObjectReleaseTracker.track(ObjectReleaseTracker.java:42)
        at org.apache.solr.core.CachingDirectoryFactory.get(CachingDirectoryFactory.java:348)
        at org.apache.solr.update.SolrIndexWriter.create(SolrIndexWriter.java:99)
        at org.apache.solr.core.SolrCore.initIndex(SolrCore.java:779)
        at org.apache.solr.core.SolrCore.<init>(SolrCore.java:976)
        at org.apache.solr.core.SolrCore.<init>(SolrCore.java:883)
        at org.apache.solr.core.CoreContainer.createFromDescriptor(CoreContainer.java:1193)
        at org.apache.solr.core.CoreContainer.create(CoreContainer.java:1103)
        at org.apache.solr.handler.admin.CoreAdminOperation.lambda$static$0(CoreAdminOperation.java:92)
        at org.apache.solr.handler.admin.CoreAdminOperation.execute(CoreAdminOperation.java:360)
        at org.apache.solr.handler.admin.CoreAdminHandler$CallInfo.call(CoreAdminHandler.java:396)
        at org.apache.solr.handler.admin.CoreAdminHandler.lambda$handleRequestBody$0(CoreAdminHandler.java:188)
        at com.codahale.metrics.InstrumentedExecutorService$InstrumentedRunnable.run(InstrumentedExecutorService.java:176)
        at org.apache.solr.common.util.ExecutorUtil$MDCAwareThreadPoolExecutor.lambda$execute$0(ExecutorUtil.java:209)
        at java.base/java.util.concurrent.ThreadPoolExecutor.runWorker(ThreadPoolExecutor.java:1167)
        at java.base/java.util.concurrent.ThreadPoolExecutor$Worker.run(ThreadPoolExecutor.java:641)
        at java.base/java.lang.Thread.run(Thread.java:844)

org.apache.solr.common.util.ObjectReleaseTracker$ObjectTrackerException: org.apache.lucene.store.MockDirectoryWrapper
        at org.apache.solr.common.util.ObjectReleaseTracker.track(ObjectReleaseTracker.java:42)
        at org.apache.solr.core.CachingDirectoryFactory.get(CachingDirectoryFactory.java:348)
        at org.apache.solr.handler.IndexFetcher.fetchLatestIndex(IndexFetcher.java:509)
        at org.apache.solr.handler.IndexFetcher.fetchLatestIndex(IndexFetcher.java:351)
        at org.apache.solr.handler.ReplicationHandler.doFetch(ReplicationHandler.java:422)
        at org.apache.solr.handler.ReplicationHandler.lambda$setupPolling$13(ReplicationHandler.java:1191)
        at java.base/java.util.concurrent.Executors$RunnableAdapter.call(Executors.java:514)
        at java.base/java.util.concurrent.FutureTask.runAndReset(FutureTask.java:305)
        at java.base/java.util.concurrent.ScheduledThreadPoolExecutor$ScheduledFutureTask.run(ScheduledThreadPoolExecutor.java:300)
        at java.base/java.util.concurrent.ThreadPoolExecutor.runWorker(ThreadPoolExecutor.java:1167)
        at java.base/java.util.concurrent.ThreadPoolExecutor$Worker.run(ThreadPoolExecutor.java:641)
        at java.base/java.lang.Thread.run(Thread.java:844)

org.apache.solr.common.util.ObjectReleaseTracker$ObjectTrackerException: org.apache.lucene.store.MockDirectoryWrapper
        at org.apache.solr.common.util.ObjectReleaseTracker.track(ObjectReleaseTracker.java:42)
        at org.apache.solr.core.CachingDirectoryFactory.get(CachingDirectoryFactory.java:348)
        at org.apache.solr.core.SolrCore.initSnapshotMetaDataManager(SolrCore.java:517)
        at org.apache.solr.core.SolrCore.<init>(SolrCore.java:968)
        at org.apache.solr.core.SolrCore.<init>(SolrCore.java:883)
        at org.apache.solr.core.CoreContainer.createFromDescriptor(CoreContainer.java:1193)
        at org.apache.solr.core.CoreContainer.create(CoreContainer.java:1103)
        at org.apache.solr.handler.admin.CoreAdminOperation.lambda$static$0(CoreAdminOperation.java:92)
        at org.apache.solr.handler.admin.CoreAdminOperation.execute(CoreAdminOperation.java:360)
        at org.apache.solr.handler.admin.CoreAdminHandler$CallInfo.call(CoreAdminHandler.java:396)
        at org.apache.solr.handler.admin.CoreAdminHandler.lambda$handleRequestBody$0(CoreAdminHandler.java:188)
        at com.codahale.metrics.InstrumentedExecutorService$InstrumentedRunnable.run(InstrumentedExecutorService.java:176)
        at org.apache.solr.common.util.ExecutorUtil$MDCAwareThreadPoolExecutor.lambda$execute$0(ExecutorUtil.java:209)
        at java.base/java.util.concurrent.ThreadPoolExecutor.runWorker(ThreadPoolExecutor.java:1167)
        at java.base/java.util.concurrent.ThreadPoolExecutor$Worker.run(ThreadPoolExecutor.java:641)
        at java.base/java.lang.Thread.run(Thread.java:844)

org.apache.solr.common.util.ObjectReleaseTracker$ObjectTrackerException: org.apache.solr.core.SolrCore
        at org.apache.solr.common.util.ObjectReleaseTracker.track(ObjectReleaseTracker.java:42)
        at org.apache.solr.core.SolrCore.<init>(SolrCore.java:1063)
        at org.apache.solr.core.SolrCore.<init>(SolrCore.java:883)
        at org.apache.solr.core.CoreContainer.createFromDescriptor(CoreContainer.java:1193)
        at org.apache.solr.core.CoreContainer.create(CoreContainer.java:1103)
        at org.apache.solr.handler.admin.CoreAdminOperation.lambda$static$0(CoreAdminOperation.java:92)
        at org.apache.solr.handler.admin.CoreAdminOperation.execute(CoreAdminOperation.java:360)
        at org.apache.solr.handler.admin.CoreAdminHandler$CallInfo.call(CoreAdminHandler.java:396)
        at org.apache.solr.handler.admin.CoreAdminHandler.lambda$handleRequestBody$0(CoreAdminHandler.java:188)
        at com.codahale.metrics.InstrumentedExecutorService$InstrumentedRunnable.run(InstrumentedExecutorService.java:176)
        at org.apache.solr.common.util.ExecutorUtil$MDCAwareThreadPoolExecutor.lambda$execute$0(ExecutorUtil.java:209)
        at java.base/java.util.concurrent.ThreadPoolExecutor.runWorker(ThreadPoolExecutor.java:1167)
        at java.base/java.util.concurrent.ThreadPoolExecutor$Worker.run(ThreadPoolExecutor.java:641)
        at java.base/java.lang.Thread.run(Thread.java:844)

>
        at __randomizedtesting.SeedInfo.seed([52C7727AD4B7E2D7]:0)
        at org.junit.Assert.fail(Assert.java:88)
        at org.junit.Assert.failNotNull(Assert.java:755)
        at org.junit.Assert.assertNull(Assert.java:737)
        at org.apache.solr.SolrTestCaseJ4.teardownTestCases(SolrTestCaseJ4.java:325)
        at java.base/jdk.internal.reflect.NativeMethodAccessorImpl.invoke0(Native Method)
        at java.base/jdk.internal.reflect.NativeMethodAccessorImpl.invoke(NativeMethodAccessorImpl.java:62)
        at java.base/jdk.internal.reflect.DelegatingMethodAccessorImpl.invoke(DelegatingMethodAccessorImpl.java:43)
        at java.base/java.lang.reflect.Method.invoke(Method.java:564)
        at com.carrotsearch.randomizedtesting.RandomizedRunner.invoke(RandomizedRunner.java:1750)
        at com.carrotsearch.randomizedtesting.RandomizedRunner$7.evaluate(RandomizedRunner.java:901)
        at com.carrotsearch.randomizedtesting.rules.StatementAdapter.evaluate(StatementAdapter.java:36)
        at com.carrotsearch.randomizedtesting.rules.SystemPropertiesRestoreRule$1.evaluate(SystemPropertiesRestoreRule.java:57)
        at org.apache.lucene.util.AbstractBeforeAfterRule$1.evaluate(AbstractBeforeAfterRule.java:45)
        at com.carrotsearch.randomizedtesting.rules.StatementAdapter.evaluate(StatementAdapter.java:36)
        at org.apache.lucene.util.TestRuleStoreClassName$1.evaluate(TestRuleStoreClassName.java:41)
        at com.carrotsearch.randomizedtesting.rules.NoShadowingOrOverridesOnMethodsRule$1.evaluate(NoShadowingOrOverridesOnMethodsRule.java:40)
        at com.carrotsearch.randomizedtesting.rules.NoShadowingOrOverridesOnMethodsRule$1.evaluate(NoShadowingOrOverridesOnMethodsRule.java:40)
        at com.carrotsearch.randomizedtesting.rules.StatementAdapter.evaluate(StatementAdapter.java:36)
        at com.carrotsearch.randomizedtesting.rules.StatementAdapter.evaluate(StatementAdapter.java:36)
        at org.apache.lucene.util.TestRuleAssertionsRequired$1.evaluate(TestRuleAssertionsRequired.java:53)
        at org.apache.lucene.util.TestRuleMarkFailure$1.evaluate(TestRuleMarkFailure.java:47)
        at org.apache.lucene.util.TestRuleIgnoreAfterMaxFailures$1.evaluate(TestRuleIgnoreAfterMaxFailures.java:64)
        at org.apache.lucene.util.TestRuleIgnoreTestSuites$1.evaluate(TestRuleIgnoreTestSuites.java:54)
        at com.carrotsearch.randomizedtesting.rules.StatementAdapter.evaluate(StatementAdapter.java:36)
        at com.carrotsearch.randomizedtesting.ThreadLeakControl$StatementRunner.run(ThreadLeakControl.java:368)
        at java.base/java.lang.Thread.run(Thread.java:844)




Build Log:
[...truncated 13692 lines...]
   [junit4] Suite: org.apache.solr.handler.TestSQLHandler
   [junit4]   2> Creating dataDir: C:\Users\jenkins\workspace\Lucene-Solr-master-Windows\solr\build\solr-core\test\J0\temp\solr.handler.TestSQLHandler_20D481020EF9F2E8-001\init-core-data-001
   [junit4]   2> 1361471 INFO  (SUITE-TestSQLHandler-seed#[20D481020EF9F2E8]-worker) [    ] o.a.s.SolrTestCaseJ4 SecureRandom sanity checks: test.solr.allowed.securerandom=null & java.security.egd=file:/dev/./urandom
   [junit4]   2> 1361476 WARN  (SUITE-TestSQLHandler-seed#[20D481020EF9F2E8]-worker) [    ] o.a.s.SolrTestCaseJ4 startTrackingSearchers: numOpens=3 numCloses=3
   [junit4]   2> 1361476 INFO  (SUITE-TestSQLHandler-seed#[20D481020EF9F2E8]-worker) [    ] o.a.s.SolrTestCaseJ4 Using PointFields (NUMERIC_POINTS_SYSPROP=true) w/NUMERIC_DOCVALUES_SYSPROP=true
   [junit4]   2> 1361478 INFO  (SUITE-TestSQLHandler-seed#[20D481020EF9F2E8]-worker) [    ] o.a.s.SolrTestCaseJ4 Randomized ssl (false) and clientAuth (false) via: @org.apache.solr.SolrTestCaseJ4$SuppressSSL(bugUrl="None")
   [junit4]   2> 1361478 INFO  (SUITE-TestSQLHandler-seed#[20D481020EF9F2E8]-worker) [    ] o.a.s.BaseDistributedSearchTestCase Setting hostContext system property: /
   [junit4]   2> 1361485 INFO  (TEST-TestSQLHandler.doTest-seed#[20D481020EF9F2E8]) [    ] o.a.s.c.ZkTestServer STARTING ZK TEST SERVER
   [junit4]   2> 1361486 INFO  (ZkTestServer Run Thread) [    ] o.a.s.c.ZkTestServer client port:0.0.0.0/0.0.0.0:0
   [junit4]   2> 1361486 INFO  (ZkTestServer Run Thread) [    ] o.a.s.c.ZkTestServer Starting server
   [junit4]   2> 1361501 INFO  (TEST-TestSQLHandler.doTest-seed#[20D481020EF9F2E8]) [    ] o.a.s.c.ZkTestServer start zk server on port:53020
   [junit4]   2> 1361501 INFO  (TEST-TestSQLHandler.doTest-seed#[20D481020EF9F2E8]) [    ] o.a.s.c.ZkTestServer parse host and port list: 127.0.0.1:53020
   [junit4]   2> 1361501 INFO  (TEST-TestSQLHandler.doTest-seed#[20D481020EF9F2E8]) [    ] o.a.s.c.ZkTestServer connecting to 127.0.0.1 53020
   [junit4]   2> 1361537 INFO  (zkConnectionManagerCallback-7045-thread-1) [    ] o.a.s.c.c.ConnectionManager zkClient has connected
   [junit4]   2> 1361559 INFO  (zkConnectionManagerCallback-7047-thread-1) [    ] o.a.s.c.c.ConnectionManager zkClient has connected
   [junit4]   2> 1361571 INFO  (TEST-TestSQLHandler.doTest-seed#[20D481020EF9F2E8]) [    ] o.a.s.c.ZkTestServer put C:\Users\jenkins\workspace\Lucene-Solr-master-Windows\solr\core\src\test-files\solr\collection1\conf\solrconfig-sql.xml to /configs/conf1/solrconfig.xml
   [junit4]   2> 1361587 INFO  (TEST-TestSQLHandler.doTest-seed#[20D481020EF9F2E8]) [    ] o.a.s.c.ZkTestServer put C:\Users\jenkins\workspace\Lucene-Solr-master-Windows\solr\core\src\test-files\solr\collection1\conf\schema-sql.xml to /configs/conf1/schema.xml
   [junit4]   2> 1361602 INFO  (TEST-TestSQLHandler.doTest-seed#[20D481020EF9F2E8]) [    ] o.a.s.c.ZkTestServer put C:\Users\jenkins\workspace\Lucene-Solr-master-Windows\solr\core\src\test-files\solr\collection1\conf\solrconfig.snippet.randomindexconfig.xml to /configs/conf1/solrconfig.snippet.randomindexconfig.xml
   [junit4]   2> 1361602 INFO  (TEST-TestSQLHandler.doTest-seed#[20D481020EF9F2E8]) [    ] o.a.s.c.ZkTestServer put C:\Users\jenkins\workspace\Lucene-Solr-master-Windows\solr\core\src\test-files\solr\collection1\conf\stopwords.txt to /configs/conf1/stopwords.txt
   [junit4]   2> 1361624 INFO  (TEST-TestSQLHandler.doTest-seed#[20D481020EF9F2E8]) [    ] o.a.s.c.ZkTestServer put C:\Users\jenkins\workspace\Lucene-Solr-master-Windows\solr\core\src\test-files\solr\collection1\conf\protwords.txt to /configs/conf1/protwords.txt
   [junit4]   2> 1361625 INFO  (TEST-TestSQLHandler.doTest-seed#[20D481020EF9F2E8]) [    ] o.a.s.c.ZkTestServer put C:\Users\jenkins\workspace\Lucene-Solr-master-Windows\solr\core\src\test-files\solr\collection1\conf\currency.xml to /configs/conf1/currency.xml
   [junit4]   2> 1361626 INFO  (TEST-TestSQLHandler.doTest-seed#[20D481020EF9F2E8]) [    ] o.a.s.c.ZkTestServer put C:\Users\jenkins\workspace\Lucene-Solr-master-Windows\solr\core\src\test-files\solr\collection1\conf\enumsConfig.xml to /configs/conf1/enumsConfig.xml
   [junit4]   2> 1361626 INFO  (TEST-TestSQLHandler.doTest-seed#[20D481020EF9F2E8]) [    ] o.a.s.c.ZkTestServer put C:\Users\jenkins\workspace\Lucene-Solr-master-Windows\solr\core\src\test-files\solr\collection1\conf\open-exchange-rates.json to /configs/conf1/open-exchange-rates.json
   [junit4]   2> 1361626 INFO  (TEST-TestSQLHandler.doTest-seed#[20D481020EF9F2E8]) [    ] o.a.s.c.ZkTestServer put C:\Users\jenkins\workspace\Lucene-Solr-master-Windows\solr\core\src\test-files\solr\collection1\conf\mapping-ISOLatin1Accent.txt to /configs/conf1/mapping-ISOLatin1Accent.txt
   [junit4]   2> 1361630 INFO  (TEST-TestSQLHandler.doTest-seed#[20D481020EF9F2E8]) [    ] o.a.s.c.ZkTestServer put C:\Users\jenkins\workspace\Lucene-Solr-master-Windows\solr\core\src\test-files\solr\collection1\conf\old_synonyms.txt to /configs/conf1/old_synonyms.txt
   [junit4]   2> 1361631 INFO  (TEST-TestSQLHandler.doTest-seed#[20D481020EF9F2E8]) [    ] o.a.s.c.ZkTestServer put C:\Users\jenkins\workspace\Lucene-Solr-master-Windows\solr\core\src\test-files\solr\collection1\conf\synonyms.txt to /configs/conf1/synonyms.txt
   [junit4]   2> 1361632 INFO  (TEST-TestSQLHandler.doTest-seed#[20D481020EF9F2E8]) [    ] o.a.s.c.AbstractFullDistribZkTestBase Will use NRT replicas unless explicitly asked otherwise
   [junit4]   2> 1362273 WARN  (TEST-TestSQLHandler.doTest-seed#[20D481020EF9F2E8]) [    ] o.e.j.s.AbstractConnector Ignoring deprecated socket close linger time
   [junit4]   2> 1362273 INFO  (TEST-TestSQLHandler.doTest-seed#[20D481020EF9F2E8]) [    ] o.a.s.c.s.e.JettySolrRunner Start Jetty (original configured port=0)
   [junit4]   2> 1362273 INFO  (TEST-TestSQLHandler.doTest-seed#[20D481020EF9F2E8]) [    ] o.a.s.c.s.e.JettySolrRunner Trying to start Jetty on port 0 try number 1 ...
   [junit4]   2> 1362273 INFO  (TEST-TestSQLHandler.doTest-seed#[20D481020EF9F2E8]) [    ] o.e.j.s.Server jetty-9.4.14.v20181114; built: 2018-11-14T21:20:31.478Z; git: c4550056e785fb5665914545889f21dc136ad9e6; jvm 9.0.4+11
   [junit4]   2> 1362273 INFO  (TEST-TestSQLHandler.doTest-seed#[20D481020EF9F2E8]) [    ] o.e.j.s.session DefaultSessionIdManager workerName=node0
   [junit4]   2> 1362273 INFO  (TEST-TestSQLHandler.doTest-seed#[20D481020EF9F2E8]) [    ] o.e.j.s.session No SessionScavenger set, using defaults
   [junit4]   2> 1362273 INFO  (TEST-TestSQLHandler.doTest-seed#[20D481020EF9F2E8]) [    ] o.e.j.s.session node0 Scavenging every 600000ms
   [junit4]   2> 1362273 INFO  (TEST-TestSQLHandler.doTest-seed#[20D481020EF9F2E8]) [    ] o.e.j.s.h.ContextHandler Started o.e.j.s.ServletContextHandler@49ee4c6a{/,null,AVAILABLE}
   [junit4]   2> 1362276 INFO  (TEST-TestSQLHandler.doTest-seed#[20D481020EF9F2E8]) [    ] o.e.j.s.AbstractConnector Started ServerConnector@21a7ec49{HTTP/1.1,[http/1.1, h2c]}{127.0.0.1:53032}
   [junit4]   2> 1362276 INFO  (TEST-TestSQLHandler.doTest-seed#[20D481020EF9F2E8]) [    ] o.e.j.s.Server Started @1362347ms
   [junit4]   2> 1362276 INFO  (TEST-TestSQLHandler.doTest-seed#[20D481020EF9F2E8]) [    ] o.a.s.c.s.e.JettySolrRunner Jetty properties: {hostContext=/, solr.data.dir=C:\Users\jenkins\workspace\Lucene-Solr-master-Windows\solr\build\solr-core\test\J0\temp\solr.handler.TestSQLHandler_20D481020EF9F2E8-001\tempDir-001/control/data, hostPort=53032, coreRootDirectory=C:\Users\jenkins\workspace\Lucene-Solr-master-Windows\solr\build\solr-core\test\J0\temp\solr.handler.TestSQLHandler_20D481020EF9F2E8-001\control-001\cores, replicaType=NRT}
   [junit4]   2> 1362276 ERROR (TEST-TestSQLHandler.doTest-seed#[20D481020EF9F2E8]) [    ] o.a.s.u.StartupLoggingUtils Missing Java Option solr.log.dir. Logging may be missing or incomplete.
   [junit4]   2> 1362276 INFO  (TEST-TestSQLHandler.doTest-seed#[20D481020EF9F2E8]) [    ] o.a.s.s.SolrDispatchFilter Using logger factory org.apache.logging.slf4j.Log4jLoggerFactory
   [junit4]   2> 1362276 INFO  (TEST-TestSQLHandler.doTest-seed#[20D481020EF9F2E8]) [    ] o.a.s.s.SolrDispatchFilter  ___      _       Welcome to Apache Solr™ version 9.0.0
   [junit4]   2> 1362276 INFO  (TEST-TestSQLHandler.doTest-seed#[20D481020EF9F2E8]) [    ] o.a.s.s.SolrDispatchFilter / __| ___| |_ _   Starting in cloud mode on port null
   [junit4]   2> 1362276 INFO  (TEST-TestSQLHandler.doTest-seed#[20D481020EF9F2E8]) [    ] o.a.s.s.SolrDispatchFilter \__ \/ _ \ | '_|  Install dir: null
   [junit4]   2> 1362276 INFO  (TEST-TestSQLHandler.doTest-seed#[20D481020EF9F2E8]) [    ] o.a.s.s.SolrDispatchFilter |___/\___/_|_|    Start time: 2019-03-27T20:09:43.044811300Z
   [junit4]   2> 1362276 INFO  (zkConnectionManagerCallback-7049-thread-1) [    ] o.a.s.c.c.ConnectionManager zkClient has connected
   [junit4]   2> 1362283 INFO  (TEST-TestSQLHandler.doTest-seed#[20D481020EF9F2E8]) [    ] o.a.s.s.SolrDispatchFilter Loading solr.xml from SolrHome (not found in ZooKeeper)
   [junit4]   2> 1362283 INFO  (TEST-TestSQLHandler.doTest-seed#[20D481020EF9F2E8]) [    ] o.a.s.c.SolrXmlConfig Loading container configuration from C:\Users\jenkins\workspace\Lucene-Solr-master-Windows\solr\build\solr-core\test\J0\temp\solr.handler.TestSQLHandler_20D481020EF9F2E8-001\control-001\solr.xml
   [junit4]   2> 1362322 INFO  (TEST-TestSQLHandler.doTest-seed#[20D481020EF9F2E8]) [    ] o.a.s.c.SolrXmlConfig Configuration parameter autoReplicaFailoverWorkLoopDelay is ignored
   [junit4]   2> 1362322 INFO  (TEST-TestSQLHandler.doTest-seed#[20D481020EF9F2E8]) [    ] o.a.s.c.SolrXmlConfig Configuration parameter autoReplicaFailoverBadNodeExpiration is ignored
   [junit4]   2> 1362336 INFO  (TEST-TestSQLHandler.doTest-seed#[20D481020EF9F2E8]) [    ] o.a.s.c.SolrXmlConfig MBean server found: com.sun.jmx.mbeanserver.JmxMBeanServer@786401ac, but no JMX reporters were configured - adding default JMX reporter.
   [junit4]   2> 1362483 INFO  (TEST-TestSQLHandler.doTest-seed#[20D481020EF9F2E8]) [    ] o.a.s.h.c.HttpShardHandlerFactory Host whitelist initialized: WhitelistHostChecker [whitelistHosts=null, whitelistHostCheckingEnabled=false]
   [junit4]   2> 1362496 WARN  (TEST-TestSQLHandler.doTest-seed#[20D481020EF9F2E8]) [    ] o.e.j.u.s.S.config No Client EndPointIdentificationAlgorithm configured for SslContextFactory@b3d70f1[provider=null,keyStore=null,trustStore=null]
   [junit4]   2> 1362501 WARN  (TEST-TestSQLHandler.doTest-seed#[20D481020EF9F2E8]) [    ] o.e.j.u.s.S.config No Client EndPointIdentificationAlgorithm configured for SslContextFactory@504cf383[provider=null,keyStore=null,trustStore=null]
   [junit4]   2> 1362502 INFO  (TEST-TestSQLHandler.doTest-seed#[20D481020EF9F2E8]) [    ] o.a.s.c.ZkContainer Zookeeper client=127.0.0.1:53020/solr
   [junit4]   2> 1362505 INFO  (zkConnectionManagerCallback-7056-thread-1) [    ] o.a.s.c.c.ConnectionManager zkClient has connected
   [junit4]   2> 1362506 WARN  (NIOServerCxn.Factory:0.0.0.0/0.0.0.0:0) [    ] o.a.z.s.NIOServerCnxn Unable to read additional data from client sessionid 0x10048b2d0030003, likely client has closed socket
   [junit4]   2> 1362509 INFO  (zkConnectionManagerCallback-7058-thread-1) [    ] o.a.s.c.c.ConnectionManager zkClient has connected
   [junit4]   2> 1362629 INFO  (TEST-TestSQLHandler.doTest-seed#[20D481020EF9F2E8]) [n:127.0.0.1:53032_    ] o.a.s.c.OverseerElectionContext I am going to be the leader 127.0.0.1:53032_
   [junit4]   2> 1362630 INFO  (TEST-TestSQLHandler.doTest-seed#[20D481020EF9F2E8]) [n:127.0.0.1:53032_    ] o.a.s.c.Overseer Overseer (id=72137526869164036-127.0.0.1:53032_-n_0000000000) starting
   [junit4]   2> 1362639 INFO  (zkConnectionManagerCallback-7065-thread-1) [    ] o.a.s.c.c.ConnectionManager zkClient has connected
   [junit4]   2> 1362643 INFO  (TEST-TestSQLHandler.doTest-seed#[20D481020EF9F2E8]) [n:127.0.0.1:53032_    ] o.a.s.c.s.i.ZkClientClusterStateProvider Cluster at 127.0.0.1:53020/solr ready
   [junit4]   2> 1362646 INFO  (TEST-TestSQLHandler.doTest-seed#[20D481020EF9F2E8]) [n:127.0.0.1:53032_    ] o.a.s.c.ZkController Register node as live in ZooKeeper:/live_nodes/127.0.0.1:53032_
   [junit4]   2> 1362646 INFO  (OverseerStateUpdate-72137526869164036-127.0.0.1:53032_-n_0000000000) [n:127.0.0.1:53032_    ] o.a.s.c.Overseer Starting to work on the main queue : 127.0.0.1:53032_
   [junit4]   2> 1362649 INFO  (OverseerStateUpdate-72137526869164036-127.0.0.1:53032_-n_0000000000) [n:127.0.0.1:53032_    ] o.a.s.c.c.ZkStateReader Updated live nodes from ZooKeeper... (0) -> (1)
   [junit4]   2> 1362659 INFO  (zkCallback-7064-thread-1) [    ] o.a.s.c.c.ZkStateReader Updated live nodes from ZooKeeper... (0) -> (1)
   [junit4]   2> 1362681 INFO  (TEST-TestSQLHandler.doTest-seed#[20D481020EF9F2E8]) [n:127.0.0.1:53032_    ] o.a.s.h.a.MetricsHistoryHandler No .system collection, keeping metrics history in memory.
   [junit4]   2> 1362705 INFO  (TEST-TestSQLHandler.doTest-seed#[20D481020EF9F2E8]) [n:127.0.0.1:53032_    ] o.a.s.m.r.SolrJmxReporter JMX monitoring for 'solr.node' (registry 'solr.node') enabled at server: com.sun.jmx.mbeanserver.JmxMBeanServer@786401ac
   [junit4]   2> 1362716 INFO  (TEST-TestSQLHandler.doTest-seed#[20D481020EF9F2E8]) [n:127.0.0.1:53032_    ] o.a.s.m.r.SolrJmxReporter JMX monitoring for 'solr.jvm' (registry 'solr.jvm') enabled at server: com.sun.jmx.mbeanserver.JmxMBeanServer@786401ac
   [junit4]   2> 1362716 INFO  (TEST-TestSQLHandler.doTest-seed#[20D481020EF9F2E8]) [n:127.0.0.1:53032_    ] o.a.s.m.r.SolrJmxReporter JMX monitoring for 'solr.jetty' (registry 'solr.jetty') enabled at server: com.sun.jmx.mbeanserver.JmxMBeanServer@786401ac
   [junit4]   2> 1362719 INFO  (TEST-TestSQLHandler.doTest-seed#[20D481020EF9F2E8]) [n:127.0.0.1:53032_    ] o.a.s.c.CorePropertiesLocator Found 0 core definitions underneath C:\Users\jenkins\workspace\Lucene-Solr-master-Windows\solr\build\solr-core\test\J0\temp\solr.handler.TestSQLHandler_20D481020EF9F2E8-001\control-001\cores
   [junit4]   2> 1362803 INFO  (zkConnectionManagerCallback-7071-thread-1) [    ] o.a.s.c.c.ConnectionManager zkClient has connected
   [junit4]   2> 1362805 INFO  (TEST-TestSQLHandler.doTest-seed#[20D481020EF9F2E8]) [    ] o.a.s.c.c.ZkStateReader Updated live nodes from ZooKeeper... (0) -> (1)
   [junit4]   2> 1362807 INFO  (TEST-TestSQLHandler.doTest-seed#[20D481020EF9F2E8]) [    ] o.a.s.c.s.i.ZkClientClusterStateProvider Cluster at 127.0.0.1:53020/solr ready
   [junit4]   2> 1362809 INFO  (qtp789158328-19567) [n:127.0.0.1:53032_    ] o.a.s.h.a.CollectionsHandler Invoked Collection Action :create with params collection.configName=conf1&name=control_collection&nrtReplicas=1&action=CREATE&numShards=1&createNodeSet=127.0.0.1:53032_&wt=javabin&version=2 and sendToOCPQueue=true
   [junit4]   2> 1362852 INFO  (OverseerThreadFactory-5961-thread-1-processing-n:127.0.0.1:53032_) [n:127.0.0.1:53032_    ] o.a.s.c.a.c.CreateCollectionCmd Create collection control_collection
   [junit4]   2> 1362969 INFO  (qtp789158328-19569) [n:127.0.0.1:53032_    x:control_collection_shard1_replica_n1] o.a.s.h.a.CoreAdminOperation core create command qt=/admin/cores&collection.configName=conf1&newCollection=true&name=control_collection_shard1_replica_n1&action=CREATE&numShards=1&collection=control_collection&shard=shard1&wt=javabin&version=2&replicaType=NRT
   [junit4]   2> 1362970 INFO  (qtp789158328-19569) [n:127.0.0.1:53032_    x:control_collection_shard1_replica_n1] o.a.s.c.TransientSolrCoreCacheDefault Allocating transient cache for 4 transient cores
   [junit4]   2> 1364005 INFO  (qtp789158328-19569) [n:127.0.0.1:53032_ c:control_collection s:shard1  x:control_collection_shard1_replica_n1] o.a.s.c.SolrConfig Using Lucene MatchVersion: 9.0.0
   [junit4]   2> 1364024 INFO  (qtp789158328-19569) [n:127.0.0.1:53032_ c:control_collection s:shard1  x:control_collection_shard1_replica_n1] o.a.s.s.IndexSchema [control_collection_shard1_replica_n1] Schema name=test
   [junit4]   2> 1364126 WARN  (qtp789158328-19569) [n:127.0.0.1:53032_ c:control_collection s:shard1  x:control_collection_shard1_replica_n1] o.a.s.s.IndexSchema Field lowerfilt1and2 is not multivalued and destination for multiple copyFields (2)
   [junit4]   2> 1364127 WARN  (qtp789158328-19569) [n:127.0.0.1:53032_ c:control_collection s:shard1  x:control_collection_shard1_replica_n1] o.a.s.s.IndexSchema Field text is not multivalued and destination for multiple copyFields (3)
   [junit4]   2> 1364127 INFO  (qtp789158328-19569) [n:127.0.0.1:53032_ c:control_collection s:shard1  x:control_collection_shard1_replica_n1] o.a.s.s.IndexSchema Loaded schema test/1.6 with uniqueid field id
   [junit4]   2> 1364127 INFO  (qtp789158328-19569) [n:127.0.0.1:53032_ c:control_collection s:shard1  x:control_collection_shard1_replica_n1] o.a.s.c.CoreContainer Creating SolrCore 'control_collection_shard1_replica_n1' using configuration from collection control_collection, trusted=true
   [junit4]   2> 1364128 INFO  (qtp789158328-19569) [n:127.0.0.1:53032_ c:control_collection s:shard1  x:control_collection_shard1_replica_n1] o.a.s.m.r.SolrJmxReporter JMX monitoring for 'solr.core.control_collection.shard1.replica_n1' (registry 'solr.core.control_collection.shard1.replica_n1') enabled at server: com.sun.jmx.mbeanserver.JmxMBeanServer@786401ac
   [junit4]   2> 1364128 INFO  (qtp789158328-19569) [n:127.0.0.1:53032_ c:control_collection s:shard1  x:control_collection_shard1_replica_n1] o.a.s.c.SolrCore [[control_collection_shard1_replica_n1] ] Opening new SolrCore at [C:\Users\jenkins\workspace\Lucene-Solr-master-Windows\solr\build\solr-core\test\J0\temp\solr.handler.TestSQLHandler_20D481020EF9F2E8-001\control-001\cores\control_collection_shard1_replica_n1], dataDir=[C:\Users\jenkins\workspace\Lucene-Solr-master-Windows\solr\build\solr-core\test\J0\temp\solr.handler.TestSQLHandler_20D481020EF9F2E8-001\control-001\cores\control_collection_shard1_replica_n1\data\]
   [junit4]   2> 1364230 INFO  (qtp789158328-19569) [n:127.0.0.1:53032_ c:control_collection s:shard1  x:control_collection_shard1_replica_n1] o.a.s.u.UpdateHandler Using UpdateLog implementation: org.apache.solr.update.UpdateLog
   [junit4]   2> 1364230 INFO  (qtp789158328-19569) [n:127.0.0.1:53032_ c:control_collection s:shard1  x:control_collection_shard1_replica_n1] o.a.s.u.UpdateLog Initializing UpdateLog: dataDir= defaultSyncLevel=FLUSH numRecordsToKeep=100 maxNumLogsToKeep=10 numVersionBuckets=65536
   [junit4]   2> 1364233 INFO  (qtp789158328-19569) [n:127.0.0.1:53032_ c:control_collection s:shard1  x:control_collection_shard1_replica_n1] o.a.s.u.CommitTracker Hard AutoCommit: disabled
   [junit4]   2> 1364233 INFO  (qtp789158328-19569) [n:127.0.0.1:53032_ c:control_collection s:shard1  x:control_collection_shard1_replica_n1] o.a.s.u.CommitTracker Soft AutoCommit: disabled
   [junit4]   2> 1364233 INFO  (qtp789158328-19569) [n:127.0.0.1:53032_ c:control_collection s:shard1  x:control_collection_shard1_replica_n1] o.a.s.s.SolrIndexSearcher Opening [Searcher@71602d5c[control_collection_shard1_replica_n1] main]
   [junit4]   2> 1364237 INFO  (qtp789158328-19569) [n:127.0.0.1:53032_ c:control_collection s:shard1  x:control_collection_shard1_replica_n1] o.a.s.r.ManagedResourceStorage Configured ZooKeeperStorageIO with znodeBase: /configs/conf1
   [junit4]   2> 1364237 INFO  (qtp789158328-19569) [n:127.0.0.1:53032_ c:control_collection s:shard1  x:control_collection_shard1_replica_n1] o.a.s.r.ManagedResourceStorage Loaded null at path _rest_managed.json using ZooKeeperStorageIO:path=/configs/conf1
   [junit4]   2> 1364239 INFO  (qtp789158328-19569) [n:127.0.0.1:53032_ c:control_collection s:shard1  x:control_collection_shard1_replica_n1] o.a.s.u.UpdateLog Could not find max version in index or recent updates, using new clock 1629190760701100032
   [junit4]   2> 1364249 INFO  (searcherExecutor-5966-thread-1-processing-n:127.0.0.1:53032_ x:control_collection_shard1_replica_n1 c:control_collection s:shard1) [n:127.0.0.1:53032_ c:control_collection s:shard1  x:control_collection_shard1_replica_n1] o.a.s.c.SolrCore [control_collection_shard1_replica_n1] Registered new searcher Searcher@71602d5c[control_collection_shard1_replica_n1] main{ExitableDirectoryReader(UninvertingDirectoryReader())}
   [junit4]   2> 1364268 INFO  (qtp789158328-19569) [n:127.0.0.1:53032_ c:control_collection s:shard1  x:control_collection_shard1_replica_n1] o.a.s.c.ZkShardTerms Successful update of terms at /collections/control_collection/terms/shard1 to Terms{values={core_node2=0}, version=0}
   [junit4]   2> 1364268 INFO  (qtp789158328-19569) [n:127.0.0.1:53032_ c:control_collection s:shard1  x:control_collection_shard1_replica_n1] o.a.s.c.ShardLeaderElectionContextBase make sure parent is created /collections/control_collection/leaders/shard1
   [junit4]   2> 1364290 INFO  (qtp789158328-19569) [n:127.0.0.1:53032_ c:control_collection s:shard1  x:control_collection_shard1_replica_n1] o.a.s.c.ShardLeaderElectionContext Enough replicas found to continue.
   [junit4]   2> 1364290 INFO  (qtp789158328-19569) [n:127.0.0.1:53032_ c:control_collection s:shard1  x:control_collection_shard1_replica_n1] o.a.s.c.ShardLeaderElectionContext I may be the new leader - try and sync
   [junit4]   2> 1364290 INFO  (qtp789158328-19569) [n:127.0.0.1:53032_ c:control_collection s:shard1  x:control_collection_shard1_replica_n1] o.a.s.c.SyncStrategy Sync replicas to http://127.0.0.1:53032/control_collection_shard1_replica_n1/
   [junit4]   2> 1364291 INFO  (qtp789158328-19569) [n:127.0.0.1:53032_ c:control_collection s:shard1  x:control_collection_shard1_replica_n1] o.a.s.c.SyncStrategy Sync Success - now sync replicas to me
   [junit4]   2> 1364292 INFO  (qtp789158328-19569) [n:127.0.0.1:53032_ c:control_collection s:shard1  x:control_collection_shard1_replica_n1] o.a.s.c.SyncStrategy http://127.0.0.1:53032/control_collection_shard1_replica_n1/ has no replicas
   [junit4]   2> 1364292 INFO  (qtp789158328-19569) [n:127.0.0.1:53032_ c:control_collection s:shard1  x:control_collection_shard1_replica_n1] o.a.s.c.ShardLeaderElectionContextBase Creating leader registration node /collections/control_collection/leaders/shard1/leader after winning as /collections/control_collection/leader_elect/shard1/election/72137526869164036-core_node2-n_0000000000
   [junit4]   2> 1364298 INFO  (qtp789158328-19569) [n:127.0.0.1:53032_ c:control_collection s:shard1  x:control_collection_shard1_replica_n1] o.a.s.c.ShardLeaderElectionContext I am the new leader: http://127.0.0.1:53032/control_collection_shard1_replica_n1/ shard1
   [junit4]   2> 1364429 INFO  (zkCallback-7057-thread-1) [    ] o.a.s.c.c.ZkStateReader A cluster state change: [WatchedEvent state:SyncConnected type:NodeDataChanged path:/collections/control_collection/state.json] for collection [control_collection] has occurred - updating... (live nodes size: [1])
   [junit4]   2> 1364430 INFO  (zkCallback-7057-thread-2) [    ] o.a.s.c.c.ZkStateReader A cluster state change: [WatchedEvent state:SyncConnected type:NodeDataChanged path:/collections/control_collection/state.json] for collection [control_collection] has occurred - updating... (live nodes size: [1])
   [junit4]   2> 1364440 INFO  (qtp789158328-19569) [n:127.0.0.1:53032_ c:control_collection s:shard1  x:control_collection_shard1_replica_n1] o.a.s.c.ZkController I am the leader, no recovery necessary
   [junit4]   2> 1364451 INFO  (qtp789158328-19569) [n:127.0.0.1:53032_ c:control_collection s:shard1  x:control_collection_shard1_replica_n1] o.a.s.s.HttpSolrCall [admin] webapp=null path=/admin/cores params={qt=/admin/cores&collection.configName=conf1&newCollection=true&name=control_collection_shard1_replica_n1&action=CREATE&numShards=1&collection=control_collection&shard=shard1&wt=javabin&version=2&replicaType=NRT} status=0 QTime=1482
   [junit4]   2> 1364453 INFO  (qtp789158328-19567) [n:127.0.0.1:53032_    ] o.a.s.h.a.CollectionsHandler Wait for new collection to be active for at most 45 seconds. Check all shard replicas
   [junit4]   2> 1364551 INFO  (zkCallback-7057-thread-2) [    ] o.a.s.c.c.ZkStateReader A cluster state change: [WatchedEvent state:SyncConnected type:NodeDataChanged path:/collections/control_collection/state.json] for collection [control_collection] has occurred - updating... (live nodes size: [1])
   [junit4]   2> 1364551 INFO  (zkCallback-7057-thread-3) [    ] o.a.s.c.c.ZkStateReader A cluster state change: [WatchedEvent state:SyncConnected type:NodeDataChanged path:/collections/control_collection/state.json] for collection [control_collection] has occurred - updating... (live nodes size: [1])
   [junit4]   2> 1364551 INFO  (zkCallback-7057-thread-1) [    ] o.a.s.c.c.ZkStateReader A cluster state change: [WatchedEvent state:SyncConnected type:NodeDataChanged path:/collections/control_collection/state.json] for collection [control_collection] has occurred - updating... (live nodes size: [1])
   [junit4]   2> 1364551 INFO  (qtp789158328-19567) [n:127.0.0.1:53032_    ] o.a.s.s.HttpSolrCall [admin] webapp=null path=/admin/collections params={collection.configName=conf1&name=control_collection&nrtReplicas=1&action=CREATE&numShards=1&createNodeSet=127.0.0.1:53032_&wt=javabin&version=2} status=0 QTime=1741
   [junit4]   2> 1364574 INFO  (zkConnectionManagerCallback-7077-thread-1) [    ] o.a.s.c.c.ConnectionManager zkClient has connected
   [junit4]   2> 1364575 INFO  (TEST-TestSQLHandler.doTest-seed#[20D481020EF9F2E8]) [    ] o.a.s.c.c.ZkStateReader Updated live nodes from ZooKeeper... (0) -> (1)
   [junit4]   2> 1364576 INFO  (TEST-TestSQLHandler.doTest-seed#[20D481020EF9F2E8]) [    ] o.a.s.c.s.i.ZkClientClusterStateProvider Cluster at 127.0.0.1:53020/solr ready
   [junit4]   2> 1364576 INFO  (TEST-TestSQLHandler.doTest-seed#[20D481020EF9F2E8]) [    ] o.a.s.c.ChaosMonkey monkey: init - expire sessions:false cause connection loss:false
   [junit4]   2> 1364577 INFO  (qtp789158328-19568) [n:127.0.0.1:53032_    ] o.a.s.h.a.CollectionsHandler Invoked Collection Action :create with params collection.configName=conf1&name=collection1&nrtReplicas=1&action=CREATE&numShards=2&createNodeSet=&stateFormat=2&wt=javabin&version=2 and sendToOCPQueue=true
   [junit4]   2> 1364580 INFO  (OverseerThreadFactory-5961-thread-2-processing-n:127.0.0.1:53032_) [n:127.0.0.1:53032_    ] o.a.s.c.a.c.CreateCollectionCmd Create collection collection1
   [junit4]   2> 1364581 INFO  (OverseerCollectionConfigSetProcessor-72137526869164036-127.0.0.1:53032_-n_0000000000) [n:127.0.0.1:53032_    ] o.a.s.c.OverseerTaskQueue Response ZK path: /overseer/collection-queue-work/qnr-0000000000 doesn't exist.  Requestor may have disconnected from ZooKeeper
   [junit4]   2> 1364806 WARN  (OverseerThreadFactory-5961-thread-2-processing-n:127.0.0.1:53032_) [n:127.0.0.1:53032_    ] o.a.s.c.a.c.CreateCollectionCmd It is unusual to create a collection (collection1) without cores.
   [junit4]   2> 1364809 INFO  (qtp789158328-19568) [n:127.0.0.1:53032_    ] o.a.s.h.a.CollectionsHandler Wait for new collection to be active for at most 45 seconds. Check all shard replicas
   [junit4]   2> 1364809 INFO  (qtp789158328-19568) [n:127.0.0.1:53032_    ] o.a.s.s.HttpSolrCall [admin] webapp=null path=/admin/collections params={collection.configName=conf1&name=collection1&nrtReplicas=1&action=CREATE&numShards=2&createNodeSet=&stateFormat=2&wt=javabin&version=2} status=0 QTime=231
   [junit4]   2> 1364812 INFO  (TEST-TestSQLHandler.doTest-seed#[20D481020EF9F2E8]) [    ] o.a.s.c.AbstractFullDistribZkTestBase Creating jetty instances pullReplicaCount=0 numOtherReplicas=4
   [junit4]   2> 1365725 INFO  (TEST-TestSQLHandler.doTest-seed#[20D481020EF9F2E8]) [    ] o.a.s.c.AbstractFullDistribZkTestBase create jetty 1 in directory C:\Users\jenkins\workspace\Lucene-Solr-master-Windows\solr\build\solr-core\test\J0\temp\solr.handler.TestSQLHandler_20D481020EF9F2E8-001\shard-1-001 of type NRT
   [junit4]   2> 1365725 WARN  (closeThreadPool-7078-thread-1) [    ] o.e.j.s.AbstractConnector Ignoring deprecated socket close linger time
   [junit4]   2> 1365725 INFO  (closeThreadPool-7078-thread-1) [    ] o.a.s.c.s.e.JettySolrRunner Start Jetty (original configured port=0)
   [junit4]   2> 1365725 INFO  (closeThreadPool-7078-thread-1) [    ] o.a.s.c.s.e.JettySolrRunner Trying to start Jetty on port 0 try number 1 ...
   [junit4]   2> 1365725 INFO  (closeThreadPool-7078-thread-1) [    ] o.e.j.s.Server jetty-9.4.14.v20181114; built: 2018-11-14T21:20:31.478Z; git: c4550056e785fb5665914545889f21dc136ad9e6; jvm 9.0.4+11
   [junit4]   2> 1365725 INFO  (closeThreadPool-7078-thread-1) [    ] o.e.j.s.session DefaultSessionIdManager workerName=node0
   [junit4]   2> 1365725 INFO  (closeThreadPool-7078-thread-1) [    ] o.e.j.s.session No SessionScavenger set, using defaults
   [junit4]   2> 1365725 INFO  (closeThreadPool-7078-thread-1) [    ] o.e.j.s.session node0 Scavenging every 600000ms
   [junit4]   2> 1365725 INFO  (closeThreadPool-7078-thread-1) [    ] o.e.j.s.h.ContextHandler Started o.e.j.s.ServletContextHandler@398d931f{/,null,AVAILABLE}
   [junit4]   2> 1365731 INFO  (closeThreadPool-7078-thread-1) [    ] o.e.j.s.AbstractConnector Started ServerConnector@6f56f9cb{HTTP/1.1,[http/1.1, h2c]}{127.0.0.1:53071}
   [junit4]   2> 1365731 INFO  (closeThreadPool-7078-thread-1) [    ] o.e.j.s.Server Started @1365805ms
   [junit4]   2> 1365731 INFO  (closeThreadPool-7078-thread-1) [    ] o.a.s.c.s.e.JettySolrRunner Jetty properties: {hostContext=/, solrconfig=solrconfig.xml, solr.data.dir=C:\Users\jenkins\workspace\Lucene-Solr-master-Windows\solr\build\solr-core\test\J0\temp\solr.handler.TestSQLHandler_20D481020EF9F2E8-001\tempDir-001/jetty1, hostPort=53071, coreRootDirectory=C:\Users\jenkins\workspace\Lucene-Solr-master-Windows\solr\build\solr-core\test\J0\temp\solr.handler.TestSQLHandler_20D481020EF9F2E8-001\shard-1-001\cores, replicaType=NRT}
   [junit4]   2> 1365731 ERROR (closeThreadPool-7078-thread-1) [    ] o.a.s.u.StartupLoggingUtils Missing Java Option solr.log.dir. Logging may be missing or incomplete.
   [junit4]   2> 1365731 INFO  (closeThreadPool-7078-thread-1) [    ] o.a.s.s.SolrDispatchFilter Using logger factory org.apache.logging.slf4j.Log4jLoggerFactory
   [junit4]   2> 1365731 INFO  (closeThreadPool-7078-thread-1) [    ] o.a.s.s.SolrDispatchFilter  ___      _       Welcome to Apache Solr™ version 9.0.0
   [junit4]   2> 1365731 INFO  (closeThreadPool-7078-thread-1) [    ] o.a.s.s.SolrDispatchFilter / __| ___| |_ _   Starting in cloud mode on port null
   [junit4]   2> 1365731 INFO  (closeThreadPool-7078-thread-1) [    ] o.a.s.s.SolrDispatchFilter \__ \/ _ \ | '_|  Install dir: null
   [junit4]   2> 1365731 INFO  (closeThreadPool-7078-thread-1) [    ] o.a.s.s.SolrDispatchFilter |___/\___/_|_|    Start time: 2019-03-27T20:09:46.499463800Z
   [junit4]   2> 1365741 INFO  (zkConnectionManagerCallback-7080-thread-1) [    ] o.a.s.c.c.ConnectionManager zkClient has connected
   [junit4]   2> 1365756 INFO  (closeThreadPool-7078-thread-1) [    ] o.a.s.s.SolrDispatchFilter Loading solr.xml from SolrHome (not found in ZooKeeper)
   [junit4]   2> 1365756 INFO  (closeThreadPool-7078-thread-1) [    ] o.a.s.c.SolrXmlConfig Loading container configuration from C:\Users\jenkins\workspace\Lucene-Solr-master-Windows\solr\build\solr-core\test\J0\temp\solr.handler.TestSQLHandler_20D481020EF9F2E8-001\shard-1-001\solr.xml
   [junit4]   2> 1365759 INFO  (closeThreadPool-7078-thread-1) [    ] o.a.s.c.SolrXmlConfig Configuration parameter autoReplicaFailoverWorkLoopDelay is ignored
   [junit4]   2> 1365759 INFO  (closeThreadPool-7078-thread-1) [    ] o.a.s.c.SolrXmlConfig Configuration parameter autoReplicaFailoverBadNodeExpiration is ignored
   [junit4]   2> 1365789 INFO  (closeThreadPool-7078-thread-1) [    ] o.a.s.c.SolrXmlConfig MBean server found: com.sun.jmx.mbeanserver.JmxMBeanServer@786401ac, but no JMX reporters were configured - adding default JMX reporter.
   [junit4]   2> 1366119 INFO  (closeThreadPool-7078-thread-1) [    ] o.a.s.h.c.HttpShardHandlerFactory Host whitelist initialized: WhitelistHostChecker [whitelistHosts=null, whitelistHostCheckingEnabled=false]
   [junit4]   2> 1366122 WARN  (closeThreadPool-7078-thread-1) [    ] o.e.j.u.s.S.config No Client EndPointIdentificationAlgorithm configured for SslContextFactory@128c9f58[provider=null,keyStore=null,trustStore=null]
   [junit4]   2> 1366131 WARN  (closeThreadPool-7078-thread-1) [    ] o.e.j.u.s.S.config No Client EndPointIdentificationAlgorithm configured for SslContextFactory@31082d6c[provider=null,keyStore=null,trustStore=null]
   [junit4]   2> 1366132 INFO  (closeThreadPool-7078-thread-1) [    ] o.a.s.c.ZkContainer Zookeeper client=127.0.0.1:53020/solr
   [junit4]   2> 1366141 INFO  (zkConnectionManagerCallback-7087-thread-1) [    ] o.a.s.c.c.ConnectionManager zkClient has connected
   [junit4]   2> 1366143 WARN  (NIOServerCxn.Factory:0.0.0.0/0.0.0.0:0) [    ] o.a.z.s.NIOServerCnxn Unable to read additional data from client sessionid 0x10048b2d0030009, likely client has closed socket
   [junit4]   2> 1366151 INFO  (zkConnectionManagerCallback-7089-thread-1) [    ] o.a.s.c.c.ConnectionManager zkClient has connected
   [junit4]   2> 1366155 INFO  (closeThreadPool-7078-thread-1) [n:127.0.0.1:53071_    ] o.a.s.c.c.ZkStateReader Updated live nodes from ZooKeeper... (0) -> (1)
   [junit4]   2> 1366164 INFO  (closeThreadPool-7078-thread-1) [n:127.0.0.1:53071_    ] o.a.s.c.ZkController Publish node=127.0.0.1:53071_ as DOWN
   [junit4]   2> 1366165 INFO  (closeThreadPool-7078-thread-1) [n:127.0.0.1:53071_    ] o.a.s.c.TransientSolrCoreCacheDefault Allocating transient cache for 4 transient cores
   [junit4]   2> 1366165 INFO  (closeThreadPool-7078-thread-1) [n:127.0.0.1:53071_    ] o.a.s.c.ZkController Register node as live in ZooKeeper:/live_nodes/127.0.0.1:53071_
   [junit4]   2> 1366168 INFO  (zkCallback-7064-thread-1) [    ] o.a.s.c.c.ZkStateReader Updated live nodes from ZooKeeper... (1) -> (2)
   [junit4]   2> 1366168 INFO  (zkCallback-7057-thread-1) [    ] o.a.s.c.c.ZkStateReader Updated live nodes from ZooKeeper... (1) -> (2)
   [junit4]   2> 1366201 INFO  (zkCallback-7088-thread-1) [    ] o.a.s.c.c.ZkStateReader Updated live nodes from ZooKeeper... (1) -> (2)
   [junit4]   2> 1366214 INFO  (zkCallback-7076-thread-1) [    ] o.a.s.c.c.ZkStateReader Updated live nodes from ZooKeeper... (1) -> (2)
   [junit4]   2> 1366225 INFO  (zkConnectionManagerCallback-7096-thread-1) [    ] o.a.s.c.c.ConnectionManager zkClient has connected
   [junit4]   2> 1366226 INFO  (closeThreadPool-7078-thread-1) [n:127.0.0.1:53071_    ] o.a.s.c.c.ZkStateReader Updated live nodes from ZooKeeper... (0) -> (2)
   [junit4]   2> 1366227 INFO  (closeThreadPool-7078-thread-1) [n:127.0.0.1:53071_    ] o.a.s.c.s.i.ZkClientClusterStateProvider Cluster at 127.0.0.1:53020/solr ready
   [junit4]   2> 1366228 INFO  (closeThreadPool-7078-thread-1) [n:127.0.0.1:53071_    ] o.a.s.h.a.MetricsHistoryHandler No .system collection, keeping metrics history in memory.
   [junit4]   2> 1366251 INFO  (closeThreadPool-7078-thread-1) [n:127.0.0.1:53071_    ] o.a.s.m.r.SolrJmxReporter JMX monitoring for 'solr.node' (registry 'solr.node') enabled at server: com.sun.jmx.mbeanserver.JmxMBeanServer@786401ac
   [junit4]   2> 1366261 INFO  (closeThreadPool-7078-thread-1) [n:127.0.0.1:53071_    ] o.a.s.m.r.SolrJmxReporter JMX monitoring for 'solr.jvm' (registry 'solr.jvm') enabled at server: com.sun.jmx.mbeanserver.JmxMBeanServer@786401ac
   [junit4]   2> 1366261 INFO  (closeThreadPool-7078-thread-1) [n:127.0.0.1:53071_    ] o.a.s.m.r.SolrJmxReporter JMX monitoring for 'solr.jetty' (registry 'solr.jetty') enabled at server: com.sun.jmx.mbeanserver.JmxMBeanServer@786401ac
   [junit4]   2> 1366262 INFO  (closeThreadPool-7078-thread-1) [n:127.0.0.1:53071_    ] o.a.s.c.CorePropertiesLocator Found 0 core definitions underneath C:\Users\jenkins\workspace\Lucene-Solr-master-Windows\solr\build\solr-core\test\J0\temp\solr.handler.TestSQLHandler_20D481020EF9F2E8-001\shard-1-001\cores
   [junit4]   2> 1366403 INFO  (TEST-TestSQLHandler.doTest-seed#[20D481020EF9F2E8]) [    ] o.a.s.c.AbstractFullDistribZkTestBase create jetty 2 in directory C:\Users\jenkins\workspace\Lucene-Solr-master-Windows\solr\build\solr-core\test\J0\temp\solr.handler.TestSQLHandler_20D481020EF9F2E8-001\shard-2-001 of type NRT
   [junit4]   2> 1366404 WARN  (closeThreadPool-7078-thread-1) [    ] o.e.j.s.AbstractConnector Ignoring deprecated socket close linger time
   [junit4]   2> 1366404 INFO  (closeThreadPool-7078-thread-1) [    ] o.a.s.c.s.e.JettySolrRunner Start Jetty (original configured port=0)
   [junit4]   2> 1366404 INFO  (closeThreadPool-7078-thread-1) [    ] o.a.s.c.s.e.JettySolrRunner Trying to start Jetty on port 0 try number 1 ...
   [junit4]   2> 1366404 INFO  (closeThreadPool-7078-thread-1) [    ] o.e.j.s.Server jetty-9.4.14.v20181114; built: 2018-11-14T21:20:31.478Z; git: c4550056e785fb5665914545889f21dc136ad9e6; jvm 9.0.4+11
   [junit4]   2> 1366405 INFO  (closeThreadPool-7078-thread-1) [    ] o.e.j.s.session DefaultSessionIdManager workerName=node0
   [junit4]   2> 1366405 INFO  (closeThreadPool-7078-thread-1) [    ] o.e.j.s.session No SessionScavenger set, using defaults
   [junit4]   2> 1366405 INFO  (closeThreadPool-7078-thread-1) [    ] o.e.j.s.session node0 Scavenging every 600000ms
   [junit4]   2> 1366405 INFO  (closeThreadPool-7078-thread-1) [    ] o.e.j.s.h.ContextHandler Started o.e.j.s.ServletContextHandler@79ca7897{/,null,AVAILABLE}
   [junit4]   2> 1366406 INFO  (closeThreadPool-7078-thread-1) [    ] o.e.j.s.AbstractConnector Started ServerConnector@595e7601{HTTP/1.1,[http/1.1, h2c]}{127.0.0.1:53090}
   [junit4]   2> 1366406 INFO  (closeThreadPool-7078-thread-1) [    ] o.e.j.s.Server Started @1366476ms
   [junit4]   2> 1366406 INFO  (closeThreadPool-7078-thread-1) [    ] o.a.s.c.s.e.JettySolrRunner Jetty properties: {hostContext=/, solrconfig=solrconfig.xml, solr.data.dir=C:\Users\jenkins\workspace\Lucene-Solr-master-Windows\solr\build\solr-core\test\J0\temp\solr.handler.TestSQLHandler_20D481020EF9F2E8-001\tempDir-001/jetty2, hostPort=53090, coreRootDirectory=C:\Users\jenkins\workspace\Lucene-Solr-master-Windows\solr\build\solr-core\test\J0\temp\solr.handler.TestSQLHandler_20D481020EF9F2E8-001\shard-2-001\cores, replicaType=NRT}
   [junit4]   2> 1366406 ERROR (closeThreadPool-7078-thread-1) [    ] o.a.s.u.StartupLoggingUtils Missing Java Option solr.log.dir. Logging may be missing or incomplete.
   [junit4]   2> 1366406 INFO  (closeThreadPool-7078-thread-1) [    ] o.a.s.s.SolrDispatchFilter Using logger factory org.apache.logging.slf4j.Log4jLoggerFactory
   [junit4]   2> 1366406 INFO  (closeThreadPool-7078-thread-1) [    ] o.a.s.s.SolrDispatchFilter  ___      _       Welcome to Apache Solr™ version 9.0.0
   [junit4]   2> 1366406 INFO  (closeThreadPool-7078-thread-1) [    ] o.a.s.s.SolrDispatchFilter / __| ___| |_ _   Starting in cloud mode on port null
   [junit4]   2> 1366406 INFO  (closeThreadPool-7078-thread-1) [    ] o.a.s.s.SolrDispatchFilter \__ \/ _ \ | '_|  Install dir: null
   [junit4]   2> 1366406 INFO  (closeThreadPool-7078-thread-1) [    ] o.a.s.s.SolrDispatchFilter |___/\___/_|_|    Start time: 2019-03-27T20:09:47.174614600Z
   [junit4]   2> 1366411 INFO  (zkConnectionManagerCallback-7099-thread-1) [    ] o.a.s.c.c.ConnectionManager zkClient has connected
   [junit4]   2> 1366412 INFO  (closeThreadPool-7078-thread-1) [    ] o.a.s.s.SolrDispatchFilter Loading solr.xml from SolrHome (not found in ZooKeeper)
   [junit4]   2> 1366412 INFO  (closeThreadPool-7078-thread-1) [    ] o.a.s.c.SolrXmlConfig Loading container configuration from C:\Users\jenkins\workspace\Lucene-Solr-master-Windows\solr\build\solr-core\test\J0\temp\solr.handler.TestSQLHandler_20D481020EF9F2E8-001\shard-2-001\solr.xml
   [junit4]   2> 1366415 INFO  (closeThreadPool-7078-thread-1) [    ] o.a.s.c.SolrXmlConfig Configuration parameter autoReplicaFailoverWorkLoopDelay is ignored
   [junit4]   2> 1366415 INFO  (closeThreadPool-7078-thread-1) [    ] o.a.s.c.SolrXmlConfig Configuration parameter autoReplicaFailoverBadNodeExpiration is ignored
   [junit4]   2> 1366416 INFO  (closeThreadPool-7078-thread-1) [    ] o.a.s.c.SolrXmlConfig MBean server found: com.sun.jmx.mbeanserver.JmxMBeanServer@786401ac, but no JMX reporters were configured - adding default JMX reporter.
   [junit4]   2> 1366585 INFO  (OverseerCollectionConfigSetProcessor-72137526869164036-127.0.0.1:53032_-n_0000000000) [n:127.0.0.1:53032_    ] o.a.s.c.OverseerTaskQueue Response ZK path: /overseer/collection-queue-work/qnr-0000000002 doesn't exist.  Requestor may have disconnected from ZooKeeper
   [junit4]   2> 1366588 INFO  (closeThreadPool-7078-thread-1) [    ] o.a.s.h.c.HttpShardHandlerFactory Host whitelist initialized: WhitelistHostChecker [whitelistHosts=null, whitelistHostCheckingEnabled=false]
   [junit4]   2> 1366596 WARN  (closeThreadPool-7078-thread-1) [    ] o.e.j.u.s.S.config No Client EndPointIdentificationAlgorithm configured for SslContextFactory@57e152fd[provider=null,keyStore=null,trustStore=null]
   [junit4]   2> 1366600 WARN  (closeThreadPool-7078-thread-1) [    ] o.e.j.u.s.S.config No Client EndPointIdentificationAlgorithm configured for SslContextFactory@61316155[provider=null,keyStore=null,trustStore=null]
   [junit4]   2> 1366602 INFO  (closeThreadPool-7078-thread-1) [    ] o.a.s.c.ZkContainer Zookeeper client=127.0.0.1:53020/solr
   [junit4]   2> 1366605 INFO  (zkConnectionManagerCallback-7106-thread-1) [    ] o.a.s.c.c.ConnectionManager zkClient has connected
   [junit4]   2> 1366606 WARN  (NIOServerCxn.Factory:0.0.0.0/0.0.0.0:0) [    ] o.a.z.s.NIOServerCnxn Unable to read additional data from client sessionid 0x10048b2d003000d, likely client has closed socket
   [junit4]   2> 1366610 INFO  (zkConne

[...truncated too long message...]

Test.testOverwriteOption
   [junit4] OK      3.21s J0 | CloudSolrClientTest.testCollectionDoesntExist
   [junit4] OK      8.62s J0 | CloudSolrClientTest.preferReplicaTypesTest
   [junit4] OK      2.50s J0 | CloudSolrClientTest.testWrongZkChrootTest
   [junit4] OK      5.70s J0 | CloudSolrClientTest.testInitializationWithSolrUrls
   [junit4] Completed [1/5] on J0 in 130.34s, 16 tests
   [junit4]
   [junit4] Suite: org.apache.solr.client.solrj.impl.CloudSolrClientTest
   [junit4] OK      12.1s J1 | CloudSolrClientTest.testShutdown
   [junit4] OK      10.5s J1 | CloudSolrClientTest.testParallelUpdateQTime
   [junit4] OK      6.69s J1 | CloudSolrClientTest.stateVersionParamTest
   [junit4] OK      9.40s J1 | CloudSolrClientTest.testNonRetryableRequests
   [junit4] OK      9.90s J1 | CloudSolrClientTest.checkCollectionParameters
   [junit4] OK      8.48s J1 | CloudSolrClientTest.testAliasHandling
   [junit4] OK      6.13s J1 | CloudSolrClientTest.testVersionsAreReturned
   [junit4] OK      13.2s J1 | CloudSolrClientTest.preferLocalShardsTest
   [junit4] OK      9.49s J1 | CloudSolrClientTest.testRetryUpdatesWhenClusterStateIsStale
   [junit4] OK      6.42s J1 | CloudSolrClientTest.testRouting
   [junit4] OK      2.75s J1 | CloudSolrClientTest.customHttpClientTest
   [junit4] OK      6.46s J1 | CloudSolrClientTest.testOverwriteOption
   [junit4] OK      2.16s J1 | CloudSolrClientTest.testCollectionDoesntExist
   [junit4] OK      10.9s J1 | CloudSolrClientTest.preferReplicaTypesTest
   [junit4] OK      2.56s J1 | CloudSolrClientTest.testWrongZkChrootTest
   [junit4] OK      5.57s J1 | CloudSolrClientTest.testInitializationWithSolrUrls
   [junit4] Completed [2/5] on J1 in 134.52s, 16 tests
   [junit4]
   [junit4] Suite: org.apache.solr.client.solrj.impl.CloudSolrClientTest
   [junit4] OK      3.95s J0 | CloudSolrClientTest.testShutdown
   [junit4] OK      5.48s J0 | CloudSolrClientTest.testParallelUpdateQTime
   [junit4] OK      5.20s J0 | CloudSolrClientTest.stateVersionParamTest
   [junit4] OK      6.98s J0 | CloudSolrClientTest.testNonRetryableRequests
   [junit4] OK      6.52s J0 | CloudSolrClientTest.checkCollectionParameters
   [junit4] OK      8.22s J0 | CloudSolrClientTest.testAliasHandling
   [junit4] OK      5.59s J0 | CloudSolrClientTest.testVersionsAreReturned
   [junit4] OK      9.25s J0 | CloudSolrClientTest.preferLocalShardsTest
   [junit4] OK      8.95s J0 | CloudSolrClientTest.testRetryUpdatesWhenClusterStateIsStale
   [junit4] OK      5.14s J0 | CloudSolrClientTest.testRouting
   [junit4] OK      2.09s J0 | CloudSolrClientTest.customHttpClientTest
   [junit4] OK      5.70s J0 | CloudSolrClientTest.testOverwriteOption
   [junit4] OK      2.08s J0 | CloudSolrClientTest.testCollectionDoesntExist
   [junit4] OK      9.48s J0 | CloudSolrClientTest.preferReplicaTypesTest
   [junit4] OK      2.15s J0 | CloudSolrClientTest.testWrongZkChrootTest
   [junit4] OK      5.00s J0 | CloudSolrClientTest.testInitializationWithSolrUrls
   [junit4] Completed [3/5] on J0 in 91.97s, 16 tests
   [junit4]
   [junit4] Suite: org.apache.solr.client.solrj.impl.CloudSolrClientTest
   [junit4] OK      4.09s J1 | CloudSolrClientTest.testShutdown
   [junit4] OK      4.53s J1 | CloudSolrClientTest.testParallelUpdateQTime
   [junit4] OK      4.73s J1 | CloudSolrClientTest.stateVersionParamTest
   [junit4] OK      7.06s J1 | CloudSolrClientTest.testNonRetryableRequests
   [junit4] OK      6.92s J1 | CloudSolrClientTest.checkCollectionParameters
   [junit4] OK      8.83s J1 | CloudSolrClientTest.testAliasHandling
   [junit4] OK      5.59s J1 | CloudSolrClientTest.testVersionsAreReturned
   [junit4] OK      7.86s J1 | CloudSolrClientTest.preferLocalShardsTest
   [junit4] OK      8.55s J1 | CloudSolrClientTest.testRetryUpdatesWhenClusterStateIsStale
   [junit4] OK      4.45s J1 | CloudSolrClientTest.testRouting
   [junit4] OK      3.05s J1 | CloudSolrClientTest.customHttpClientTest
   [junit4] OK      5.45s J1 | CloudSolrClientTest.testOverwriteOption
   [junit4] OK      2.19s J1 | CloudSolrClientTest.testCollectionDoesntExist
   [junit4] OK      11.6s J1 | CloudSolrClientTest.preferReplicaTypesTest
   [junit4] OK      2.49s J1 | CloudSolrClientTest.testWrongZkChrootTest
   [junit4] OK      5.16s J1 | CloudSolrClientTest.testInitializationWithSolrUrls
   [junit4] Completed [4/5] on J1 in 92.89s, 16 tests
   [junit4]
   [junit4] Suite: org.apache.solr.client.solrj.impl.CloudSolrClientTest
   [junit4] OK      3.80s J0 | CloudSolrClientTest.testShutdown
   [junit4] OK      5.13s J0 | CloudSolrClientTest.testParallelUpdateQTime
   [junit4] OK      4.80s J0 | CloudSolrClientTest.stateVersionParamTest
   [junit4] OK      6.92s J0 | CloudSolrClientTest.testNonRetryableRequests
   [junit4] OK      7.23s J0 | CloudSolrClientTest.checkCollectionParameters
   [junit4] OK      8.17s J0 | CloudSolrClientTest.testAliasHandling
   [junit4] OK      4.88s J0 | CloudSolrClientTest.testVersionsAreReturned
   [junit4] OK      9.60s J0 | CloudSolrClientTest.preferLocalShardsTest
   [junit4] OK      8.40s J0 | CloudSolrClientTest.testRetryUpdatesWhenClusterStateIsStale
   [junit4] OK      5.52s J0 | CloudSolrClientTest.testRouting
   [junit4] OK      2.89s J0 | CloudSolrClientTest.customHttpClientTest
   [junit4] OK      5.67s J0 | CloudSolrClientTest.testOverwriteOption
   [junit4] OK      2.55s J0 | CloudSolrClientTest.testCollectionDoesntExist
   [junit4] OK      8.64s J0 | CloudSolrClientTest.preferReplicaTypesTest
   [junit4] OK      2.27s J0 | CloudSolrClientTest.testWrongZkChrootTest
   [junit4] OK      4.59s J0 | CloudSolrClientTest.testInitializationWithSolrUrls
   [junit4] Completed [5/5] on J0 in 91.34s, 16 tests
   [junit4]
   [junit4] JVM J0:     2.00 ..   316.83 =   314.83s
   [junit4] JVM J1:     1.49 ..   230.27 =   228.78s
   [junit4] Execution time total: 5 minutes 16 seconds
   [junit4] Tests summary: 5 suites, 80 tests
   [junit4] Could not remove temporary path: C:\Users\jenkins\workspace\Lucene-Solr-master-Windows\solr\build\solr-solrj\test\J1 (java.nio.file.DirectoryNotEmptyException: Remaining files: [C:\Users\jenkins\workspace\Lucene-Solr-master-Windows\solr\build\solr-solrj\test\J1\temp])
   [junit4] Could not remove temporary path: C:\Users\jenkins\workspace\Lucene-Solr-master-Windows\solr\build\solr-solrj\test\J0 (java.nio.file.DirectoryNotEmptyException: Remaining files: [C:\Users\jenkins\workspace\Lucene-Solr-master-Windows\solr\build\solr-solrj\test\J0\temp])
     [echo] 5 slowest tests:
[junit4:tophints] 125.74s | org.apache.solr.client.solrj.impl.CloudSolrClientTest
[junit4:tophints]  93.84s | org.apache.solr.client.solrj.impl.CloudHttp2SolrClientTest
[junit4:tophints]  85.71s | org.apache.solr.client.solrj.io.stream.StreamDecoratorTest
[junit4:tophints]  52.42s | org.apache.solr.common.cloud.TestCollectionStateWatchers
[junit4:tophints]  49.80s | org.apache.solr.common.cloud.TestCloudCollectionsListeners

-check-totals:
WARNING: An illegal reflective access operation has occurred
WARNING: Illegal reflective access by org.codehaus.groovy.reflection.CachedClass (file:/C:/Users/jenkins/.ivy2/cache/org.codehaus.groovy/groovy-all/jars/groovy-all-2.4.15.jar) to method java.lang.Object.finalize()
WARNING: Please consider reporting this to the maintainers of org.codehaus.groovy.reflection.CachedClass
WARNING: Use --illegal-access=warn to enable warnings of further illegal reflective access operations
WARNING: All illegal access operations will be denied in a future release

test-nocompile:

BUILD SUCCESSFUL
Total time: 5 minutes 21 seconds
[repro] Failures:
[repro]   0/5 failed: org.apache.solr.client.solrj.impl.CloudSolrClientTest
[repro]   3/5 failed: org.apache.solr.handler.TestSQLHandler
[repro] Exiting with code 1

C:\Users\jenkins\workspace\Lucene-Solr-master-Windows>IF EXIST lucene\build move /y lucene\build lucene\build.repro
        1 dir(s) moved.

C:\Users\jenkins\workspace\Lucene-Solr-master-Windows>IF EXIST solr\build move /y solr\build solr\build.repro
        1 dir(s) moved.

C:\Users\jenkins\workspace\Lucene-Solr-master-Windows>IF EXIST lucene\build.orig move /y lucene\build.orig lucene\build
        1 dir(s) moved.

C:\Users\jenkins\workspace\Lucene-Solr-master-Windows>IF EXIST solr\build.orig move /y solr\build.orig solr\build
        1 dir(s) moved.

C:\Users\jenkins\workspace\Lucene-Solr-master-Windows>exit 0
Archiving artifacts
Setting ANT_1_8_2_HOME=C:\Users\jenkins\tools\hudson.tasks.Ant_AntInstallation\ANT_1.8.2
[WARNINGS] Parsing warnings in console log with parser Java Compiler (javac)
Setting ANT_1_8_2_HOME=C:\Users\jenkins\tools\hudson.tasks.Ant_AntInstallation\ANT_1.8.2
No credentials specified
Setting ANT_1_8_2_HOME=C:\Users\jenkins\tools\hudson.tasks.Ant_AntInstallation\ANT_1.8.2
<Git Blamer> Using GitBlamer to create author and commit information for all warnings.
<Git Blamer> GIT_COMMIT=7e834516104a2c3f68722ef08cc867a492119667, workspace=C:\Users\jenkins\workspace\Lucene-Solr-master-Windows
[WARNINGS] Computing warning deltas based on reference build #7840
Recording test results
Setting ANT_1_8_2_HOME=C:\Users\jenkins\tools\hudson.tasks.Ant_AntInstallation\ANT_1.8.2
Build step 'Publish JUnit test result report' changed build result to UNSTABLE
Email was triggered for: Unstable (Test Failures)
Sending email for trigger: Unstable (Test Failures)
Setting ANT_1_8_2_HOME=C:\Users\jenkins\tools\hudson.tasks.Ant_AntInstallation\ANT_1.8.2
Setting ANT_1_8_2_HOME=C:\Users\jenkins\tools\hudson.tasks.Ant_AntInstallation\ANT_1.8.2
Setting ANT_1_8_2_HOME=C:\Users\jenkins\tools\hudson.tasks.Ant_AntInstallation\ANT_1.8.2
Setting ANT_1_8_2_HOME=C:\Users\jenkins\tools\hudson.tasks.Ant_AntInstallation\ANT_1.8.2
Setting ANT_1_8_2_HOME=C:\Users\jenkins\tools\hudson.tasks.Ant_AntInstallation\ANT_1.8.2
Setting ANT_1_8_2_HOME=C:\Users\jenkins\tools\hudson.tasks.Ant_AntInstallation\ANT_1.8.2


---------------------------------------------------------------------
To unsubscribe, e-mail: [hidden email]
For additional commands, e-mail: [hidden email]
Reply | Threaded
Open this post in threaded view
|

Re: [JENKINS] Lucene-Solr-master-Windows (64bit/jdk-9.0.4) - Build # 7841 - Unstable!

Joel Bernstein
A fix was committed for this earlier today, but this test was run on the prior version of TestSQLHandler.  




On Wed, Mar 27, 2019 at 5:45 PM Policeman Jenkins Server <[hidden email]> wrote:
Build: https://jenkins.thetaphi.de/job/Lucene-Solr-master-Windows/7841/
Java: 64bit/jdk-9.0.4 -XX:+UseCompressedOops -XX:+UseParallelGC

5 tests failed.
FAILED:  org.apache.solr.handler.TestSQLHandler.doTest

Error Message:
--> http://127.0.0.1:56660/collection1_shard2_replica_n2:Failed to execute sqlQuery 'select id, field_i, str_s, field_i_p, field_f_p, field_d_p, field_l_p from collection1 where (text='(XXXX)' OR text='XXXX') AND text='XXXX' order by field_i desc' against JDBC connection 'jdbc:calcitesolr:'. Error while executing SQL "select id, field_i, str_s, field_i_p, field_f_p, field_d_p, field_l_p from collection1 where (text='(XXXX)' OR text='XXXX') AND text='XXXX' order by field_i desc": java.io.IOException: java.util.concurrent.ExecutionException: java.io.IOException: --> http://127.0.0.1:56710/collection1_shard2_replica_n5/:id{type=string,properties=indexed,stored,sortMissingLast,uninvertible} must have DocValues to use this feature.

Stack Trace:
java.io.IOException: --> http://127.0.0.1:56660/collection1_shard2_replica_n2:Failed to execute sqlQuery 'select id, field_i, str_s, field_i_p, field_f_p, field_d_p, field_l_p from collection1 where (text='(XXXX)' OR text='XXXX') AND text='XXXX' order by field_i desc' against JDBC connection 'jdbc:calcitesolr:'.
Error while executing SQL "select id, field_i, str_s, field_i_p, field_f_p, field_d_p, field_l_p from collection1 where (text='(XXXX)' OR text='XXXX') AND text='XXXX' order by field_i desc": java.io.IOException: java.util.concurrent.ExecutionException: java.io.IOException: --> http://127.0.0.1:56710/collection1_shard2_replica_n5/:id{type=string,properties=indexed,stored,sortMissingLast,uninvertible} must have DocValues to use this feature.
        at __randomizedtesting.SeedInfo.seed([20D481020EF9F2E8:879039A66342E151]:0)
        at org.apache.solr.client.solrj.io.stream.SolrStream.read(SolrStream.java:215)
        at org.apache.solr.handler.TestSQLHandler.getTuples(TestSQLHandler.java:2517)
        at org.apache.solr.handler.TestSQLHandler.testBasicSelect(TestSQLHandler.java:148)
        at org.apache.solr.handler.TestSQLHandler.doTest(TestSQLHandler.java:99)
        at java.base/jdk.internal.reflect.NativeMethodAccessorImpl.invoke0(Native Method)
        at java.base/jdk.internal.reflect.NativeMethodAccessorImpl.invoke(NativeMethodAccessorImpl.java:62)
        at java.base/jdk.internal.reflect.DelegatingMethodAccessorImpl.invoke(DelegatingMethodAccessorImpl.java:43)
        at java.base/java.lang.reflect.Method.invoke(Method.java:564)
        at com.carrotsearch.randomizedtesting.RandomizedRunner.invoke(RandomizedRunner.java:1750)
        at com.carrotsearch.randomizedtesting.RandomizedRunner$8.evaluate(RandomizedRunner.java:938)
        at com.carrotsearch.randomizedtesting.RandomizedRunner$9.evaluate(RandomizedRunner.java:974)
        at com.carrotsearch.randomizedtesting.RandomizedRunner$10.evaluate(RandomizedRunner.java:988)
        at org.apache.solr.BaseDistributedSearchTestCase$ShardsRepeatRule$ShardsFixedStatement.callStatement(BaseDistributedSearchTestCase.java:1082)
        at org.apache.solr.BaseDistributedSearchTestCase$ShardsRepeatRule$ShardsStatement.evaluate(BaseDistributedSearchTestCase.java:1054)
        at com.carrotsearch.randomizedtesting.rules.SystemPropertiesRestoreRule$1.evaluate(SystemPropertiesRestoreRule.java:57)
        at org.apache.lucene.util.TestRuleSetupTeardownChained$1.evaluate(TestRuleSetupTeardownChained.java:49)
        at org.apache.lucene.util.AbstractBeforeAfterRule$1.evaluate(AbstractBeforeAfterRule.java:45)
        at org.apache.lucene.util.TestRuleThreadAndTestName$1.evaluate(TestRuleThreadAndTestName.java:48)
        at org.apache.lucene.util.TestRuleIgnoreAfterMaxFailures$1.evaluate(TestRuleIgnoreAfterMaxFailures.java:64)
        at org.apache.lucene.util.TestRuleMarkFailure$1.evaluate(TestRuleMarkFailure.java:47)
        at com.carrotsearch.randomizedtesting.rules.StatementAdapter.evaluate(StatementAdapter.java:36)
        at com.carrotsearch.randomizedtesting.ThreadLeakControl$StatementRunner.run(ThreadLeakControl.java:368)
        at com.carrotsearch.randomizedtesting.ThreadLeakControl.forkTimeoutingTask(ThreadLeakControl.java:817)
        at com.carrotsearch.randomizedtesting.ThreadLeakControl$3.evaluate(ThreadLeakControl.java:468)
        at com.carrotsearch.randomizedtesting.RandomizedRunner.runSingleTest(RandomizedRunner.java:947)
        at com.carrotsearch.randomizedtesting.RandomizedRunner$5.evaluate(RandomizedRunner.java:832)
        at com.carrotsearch.randomizedtesting.RandomizedRunner$6.evaluate(RandomizedRunner.java:883)
        at com.carrotsearch.randomizedtesting.RandomizedRunner$7.evaluate(RandomizedRunner.java:894)
        at com.carrotsearch.randomizedtesting.rules.StatementAdapter.evaluate(StatementAdapter.java:36)
        at com.carrotsearch.randomizedtesting.rules.SystemPropertiesRestoreRule$1.evaluate(SystemPropertiesRestoreRule.java:57)
        at org.apache.lucene.util.AbstractBeforeAfterRule$1.evaluate(AbstractBeforeAfterRule.java:45)
        at com.carrotsearch.randomizedtesting.rules.StatementAdapter.evaluate(StatementAdapter.java:36)
        at org.apache.lucene.util.TestRuleStoreClassName$1.evaluate(TestRuleStoreClassName.java:41)
        at com.carrotsearch.randomizedtesting.rules.NoShadowingOrOverridesOnMethodsRule$1.evaluate(NoShadowingOrOverridesOnMethodsRule.java:40)
        at com.carrotsearch.randomizedtesting.rules.NoShadowingOrOverridesOnMethodsRule$1.evaluate(NoShadowingOrOverridesOnMethodsRule.java:40)
        at com.carrotsearch.randomizedtesting.rules.StatementAdapter.evaluate(StatementAdapter.java:36)
        at com.carrotsearch.randomizedtesting.rules.StatementAdapter.evaluate(StatementAdapter.java:36)
        at org.apache.lucene.util.TestRuleAssertionsRequired$1.evaluate(TestRuleAssertionsRequired.java:53)
        at org.apache.lucene.util.TestRuleMarkFailure$1.evaluate(TestRuleMarkFailure.java:47)
        at org.apache.lucene.util.TestRuleIgnoreAfterMaxFailures$1.evaluate(TestRuleIgnoreAfterMaxFailures.java:64)
        at org.apache.lucene.util.TestRuleIgnoreTestSuites$1.evaluate(TestRuleIgnoreTestSuites.java:54)
        at com.carrotsearch.randomizedtesting.rules.StatementAdapter.evaluate(StatementAdapter.java:36)
        at com.carrotsearch.randomizedtesting.ThreadLeakControl$StatementRunner.run(ThreadLeakControl.java:368)
        at java.base/java.lang.Thread.run(Thread.java:844)


FAILED:  org.apache.solr.handler.TestSQLHandler.doTest

Error Message:
--> http://127.0.0.1:56687/collection1_shard2_replica_n2:Failed to execute sqlQuery 'select id, field_i, str_s, field_i_p, field_f_p, field_d_p, field_l_p from collection1 where (text='(XXXX)' OR text='XXXX') AND text='XXXX' order by field_i desc' against JDBC connection 'jdbc:calcitesolr:'. Error while executing SQL "select id, field_i, str_s, field_i_p, field_f_p, field_d_p, field_l_p from collection1 where (text='(XXXX)' OR text='XXXX') AND text='XXXX' order by field_i desc": java.io.IOException: java.util.concurrent.ExecutionException: java.io.IOException: --> http://127.0.0.1:56687/collection1_shard2_replica_n2/:id{type=string,properties=indexed,stored,sortMissingLast,uninvertible} must have DocValues to use this feature.

Stack Trace:
java.io.IOException: --> http://127.0.0.1:56687/collection1_shard2_replica_n2:Failed to execute sqlQuery 'select id, field_i, str_s, field_i_p, field_f_p, field_d_p, field_l_p from collection1 where (text='(XXXX)' OR text='XXXX') AND text='XXXX' order by field_i desc' against JDBC connection 'jdbc:calcitesolr:'.
Error while executing SQL "select id, field_i, str_s, field_i_p, field_f_p, field_d_p, field_l_p from collection1 where (text='(XXXX)' OR text='XXXX') AND text='XXXX' order by field_i desc": java.io.IOException: java.util.concurrent.ExecutionException: java.io.IOException: --> http://127.0.0.1:56687/collection1_shard2_replica_n2/:id{type=string,properties=indexed,stored,sortMissingLast,uninvertible} must have DocValues to use this feature.
        at __randomizedtesting.SeedInfo.seed([20D481020EF9F2E8:879039A66342E151]:0)
        at org.apache.solr.client.solrj.io.stream.SolrStream.read(SolrStream.java:215)
        at org.apache.solr.handler.TestSQLHandler.getTuples(TestSQLHandler.java:2517)
        at org.apache.solr.handler.TestSQLHandler.testBasicSelect(TestSQLHandler.java:148)
        at org.apache.solr.handler.TestSQLHandler.doTest(TestSQLHandler.java:99)
        at java.base/jdk.internal.reflect.NativeMethodAccessorImpl.invoke0(Native Method)
        at java.base/jdk.internal.reflect.NativeMethodAccessorImpl.invoke(NativeMethodAccessorImpl.java:62)
        at java.base/jdk.internal.reflect.DelegatingMethodAccessorImpl.invoke(DelegatingMethodAccessorImpl.java:43)
        at java.base/java.lang.reflect.Method.invoke(Method.java:564)
        at com.carrotsearch.randomizedtesting.RandomizedRunner.invoke(RandomizedRunner.java:1750)
        at com.carrotsearch.randomizedtesting.RandomizedRunner$8.evaluate(RandomizedRunner.java:938)
        at com.carrotsearch.randomizedtesting.RandomizedRunner$9.evaluate(RandomizedRunner.java:974)
        at com.carrotsearch.randomizedtesting.RandomizedRunner$10.evaluate(RandomizedRunner.java:988)
        at org.apache.solr.BaseDistributedSearchTestCase$ShardsRepeatRule$ShardsFixedStatement.callStatement(BaseDistributedSearchTestCase.java:1082)
        at org.apache.solr.BaseDistributedSearchTestCase$ShardsRepeatRule$ShardsStatement.evaluate(BaseDistributedSearchTestCase.java:1054)
        at com.carrotsearch.randomizedtesting.rules.SystemPropertiesRestoreRule$1.evaluate(SystemPropertiesRestoreRule.java:57)
        at org.apache.lucene.util.TestRuleSetupTeardownChained$1.evaluate(TestRuleSetupTeardownChained.java:49)
        at org.apache.lucene.util.AbstractBeforeAfterRule$1.evaluate(AbstractBeforeAfterRule.java:45)
        at org.apache.lucene.util.TestRuleThreadAndTestName$1.evaluate(TestRuleThreadAndTestName.java:48)
        at org.apache.lucene.util.TestRuleIgnoreAfterMaxFailures$1.evaluate(TestRuleIgnoreAfterMaxFailures.java:64)
        at org.apache.lucene.util.TestRuleMarkFailure$1.evaluate(TestRuleMarkFailure.java:47)
        at com.carrotsearch.randomizedtesting.rules.StatementAdapter.evaluate(StatementAdapter.java:36)
        at com.carrotsearch.randomizedtesting.ThreadLeakControl$StatementRunner.run(ThreadLeakControl.java:368)
        at com.carrotsearch.randomizedtesting.ThreadLeakControl.forkTimeoutingTask(ThreadLeakControl.java:817)
        at com.carrotsearch.randomizedtesting.ThreadLeakControl$3.evaluate(ThreadLeakControl.java:468)
        at com.carrotsearch.randomizedtesting.RandomizedRunner.runSingleTest(RandomizedRunner.java:947)
        at com.carrotsearch.randomizedtesting.RandomizedRunner$5.evaluate(RandomizedRunner.java:832)
        at com.carrotsearch.randomizedtesting.RandomizedRunner$6.evaluate(RandomizedRunner.java:883)
        at com.carrotsearch.randomizedtesting.RandomizedRunner$7.evaluate(RandomizedRunner.java:894)
        at com.carrotsearch.randomizedtesting.rules.StatementAdapter.evaluate(StatementAdapter.java:36)
        at com.carrotsearch.randomizedtesting.rules.SystemPropertiesRestoreRule$1.evaluate(SystemPropertiesRestoreRule.java:57)
        at org.apache.lucene.util.AbstractBeforeAfterRule$1.evaluate(AbstractBeforeAfterRule.java:45)
        at com.carrotsearch.randomizedtesting.rules.StatementAdapter.evaluate(StatementAdapter.java:36)
        at org.apache.lucene.util.TestRuleStoreClassName$1.evaluate(TestRuleStoreClassName.java:41)
        at com.carrotsearch.randomizedtesting.rules.NoShadowingOrOverridesOnMethodsRule$1.evaluate(NoShadowingOrOverridesOnMethodsRule.java:40)
        at com.carrotsearch.randomizedtesting.rules.NoShadowingOrOverridesOnMethodsRule$1.evaluate(NoShadowingOrOverridesOnMethodsRule.java:40)
        at com.carrotsearch.randomizedtesting.rules.StatementAdapter.evaluate(StatementAdapter.java:36)
        at com.carrotsearch.randomizedtesting.rules.StatementAdapter.evaluate(StatementAdapter.java:36)
        at org.apache.lucene.util.TestRuleAssertionsRequired$1.evaluate(TestRuleAssertionsRequired.java:53)
        at org.apache.lucene.util.TestRuleMarkFailure$1.evaluate(TestRuleMarkFailure.java:47)
        at org.apache.lucene.util.TestRuleIgnoreAfterMaxFailures$1.evaluate(TestRuleIgnoreAfterMaxFailures.java:64)
        at org.apache.lucene.util.TestRuleIgnoreTestSuites$1.evaluate(TestRuleIgnoreTestSuites.java:54)
        at com.carrotsearch.randomizedtesting.rules.StatementAdapter.evaluate(StatementAdapter.java:36)
        at com.carrotsearch.randomizedtesting.ThreadLeakControl$StatementRunner.run(ThreadLeakControl.java:368)
        at java.base/java.lang.Thread.run(Thread.java:844)


FAILED:  org.apache.solr.handler.TestSQLHandler.doTest

Error Message:
--> http://127.0.0.1:56996/collection1_shard2_replica_n2:Failed to execute sqlQuery 'select id, field_i, str_s, field_i_p, field_f_p, field_d_p, field_l_p from collection1 where (text='(XXXX)' OR text='XXXX') AND text='XXXX' order by field_i desc' against JDBC connection 'jdbc:calcitesolr:'. Error while executing SQL "select id, field_i, str_s, field_i_p, field_f_p, field_d_p, field_l_p from collection1 where (text='(XXXX)' OR text='XXXX') AND text='XXXX' order by field_i desc": java.io.IOException: java.util.concurrent.ExecutionException: java.io.IOException: --> http://127.0.0.1:56996/collection1_shard2_replica_n2/:id{type=string,properties=indexed,stored,sortMissingLast,uninvertible} must have DocValues to use this feature.

Stack Trace:
java.io.IOException: --> http://127.0.0.1:56996/collection1_shard2_replica_n2:Failed to execute sqlQuery 'select id, field_i, str_s, field_i_p, field_f_p, field_d_p, field_l_p from collection1 where (text='(XXXX)' OR text='XXXX') AND text='XXXX' order by field_i desc' against JDBC connection 'jdbc:calcitesolr:'.
Error while executing SQL "select id, field_i, str_s, field_i_p, field_f_p, field_d_p, field_l_p from collection1 where (text='(XXXX)' OR text='XXXX') AND text='XXXX' order by field_i desc": java.io.IOException: java.util.concurrent.ExecutionException: java.io.IOException: --> http://127.0.0.1:56996/collection1_shard2_replica_n2/:id{type=string,properties=indexed,stored,sortMissingLast,uninvertible} must have DocValues to use this feature.
        at __randomizedtesting.SeedInfo.seed([20D481020EF9F2E8:879039A66342E151]:0)
        at org.apache.solr.client.solrj.io.stream.SolrStream.read(SolrStream.java:215)
        at org.apache.solr.handler.TestSQLHandler.getTuples(TestSQLHandler.java:2517)
        at org.apache.solr.handler.TestSQLHandler.testBasicSelect(TestSQLHandler.java:148)
        at org.apache.solr.handler.TestSQLHandler.doTest(TestSQLHandler.java:99)
        at java.base/jdk.internal.reflect.NativeMethodAccessorImpl.invoke0(Native Method)
        at java.base/jdk.internal.reflect.NativeMethodAccessorImpl.invoke(NativeMethodAccessorImpl.java:62)
        at java.base/jdk.internal.reflect.DelegatingMethodAccessorImpl.invoke(DelegatingMethodAccessorImpl.java:43)
        at java.base/java.lang.reflect.Method.invoke(Method.java:564)
        at com.carrotsearch.randomizedtesting.RandomizedRunner.invoke(RandomizedRunner.java:1750)
        at com.carrotsearch.randomizedtesting.RandomizedRunner$8.evaluate(RandomizedRunner.java:938)
        at com.carrotsearch.randomizedtesting.RandomizedRunner$9.evaluate(RandomizedRunner.java:974)
        at com.carrotsearch.randomizedtesting.RandomizedRunner$10.evaluate(RandomizedRunner.java:988)
        at org.apache.solr.BaseDistributedSearchTestCase$ShardsRepeatRule$ShardsFixedStatement.callStatement(BaseDistributedSearchTestCase.java:1082)
        at org.apache.solr.BaseDistributedSearchTestCase$ShardsRepeatRule$ShardsStatement.evaluate(BaseDistributedSearchTestCase.java:1054)
        at com.carrotsearch.randomizedtesting.rules.SystemPropertiesRestoreRule$1.evaluate(SystemPropertiesRestoreRule.java:57)
        at org.apache.lucene.util.TestRuleSetupTeardownChained$1.evaluate(TestRuleSetupTeardownChained.java:49)
        at org.apache.lucene.util.AbstractBeforeAfterRule$1.evaluate(AbstractBeforeAfterRule.java:45)
        at org.apache.lucene.util.TestRuleThreadAndTestName$1.evaluate(TestRuleThreadAndTestName.java:48)
        at org.apache.lucene.util.TestRuleIgnoreAfterMaxFailures$1.evaluate(TestRuleIgnoreAfterMaxFailures.java:64)
        at org.apache.lucene.util.TestRuleMarkFailure$1.evaluate(TestRuleMarkFailure.java:47)
        at com.carrotsearch.randomizedtesting.rules.StatementAdapter.evaluate(StatementAdapter.java:36)
        at com.carrotsearch.randomizedtesting.ThreadLeakControl$StatementRunner.run(ThreadLeakControl.java:368)
        at com.carrotsearch.randomizedtesting.ThreadLeakControl.forkTimeoutingTask(ThreadLeakControl.java:817)
        at com.carrotsearch.randomizedtesting.ThreadLeakControl$3.evaluate(ThreadLeakControl.java:468)
        at com.carrotsearch.randomizedtesting.RandomizedRunner.runSingleTest(RandomizedRunner.java:947)
        at com.carrotsearch.randomizedtesting.RandomizedRunner$5.evaluate(RandomizedRunner.java:832)
        at com.carrotsearch.randomizedtesting.RandomizedRunner$6.evaluate(RandomizedRunner.java:883)
        at com.carrotsearch.randomizedtesting.RandomizedRunner$7.evaluate(RandomizedRunner.java:894)
        at com.carrotsearch.randomizedtesting.rules.StatementAdapter.evaluate(StatementAdapter.java:36)
        at com.carrotsearch.randomizedtesting.rules.SystemPropertiesRestoreRule$1.evaluate(SystemPropertiesRestoreRule.java:57)
        at org.apache.lucene.util.AbstractBeforeAfterRule$1.evaluate(AbstractBeforeAfterRule.java:45)
        at com.carrotsearch.randomizedtesting.rules.StatementAdapter.evaluate(StatementAdapter.java:36)
        at org.apache.lucene.util.TestRuleStoreClassName$1.evaluate(TestRuleStoreClassName.java:41)
        at com.carrotsearch.randomizedtesting.rules.NoShadowingOrOverridesOnMethodsRule$1.evaluate(NoShadowingOrOverridesOnMethodsRule.java:40)
        at com.carrotsearch.randomizedtesting.rules.NoShadowingOrOverridesOnMethodsRule$1.evaluate(NoShadowingOrOverridesOnMethodsRule.java:40)
        at com.carrotsearch.randomizedtesting.rules.StatementAdapter.evaluate(StatementAdapter.java:36)
        at com.carrotsearch.randomizedtesting.rules.StatementAdapter.evaluate(StatementAdapter.java:36)
        at org.apache.lucene.util.TestRuleAssertionsRequired$1.evaluate(TestRuleAssertionsRequired.java:53)
        at org.apache.lucene.util.TestRuleMarkFailure$1.evaluate(TestRuleMarkFailure.java:47)
        at org.apache.lucene.util.TestRuleIgnoreAfterMaxFailures$1.evaluate(TestRuleIgnoreAfterMaxFailures.java:64)
        at org.apache.lucene.util.TestRuleIgnoreTestSuites$1.evaluate(TestRuleIgnoreTestSuites.java:54)
        at com.carrotsearch.randomizedtesting.rules.StatementAdapter.evaluate(StatementAdapter.java:36)
        at com.carrotsearch.randomizedtesting.ThreadLeakControl$StatementRunner.run(ThreadLeakControl.java:368)
        at java.base/java.lang.Thread.run(Thread.java:844)


FAILED:  org.apache.solr.handler.TestSQLHandler.doTest

Error Message:


Stack Trace:
java.lang.AssertionError
        at __randomizedtesting.SeedInfo.seed([20D481020EF9F2E8:879039A66342E151]:0)
        at org.apache.solr.handler.TestSQLHandler.testBasicSelect(TestSQLHandler.java:238)
        at org.apache.solr.handler.TestSQLHandler.doTest(TestSQLHandler.java:99)
        at java.base/jdk.internal.reflect.NativeMethodAccessorImpl.invoke0(Native Method)
        at java.base/jdk.internal.reflect.NativeMethodAccessorImpl.invoke(NativeMethodAccessorImpl.java:62)
        at java.base/jdk.internal.reflect.DelegatingMethodAccessorImpl.invoke(DelegatingMethodAccessorImpl.java:43)
        at java.base/java.lang.reflect.Method.invoke(Method.java:564)
        at com.carrotsearch.randomizedtesting.RandomizedRunner.invoke(RandomizedRunner.java:1750)
        at com.carrotsearch.randomizedtesting.RandomizedRunner$8.evaluate(RandomizedRunner.java:938)
        at com.carrotsearch.randomizedtesting.RandomizedRunner$9.evaluate(RandomizedRunner.java:974)
        at com.carrotsearch.randomizedtesting.RandomizedRunner$10.evaluate(RandomizedRunner.java:988)
        at org.apache.solr.BaseDistributedSearchTestCase$ShardsRepeatRule$ShardsFixedStatement.callStatement(BaseDistributedSearchTestCase.java:1082)
        at org.apache.solr.BaseDistributedSearchTestCase$ShardsRepeatRule$ShardsStatement.evaluate(BaseDistributedSearchTestCase.java:1054)
        at com.carrotsearch.randomizedtesting.rules.SystemPropertiesRestoreRule$1.evaluate(SystemPropertiesRestoreRule.java:57)
        at org.apache.lucene.util.TestRuleSetupTeardownChained$1.evaluate(TestRuleSetupTeardownChained.java:49)
        at org.apache.lucene.util.AbstractBeforeAfterRule$1.evaluate(AbstractBeforeAfterRule.java:45)
        at org.apache.lucene.util.TestRuleThreadAndTestName$1.evaluate(TestRuleThreadAndTestName.java:48)
        at org.apache.lucene.util.TestRuleIgnoreAfterMaxFailures$1.evaluate(TestRuleIgnoreAfterMaxFailures.java:64)
        at org.apache.lucene.util.TestRuleMarkFailure$1.evaluate(TestRuleMarkFailure.java:47)
        at com.carrotsearch.randomizedtesting.rules.StatementAdapter.evaluate(StatementAdapter.java:36)
        at com.carrotsearch.randomizedtesting.ThreadLeakControl$StatementRunner.run(ThreadLeakControl.java:368)
        at com.carrotsearch.randomizedtesting.ThreadLeakControl.forkTimeoutingTask(ThreadLeakControl.java:817)
        at com.carrotsearch.randomizedtesting.ThreadLeakControl$3.evaluate(ThreadLeakControl.java:468)
        at com.carrotsearch.randomizedtesting.RandomizedRunner.runSingleTest(RandomizedRunner.java:947)
        at com.carrotsearch.randomizedtesting.RandomizedRunner$5.evaluate(RandomizedRunner.java:832)
        at com.carrotsearch.randomizedtesting.RandomizedRunner$6.evaluate(RandomizedRunner.java:883)
        at com.carrotsearch.randomizedtesting.RandomizedRunner$7.evaluate(RandomizedRunner.java:894)
        at com.carrotsearch.randomizedtesting.rules.StatementAdapter.evaluate(StatementAdapter.java:36)
        at com.carrotsearch.randomizedtesting.rules.SystemPropertiesRestoreRule$1.evaluate(SystemPropertiesRestoreRule.java:57)
        at org.apache.lucene.util.AbstractBeforeAfterRule$1.evaluate(AbstractBeforeAfterRule.java:45)
        at com.carrotsearch.randomizedtesting.rules.StatementAdapter.evaluate(StatementAdapter.java:36)
        at org.apache.lucene.util.TestRuleStoreClassName$1.evaluate(TestRuleStoreClassName.java:41)
        at com.carrotsearch.randomizedtesting.rules.NoShadowingOrOverridesOnMethodsRule$1.evaluate(NoShadowingOrOverridesOnMethodsRule.java:40)
        at com.carrotsearch.randomizedtesting.rules.NoShadowingOrOverridesOnMethodsRule$1.evaluate(NoShadowingOrOverridesOnMethodsRule.java:40)
        at com.carrotsearch.randomizedtesting.rules.StatementAdapter.evaluate(StatementAdapter.java:36)
        at com.carrotsearch.randomizedtesting.rules.StatementAdapter.evaluate(StatementAdapter.java:36)
        at org.apache.lucene.util.TestRuleAssertionsRequired$1.evaluate(TestRuleAssertionsRequired.java:53)
        at org.apache.lucene.util.TestRuleMarkFailure$1.evaluate(TestRuleMarkFailure.java:47)
        at org.apache.lucene.util.TestRuleIgnoreAfterMaxFailures$1.evaluate(TestRuleIgnoreAfterMaxFailures.java:64)
        at org.apache.lucene.util.TestRuleIgnoreTestSuites$1.evaluate(TestRuleIgnoreTestSuites.java:54)
        at com.carrotsearch.randomizedtesting.rules.StatementAdapter.evaluate(StatementAdapter.java:36)
        at com.carrotsearch.randomizedtesting.ThreadLeakControl$StatementRunner.run(ThreadLeakControl.java:368)
        at java.base/java.lang.Thread.run(Thread.java:844)


FAILED:  junit.framework.TestSuite.org.apache.solr.client.solrj.impl.CloudSolrClientTest

Error Message:
ObjectTracker found 4 object(s) that were not released!!! [MockDirectoryWrapper, MockDirectoryWrapper, MockDirectoryWrapper, SolrCore] org.apache.solr.common.util.ObjectReleaseTracker$ObjectTrackerException: org.apache.lucene.store.MockDirectoryWrapper  at org.apache.solr.common.util.ObjectReleaseTracker.track(ObjectReleaseTracker.java:42)  at org.apache.solr.core.CachingDirectoryFactory.get(CachingDirectoryFactory.java:348)  at org.apache.solr.update.SolrIndexWriter.create(SolrIndexWriter.java:99)  at org.apache.solr.core.SolrCore.initIndex(SolrCore.java:779)  at org.apache.solr.core.SolrCore.<init>(SolrCore.java:976)  at org.apache.solr.core.SolrCore.<init>(SolrCore.java:883)  at org.apache.solr.core.CoreContainer.createFromDescriptor(CoreContainer.java:1193)  at org.apache.solr.core.CoreContainer.create(CoreContainer.java:1103)  at org.apache.solr.handler.admin.CoreAdminOperation.lambda$static$0(CoreAdminOperation.java:92)  at org.apache.solr.handler.admin.CoreAdminOperation.execute(CoreAdminOperation.java:360)  at org.apache.solr.handler.admin.CoreAdminHandler$CallInfo.call(CoreAdminHandler.java:396)  at org.apache.solr.handler.admin.CoreAdminHandler.lambda$handleRequestBody$0(CoreAdminHandler.java:188)  at com.codahale.metrics.InstrumentedExecutorService$InstrumentedRunnable.run(InstrumentedExecutorService.java:176)  at org.apache.solr.common.util.ExecutorUtil$MDCAwareThreadPoolExecutor.lambda$execute$0(ExecutorUtil.java:209)  at java.base/java.util.concurrent.ThreadPoolExecutor.runWorker(ThreadPoolExecutor.java:1167)  at java.base/java.util.concurrent.ThreadPoolExecutor$Worker.run(ThreadPoolExecutor.java:641)  at java.base/java.lang.Thread.run(Thread.java:844)  org.apache.solr.common.util.ObjectReleaseTracker$ObjectTrackerException: org.apache.lucene.store.MockDirectoryWrapper  at org.apache.solr.common.util.ObjectReleaseTracker.track(ObjectReleaseTracker.java:42)  at org.apache.solr.core.CachingDirectoryFactory.get(CachingDirectoryFactory.java:348)  at org.apache.solr.handler.IndexFetcher.fetchLatestIndex(IndexFetcher.java:509)  at org.apache.solr.handler.IndexFetcher.fetchLatestIndex(IndexFetcher.java:351)  at org.apache.solr.handler.ReplicationHandler.doFetch(ReplicationHandler.java:422)  at org.apache.solr.handler.ReplicationHandler.lambda$setupPolling$13(ReplicationHandler.java:1191)  at java.base/java.util.concurrent.Executors$RunnableAdapter.call(Executors.java:514)  at java.base/java.util.concurrent.FutureTask.runAndReset(FutureTask.java:305)  at java.base/java.util.concurrent.ScheduledThreadPoolExecutor$ScheduledFutureTask.run(ScheduledThreadPoolExecutor.java:300)  at java.base/java.util.concurrent.ThreadPoolExecutor.runWorker(ThreadPoolExecutor.java:1167)  at java.base/java.util.concurrent.ThreadPoolExecutor$Worker.run(ThreadPoolExecutor.java:641)  at java.base/java.lang.Thread.run(Thread.java:844)  org.apache.solr.common.util.ObjectReleaseTracker$ObjectTrackerException: org.apache.lucene.store.MockDirectoryWrapper  at org.apache.solr.common.util.ObjectReleaseTracker.track(ObjectReleaseTracker.java:42)  at org.apache.solr.core.CachingDirectoryFactory.get(CachingDirectoryFactory.java:348)  at org.apache.solr.core.SolrCore.initSnapshotMetaDataManager(SolrCore.java:517)  at org.apache.solr.core.SolrCore.<init>(SolrCore.java:968)  at org.apache.solr.core.SolrCore.<init>(SolrCore.java:883)  at org.apache.solr.core.CoreContainer.createFromDescriptor(CoreContainer.java:1193)  at org.apache.solr.core.CoreContainer.create(CoreContainer.java:1103)  at org.apache.solr.handler.admin.CoreAdminOperation.lambda$static$0(CoreAdminOperation.java:92)  at org.apache.solr.handler.admin.CoreAdminOperation.execute(CoreAdminOperation.java:360)  at org.apache.solr.handler.admin.CoreAdminHandler$CallInfo.call(CoreAdminHandler.java:396)  at org.apache.solr.handler.admin.CoreAdminHandler.lambda$handleRequestBody$0(CoreAdminHandler.java:188)  at com.codahale.metrics.InstrumentedExecutorService$InstrumentedRunnable.run(InstrumentedExecutorService.java:176)  at org.apache.solr.common.util.ExecutorUtil$MDCAwareThreadPoolExecutor.lambda$execute$0(ExecutorUtil.java:209)  at java.base/java.util.concurrent.ThreadPoolExecutor.runWorker(ThreadPoolExecutor.java:1167)  at java.base/java.util.concurrent.ThreadPoolExecutor$Worker.run(ThreadPoolExecutor.java:641)  at java.base/java.lang.Thread.run(Thread.java:844)  org.apache.solr.common.util.ObjectReleaseTracker$ObjectTrackerException: org.apache.solr.core.SolrCore  at org.apache.solr.common.util.ObjectReleaseTracker.track(ObjectReleaseTracker.java:42)  at org.apache.solr.core.SolrCore.<init>(SolrCore.java:1063)  at org.apache.solr.core.SolrCore.<init>(SolrCore.java:883)  at org.apache.solr.core.CoreContainer.createFromDescriptor(CoreContainer.java:1193)  at org.apache.solr.core.CoreContainer.create(CoreContainer.java:1103)  at org.apache.solr.handler.admin.CoreAdminOperation.lambda$static$0(CoreAdminOperation.java:92)  at org.apache.solr.handler.admin.CoreAdminOperation.execute(CoreAdminOperation.java:360)  at org.apache.solr.handler.admin.CoreAdminHandler$CallInfo.call(CoreAdminHandler.java:396)  at org.apache.solr.handler.admin.CoreAdminHandler.lambda$handleRequestBody$0(CoreAdminHandler.java:188)  at com.codahale.metrics.InstrumentedExecutorService$InstrumentedRunnable.run(InstrumentedExecutorService.java:176)  at org.apache.solr.common.util.ExecutorUtil$MDCAwareThreadPoolExecutor.lambda$execute$0(ExecutorUtil.java:209)  at java.base/java.util.concurrent.ThreadPoolExecutor.runWorker(ThreadPoolExecutor.java:1167)  at java.base/java.util.concurrent.ThreadPoolExecutor$Worker.run(ThreadPoolExecutor.java:641)  at java.base/java.lang.Thread.run(Thread.java:844)   expected null, but was:<ObjectTracker found 4 object(s) that were not released!!! [MockDirectoryWrapper, MockDirectoryWrapper, MockDirectoryWrapper, SolrCore] org.apache.solr.common.util.ObjectReleaseTracker$ObjectTrackerException: org.apache.lucene.store.MockDirectoryWrapper  at org.apache.solr.common.util.ObjectReleaseTracker.track(ObjectReleaseTracker.java:42)  at org.apache.solr.core.CachingDirectoryFactory.get(CachingDirectoryFactory.java:348)  at org.apache.solr.update.SolrIndexWriter.create(SolrIndexWriter.java:99)  at org.apache.solr.core.SolrCore.initIndex(SolrCore.java:779)  at org.apache.solr.core.SolrCore.<init>(SolrCore.java:976)  at org.apache.solr.core.SolrCore.<init>(SolrCore.java:883)  at org.apache.solr.core.CoreContainer.createFromDescriptor(CoreContainer.java:1193)  at org.apache.solr.core.CoreContainer.create(CoreContainer.java:1103)  at org.apache.solr.handler.admin.CoreAdminOperation.lambda$static$0(CoreAdminOperation.java:92)  at org.apache.solr.handler.admin.CoreAdminOperation.execute(CoreAdminOperation.java:360)  at org.apache.solr.handler.admin.CoreAdminHandler$CallInfo.call(CoreAdminHandler.java:396)  at org.apache.solr.handler.admin.CoreAdminHandler.lambda$handleRequestBody$0(CoreAdminHandler.java:188)  at com.codahale.metrics.InstrumentedExecutorService$InstrumentedRunnable.run(InstrumentedExecutorService.java:176)  at org.apache.solr.common.util.ExecutorUtil$MDCAwareThreadPoolExecutor.lambda$execute$0(ExecutorUtil.java:209)  at java.base/java.util.concurrent.ThreadPoolExecutor.runWorker(ThreadPoolExecutor.java:1167)  at java.base/java.util.concurrent.ThreadPoolExecutor$Worker.run(ThreadPoolExecutor.java:641)  at java.base/java.lang.Thread.run(Thread.java:844)  org.apache.solr.common.util.ObjectReleaseTracker$ObjectTrackerException: org.apache.lucene.store.MockDirectoryWrapper  at org.apache.solr.common.util.ObjectReleaseTracker.track(ObjectReleaseTracker.java:42)  at org.apache.solr.core.CachingDirectoryFactory.get(CachingDirectoryFactory.java:348)  at org.apache.solr.handler.IndexFetcher.fetchLatestIndex(IndexFetcher.java:509)  at org.apache.solr.handler.IndexFetcher.fetchLatestIndex(IndexFetcher.java:351)  at org.apache.solr.handler.ReplicationHandler.doFetch(ReplicationHandler.java:422)  at org.apache.solr.handler.ReplicationHandler.lambda$setupPolling$13(ReplicationHandler.java:1191)  at java.base/java.util.concurrent.Executors$RunnableAdapter.call(Executors.java:514)  at java.base/java.util.concurrent.FutureTask.runAndReset(FutureTask.java:305)  at java.base/java.util.concurrent.ScheduledThreadPoolExecutor$ScheduledFutureTask.run(ScheduledThreadPoolExecutor.java:300)  at java.base/java.util.concurrent.ThreadPoolExecutor.runWorker(ThreadPoolExecutor.java:1167)  at java.base/java.util.concurrent.ThreadPoolExecutor$Worker.run(ThreadPoolExecutor.java:641)  at java.base/java.lang.Thread.run(Thread.java:844)  org.apache.solr.common.util.ObjectReleaseTracker$ObjectTrackerException: org.apache.lucene.store.MockDirectoryWrapper  at org.apache.solr.common.util.ObjectReleaseTracker.track(ObjectReleaseTracker.java:42)  at org.apache.solr.core.CachingDirectoryFactory.get(CachingDirectoryFactory.java:348)  at org.apache.solr.core.SolrCore.initSnapshotMetaDataManager(SolrCore.java:517)  at org.apache.solr.core.SolrCore.<init>(SolrCore.java:968)  at org.apache.solr.core.SolrCore.<init>(SolrCore.java:883)  at org.apache.solr.core.CoreContainer.createFromDescriptor(CoreContainer.java:1193)  at org.apache.solr.core.CoreContainer.create(CoreContainer.java:1103)  at org.apache.solr.handler.admin.CoreAdminOperation.lambda$static$0(CoreAdminOperation.java:92)  at org.apache.solr.handler.admin.CoreAdminOperation.execute(CoreAdminOperation.java:360)  at org.apache.solr.handler.admin.CoreAdminHandler$CallInfo.call(CoreAdminHandler.java:396)  at org.apache.solr.handler.admin.CoreAdminHandler.lambda$handleRequestBody$0(CoreAdminHandler.java:188)  at com.codahale.metrics.InstrumentedExecutorService$InstrumentedRunnable.run(InstrumentedExecutorService.java:176)  at org.apache.solr.common.util.ExecutorUtil$MDCAwareThreadPoolExecutor.lambda$execute$0(ExecutorUtil.java:209)  at java.base/java.util.concurrent.ThreadPoolExecutor.runWorker(ThreadPoolExecutor.java:1167)  at java.base/java.util.concurrent.ThreadPoolExecutor$Worker.run(ThreadPoolExecutor.java:641)  at java.base/java.lang.Thread.run(Thread.java:844)  org.apache.solr.common.util.ObjectReleaseTracker$ObjectTrackerException: org.apache.solr.core.SolrCore  at org.apache.solr.common.util.ObjectReleaseTracker.track(ObjectReleaseTracker.java:42)  at org.apache.solr.core.SolrCore.<init>(SolrCore.java:1063)  at org.apache.solr.core.SolrCore.<init>(SolrCore.java:883)  at org.apache.solr.core.CoreContainer.createFromDescriptor(CoreContainer.java:1193)  at org.apache.solr.core.CoreContainer.create(CoreContainer.java:1103)  at org.apache.solr.handler.admin.CoreAdminOperation.lambda$static$0(CoreAdminOperation.java:92)  at org.apache.solr.handler.admin.CoreAdminOperation.execute(CoreAdminOperation.java:360)  at org.apache.solr.handler.admin.CoreAdminHandler$CallInfo.call(CoreAdminHandler.java:396)  at org.apache.solr.handler.admin.CoreAdminHandler.lambda$handleRequestBody$0(CoreAdminHandler.java:188)  at com.codahale.metrics.InstrumentedExecutorService$InstrumentedRunnable.run(InstrumentedExecutorService.java:176)  at org.apache.solr.common.util.ExecutorUtil$MDCAwareThreadPoolExecutor.lambda$execute$0(ExecutorUtil.java:209)  at java.base/java.util.concurrent.ThreadPoolExecutor.runWorker(ThreadPoolExecutor.java:1167)  at java.base/java.util.concurrent.ThreadPoolExecutor$Worker.run(ThreadPoolExecutor.java:641)  at java.base/java.lang.Thread.run(Thread.java:844)  >

Stack Trace:
java.lang.AssertionError: ObjectTracker found 4 object(s) that were not released!!! [MockDirectoryWrapper, MockDirectoryWrapper, MockDirectoryWrapper, SolrCore]
org.apache.solr.common.util.ObjectReleaseTracker$ObjectTrackerException: org.apache.lucene.store.MockDirectoryWrapper
        at org.apache.solr.common.util.ObjectReleaseTracker.track(ObjectReleaseTracker.java:42)
        at org.apache.solr.core.CachingDirectoryFactory.get(CachingDirectoryFactory.java:348)
        at org.apache.solr.update.SolrIndexWriter.create(SolrIndexWriter.java:99)
        at org.apache.solr.core.SolrCore.initIndex(SolrCore.java:779)
        at org.apache.solr.core.SolrCore.<init>(SolrCore.java:976)
        at org.apache.solr.core.SolrCore.<init>(SolrCore.java:883)
        at org.apache.solr.core.CoreContainer.createFromDescriptor(CoreContainer.java:1193)
        at org.apache.solr.core.CoreContainer.create(CoreContainer.java:1103)
        at org.apache.solr.handler.admin.CoreAdminOperation.lambda$static$0(CoreAdminOperation.java:92)
        at org.apache.solr.handler.admin.CoreAdminOperation.execute(CoreAdminOperation.java:360)
        at org.apache.solr.handler.admin.CoreAdminHandler$CallInfo.call(CoreAdminHandler.java:396)
        at org.apache.solr.handler.admin.CoreAdminHandler.lambda$handleRequestBody$0(CoreAdminHandler.java:188)
        at com.codahale.metrics.InstrumentedExecutorService$InstrumentedRunnable.run(InstrumentedExecutorService.java:176)
        at org.apache.solr.common.util.ExecutorUtil$MDCAwareThreadPoolExecutor.lambda$execute$0(ExecutorUtil.java:209)
        at java.base/java.util.concurrent.ThreadPoolExecutor.runWorker(ThreadPoolExecutor.java:1167)
        at java.base/java.util.concurrent.ThreadPoolExecutor$Worker.run(ThreadPoolExecutor.java:641)
        at java.base/java.lang.Thread.run(Thread.java:844)

org.apache.solr.common.util.ObjectReleaseTracker$ObjectTrackerException: org.apache.lucene.store.MockDirectoryWrapper
        at org.apache.solr.common.util.ObjectReleaseTracker.track(ObjectReleaseTracker.java:42)
        at org.apache.solr.core.CachingDirectoryFactory.get(CachingDirectoryFactory.java:348)
        at org.apache.solr.handler.IndexFetcher.fetchLatestIndex(IndexFetcher.java:509)
        at org.apache.solr.handler.IndexFetcher.fetchLatestIndex(IndexFetcher.java:351)
        at org.apache.solr.handler.ReplicationHandler.doFetch(ReplicationHandler.java:422)
        at org.apache.solr.handler.ReplicationHandler.lambda$setupPolling$13(ReplicationHandler.java:1191)
        at java.base/java.util.concurrent.Executors$RunnableAdapter.call(Executors.java:514)
        at java.base/java.util.concurrent.FutureTask.runAndReset(FutureTask.java:305)
        at java.base/java.util.concurrent.ScheduledThreadPoolExecutor$ScheduledFutureTask.run(ScheduledThreadPoolExecutor.java:300)
        at java.base/java.util.concurrent.ThreadPoolExecutor.runWorker(ThreadPoolExecutor.java:1167)
        at java.base/java.util.concurrent.ThreadPoolExecutor$Worker.run(ThreadPoolExecutor.java:641)
        at java.base/java.lang.Thread.run(Thread.java:844)

org.apache.solr.common.util.ObjectReleaseTracker$ObjectTrackerException: org.apache.lucene.store.MockDirectoryWrapper
        at org.apache.solr.common.util.ObjectReleaseTracker.track(ObjectReleaseTracker.java:42)
        at org.apache.solr.core.CachingDirectoryFactory.get(CachingDirectoryFactory.java:348)
        at org.apache.solr.core.SolrCore.initSnapshotMetaDataManager(SolrCore.java:517)
        at org.apache.solr.core.SolrCore.<init>(SolrCore.java:968)
        at org.apache.solr.core.SolrCore.<init>(SolrCore.java:883)
        at org.apache.solr.core.CoreContainer.createFromDescriptor(CoreContainer.java:1193)
        at org.apache.solr.core.CoreContainer.create(CoreContainer.java:1103)
        at org.apache.solr.handler.admin.CoreAdminOperation.lambda$static$0(CoreAdminOperation.java:92)
        at org.apache.solr.handler.admin.CoreAdminOperation.execute(CoreAdminOperation.java:360)
        at org.apache.solr.handler.admin.CoreAdminHandler$CallInfo.call(CoreAdminHandler.java:396)
        at org.apache.solr.handler.admin.CoreAdminHandler.lambda$handleRequestBody$0(CoreAdminHandler.java:188)
        at com.codahale.metrics.InstrumentedExecutorService$InstrumentedRunnable.run(InstrumentedExecutorService.java:176)
        at org.apache.solr.common.util.ExecutorUtil$MDCAwareThreadPoolExecutor.lambda$execute$0(ExecutorUtil.java:209)
        at java.base/java.util.concurrent.ThreadPoolExecutor.runWorker(ThreadPoolExecutor.java:1167)
        at java.base/java.util.concurrent.ThreadPoolExecutor$Worker.run(ThreadPoolExecutor.java:641)
        at java.base/java.lang.Thread.run(Thread.java:844)

org.apache.solr.common.util.ObjectReleaseTracker$ObjectTrackerException: org.apache.solr.core.SolrCore
        at org.apache.solr.common.util.ObjectReleaseTracker.track(ObjectReleaseTracker.java:42)
        at org.apache.solr.core.SolrCore.<init>(SolrCore.java:1063)
        at org.apache.solr.core.SolrCore.<init>(SolrCore.java:883)
        at org.apache.solr.core.CoreContainer.createFromDescriptor(CoreContainer.java:1193)
        at org.apache.solr.core.CoreContainer.create(CoreContainer.java:1103)
        at org.apache.solr.handler.admin.CoreAdminOperation.lambda$static$0(CoreAdminOperation.java:92)
        at org.apache.solr.handler.admin.CoreAdminOperation.execute(CoreAdminOperation.java:360)
        at org.apache.solr.handler.admin.CoreAdminHandler$CallInfo.call(CoreAdminHandler.java:396)
        at org.apache.solr.handler.admin.CoreAdminHandler.lambda$handleRequestBody$0(CoreAdminHandler.java:188)
        at com.codahale.metrics.InstrumentedExecutorService$InstrumentedRunnable.run(InstrumentedExecutorService.java:176)
        at org.apache.solr.common.util.ExecutorUtil$MDCAwareThreadPoolExecutor.lambda$execute$0(ExecutorUtil.java:209)
        at java.base/java.util.concurrent.ThreadPoolExecutor.runWorker(ThreadPoolExecutor.java:1167)
        at java.base/java.util.concurrent.ThreadPoolExecutor$Worker.run(ThreadPoolExecutor.java:641)
        at java.base/java.lang.Thread.run(Thread.java:844)

 expected null, but was:<ObjectTracker found 4 object(s) that were not released!!! [MockDirectoryWrapper, MockDirectoryWrapper, MockDirectoryWrapper, SolrCore]
org.apache.solr.common.util.ObjectReleaseTracker$ObjectTrackerException: org.apache.lucene.store.MockDirectoryWrapper
        at org.apache.solr.common.util.ObjectReleaseTracker.track(ObjectReleaseTracker.java:42)
        at org.apache.solr.core.CachingDirectoryFactory.get(CachingDirectoryFactory.java:348)
        at org.apache.solr.update.SolrIndexWriter.create(SolrIndexWriter.java:99)
        at org.apache.solr.core.SolrCore.initIndex(SolrCore.java:779)
        at org.apache.solr.core.SolrCore.<init>(SolrCore.java:976)
        at org.apache.solr.core.SolrCore.<init>(SolrCore.java:883)
        at org.apache.solr.core.CoreContainer.createFromDescriptor(CoreContainer.java:1193)
        at org.apache.solr.core.CoreContainer.create(CoreContainer.java:1103)
        at org.apache.solr.handler.admin.CoreAdminOperation.lambda$static$0(CoreAdminOperation.java:92)
        at org.apache.solr.handler.admin.CoreAdminOperation.execute(CoreAdminOperation.java:360)
        at org.apache.solr.handler.admin.CoreAdminHandler$CallInfo.call(CoreAdminHandler.java:396)
        at org.apache.solr.handler.admin.CoreAdminHandler.lambda$handleRequestBody$0(CoreAdminHandler.java:188)
        at com.codahale.metrics.InstrumentedExecutorService$InstrumentedRunnable.run(InstrumentedExecutorService.java:176)
        at org.apache.solr.common.util.ExecutorUtil$MDCAwareThreadPoolExecutor.lambda$execute$0(ExecutorUtil.java:209)
        at java.base/java.util.concurrent.ThreadPoolExecutor.runWorker(ThreadPoolExecutor.java:1167)
        at java.base/java.util.concurrent.ThreadPoolExecutor$Worker.run(ThreadPoolExecutor.java:641)
        at java.base/java.lang.Thread.run(Thread.java:844)

org.apache.solr.common.util.ObjectReleaseTracker$ObjectTrackerException: org.apache.lucene.store.MockDirectoryWrapper
        at org.apache.solr.common.util.ObjectReleaseTracker.track(ObjectReleaseTracker.java:42)
        at org.apache.solr.core.CachingDirectoryFactory.get(CachingDirectoryFactory.java:348)
        at org.apache.solr.handler.IndexFetcher.fetchLatestIndex(IndexFetcher.java:509)
        at org.apache.solr.handler.IndexFetcher.fetchLatestIndex(IndexFetcher.java:351)
        at org.apache.solr.handler.ReplicationHandler.doFetch(ReplicationHandler.java:422)
        at org.apache.solr.handler.ReplicationHandler.lambda$setupPolling$13(ReplicationHandler.java:1191)
        at java.base/java.util.concurrent.Executors$RunnableAdapter.call(Executors.java:514)
        at java.base/java.util.concurrent.FutureTask.runAndReset(FutureTask.java:305)
        at java.base/java.util.concurrent.ScheduledThreadPoolExecutor$ScheduledFutureTask.run(ScheduledThreadPoolExecutor.java:300)
        at java.base/java.util.concurrent.ThreadPoolExecutor.runWorker(ThreadPoolExecutor.java:1167)
        at java.base/java.util.concurrent.ThreadPoolExecutor$Worker.run(ThreadPoolExecutor.java:641)
        at java.base/java.lang.Thread.run(Thread.java:844)

org.apache.solr.common.util.ObjectReleaseTracker$ObjectTrackerException: org.apache.lucene.store.MockDirectoryWrapper
        at org.apache.solr.common.util.ObjectReleaseTracker.track(ObjectReleaseTracker.java:42)
        at org.apache.solr.core.CachingDirectoryFactory.get(CachingDirectoryFactory.java:348)
        at org.apache.solr.core.SolrCore.initSnapshotMetaDataManager(SolrCore.java:517)
        at org.apache.solr.core.SolrCore.<init>(SolrCore.java:968)
        at org.apache.solr.core.SolrCore.<init>(SolrCore.java:883)
        at org.apache.solr.core.CoreContainer.createFromDescriptor(CoreContainer.java:1193)
        at org.apache.solr.core.CoreContainer.create(CoreContainer.java:1103)
        at org.apache.solr.handler.admin.CoreAdminOperation.lambda$static$0(CoreAdminOperation.java:92)
        at org.apache.solr.handler.admin.CoreAdminOperation.execute(CoreAdminOperation.java:360)
        at org.apache.solr.handler.admin.CoreAdminHandler$CallInfo.call(CoreAdminHandler.java:396)
        at org.apache.solr.handler.admin.CoreAdminHandler.lambda$handleRequestBody$0(CoreAdminHandler.java:188)
        at com.codahale.metrics.InstrumentedExecutorService$InstrumentedRunnable.run(InstrumentedExecutorService.java:176)
        at org.apache.solr.common.util.ExecutorUtil$MDCAwareThreadPoolExecutor.lambda$execute$0(ExecutorUtil.java:209)
        at java.base/java.util.concurrent.ThreadPoolExecutor.runWorker(ThreadPoolExecutor.java:1167)
        at java.base/java.util.concurrent.ThreadPoolExecutor$Worker.run(ThreadPoolExecutor.java:641)
        at java.base/java.lang.Thread.run(Thread.java:844)

org.apache.solr.common.util.ObjectReleaseTracker$ObjectTrackerException: org.apache.solr.core.SolrCore
        at org.apache.solr.common.util.ObjectReleaseTracker.track(ObjectReleaseTracker.java:42)
        at org.apache.solr.core.SolrCore.<init>(SolrCore.java:1063)
        at org.apache.solr.core.SolrCore.<init>(SolrCore.java:883)
        at org.apache.solr.core.CoreContainer.createFromDescriptor(CoreContainer.java:1193)
        at org.apache.solr.core.CoreContainer.create(CoreContainer.java:1103)
        at org.apache.solr.handler.admin.CoreAdminOperation.lambda$static$0(CoreAdminOperation.java:92)
        at org.apache.solr.handler.admin.CoreAdminOperation.execute(CoreAdminOperation.java:360)
        at org.apache.solr.handler.admin.CoreAdminHandler$CallInfo.call(CoreAdminHandler.java:396)
        at org.apache.solr.handler.admin.CoreAdminHandler.lambda$handleRequestBody$0(CoreAdminHandler.java:188)
        at com.codahale.metrics.InstrumentedExecutorService$InstrumentedRunnable.run(InstrumentedExecutorService.java:176)
        at org.apache.solr.common.util.ExecutorUtil$MDCAwareThreadPoolExecutor.lambda$execute$0(ExecutorUtil.java:209)
        at java.base/java.util.concurrent.ThreadPoolExecutor.runWorker(ThreadPoolExecutor.java:1167)
        at java.base/java.util.concurrent.ThreadPoolExecutor$Worker.run(ThreadPoolExecutor.java:641)
        at java.base/java.lang.Thread.run(Thread.java:844)

>
        at __randomizedtesting.SeedInfo.seed([52C7727AD4B7E2D7]:0)
        at org.junit.Assert.fail(Assert.java:88)
        at org.junit.Assert.failNotNull(Assert.java:755)
        at org.junit.Assert.assertNull(Assert.java:737)
        at org.apache.solr.SolrTestCaseJ4.teardownTestCases(SolrTestCaseJ4.java:325)
        at java.base/jdk.internal.reflect.NativeMethodAccessorImpl.invoke0(Native Method)
        at java.base/jdk.internal.reflect.NativeMethodAccessorImpl.invoke(NativeMethodAccessorImpl.java:62)
        at java.base/jdk.internal.reflect.DelegatingMethodAccessorImpl.invoke(DelegatingMethodAccessorImpl.java:43)
        at java.base/java.lang.reflect.Method.invoke(Method.java:564)
        at com.carrotsearch.randomizedtesting.RandomizedRunner.invoke(RandomizedRunner.java:1750)
        at com.carrotsearch.randomizedtesting.RandomizedRunner$7.evaluate(RandomizedRunner.java:901)
        at com.carrotsearch.randomizedtesting.rules.StatementAdapter.evaluate(StatementAdapter.java:36)
        at com.carrotsearch.randomizedtesting.rules.SystemPropertiesRestoreRule$1.evaluate(SystemPropertiesRestoreRule.java:57)
        at org.apache.lucene.util.AbstractBeforeAfterRule$1.evaluate(AbstractBeforeAfterRule.java:45)
        at com.carrotsearch.randomizedtesting.rules.StatementAdapter.evaluate(StatementAdapter.java:36)
        at org.apache.lucene.util.TestRuleStoreClassName$1.evaluate(TestRuleStoreClassName.java:41)
        at com.carrotsearch.randomizedtesting.rules.NoShadowingOrOverridesOnMethodsRule$1.evaluate(NoShadowingOrOverridesOnMethodsRule.java:40)
        at com.carrotsearch.randomizedtesting.rules.NoShadowingOrOverridesOnMethodsRule$1.evaluate(NoShadowingOrOverridesOnMethodsRule.java:40)
        at com.carrotsearch.randomizedtesting.rules.StatementAdapter.evaluate(StatementAdapter.java:36)
        at com.carrotsearch.randomizedtesting.rules.StatementAdapter.evaluate(StatementAdapter.java:36)
        at org.apache.lucene.util.TestRuleAssertionsRequired$1.evaluate(TestRuleAssertionsRequired.java:53)
        at org.apache.lucene.util.TestRuleMarkFailure$1.evaluate(TestRuleMarkFailure.java:47)
        at org.apache.lucene.util.TestRuleIgnoreAfterMaxFailures$1.evaluate(TestRuleIgnoreAfterMaxFailures.java:64)
        at org.apache.lucene.util.TestRuleIgnoreTestSuites$1.evaluate(TestRuleIgnoreTestSuites.java:54)
        at com.carrotsearch.randomizedtesting.rules.StatementAdapter.evaluate(StatementAdapter.java:36)
        at com.carrotsearch.randomizedtesting.ThreadLeakControl$StatementRunner.run(ThreadLeakControl.java:368)
        at java.base/java.lang.Thread.run(Thread.java:844)




Build Log:
[...truncated 13692 lines...]
   [junit4] Suite: org.apache.solr.handler.TestSQLHandler
   [junit4]   2> Creating dataDir: C:\Users\jenkins\workspace\Lucene-Solr-master-Windows\solr\build\solr-core\test\J0\temp\solr.handler.TestSQLHandler_20D481020EF9F2E8-001\init-core-data-001
   [junit4]   2> 1361471 INFO  (SUITE-TestSQLHandler-seed#[20D481020EF9F2E8]-worker) [    ] o.a.s.SolrTestCaseJ4 SecureRandom sanity checks: test.solr.allowed.securerandom=null & java.security.egd=file:/dev/./urandom
   [junit4]   2> 1361476 WARN  (SUITE-TestSQLHandler-seed#[20D481020EF9F2E8]-worker) [    ] o.a.s.SolrTestCaseJ4 startTrackingSearchers: numOpens=3 numCloses=3
   [junit4]   2> 1361476 INFO  (SUITE-TestSQLHandler-seed#[20D481020EF9F2E8]-worker) [    ] o.a.s.SolrTestCaseJ4 Using PointFields (NUMERIC_POINTS_SYSPROP=true) w/NUMERIC_DOCVALUES_SYSPROP=true
   [junit4]   2> 1361478 INFO  (SUITE-TestSQLHandler-seed#[20D481020EF9F2E8]-worker) [    ] o.a.s.SolrTestCaseJ4 Randomized ssl (false) and clientAuth (false) via: @org.apache.solr.SolrTestCaseJ4$SuppressSSL(bugUrl="None")
   [junit4]   2> 1361478 INFO  (SUITE-TestSQLHandler-seed#[20D481020EF9F2E8]-worker) [    ] o.a.s.BaseDistributedSearchTestCase Setting hostContext system property: /
   [junit4]   2> 1361485 INFO  (TEST-TestSQLHandler.doTest-seed#[20D481020EF9F2E8]) [    ] o.a.s.c.ZkTestServer STARTING ZK TEST SERVER
   [junit4]   2> 1361486 INFO  (ZkTestServer Run Thread) [    ] o.a.s.c.ZkTestServer client port:0.0.0.0/0.0.0.0:0
   [junit4]   2> 1361486 INFO  (ZkTestServer Run Thread) [    ] o.a.s.c.ZkTestServer Starting server
   [junit4]   2> 1361501 INFO  (TEST-TestSQLHandler.doTest-seed#[20D481020EF9F2E8]) [    ] o.a.s.c.ZkTestServer start zk server on port:53020
   [junit4]   2> 1361501 INFO  (TEST-TestSQLHandler.doTest-seed#[20D481020EF9F2E8]) [    ] o.a.s.c.ZkTestServer parse host and port list: 127.0.0.1:53020
   [junit4]   2> 1361501 INFO  (TEST-TestSQLHandler.doTest-seed#[20D481020EF9F2E8]) [    ] o.a.s.c.ZkTestServer connecting to 127.0.0.1 53020
   [junit4]   2> 1361537 INFO  (zkConnectionManagerCallback-7045-thread-1) [    ] o.a.s.c.c.ConnectionManager zkClient has connected
   [junit4]   2> 1361559 INFO  (zkConnectionManagerCallback-7047-thread-1) [    ] o.a.s.c.c.ConnectionManager zkClient has connected
   [junit4]   2> 1361571 INFO  (TEST-TestSQLHandler.doTest-seed#[20D481020EF9F2E8]) [    ] o.a.s.c.ZkTestServer put C:\Users\jenkins\workspace\Lucene-Solr-master-Windows\solr\core\src\test-files\solr\collection1\conf\solrconfig-sql.xml to /configs/conf1/solrconfig.xml
   [junit4]   2> 1361587 INFO  (TEST-TestSQLHandler.doTest-seed#[20D481020EF9F2E8]) [    ] o.a.s.c.ZkTestServer put C:\Users\jenkins\workspace\Lucene-Solr-master-Windows\solr\core\src\test-files\solr\collection1\conf\schema-sql.xml to /configs/conf1/schema.xml
   [junit4]   2> 1361602 INFO  (TEST-TestSQLHandler.doTest-seed#[20D481020EF9F2E8]) [    ] o.a.s.c.ZkTestServer put C:\Users\jenkins\workspace\Lucene-Solr-master-Windows\solr\core\src\test-files\solr\collection1\conf\solrconfig.snippet.randomindexconfig.xml to /configs/conf1/solrconfig.snippet.randomindexconfig.xml
   [junit4]   2> 1361602 INFO  (TEST-TestSQLHandler.doTest-seed#[20D481020EF9F2E8]) [    ] o.a.s.c.ZkTestServer put C:\Users\jenkins\workspace\Lucene-Solr-master-Windows\solr\core\src\test-files\solr\collection1\conf\stopwords.txt to /configs/conf1/stopwords.txt
   [junit4]   2> 1361624 INFO  (TEST-TestSQLHandler.doTest-seed#[20D481020EF9F2E8]) [    ] o.a.s.c.ZkTestServer put C:\Users\jenkins\workspace\Lucene-Solr-master-Windows\solr\core\src\test-files\solr\collection1\conf\protwords.txt to /configs/conf1/protwords.txt
   [junit4]   2> 1361625 INFO  (TEST-TestSQLHandler.doTest-seed#[20D481020EF9F2E8]) [    ] o.a.s.c.ZkTestServer put C:\Users\jenkins\workspace\Lucene-Solr-master-Windows\solr\core\src\test-files\solr\collection1\conf\currency.xml to /configs/conf1/currency.xml
   [junit4]   2> 1361626 INFO  (TEST-TestSQLHandler.doTest-seed#[20D481020EF9F2E8]) [    ] o.a.s.c.ZkTestServer put C:\Users\jenkins\workspace\Lucene-Solr-master-Windows\solr\core\src\test-files\solr\collection1\conf\enumsConfig.xml to /configs/conf1/enumsConfig.xml
   [junit4]   2> 1361626 INFO  (TEST-TestSQLHandler.doTest-seed#[20D481020EF9F2E8]) [    ] o.a.s.c.ZkTestServer put C:\Users\jenkins\workspace\Lucene-Solr-master-Windows\solr\core\src\test-files\solr\collection1\conf\open-exchange-rates.json to /configs/conf1/open-exchange-rates.json
   [junit4]   2> 1361626 INFO  (TEST-TestSQLHandler.doTest-seed#[20D481020EF9F2E8]) [    ] o.a.s.c.ZkTestServer put C:\Users\jenkins\workspace\Lucene-Solr-master-Windows\solr\core\src\test-files\solr\collection1\conf\mapping-ISOLatin1Accent.txt to /configs/conf1/mapping-ISOLatin1Accent.txt
   [junit4]   2> 1361630 INFO  (TEST-TestSQLHandler.doTest-seed#[20D481020EF9F2E8]) [    ] o.a.s.c.ZkTestServer put C:\Users\jenkins\workspace\Lucene-Solr-master-Windows\solr\core\src\test-files\solr\collection1\conf\old_synonyms.txt to /configs/conf1/old_synonyms.txt
   [junit4]   2> 1361631 INFO  (TEST-TestSQLHandler.doTest-seed#[20D481020EF9F2E8]) [    ] o.a.s.c.ZkTestServer put C:\Users\jenkins\workspace\Lucene-Solr-master-Windows\solr\core\src\test-files\solr\collection1\conf\synonyms.txt to /configs/conf1/synonyms.txt
   [junit4]   2> 1361632 INFO  (TEST-TestSQLHandler.doTest-seed#[20D481020EF9F2E8]) [    ] o.a.s.c.AbstractFullDistribZkTestBase Will use NRT replicas unless explicitly asked otherwise
   [junit4]   2> 1362273 WARN  (TEST-TestSQLHandler.doTest-seed#[20D481020EF9F2E8]) [    ] o.e.j.s.AbstractConnector Ignoring deprecated socket close linger time
   [junit4]   2> 1362273 INFO  (TEST-TestSQLHandler.doTest-seed#[20D481020EF9F2E8]) [    ] o.a.s.c.s.e.JettySolrRunner Start Jetty (original configured port=0)
   [junit4]   2> 1362273 INFO  (TEST-TestSQLHandler.doTest-seed#[20D481020EF9F2E8]) [    ] o.a.s.c.s.e.JettySolrRunner Trying to start Jetty on port 0 try number 1 ...
   [junit4]   2> 1362273 INFO  (TEST-TestSQLHandler.doTest-seed#[20D481020EF9F2E8]) [    ] o.e.j.s.Server jetty-9.4.14.v20181114; built: 2018-11-14T21:20:31.478Z; git: c4550056e785fb5665914545889f21dc136ad9e6; jvm 9.0.4+11
   [junit4]   2> 1362273 INFO  (TEST-TestSQLHandler.doTest-seed#[20D481020EF9F2E8]) [    ] o.e.j.s.session DefaultSessionIdManager workerName=node0
   [junit4]   2> 1362273 INFO  (TEST-TestSQLHandler.doTest-seed#[20D481020EF9F2E8]) [    ] o.e.j.s.session No SessionScavenger set, using defaults
   [junit4]   2> 1362273 INFO  (TEST-TestSQLHandler.doTest-seed#[20D481020EF9F2E8]) [    ] o.e.j.s.session node0 Scavenging every 600000ms
   [junit4]   2> 1362273 INFO  (TEST-TestSQLHandler.doTest-seed#[20D481020EF9F2E8]) [    ] o.e.j.s.h.ContextHandler Started o.e.j.s.ServletContextHandler@49ee4c6a{/,null,AVAILABLE}
   [junit4]   2> 1362276 INFO  (TEST-TestSQLHandler.doTest-seed#[20D481020EF9F2E8]) [    ] o.e.j.s.AbstractConnector Started ServerConnector@21a7ec49{HTTP/1.1,[http/1.1, h2c]}{127.0.0.1:53032}
   [junit4]   2> 1362276 INFO  (TEST-TestSQLHandler.doTest-seed#[20D481020EF9F2E8]) [    ] o.e.j.s.Server Started @1362347ms
   [junit4]   2> 1362276 INFO  (TEST-TestSQLHandler.doTest-seed#[20D481020EF9F2E8]) [    ] o.a.s.c.s.e.JettySolrRunner Jetty properties: {hostContext=/, solr.data.dir=C:\Users\jenkins\workspace\Lucene-Solr-master-Windows\solr\build\solr-core\test\J0\temp\solr.handler.TestSQLHandler_20D481020EF9F2E8-001\tempDir-001/control/data, hostPort=53032, coreRootDirectory=C:\Users\jenkins\workspace\Lucene-Solr-master-Windows\solr\build\solr-core\test\J0\temp\solr.handler.TestSQLHandler_20D481020EF9F2E8-001\control-001\cores, replicaType=NRT}
   [junit4]   2> 1362276 ERROR (TEST-TestSQLHandler.doTest-seed#[20D481020EF9F2E8]) [    ] o.a.s.u.StartupLoggingUtils Missing Java Option solr.log.dir. Logging may be missing or incomplete.
   [junit4]   2> 1362276 INFO  (TEST-TestSQLHandler.doTest-seed#[20D481020EF9F2E8]) [    ] o.a.s.s.SolrDispatchFilter Using logger factory org.apache.logging.slf4j.Log4jLoggerFactory
   [junit4]   2> 1362276 INFO  (TEST-TestSQLHandler.doTest-seed#[20D481020EF9F2E8]) [    ] o.a.s.s.SolrDispatchFilter  ___      _       Welcome to Apache Solr™ version 9.0.0
   [junit4]   2> 1362276 INFO  (TEST-TestSQLHandler.doTest-seed#[20D481020EF9F2E8]) [    ] o.a.s.s.SolrDispatchFilter / __| ___| |_ _   Starting in cloud mode on port null
   [junit4]   2> 1362276 INFO  (TEST-TestSQLHandler.doTest-seed#[20D481020EF9F2E8]) [    ] o.a.s.s.SolrDispatchFilter \__ \/ _ \ | '_|  Install dir: null
   [junit4]   2> 1362276 INFO  (TEST-TestSQLHandler.doTest-seed#[20D481020EF9F2E8]) [    ] o.a.s.s.SolrDispatchFilter |___/\___/_|_|    Start time: 2019-03-27T20:09:43.044811300Z
   [junit4]   2> 1362276 INFO  (zkConnectionManagerCallback-7049-thread-1) [    ] o.a.s.c.c.ConnectionManager zkClient has connected
   [junit4]   2> 1362283 INFO  (TEST-TestSQLHandler.doTest-seed#[20D481020EF9F2E8]) [    ] o.a.s.s.SolrDispatchFilter Loading solr.xml from SolrHome (not found in ZooKeeper)
   [junit4]   2> 1362283 INFO  (TEST-TestSQLHandler.doTest-seed#[20D481020EF9F2E8]) [    ] o.a.s.c.SolrXmlConfig Loading container configuration from C:\Users\jenkins\workspace\Lucene-Solr-master-Windows\solr\build\solr-core\test\J0\temp\solr.handler.TestSQLHandler_20D481020EF9F2E8-001\control-001\solr.xml
   [junit4]   2> 1362322 INFO  (TEST-TestSQLHandler.doTest-seed#[20D481020EF9F2E8]) [    ] o.a.s.c.SolrXmlConfig Configuration parameter autoReplicaFailoverWorkLoopDelay is ignored
   [junit4]   2> 1362322 INFO  (TEST-TestSQLHandler.doTest-seed#[20D481020EF9F2E8]) [    ] o.a.s.c.SolrXmlConfig Configuration parameter autoReplicaFailoverBadNodeExpiration is ignored
   [junit4]   2> 1362336 INFO  (TEST-TestSQLHandler.doTest-seed#[20D481020EF9F2E8]) [    ] o.a.s.c.SolrXmlConfig MBean server found: com.sun.jmx.mbeanserver.JmxMBeanServer@786401ac, but no JMX reporters were configured - adding default JMX reporter.
   [junit4]   2> 1362483 INFO  (TEST-TestSQLHandler.doTest-seed#[20D481020EF9F2E8]) [    ] o.a.s.h.c.HttpShardHandlerFactory Host whitelist initialized: WhitelistHostChecker [whitelistHosts=null, whitelistHostCheckingEnabled=false]
   [junit4]   2> 1362496 WARN  (TEST-TestSQLHandler.doTest-seed#[20D481020EF9F2E8]) [    ] o.e.j.u.s.S.config No Client EndPointIdentificationAlgorithm configured for SslContextFactory@b3d70f1[provider=null,keyStore=null,trustStore=null]
   [junit4]   2> 1362501 WARN  (TEST-TestSQLHandler.doTest-seed#[20D481020EF9F2E8]) [    ] o.e.j.u.s.S.config No Client EndPointIdentificationAlgorithm configured for SslContextFactory@504cf383[provider=null,keyStore=null,trustStore=null]
   [junit4]   2> 1362502 INFO  (TEST-TestSQLHandler.doTest-seed#[20D481020EF9F2E8]) [    ] o.a.s.c.ZkContainer Zookeeper client=127.0.0.1:53020/solr
   [junit4]   2> 1362505 INFO  (zkConnectionManagerCallback-7056-thread-1) [    ] o.a.s.c.c.ConnectionManager zkClient has connected
   [junit4]   2> 1362506 WARN  (NIOServerCxn.Factory:0.0.0.0/0.0.0.0:0) [    ] o.a.z.s.NIOServerCnxn Unable to read additional data from client sessionid 0x10048b2d0030003, likely client has closed socket
   [junit4]   2> 1362509 INFO  (zkConnectionManagerCallback-7058-thread-1) [    ] o.a.s.c.c.ConnectionManager zkClient has connected
   [junit4]   2> 1362629 INFO  (TEST-TestSQLHandler.doTest-seed#[20D481020EF9F2E8]) [n:127.0.0.1:53032_    ] o.a.s.c.OverseerElectionContext I am going to be the leader 127.0.0.1:53032_
   [junit4]   2> 1362630 INFO  (TEST-TestSQLHandler.doTest-seed#[20D481020EF9F2E8]) [n:127.0.0.1:53032_    ] o.a.s.c.Overseer Overseer (id=72137526869164036-127.0.0.1:53032_-n_0000000000) starting
   [junit4]   2> 1362639 INFO  (zkConnectionManagerCallback-7065-thread-1) [    ] o.a.s.c.c.ConnectionManager zkClient has connected
   [junit4]   2> 1362643 INFO  (TEST-TestSQLHandler.doTest-seed#[20D481020EF9F2E8]) [n:127.0.0.1:53032_    ] o.a.s.c.s.i.ZkClientClusterStateProvider Cluster at 127.0.0.1:53020/solr ready
   [junit4]   2> 1362646 INFO  (TEST-TestSQLHandler.doTest-seed#[20D481020EF9F2E8]) [n:127.0.0.1:53032_    ] o.a.s.c.ZkController Register node as live in ZooKeeper:/live_nodes/127.0.0.1:53032_
   [junit4]   2> 1362646 INFO  (OverseerStateUpdate-72137526869164036-127.0.0.1:53032_-n_0000000000) [n:127.0.0.1:53032_    ] o.a.s.c.Overseer Starting to work on the main queue : 127.0.0.1:53032_
   [junit4]   2> 1362649 INFO  (OverseerStateUpdate-72137526869164036-127.0.0.1:53032_-n_0000000000) [n:127.0.0.1:53032_    ] o.a.s.c.c.ZkStateReader Updated live nodes from ZooKeeper... (0) -> (1)
   [junit4]   2> 1362659 INFO  (zkCallback-7064-thread-1) [    ] o.a.s.c.c.ZkStateReader Updated live nodes from ZooKeeper... (0) -> (1)
   [junit4]   2> 1362681 INFO  (TEST-TestSQLHandler.doTest-seed#[20D481020EF9F2E8]) [n:127.0.0.1:53032_    ] o.a.s.h.a.MetricsHistoryHandler No .system collection, keeping metrics history in memory.
   [junit4]   2> 1362705 INFO  (TEST-TestSQLHandler.doTest-seed#[20D481020EF9F2E8]) [n:127.0.0.1:53032_    ] o.a.s.m.r.SolrJmxReporter JMX monitoring for 'solr.node' (registry 'solr.node') enabled at server: com.sun.jmx.mbeanserver.JmxMBeanServer@786401ac
   [junit4]   2> 1362716 INFO  (TEST-TestSQLHandler.doTest-seed#[20D481020EF9F2E8]) [n:127.0.0.1:53032_    ] o.a.s.m.r.SolrJmxReporter JMX monitoring for 'solr.jvm' (registry 'solr.jvm') enabled at server: com.sun.jmx.mbeanserver.JmxMBeanServer@786401ac
   [junit4]   2> 1362716 INFO  (TEST-TestSQLHandler.doTest-seed#[20D481020EF9F2E8]) [n:127.0.0.1:53032_    ] o.a.s.m.r.SolrJmxReporter JMX monitoring for 'solr.jetty' (registry 'solr.jetty') enabled at server: com.sun.jmx.mbeanserver.JmxMBeanServer@786401ac
   [junit4]   2> 1362719 INFO  (TEST-TestSQLHandler.doTest-seed#[20D481020EF9F2E8]) [n:127.0.0.1:53032_    ] o.a.s.c.CorePropertiesLocator Found 0 core definitions underneath C:\Users\jenkins\workspace\Lucene-Solr-master-Windows\solr\build\solr-core\test\J0\temp\solr.handler.TestSQLHandler_20D481020EF9F2E8-001\control-001\cores
   [junit4]   2> 1362803 INFO  (zkConnectionManagerCallback-7071-thread-1) [    ] o.a.s.c.c.ConnectionManager zkClient has connected
   [junit4]   2> 1362805 INFO  (TEST-TestSQLHandler.doTest-seed#[20D481020EF9F2E8]) [    ] o.a.s.c.c.ZkStateReader Updated live nodes from ZooKeeper... (0) -> (1)
   [junit4]   2> 1362807 INFO  (TEST-TestSQLHandler.doTest-seed#[20D481020EF9F2E8]) [    ] o.a.s.c.s.i.ZkClientClusterStateProvider Cluster at 127.0.0.1:53020/solr ready
   [junit4]   2> 1362809 INFO  (qtp789158328-19567) [n:127.0.0.1:53032_    ] o.a.s.h.a.CollectionsHandler Invoked Collection Action :create with params collection.configName=conf1&name=control_collection&nrtReplicas=1&action=CREATE&numShards=1&createNodeSet=127.0.0.1:53032_&wt=javabin&version=2 and sendToOCPQueue=true
   [junit4]   2> 1362852 INFO  (OverseerThreadFactory-5961-thread-1-processing-n:127.0.0.1:53032_) [n:127.0.0.1:53032_    ] o.a.s.c.a.c.CreateCollectionCmd Create collection control_collection
   [junit4]   2> 1362969 INFO  (qtp789158328-19569) [n:127.0.0.1:53032_    x:control_collection_shard1_replica_n1] o.a.s.h.a.CoreAdminOperation core create command qt=/admin/cores&collection.configName=conf1&newCollection=true&name=control_collection_shard1_replica_n1&action=CREATE&numShards=1&collection=control_collection&shard=shard1&wt=javabin&version=2&replicaType=NRT
   [junit4]   2> 1362970 INFO  (qtp789158328-19569) [n:127.0.0.1:53032_    x:control_collection_shard1_replica_n1] o.a.s.c.TransientSolrCoreCacheDefault Allocating transient cache for 4 transient cores
   [junit4]   2> 1364005 INFO  (qtp789158328-19569) [n:127.0.0.1:53032_ c:control_collection s:shard1  x:control_collection_shard1_replica_n1] o.a.s.c.SolrConfig Using Lucene MatchVersion: 9.0.0
   [junit4]   2> 1364024 INFO  (qtp789158328-19569) [n:127.0.0.1:53032_ c:control_collection s:shard1  x:control_collection_shard1_replica_n1] o.a.s.s.IndexSchema [control_collection_shard1_replica_n1] Schema name=test
   [junit4]   2> 1364126 WARN  (qtp789158328-19569) [n:127.0.0.1:53032_ c:control_collection s:shard1  x:control_collection_shard1_replica_n1] o.a.s.s.IndexSchema Field lowerfilt1and2 is not multivalued and destination for multiple copyFields (2)
   [junit4]   2> 1364127 WARN  (qtp789158328-19569) [n:127.0.0.1:53032_ c:control_collection s:shard1  x:control_collection_shard1_replica_n1] o.a.s.s.IndexSchema Field text is not multivalued and destination for multiple copyFields (3)
   [junit4]   2> 1364127 INFO  (qtp789158328-19569) [n:127.0.0.1:53032_ c:control_collection s:shard1  x:control_collection_shard1_replica_n1] o.a.s.s.IndexSchema Loaded schema test/1.6 with uniqueid field id
   [junit4]   2> 1364127 INFO  (qtp789158328-19569) [n:127.0.0.1:53032_ c:control_collection s:shard1  x:control_collection_shard1_replica_n1] o.a.s.c.CoreContainer Creating SolrCore 'control_collection_shard1_replica_n1' using configuration from collection control_collection, trusted=true
   [junit4]   2> 1364128 INFO  (qtp789158328-19569) [n:127.0.0.1:53032_ c:control_collection s:shard1  x:control_collection_shard1_replica_n1] o.a.s.m.r.SolrJmxReporter JMX monitoring for 'solr.core.control_collection.shard1.replica_n1' (registry 'solr.core.control_collection.shard1.replica_n1') enabled at server: com.sun.jmx.mbeanserver.JmxMBeanServer@786401ac
   [junit4]   2> 1364128 INFO  (qtp789158328-19569) [n:127.0.0.1:53032_ c:control_collection s:shard1  x:control_collection_shard1_replica_n1] o.a.s.c.SolrCore [[control_collection_shard1_replica_n1] ] Opening new SolrCore at [C:\Users\jenkins\workspace\Lucene-Solr-master-Windows\solr\build\solr-core\test\J0\temp\solr.handler.TestSQLHandler_20D481020EF9F2E8-001\control-001\cores\control_collection_shard1_replica_n1], dataDir=[C:\Users\jenkins\workspace\Lucene-Solr-master-Windows\solr\build\solr-core\test\J0\temp\solr.handler.TestSQLHandler_20D481020EF9F2E8-001\control-001\cores\control_collection_shard1_replica_n1\data\]
   [junit4]   2> 1364230 INFO  (qtp789158328-19569) [n:127.0.0.1:53032_ c:control_collection s:shard1  x:control_collection_shard1_replica_n1] o.a.s.u.UpdateHandler Using UpdateLog implementation: org.apache.solr.update.UpdateLog
   [junit4]   2> 1364230 INFO  (qtp789158328-19569) [n:127.0.0.1:53032_ c:control_collection s:shard1  x:control_collection_shard1_replica_n1] o.a.s.u.UpdateLog Initializing UpdateLog: dataDir= defaultSyncLevel=FLUSH numRecordsToKeep=100 maxNumLogsToKeep=10 numVersionBuckets=65536
   [junit4]   2> 1364233 INFO  (qtp789158328-19569) [n:127.0.0.1:53032_ c:control_collection s:shard1  x:control_collection_shard1_replica_n1] o.a.s.u.CommitTracker Hard AutoCommit: disabled
   [junit4]   2> 1364233 INFO  (qtp789158328-19569) [n:127.0.0.1:53032_ c:control_collection s:shard1  x:control_collection_shard1_replica_n1] o.a.s.u.CommitTracker Soft AutoCommit: disabled
   [junit4]   2> 1364233 INFO  (qtp789158328-19569) [n:127.0.0.1:53032_ c:control_collection s:shard1  x:control_collection_shard1_replica_n1] o.a.s.s.SolrIndexSearcher Opening [Searcher@71602d5c[control_collection_shard1_replica_n1] main]
   [junit4]   2> 1364237 INFO  (qtp789158328-19569) [n:127.0.0.1:53032_ c:control_collection s:shard1  x:control_collection_shard1_replica_n1] o.a.s.r.ManagedResourceStorage Configured ZooKeeperStorageIO with znodeBase: /configs/conf1
   [junit4]   2> 1364237 INFO  (qtp789158328-19569) [n:127.0.0.1:53032_ c:control_collection s:shard1  x:control_collection_shard1_replica_n1] o.a.s.r.ManagedResourceStorage Loaded null at path _rest_managed.json using ZooKeeperStorageIO:path=/configs/conf1
   [junit4]   2> 1364239 INFO  (qtp789158328-19569) [n:127.0.0.1:53032_ c:control_collection s:shard1  x:control_collection_shard1_replica_n1] o.a.s.u.UpdateLog Could not find max version in index or recent updates, using new clock 1629190760701100032
   [junit4]   2> 1364249 INFO  (searcherExecutor-5966-thread-1-processing-n:127.0.0.1:53032_ x:control_collection_shard1_replica_n1 c:control_collection s:shard1) [n:127.0.0.1:53032_ c:control_collection s:shard1  x:control_collection_shard1_replica_n1] o.a.s.c.SolrCore [control_collection_shard1_replica_n1] Registered new searcher Searcher@71602d5c[control_collection_shard1_replica_n1] main{ExitableDirectoryReader(UninvertingDirectoryReader())}
   [junit4]   2> 1364268 INFO  (qtp789158328-19569) [n:127.0.0.1:53032_ c:control_collection s:shard1  x:control_collection_shard1_replica_n1] o.a.s.c.ZkShardTerms Successful update of terms at /collections/control_collection/terms/shard1 to Terms{values={core_node2=0}, version=0}
   [junit4]   2> 1364268 INFO  (qtp789158328-19569) [n:127.0.0.1:53032_ c:control_collection s:shard1  x:control_collection_shard1_replica_n1] o.a.s.c.ShardLeaderElectionContextBase make sure parent is created /collections/control_collection/leaders/shard1
   [junit4]   2> 1364290 INFO  (qtp789158328-19569) [n:127.0.0.1:53032_ c:control_collection s:shard1  x:control_collection_shard1_replica_n1] o.a.s.c.ShardLeaderElectionContext Enough replicas found to continue.
   [junit4]   2> 1364290 INFO  (qtp789158328-19569) [n:127.0.0.1:53032_ c:control_collection s:shard1  x:control_collection_shard1_replica_n1] o.a.s.c.ShardLeaderElectionContext I may be the new leader - try and sync
   [junit4]   2> 1364290 INFO  (qtp789158328-19569) [n:127.0.0.1:53032_ c:control_collection s:shard1  x:control_collection_shard1_replica_n1] o.a.s.c.SyncStrategy Sync replicas to http://127.0.0.1:53032/control_collection_shard1_replica_n1/
   [junit4]   2> 1364291 INFO  (qtp789158328-19569) [n:127.0.0.1:53032_ c:control_collection s:shard1  x:control_collection_shard1_replica_n1] o.a.s.c.SyncStrategy Sync Success - now sync replicas to me
   [junit4]   2> 1364292 INFO  (qtp789158328-19569) [n:127.0.0.1:53032_ c:control_collection s:shard1  x:control_collection_shard1_replica_n1] o.a.s.c.SyncStrategy http://127.0.0.1:53032/control_collection_shard1_replica_n1/ has no replicas
   [junit4]   2> 1364292 INFO  (qtp789158328-19569) [n:127.0.0.1:53032_ c:control_collection s:shard1  x:control_collection_shard1_replica_n1] o.a.s.c.ShardLeaderElectionContextBase Creating leader registration node /collections/control_collection/leaders/shard1/leader after winning as /collections/control_collection/leader_elect/shard1/election/72137526869164036-core_node2-n_0000000000
   [junit4]   2> 1364298 INFO  (qtp789158328-19569) [n:127.0.0.1:53032_ c:control_collection s:shard1  x:control_collection_shard1_replica_n1] o.a.s.c.ShardLeaderElectionContext I am the new leader: http://127.0.0.1:53032/control_collection_shard1_replica_n1/ shard1
   [junit4]   2> 1364429 INFO  (zkCallback-7057-thread-1) [    ] o.a.s.c.c.ZkStateReader A cluster state change: [WatchedEvent state:SyncConnected type:NodeDataChanged path:/collections/control_collection/state.json] for collection [control_collection] has occurred - updating... (live nodes size: [1])
   [junit4]   2> 1364430 INFO  (zkCallback-7057-thread-2) [    ] o.a.s.c.c.ZkStateReader A cluster state change: [WatchedEvent state:SyncConnected type:NodeDataChanged path:/collections/control_collection/state.json] for collection [control_collection] has occurred - updating... (live nodes size: [1])
   [junit4]   2> 1364440 INFO  (qtp789158328-19569) [n:127.0.0.1:53032_ c:control_collection s:shard1  x:control_collection_shard1_replica_n1] o.a.s.c.ZkController I am the leader, no recovery necessary
   [junit4]   2> 1364451 INFO  (qtp789158328-19569) [n:127.0.0.1:53032_ c:control_collection s:shard1  x:control_collection_shard1_replica_n1] o.a.s.s.HttpSolrCall [admin] webapp=null path=/admin/cores params={qt=/admin/cores&collection.configName=conf1&newCollection=true&name=control_collection_shard1_replica_n1&action=CREATE&numShards=1&collection=control_collection&shard=shard1&wt=javabin&version=2&replicaType=NRT} status=0 QTime=1482
   [junit4]   2> 1364453 INFO  (qtp789158328-19567) [n:127.0.0.1:53032_    ] o.a.s.h.a.CollectionsHandler Wait for new collection to be active for at most 45 seconds. Check all shard replicas
   [junit4]   2> 1364551 INFO  (zkCallback-7057-thread-2) [    ] o.a.s.c.c.ZkStateReader A cluster state change: [WatchedEvent state:SyncConnected type:NodeDataChanged path:/collections/control_collection/state.json] for collection [control_collection] has occurred - updating... (live nodes size: [1])
   [junit4]   2> 1364551 INFO  (zkCallback-7057-thread-3) [    ] o.a.s.c.c.ZkStateReader A cluster state change: [WatchedEvent state:SyncConnected type:NodeDataChanged path:/collections/control_collection/state.json] for collection [control_collection] has occurred - updating... (live nodes size: [1])
   [junit4]   2> 1364551 INFO  (zkCallback-7057-thread-1) [    ] o.a.s.c.c.ZkStateReader A cluster state change: [WatchedEvent state:SyncConnected type:NodeDataChanged path:/collections/control_collection/state.json] for collection [control_collection] has occurred - updating... (live nodes size: [1])
   [junit4]   2> 1364551 INFO  (qtp789158328-19567) [n:127.0.0.1:53032_    ] o.a.s.s.HttpSolrCall [admin] webapp=null path=/admin/collections params={collection.configName=conf1&name=control_collection&nrtReplicas=1&action=CREATE&numShards=1&createNodeSet=127.0.0.1:53032_&wt=javabin&version=2} status=0 QTime=1741
   [junit4]   2> 1364574 INFO  (zkConnectionManagerCallback-7077-thread-1) [    ] o.a.s.c.c.ConnectionManager zkClient has connected
   [junit4]   2> 1364575 INFO  (TEST-TestSQLHandler.doTest-seed#[20D481020EF9F2E8]) [    ] o.a.s.c.c.ZkStateReader Updated live nodes from ZooKeeper... (0) -> (1)
   [junit4]   2> 1364576 INFO  (TEST-TestSQLHandler.doTest-seed#[20D481020EF9F2E8]) [    ] o.a.s.c.s.i.ZkClientClusterStateProvider Cluster at 127.0.0.1:53020/solr ready
   [junit4]   2> 1364576 INFO  (TEST-TestSQLHandler.doTest-seed#[20D481020EF9F2E8]) [    ] o.a.s.c.ChaosMonkey monkey: init - expire sessions:false cause connection loss:false
   [junit4]   2> 1364577 INFO  (qtp789158328-19568) [n:127.0.0.1:53032_    ] o.a.s.h.a.CollectionsHandler Invoked Collection Action :create with params collection.configName=conf1&name=collection1&nrtReplicas=1&action=CREATE&numShards=2&createNodeSet=&stateFormat=2&wt=javabin&version=2 and sendToOCPQueue=true
   [junit4]   2> 1364580 INFO  (OverseerThreadFactory-5961-thread-2-processing-n:127.0.0.1:53032_) [n:127.0.0.1:53032_    ] o.a.s.c.a.c.CreateCollectionCmd Create collection collection1
   [junit4]   2> 1364581 INFO  (OverseerCollectionConfigSetProcessor-72137526869164036-127.0.0.1:53032_-n_0000000000) [n:127.0.0.1:53032_    ] o.a.s.c.OverseerTaskQueue Response ZK path: /overseer/collection-queue-work/qnr-0000000000 doesn't exist.  Requestor may have disconnected from ZooKeeper
   [junit4]   2> 1364806 WARN  (OverseerThreadFactory-5961-thread-2-processing-n:127.0.0.1:53032_) [n:127.0.0.1:53032_    ] o.a.s.c.a.c.CreateCollectionCmd It is unusual to create a collection (collection1) without cores.
   [junit4]   2> 1364809 INFO  (qtp789158328-19568) [n:127.0.0.1:53032_    ] o.a.s.h.a.CollectionsHandler Wait for new collection to be active for at most 45 seconds. Check all shard replicas
   [junit4]   2> 1364809 INFO  (qtp789158328-19568) [n:127.0.0.1:53032_    ] o.a.s.s.HttpSolrCall [admin] webapp=null path=/admin/collections params={collection.configName=conf1&name=collection1&nrtReplicas=1&action=CREATE&numShards=2&createNodeSet=&stateFormat=2&wt=javabin&version=2} status=0 QTime=231
   [junit4]   2> 1364812 INFO  (TEST-TestSQLHandler.doTest-seed#[20D481020EF9F2E8]) [    ] o.a.s.c.AbstractFullDistribZkTestBase Creating jetty instances pullReplicaCount=0 numOtherReplicas=4
   [junit4]   2> 1365725 INFO  (TEST-TestSQLHandler.doTest-seed#[20D481020EF9F2E8]) [    ] o.a.s.c.AbstractFullDistribZkTestBase create jetty 1 in directory C:\Users\jenkins\workspace\Lucene-Solr-master-Windows\solr\build\solr-core\test\J0\temp\solr.handler.TestSQLHandler_20D481020EF9F2E8-001\shard-1-001 of type NRT
   [junit4]   2> 1365725 WARN  (closeThreadPool-7078-thread-1) [    ] o.e.j.s.AbstractConnector Ignoring deprecated socket close linger time
   [junit4]   2> 1365725 INFO  (closeThreadPool-7078-thread-1) [    ] o.a.s.c.s.e.JettySolrRunner Start Jetty (original configured port=0)
   [junit4]   2> 1365725 INFO  (closeThreadPool-7078-thread-1) [    ] o.a.s.c.s.e.JettySolrRunner Trying to start Jetty on port 0 try number 1 ...
   [junit4]   2> 1365725 INFO  (closeThreadPool-7078-thread-1) [    ] o.e.j.s.Server jetty-9.4.14.v20181114; built: 2018-11-14T21:20:31.478Z; git: c4550056e785fb5665914545889f21dc136ad9e6; jvm 9.0.4+11
   [junit4]   2> 1365725 INFO  (closeThreadPool-7078-thread-1) [    ] o.e.j.s.session DefaultSessionIdManager workerName=node0
   [junit4]   2> 1365725 INFO  (closeThreadPool-7078-thread-1) [    ] o.e.j.s.session No SessionScavenger set, using defaults
   [junit4]   2> 1365725 INFO  (closeThreadPool-7078-thread-1) [    ] o.e.j.s.session node0 Scavenging every 600000ms
   [junit4]   2> 1365725 INFO  (closeThreadPool-7078-thread-1) [    ] o.e.j.s.h.ContextHandler Started o.e.j.s.ServletContextHandler@398d931f{/,null,AVAILABLE}
   [junit4]   2> 1365731 INFO  (closeThreadPool-7078-thread-1) [    ] o.e.j.s.AbstractConnector Started ServerConnector@6f56f9cb{HTTP/1.1,[http/1.1, h2c]}{127.0.0.1:53071}
   [junit4]   2> 1365731 INFO  (closeThreadPool-7078-thread-1) [    ] o.e.j.s.Server Started @1365805ms
   [junit4]   2> 1365731 INFO  (closeThreadPool-7078-thread-1) [    ] o.a.s.c.s.e.JettySolrRunner Jetty properties: {hostContext=/, solrconfig=solrconfig.xml, solr.data.dir=C:\Users\jenkins\workspace\Lucene-Solr-master-Windows\solr\build\solr-core\test\J0\temp\solr.handler.TestSQLHandler_20D481020EF9F2E8-001\tempDir-001/jetty1, hostPort=53071, coreRootDirectory=C:\Users\jenkins\workspace\Lucene-Solr-master-Windows\solr\build\solr-core\test\J0\temp\solr.handler.TestSQLHandler_20D481020EF9F2E8-001\shard-1-001\cores, replicaType=NRT}
   [junit4]   2> 1365731 ERROR (closeThreadPool-7078-thread-1) [    ] o.a.s.u.StartupLoggingUtils Missing Java Option solr.log.dir. Logging may be missing or incomplete.
   [junit4]   2> 1365731 INFO  (closeThreadPool-7078-thread-1) [    ] o.a.s.s.SolrDispatchFilter Using logger factory org.apache.logging.slf4j.Log4jLoggerFactory
   [junit4]   2> 1365731 INFO  (closeThreadPool-7078-thread-1) [    ] o.a.s.s.SolrDispatchFilter  ___      _       Welcome to Apache Solr™ version 9.0.0
   [junit4]   2> 1365731 INFO  (closeThreadPool-7078-thread-1) [    ] o.a.s.s.SolrDispatchFilter / __| ___| |_ _   Starting in cloud mode on port null
   [junit4]   2> 1365731 INFO  (closeThreadPool-7078-thread-1) [    ] o.a.s.s.SolrDispatchFilter \__ \/ _ \ | '_|  Install dir: null
   [junit4]   2> 1365731 INFO  (closeThreadPool-7078-thread-1) [    ] o.a.s.s.SolrDispatchFilter |___/\___/_|_|    Start time: 2019-03-27T20:09:46.499463800Z
   [junit4]   2> 1365741 INFO  (zkConnectionManagerCallback-7080-thread-1) [    ] o.a.s.c.c.ConnectionManager zkClient has connected
   [junit4]   2> 1365756 INFO  (closeThreadPool-7078-thread-1) [    ] o.a.s.s.SolrDispatchFilter Loading solr.xml from SolrHome (not found in ZooKeeper)
   [junit4]   2> 1365756 INFO  (closeThreadPool-7078-thread-1) [    ] o.a.s.c.SolrXmlConfig Loading container configuration from C:\Users\jenkins\workspace\Lucene-Solr-master-Windows\solr\build\solr-core\test\J0\temp\solr.handler.TestSQLHandler_20D481020EF9F2E8-001\shard-1-001\solr.xml
   [junit4]   2> 1365759 INFO  (closeThreadPool-7078-thread-1) [    ] o.a.s.c.SolrXmlConfig Configuration parameter autoReplicaFailoverWorkLoopDelay is ignored
   [junit4]   2> 1365759 INFO  (closeThreadPool-7078-thread-1) [    ] o.a.s.c.SolrXmlConfig Configuration parameter autoReplicaFailoverBadNodeExpiration is ignored
   [junit4]   2> 1365789 INFO  (closeThreadPool-7078-thread-1) [    ] o.a.s.c.SolrXmlConfig MBean server found: com.sun.jmx.mbeanserver.JmxMBeanServer@786401ac, but no JMX reporters were configured - adding default JMX reporter.
   [junit4]   2> 1366119 INFO  (closeThreadPool-7078-thread-1) [    ] o.a.s.h.c.HttpShardHandlerFactory Host whitelist initialized: WhitelistHostChecker [whitelistHosts=null, whitelistHostCheckingEnabled=false]
   [junit4]   2> 1366122 WARN  (closeThreadPool-7078-thread-1) [    ] o.e.j.u.s.S.config No Client EndPointIdentificationAlgorithm configured for SslContextFactory@128c9f58[provider=null,keyStore=null,trustStore=null]
   [junit4]   2> 1366131 WARN  (closeThreadPool-7078-thread-1) [    ] o.e.j.u.s.S.config No Client EndPointIdentificationAlgorithm configured for SslContextFactory@31082d6c[provider=null,keyStore=null,trustStore=null]
   [junit4]   2> 1366132 INFO  (closeThreadPool-7078-thread-1) [    ] o.a.s.c.ZkContainer Zookeeper client=127.0.0.1:53020/solr
   [junit4]   2> 1366141 INFO  (zkConnectionManagerCallback-7087-thread-1) [    ] o.a.s.c.c.ConnectionManager zkClient has connected
   [junit4]   2> 1366143 WARN  (NIOServerCxn.Factory:0.0.0.0/0.0.0.0:0) [    ] o.a.z.s.NIOServerCnxn Unable to read additional data from client sessionid 0x10048b2d0030009, likely client has closed socket
   [junit4]   2> 1366151 INFO  (zkConnectionManagerCallback-7089-thread-1) [    ] o.a.s.c.c.ConnectionManager zkClient has connected
   [junit4]   2> 1366155 INFO  (closeThreadPool-7078-thread-1) [n:127.0.0.1:53071_    ] o.a.s.c.c.ZkStateReader Updated live nodes from ZooKeeper... (0) -> (1)
   [junit4]   2> 1366164 INFO  (closeThreadPool-7078-thread-1) [n:127.0.0.1:53071_    ] o.a.s.c.ZkController Publish node=127.0.0.1:53071_ as DOWN
   [junit4]   2> 1366165 INFO  (closeThreadPool-7078-thread-1) [n:127.0.0.1:53071_    ] o.a.s.c.TransientSolrCoreCacheDefault Allocating transient cache for 4 transient cores
   [junit4]   2> 1366165 INFO  (closeThreadPool-7078-thread-1) [n:127.0.0.1:53071_    ] o.a.s.c.ZkController Register node as live in ZooKeeper:/live_nodes/127.0.0.1:53071_
   [junit4]   2> 1366168 INFO  (zkCallback-7064-thread-1) [    ] o.a.s.c.c.ZkStateReader Updated live nodes from ZooKeeper... (1) -> (2)
   [junit4]   2> 1366168 INFO  (zkCallback-7057-thread-1) [    ] o.a.s.c.c.ZkStateReader Updated live nodes from ZooKeeper... (1) -> (2)
   [junit4]   2> 1366201 INFO  (zkCallback-7088-thread-1) [    ] o.a.s.c.c.ZkStateReader Updated live nodes from ZooKeeper... (1) -> (2)
   [junit4]   2> 1366214 INFO  (zkCallback-7076-thread-1) [    ] o.a.s.c.c.ZkStateReader Updated live nodes from ZooKeeper... (1) -> (2)
   [junit4]   2> 1366225 INFO  (zkConnectionManagerCallback-7096-thread-1) [    ] o.a.s.c.c.ConnectionManager zkClient has connected
   [junit4]   2> 1366226 INFO  (closeThreadPool-7078-thread-1) [n:127.0.0.1:53071_    ] o.a.s.c.c.ZkStateReader Updated live nodes from ZooKeeper... (0) -> (2)
   [junit4]   2> 1366227 INFO  (closeThreadPool-7078-thread-1) [n:127.0.0.1:53071_    ] o.a.s.c.s.i.ZkClientClusterStateProvider Cluster at 127.0.0.1:53020/solr ready
   [junit4]   2> 1366228 INFO  (closeThreadPool-7078-thread-1) [n:127.0.0.1:53071_    ] o.a.s.h.a.MetricsHistoryHandler No .system collection, keeping metrics history in memory.
   [junit4]   2> 1366251 INFO  (closeThreadPool-7078-thread-1) [n:127.0.0.1:53071_    ] o.a.s.m.r.SolrJmxReporter JMX monitoring for 'solr.node' (registry 'solr.node') enabled at server: com.sun.jmx.mbeanserver.JmxMBeanServer@786401ac
   [junit4]   2> 1366261 INFO  (closeThreadPool-7078-thread-1) [n:127.0.0.1:53071_    ] o.a.s.m.r.SolrJmxReporter JMX monitoring for 'solr.jvm' (registry 'solr.jvm') enabled at server: com.sun.jmx.mbeanserver.JmxMBeanServer@786401ac
   [junit4]   2> 1366261 INFO  (closeThreadPool-7078-thread-1) [n:127.0.0.1:53071_    ] o.a.s.m.r.SolrJmxReporter JMX monitoring for 'solr.jetty' (registry 'solr.jetty') enabled at server: com.sun.jmx.mbeanserver.JmxMBeanServer@786401ac
   [junit4]   2> 1366262 INFO  (closeThreadPool-7078-thread-1) [n:127.0.0.1:53071_    ] o.a.s.c.CorePropertiesLocator Found 0 core definitions underneath C:\Users\jenkins\workspace\Lucene-Solr-master-Windows\solr\build\solr-core\test\J0\temp\solr.handler.TestSQLHandler_20D481020EF9F2E8-001\shard-1-001\cores
   [junit4]   2> 1366403 INFO  (TEST-TestSQLHandler.doTest-seed#[20D481020EF9F2E8]) [    ] o.a.s.c.AbstractFullDistribZkTestBase create jetty 2 in directory C:\Users\jenkins\workspace\Lucene-Solr-master-Windows\solr\build\solr-core\test\J0\temp\solr.handler.TestSQLHandler_20D481020EF9F2E8-001\shard-2-001 of type NRT
   [junit4]   2> 1366404 WARN  (closeThreadPool-7078-thread-1) [    ] o.e.j.s.AbstractConnector Ignoring deprecated socket close linger time
   [junit4]   2> 1366404 INFO  (closeThreadPool-7078-thread-1) [    ] o.a.s.c.s.e.JettySolrRunner Start Jetty (original configured port=0)
   [junit4]   2> 1366404 INFO  (closeThreadPool-7078-thread-1) [    ] o.a.s.c.s.e.JettySolrRunner Trying to start Jetty on port 0 try number 1 ...
   [junit4]   2> 1366404 INFO  (closeThreadPool-7078-thread-1) [    ] o.e.j.s.Server jetty-9.4.14.v20181114; built: 2018-11-14T21:20:31.478Z; git: c4550056e785fb5665914545889f21dc136ad9e6; jvm 9.0.4+11
   [junit4]   2> 1366405 INFO  (closeThreadPool-7078-thread-1) [    ] o.e.j.s.session DefaultSessionIdManager workerName=node0
   [junit4]   2> 1366405 INFO  (closeThreadPool-7078-thread-1) [    ] o.e.j.s.session No SessionScavenger set, using defaults
   [junit4]   2> 1366405 INFO  (closeThreadPool-7078-thread-1) [    ] o.e.j.s.session node0 Scavenging every 600000ms
   [junit4]   2> 1366405 INFO  (closeThreadPool-7078-thread-1) [    ] o.e.j.s.h.ContextHandler Started o.e.j.s.ServletContextHandler@79ca7897{/,null,AVAILABLE}
   [junit4]   2> 1366406 INFO  (closeThreadPool-7078-thread-1) [    ] o.e.j.s.AbstractConnector Started ServerConnector@595e7601{HTTP/1.1,[http/1.1, h2c]}{127.0.0.1:53090}
   [junit4]   2> 1366406 INFO  (closeThreadPool-7078-thread-1) [    ] o.e.j.s.Server Started @1366476ms
   [junit4]   2> 1366406 INFO  (closeThreadPool-7078-thread-1) [    ] o.a.s.c.s.e.JettySolrRunner Jetty properties: {hostContext=/, solrconfig=solrconfig.xml, solr.data.dir=C:\Users\jenkins\workspace\Lucene-Solr-master-Windows\solr\build\solr-core\test\J0\temp\solr.handler.TestSQLHandler_20D481020EF9F2E8-001\tempDir-001/jetty2, hostPort=53090, coreRootDirectory=C:\Users\jenkins\workspace\Lucene-Solr-master-Windows\solr\build\solr-core\test\J0\temp\solr.handler.TestSQLHandler_20D481020EF9F2E8-001\shard-2-001\cores, replicaType=NRT}
   [junit4]   2> 1366406 ERROR (closeThreadPool-7078-thread-1) [    ] o.a.s.u.StartupLoggingUtils Missing Java Option solr.log.dir. Logging may be missing or incomplete.
   [junit4]   2> 1366406 INFO  (closeThreadPool-7078-thread-1) [    ] o.a.s.s.SolrDispatchFilter Using logger factory org.apache.logging.slf4j.Log4jLoggerFactory
   [junit4]   2> 1366406 INFO  (closeThreadPool-7078-thread-1) [    ] o.a.s.s.SolrDispatchFilter  ___      _       Welcome to Apache Solr™ version 9.0.0
   [junit4]   2> 1366406 INFO  (closeThreadPool-7078-thread-1) [    ] o.a.s.s.SolrDispatchFilter / __| ___| |_ _   Starting in cloud mode on port null
   [junit4]   2> 1366406 INFO  (closeThreadPool-7078-thread-1) [    ] o.a.s.s.SolrDispatchFilter \__ \/ _ \ | '_|  Install dir: null
   [junit4]   2> 1366406 INFO  (closeThreadPool-7078-thread-1) [    ] o.a.s.s.SolrDispatchFilter |___/\___/_|_|    Start time: 2019-03-27T20:09:47.174614600Z
   [junit4]   2> 1366411 INFO  (zkConnectionManagerCallback-7099-thread-1) [    ] o.a.s.c.c.ConnectionManager zkClient has connected
   [junit4]   2> 1366412 INFO  (closeThreadPool-7078-thread-1) [    ] o.a.s.s.SolrDispatchFilter Loading solr.xml from SolrHome (not found in ZooKeeper)
   [junit4]   2> 1366412 INFO  (closeThreadPool-7078-thread-1) [    ] o.a.s.c.SolrXmlConfig Loading container configuration from C:\Users\jenkins\workspace\Lucene-Solr-master-Windows\solr\build\solr-core\test\J0\temp\solr.handler.TestSQLHandler_20D481020EF9F2E8-001\shard-2-001\solr.xml
   [junit4]   2> 1366415 INFO  (closeThreadPool-7078-thread-1) [    ] o.a.s.c.SolrXmlConfig Configuration parameter autoReplicaFailoverWorkLoopDelay is ignored
   [junit4]   2> 1366415 INFO  (closeThreadPool-7078-thread-1) [    ] o.a.s.c.SolrXmlConfig Configuration parameter autoReplicaFailoverBadNodeExpiration is ignored
   [junit4]   2> 1366416 INFO  (closeThreadPool-7078-thread-1) [    ] o.a.s.c.SolrXmlConfig MBean server found: com.sun.jmx.mbeanserver.JmxMBeanServer@786401ac, but no JMX reporters were configured - adding default JMX reporter.
   [junit4]   2> 1366585 INFO  (OverseerCollectionConfigSetProcessor-72137526869164036-127.0.0.1:53032_-n_0000000000) [n:127.0.0.1:53032_    ] o.a.s.c.OverseerTaskQueue Response ZK path: /overseer/collection-queue-work/qnr-0000000002 doesn't exist.  Requestor may have disconnected from ZooKeeper
   [junit4]   2> 1366588 INFO  (closeThreadPool-7078-thread-1) [    ] o.a.s.h.c.HttpShardHandlerFactory Host whitelist initialized: WhitelistHostChecker [whitelistHosts=null, whitelistHostCheckingEnabled=false]
   [junit4]   2> 1366596 WARN  (closeThreadPool-7078-thread-1) [    ] o.e.j.u.s.S.config No Client EndPointIdentificationAlgorithm configured for SslContextFactory@57e152fd[provider=null,keyStore=null,trustStore=null]
   [junit4]   2> 1366600 WARN  (closeThreadPool-7078-thread-1) [    ] o.e.j.u.s.S.config No Client EndPointIdentificationAlgorithm configured for SslContextFactory@61316155[provider=null,keyStore=null,trustStore=null]
   [junit4]   2> 1366602 INFO  (closeThreadPool-7078-thread-1) [    ] o.a.s.c.ZkContainer Zookeeper client=127.0.0.1:53020/solr
   [junit4]   2> 1366605 INFO  (zkConnectionManagerCallback-7106-thread-1) [    ] o.a.s.c.c.ConnectionManager zkClient has connected
   [junit4]   2> 1366606 WARN  (NIOServerCxn.Factory:0.0.0.0/0.0.0.0:0) [    ] o.a.z.s.NIOServerCnxn Unable to read additional data from client sessionid 0x10048b2d003000d, likely client has closed socket
   [junit4]   2> 1366610 INFO  (zkConne

[...truncated too long message...]

Test.testOverwriteOption
   [junit4] OK      3.21s J0 | CloudSolrClientTest.testCollectionDoesntExist
   [junit4] OK      8.62s J0 | CloudSolrClientTest.preferReplicaTypesTest
   [junit4] OK      2.50s J0 | CloudSolrClientTest.testWrongZkChrootTest
   [junit4] OK      5.70s J0 | CloudSolrClientTest.testInitializationWithSolrUrls
   [junit4] Completed [1/5] on J0 in 130.34s, 16 tests
   [junit4]
   [junit4] Suite: org.apache.solr.client.solrj.impl.CloudSolrClientTest
   [junit4] OK      12.1s J1 | CloudSolrClientTest.testShutdown
   [junit4] OK      10.5s J1 | CloudSolrClientTest.testParallelUpdateQTime
   [junit4] OK      6.69s J1 | CloudSolrClientTest.stateVersionParamTest
   [junit4] OK      9.40s J1 | CloudSolrClientTest.testNonRetryableRequests
   [junit4] OK      9.90s J1 | CloudSolrClientTest.checkCollectionParameters
   [junit4] OK      8.48s J1 | CloudSolrClientTest.testAliasHandling
   [junit4] OK      6.13s J1 | CloudSolrClientTest.testVersionsAreReturned
   [junit4] OK      13.2s J1 | CloudSolrClientTest.preferLocalShardsTest
   [junit4] OK      9.49s J1 | CloudSolrClientTest.testRetryUpdatesWhenClusterStateIsStale
   [junit4] OK      6.42s J1 | CloudSolrClientTest.testRouting
   [junit4] OK      2.75s J1 | CloudSolrClientTest.customHttpClientTest
   [junit4] OK      6.46s J1 | CloudSolrClientTest.testOverwriteOption
   [junit4] OK      2.16s J1 | CloudSolrClientTest.testCollectionDoesntExist
   [junit4] OK      10.9s J1 | CloudSolrClientTest.preferReplicaTypesTest
   [junit4] OK      2.56s J1 | CloudSolrClientTest.testWrongZkChrootTest
   [junit4] OK      5.57s J1 | CloudSolrClientTest.testInitializationWithSolrUrls
   [junit4] Completed [2/5] on J1 in 134.52s, 16 tests
   [junit4]
   [junit4] Suite: org.apache.solr.client.solrj.impl.CloudSolrClientTest
   [junit4] OK      3.95s J0 | CloudSolrClientTest.testShutdown
   [junit4] OK      5.48s J0 | CloudSolrClientTest.testParallelUpdateQTime
   [junit4] OK      5.20s J0 | CloudSolrClientTest.stateVersionParamTest
   [junit4] OK      6.98s J0 | CloudSolrClientTest.testNonRetryableRequests
   [junit4] OK      6.52s J0 | CloudSolrClientTest.checkCollectionParameters
   [junit4] OK      8.22s J0 | CloudSolrClientTest.testAliasHandling
   [junit4] OK      5.59s J0 | CloudSolrClientTest.testVersionsAreReturned
   [junit4] OK      9.25s J0 | CloudSolrClientTest.preferLocalShardsTest
   [junit4] OK      8.95s J0 | CloudSolrClientTest.testRetryUpdatesWhenClusterStateIsStale
   [junit4] OK      5.14s J0 | CloudSolrClientTest.testRouting
   [junit4] OK      2.09s J0 | CloudSolrClientTest.customHttpClientTest
   [junit4] OK      5.70s J0 | CloudSolrClientTest.testOverwriteOption
   [junit4] OK      2.08s J0 | CloudSolrClientTest.testCollectionDoesntExist
   [junit4] OK      9.48s J0 | CloudSolrClientTest.preferReplicaTypesTest
   [junit4] OK      2.15s J0 | CloudSolrClientTest.testWrongZkChrootTest
   [junit4] OK      5.00s J0 | CloudSolrClientTest.testInitializationWithSolrUrls
   [junit4] Completed [3/5] on J0 in 91.97s, 16 tests
   [junit4]
   [junit4] Suite: org.apache.solr.client.solrj.impl.CloudSolrClientTest
   [junit4] OK      4.09s J1 | CloudSolrClientTest.testShutdown
   [junit4] OK      4.53s J1 | CloudSolrClientTest.testParallelUpdateQTime
   [junit4] OK      4.73s J1 | CloudSolrClientTest.stateVersionParamTest
   [junit4] OK      7.06s J1 | CloudSolrClientTest.testNonRetryableRequests
   [junit4] OK      6.92s J1 | CloudSolrClientTest.checkCollectionParameters
   [junit4] OK      8.83s J1 | CloudSolrClientTest.testAliasHandling
   [junit4] OK      5.59s J1 | CloudSolrClientTest.testVersionsAreReturned
   [junit4] OK      7.86s J1 | CloudSolrClientTest.preferLocalShardsTest
   [junit4] OK      8.55s J1 | CloudSolrClientTest.testRetryUpdatesWhenClusterStateIsStale
   [junit4] OK      4.45s J1 | CloudSolrClientTest.testRouting
   [junit4] OK      3.05s J1 | CloudSolrClientTest.customHttpClientTest
   [junit4] OK      5.45s J1 | CloudSolrClientTest.testOverwriteOption
   [junit4] OK      2.19s J1 | CloudSolrClientTest.testCollectionDoesntExist
   [junit4] OK      11.6s J1 | CloudSolrClientTest.preferReplicaTypesTest
   [junit4] OK      2.49s J1 | CloudSolrClientTest.testWrongZkChrootTest
   [junit4] OK      5.16s J1 | CloudSolrClientTest.testInitializationWithSolrUrls
   [junit4] Completed [4/5] on J1 in 92.89s, 16 tests
   [junit4]
   [junit4] Suite: org.apache.solr.client.solrj.impl.CloudSolrClientTest
   [junit4] OK      3.80s J0 | CloudSolrClientTest.testShutdown
   [junit4] OK      5.13s J0 | CloudSolrClientTest.testParallelUpdateQTime
   [junit4] OK      4.80s J0 | CloudSolrClientTest.stateVersionParamTest
   [junit4] OK      6.92s J0 | CloudSolrClientTest.testNonRetryableRequests
   [junit4] OK      7.23s J0 | CloudSolrClientTest.checkCollectionParameters
   [junit4] OK      8.17s J0 | CloudSolrClientTest.testAliasHandling
   [junit4] OK      4.88s J0 | CloudSolrClientTest.testVersionsAreReturned
   [junit4] OK      9.60s J0 | CloudSolrClientTest.preferLocalShardsTest
   [junit4] OK      8.40s J0 | CloudSolrClientTest.testRetryUpdatesWhenClusterStateIsStale
   [junit4] OK      5.52s J0 | CloudSolrClientTest.testRouting
   [junit4] OK      2.89s J0 | CloudSolrClientTest.customHttpClientTest
   [junit4] OK      5.67s J0 | CloudSolrClientTest.testOverwriteOption
   [junit4] OK      2.55s J0 | CloudSolrClientTest.testCollectionDoesntExist
   [junit4] OK      8.64s J0 | CloudSolrClientTest.preferReplicaTypesTest
   [junit4] OK      2.27s J0 | CloudSolrClientTest.testWrongZkChrootTest
   [junit4] OK      4.59s J0 | CloudSolrClientTest.testInitializationWithSolrUrls
   [junit4] Completed [5/5] on J0 in 91.34s, 16 tests
   [junit4]
   [junit4] JVM J0:     2.00 ..   316.83 =   314.83s
   [junit4] JVM J1:     1.49 ..   230.27 =   228.78s
   [junit4] Execution time total: 5 minutes 16 seconds
   [junit4] Tests summary: 5 suites, 80 tests
   [junit4] Could not remove temporary path: C:\Users\jenkins\workspace\Lucene-Solr-master-Windows\solr\build\solr-solrj\test\J1 (java.nio.file.DirectoryNotEmptyException: Remaining files: [C:\Users\jenkins\workspace\Lucene-Solr-master-Windows\solr\build\solr-solrj\test\J1\temp])
   [junit4] Could not remove temporary path: C:\Users\jenkins\workspace\Lucene-Solr-master-Windows\solr\build\solr-solrj\test\J0 (java.nio.file.DirectoryNotEmptyException: Remaining files: [C:\Users\jenkins\workspace\Lucene-Solr-master-Windows\solr\build\solr-solrj\test\J0\temp])
     [echo] 5 slowest tests:
[junit4:tophints] 125.74s | org.apache.solr.client.solrj.impl.CloudSolrClientTest
[junit4:tophints]  93.84s | org.apache.solr.client.solrj.impl.CloudHttp2SolrClientTest
[junit4:tophints]  85.71s | org.apache.solr.client.solrj.io.stream.StreamDecoratorTest
[junit4:tophints]  52.42s | org.apache.solr.common.cloud.TestCollectionStateWatchers
[junit4:tophints]  49.80s | org.apache.solr.common.cloud.TestCloudCollectionsListeners

-check-totals:
WARNING: An illegal reflective access operation has occurred
WARNING: Illegal reflective access by org.codehaus.groovy.reflection.CachedClass (file:/C:/Users/jenkins/.ivy2/cache/org.codehaus.groovy/groovy-all/jars/groovy-all-2.4.15.jar) to method java.lang.Object.finalize()
WARNING: Please consider reporting this to the maintainers of org.codehaus.groovy.reflection.CachedClass
WARNING: Use --illegal-access=warn to enable warnings of further illegal reflective access operations
WARNING: All illegal access operations will be denied in a future release

test-nocompile:

BUILD SUCCESSFUL
Total time: 5 minutes 21 seconds
[repro] Failures:
[repro]   0/5 failed: org.apache.solr.client.solrj.impl.CloudSolrClientTest
[repro]   3/5 failed: org.apache.solr.handler.TestSQLHandler
[repro] Exiting with code 1

C:\Users\jenkins\workspace\Lucene-Solr-master-Windows>IF EXIST lucene\build move /y lucene\build lucene\build.repro
        1 dir(s) moved.

C:\Users\jenkins\workspace\Lucene-Solr-master-Windows>IF EXIST solr\build move /y solr\build solr\build.repro
        1 dir(s) moved.

C:\Users\jenkins\workspace\Lucene-Solr-master-Windows>IF EXIST lucene\build.orig move /y lucene\build.orig lucene\build
        1 dir(s) moved.

C:\Users\jenkins\workspace\Lucene-Solr-master-Windows>IF EXIST solr\build.orig move /y solr\build.orig solr\build
        1 dir(s) moved.

C:\Users\jenkins\workspace\Lucene-Solr-master-Windows>exit 0
Archiving artifacts
Setting ANT_1_8_2_HOME=C:\Users\jenkins\tools\hudson.tasks.Ant_AntInstallation\ANT_1.8.2
[WARNINGS] Parsing warnings in console log with parser Java Compiler (javac)
Setting ANT_1_8_2_HOME=C:\Users\jenkins\tools\hudson.tasks.Ant_AntInstallation\ANT_1.8.2
No credentials specified
Setting ANT_1_8_2_HOME=C:\Users\jenkins\tools\hudson.tasks.Ant_AntInstallation\ANT_1.8.2
<Git Blamer> Using GitBlamer to create author and commit information for all warnings.
<Git Blamer> GIT_COMMIT=7e834516104a2c3f68722ef08cc867a492119667, workspace=C:\Users\jenkins\workspace\Lucene-Solr-master-Windows
[WARNINGS] Computing warning deltas based on reference build #7840
Recording test results
Setting ANT_1_8_2_HOME=C:\Users\jenkins\tools\hudson.tasks.Ant_AntInstallation\ANT_1.8.2
Build step 'Publish JUnit test result report' changed build result to UNSTABLE
Email was triggered for: Unstable (Test Failures)
Sending email for trigger: Unstable (Test Failures)
Setting ANT_1_8_2_HOME=C:\Users\jenkins\tools\hudson.tasks.Ant_AntInstallation\ANT_1.8.2
Setting ANT_1_8_2_HOME=C:\Users\jenkins\tools\hudson.tasks.Ant_AntInstallation\ANT_1.8.2
Setting ANT_1_8_2_HOME=C:\Users\jenkins\tools\hudson.tasks.Ant_AntInstallation\ANT_1.8.2
Setting ANT_1_8_2_HOME=C:\Users\jenkins\tools\hudson.tasks.Ant_AntInstallation\ANT_1.8.2
Setting ANT_1_8_2_HOME=C:\Users\jenkins\tools\hudson.tasks.Ant_AntInstallation\ANT_1.8.2
Setting ANT_1_8_2_HOME=C:\Users\jenkins\tools\hudson.tasks.Ant_AntInstallation\ANT_1.8.2

---------------------------------------------------------------------
To unsubscribe, e-mail: [hidden email]
For additional commands, e-mail: [hidden email]