[JENKINS] Lucene-Solr-tests-only-3.x-java7 - Build # 1698 - Failure

classic Classic list List threaded Threaded
2 messages Options
Reply | Threaded
Open this post in threaded view
|

[JENKINS] Lucene-Solr-tests-only-3.x-java7 - Build # 1698 - Failure

Apache Jenkins Server-2
Build: https://builds.apache.org/job/Lucene-Solr-tests-only-3.x-java7/1698/

1 tests failed.
REGRESSION:  org.apache.solr.client.solrj.embedded.LargeVolumeJettyTest.testMultiThreaded

Error Message:
java.lang.AssertionError: Some threads threw uncaught exceptions!

Stack Trace:
java.lang.RuntimeException: java.lang.AssertionError: Some threads threw uncaught exceptions!
        at org.apache.lucene.util.LuceneTestCase.tearDown(LuceneTestCase.java:593)
        at org.apache.solr.SolrTestCaseJ4.tearDown(SolrTestCaseJ4.java:96)
        at org.apache.lucene.util.LuceneTestCaseRunner.runChild(LuceneTestCaseRunner.java:147)
        at org.apache.lucene.util.LuceneTestCaseRunner.runChild(LuceneTestCaseRunner.java:50)
        at org.apache.lucene.util.LuceneTestCase.checkUncaughtExceptionsAfter(LuceneTestCase.java:621)
        at org.apache.lucene.util.LuceneTestCase.tearDown(LuceneTestCase.java:565)




Build Log (for compile errors):
[...truncated 16674 lines...]



---------------------------------------------------------------------
To unsubscribe, e-mail: [hidden email]
For additional commands, e-mail: [hidden email]

Reply | Threaded
Open this post in threaded view
|

[JENKINS] Lucene-Solr-tests-only-3.x-java7 - Build # 1699 - Still Failing

Apache Jenkins Server-2
Build: https://builds.apache.org/job/Lucene-Solr-tests-only-3.x-java7/1699/

1 tests failed.
REGRESSION:  org.apache.solr.TestDistributedGrouping.testDistribSearch

Error Message:
java.lang.AssertionError: Some threads threw uncaught exceptions!

Stack Trace:
java.lang.RuntimeException: java.lang.AssertionError: Some threads threw uncaught exceptions!
        at org.apache.lucene.util.LuceneTestCase.tearDown(LuceneTestCase.java:593)
        at org.apache.solr.SolrTestCaseJ4.tearDown(SolrTestCaseJ4.java:96)
        at org.apache.solr.BaseDistributedSearchTestCase.tearDown(BaseDistributedSearchTestCase.java:160)
        at org.apache.lucene.util.LuceneTestCaseRunner.runChild(LuceneTestCaseRunner.java:147)
        at org.apache.lucene.util.LuceneTestCaseRunner.runChild(LuceneTestCaseRunner.java:50)
        at org.apache.lucene.util.LuceneTestCase.checkUncaughtExceptionsAfter(LuceneTestCase.java:621)
        at org.apache.lucene.util.LuceneTestCase.tearDown(LuceneTestCase.java:565)




Build Log (for compile errors):
[...truncated 16227 lines...]



---------------------------------------------------------------------
To unsubscribe, e-mail: [hidden email]
For additional commands, e-mail: [hidden email]