[JENKINS] Lucene-Solr-tests-only-trunk - Build # 12492 - Failure

classic Classic list List threaded Threaded
5 messages Options
Reply | Threaded
Open this post in threaded view
|

[JENKINS] Lucene-Solr-tests-only-trunk - Build # 12492 - Failure

Apache Jenkins Server-2
Build: https://builds.apache.org/job/Lucene-Solr-tests-only-trunk/12492/

2 tests failed.
REGRESSION:  org.apache.lucene.index.TestDeletionPolicy.testKeepLastNDeletionPolicyWithCreates

Error Message:
null

Stack Trace:
java.lang.NullPointerException
        at org.apache.lucene.index.FilterAtomicReader$FilterFields.terms(FilterAtomicReader.java:53)
        at org.apache.lucene.util.TermContext.build(TermContext.java:94)
        at org.apache.lucene.search.TermQuery.createWeight(TermQuery.java:180)
        at org.apache.lucene.search.IndexSearcher.createNormalizedWeight(IndexSearcher.java:584)
        at org.apache.lucene.search.AssertingIndexSearcher.createNormalizedWeight(AssertingIndexSearcher.java:59)
        at org.apache.lucene.search.IndexSearcher.search(IndexSearcher.java:258)
        at org.apache.lucene.index.TestDeletionPolicy.testKeepLastNDeletionPolicyWithCreates(TestDeletionPolicy.java:701)
        at org.apache.lucene.util.LuceneTestCase$SubclassSetupTeardownRule$1.evaluate(LuceneTestCase.java:707)
        at org.apache.lucene.util.LuceneTestCase$InternalSetupTeardownRule$1.evaluate(LuceneTestCase.java:606)
        at org.apache.lucene.util.LuceneTestCase$TestResultInterceptorRule$1.evaluate(LuceneTestCase.java:511)
        at org.apache.lucene.util.LuceneTestCase$RememberThreadRule$1.evaluate(LuceneTestCase.java:569)
        at org.apache.lucene.util.LuceneTestCaseRunner.runChild(LuceneTestCaseRunner.java:165)
        at org.apache.lucene.util.LuceneTestCaseRunner.runChild(LuceneTestCaseRunner.java:57)


REGRESSION:  org.apache.lucene.index.TestIndexWriterNRTIsCurrent.testIsCurrentWithThreads

Error Message:
java.lang.AssertionError: Some threads threw uncaught exceptions!

Stack Trace:
java.lang.RuntimeException: java.lang.AssertionError: Some threads threw uncaught exceptions!
        at org.apache.lucene.util.LuceneTestCase.tearDownInternal(LuceneTestCase.java:780)
        at org.apache.lucene.util.LuceneTestCase.access$1000(LuceneTestCase.java:138)
        at org.apache.lucene.util.LuceneTestCase$InternalSetupTeardownRule$1.evaluate(LuceneTestCase.java:607)
        at org.apache.lucene.util.LuceneTestCase$TestResultInterceptorRule$1.evaluate(LuceneTestCase.java:511)
        at org.apache.lucene.util.LuceneTestCase$RememberThreadRule$1.evaluate(LuceneTestCase.java:569)
        at org.apache.lucene.util.LuceneTestCaseRunner.runChild(LuceneTestCaseRunner.java:165)
        at org.apache.lucene.util.LuceneTestCaseRunner.runChild(LuceneTestCaseRunner.java:57)
        at org.apache.lucene.util.LuceneTestCase.checkUncaughtExceptionsAfter(LuceneTestCase.java:808)
        at org.apache.lucene.util.LuceneTestCase.tearDownInternal(LuceneTestCase.java:752)




Build Log (for compile errors):
[...truncated 1547 lines...]




---------------------------------------------------------------------
To unsubscribe, e-mail: [hidden email]
For additional commands, e-mail: [hidden email]
Reply | Threaded
Open this post in threaded view
|

[JENKINS] Lucene-Solr-tests-only-trunk - Build # 12493 - Still Failing

Apache Jenkins Server-2
Build: https://builds.apache.org/job/Lucene-Solr-tests-only-trunk/12493/

1 tests failed.
FAILED:  org.apache.lucene.queries.function.TestOrdValues.testReverseOrdFieldRank

Error Message:
java.lang.AssertionError: org.apache.lucene.queries.function.TestOrdValues.testReverseOrdFieldRank: Insane FieldCache usage(s) found expected:<0> but was:<1>

Stack Trace:
java.lang.RuntimeException: java.lang.AssertionError: org.apache.lucene.queries.function.TestOrdValues.testReverseOrdFieldRank: Insane FieldCache usage(s) found expected:<0> but was:<1>
        at org.apache.lucene.util.LuceneTestCase.tearDownInternal(LuceneTestCase.java:780)
        at org.apache.lucene.util.LuceneTestCase.access$1000(LuceneTestCase.java:138)
        at org.apache.lucene.util.LuceneTestCase$InternalSetupTeardownRule$1.evaluate(LuceneTestCase.java:607)
        at org.apache.lucene.util.LuceneTestCase$TestResultInterceptorRule$1.evaluate(LuceneTestCase.java:511)
        at org.apache.lucene.util.LuceneTestCase$RememberThreadRule$1.evaluate(LuceneTestCase.java:569)
        at org.apache.lucene.util.LuceneTestCaseRunner.runChild(LuceneTestCaseRunner.java:165)
        at org.apache.lucene.util.LuceneTestCaseRunner.runChild(LuceneTestCaseRunner.java:57)
        at org.apache.lucene.util.LuceneTestCase.assertSaneFieldCaches(LuceneTestCase.java:907)
        at org.apache.lucene.util.LuceneTestCase.tearDownInternal(LuceneTestCase.java:770)




Build Log (for compile errors):
[...truncated 5037 lines...]




---------------------------------------------------------------------
To unsubscribe, e-mail: [hidden email]
For additional commands, e-mail: [hidden email]
Reply | Threaded
Open this post in threaded view
|

Re: [JENKINS] Lucene-Solr-tests-only-trunk - Build # 12492 - Failure

Robert Muir
In reply to this post by Apache Jenkins Server-2
There are actually 2 failures here... TestDeletionPolicy was a bug in
LuceneTestCase.
TestIndexWriterNRTIsCurrent is something else, and it doesnt reproduce
easily yet

On Wed, Feb 22, 2012 at 4:11 AM, Apache Jenkins Server
<[hidden email]> wrote:

> Build: https://builds.apache.org/job/Lucene-Solr-tests-only-trunk/12492/
>
> 2 tests failed.
> REGRESSION:  org.apache.lucene.index.TestDeletionPolicy.testKeepLastNDeletionPolicyWithCreates
>
> Error Message:
> null
>
> Stack Trace:
> java.lang.NullPointerException
>        at org.apache.lucene.index.FilterAtomicReader$FilterFields.terms(FilterAtomicReader.java:53)
>        at org.apache.lucene.util.TermContext.build(TermContext.java:94)
>        at org.apache.lucene.search.TermQuery.createWeight(TermQuery.java:180)
>        at org.apache.lucene.search.IndexSearcher.createNormalizedWeight(IndexSearcher.java:584)
>        at org.apache.lucene.search.AssertingIndexSearcher.createNormalizedWeight(AssertingIndexSearcher.java:59)
>        at org.apache.lucene.search.IndexSearcher.search(IndexSearcher.java:258)
>        at org.apache.lucene.index.TestDeletionPolicy.testKeepLastNDeletionPolicyWithCreates(TestDeletionPolicy.java:701)
>        at org.apache.lucene.util.LuceneTestCase$SubclassSetupTeardownRule$1.evaluate(LuceneTestCase.java:707)
>        at org.apache.lucene.util.LuceneTestCase$InternalSetupTeardownRule$1.evaluate(LuceneTestCase.java:606)
>        at org.apache.lucene.util.LuceneTestCase$TestResultInterceptorRule$1.evaluate(LuceneTestCase.java:511)
>        at org.apache.lucene.util.LuceneTestCase$RememberThreadRule$1.evaluate(LuceneTestCase.java:569)
>        at org.apache.lucene.util.LuceneTestCaseRunner.runChild(LuceneTestCaseRunner.java:165)
>        at org.apache.lucene.util.LuceneTestCaseRunner.runChild(LuceneTestCaseRunner.java:57)
>
>
> REGRESSION:  org.apache.lucene.index.TestIndexWriterNRTIsCurrent.testIsCurrentWithThreads
>
> Error Message:
> java.lang.AssertionError: Some threads threw uncaught exceptions!
>
> Stack Trace:
> java.lang.RuntimeException: java.lang.AssertionError: Some threads threw uncaught exceptions!
>        at org.apache.lucene.util.LuceneTestCase.tearDownInternal(LuceneTestCase.java:780)
>        at org.apache.lucene.util.LuceneTestCase.access$1000(LuceneTestCase.java:138)
>        at org.apache.lucene.util.LuceneTestCase$InternalSetupTeardownRule$1.evaluate(LuceneTestCase.java:607)
>        at org.apache.lucene.util.LuceneTestCase$TestResultInterceptorRule$1.evaluate(LuceneTestCase.java:511)
>        at org.apache.lucene.util.LuceneTestCase$RememberThreadRule$1.evaluate(LuceneTestCase.java:569)
>        at org.apache.lucene.util.LuceneTestCaseRunner.runChild(LuceneTestCaseRunner.java:165)
>        at org.apache.lucene.util.LuceneTestCaseRunner.runChild(LuceneTestCaseRunner.java:57)
>        at org.apache.lucene.util.LuceneTestCase.checkUncaughtExceptionsAfter(LuceneTestCase.java:808)
>        at org.apache.lucene.util.LuceneTestCase.tearDownInternal(LuceneTestCase.java:752)
>
>
>
>
> Build Log (for compile errors):
> [...truncated 1547 lines...]
>
>
>
>
> ---------------------------------------------------------------------
> To unsubscribe, e-mail: [hidden email]
> For additional commands, e-mail: [hidden email]



--
lucidimagination.com

---------------------------------------------------------------------
To unsubscribe, e-mail: [hidden email]
For additional commands, e-mail: [hidden email]

Reply | Threaded
Open this post in threaded view
|

[JENKINS] Lucene-Solr-tests-only-trunk - Build # 12494 - Still Failing

Apache Jenkins Server-2
In reply to this post by Apache Jenkins Server-2
Build: https://builds.apache.org/job/Lucene-Solr-tests-only-trunk/12494/

2 tests failed.
FAILED:  org.apache.solr.cloud.BasicDistributedZkTest.testDistribSearch

Error Message:
There are still nodes recoverying

Stack Trace:
junit.framework.AssertionFailedError: There are still nodes recoverying
        at org.apache.lucene.util.LuceneTestCaseRunner.runChild(LuceneTestCaseRunner.java:165)
        at org.apache.lucene.util.LuceneTestCaseRunner.runChild(LuceneTestCaseRunner.java:57)
        at org.apache.solr.cloud.AbstractDistributedZkTestCase.waitForRecoveriesToFinish(AbstractDistributedZkTestCase.java:124)
        at org.apache.solr.cloud.BasicDistributedZkTest.testANewCollectionInOneInstanceWithManualShardAssignement(BasicDistributedZkTest.java:306)
        at org.apache.solr.cloud.BasicDistributedZkTest.doTest(BasicDistributedZkTest.java:276)
        at org.apache.solr.BaseDistributedSearchTestCase.testDistribSearch(BaseDistributedSearchTestCase.java:664)
        at org.apache.lucene.util.LuceneTestCase$SubclassSetupTeardownRule$1.evaluate(LuceneTestCase.java:707)
        at org.apache.lucene.util.LuceneTestCase$InternalSetupTeardownRule$1.evaluate(LuceneTestCase.java:606)
        at org.apache.lucene.util.LuceneTestCase$TestResultInterceptorRule$1.evaluate(LuceneTestCase.java:511)
        at org.apache.lucene.util.LuceneTestCase$RememberThreadRule$1.evaluate(LuceneTestCase.java:569)


FAILED:  junit.framework.TestSuite.org.apache.solr.cloud.BasicDistributedZkTest

Error Message:
ERROR: SolrIndexSearcher opens=86 closes=85

Stack Trace:
junit.framework.AssertionFailedError: ERROR: SolrIndexSearcher opens=86 closes=85
        at org.apache.solr.SolrTestCaseJ4.endTrackingSearchers(SolrTestCaseJ4.java:152)
        at org.apache.solr.SolrTestCaseJ4.afterClassSolrTestCase(SolrTestCaseJ4.java:76)




Build Log (for compile errors):
[...truncated 7939 lines...]




---------------------------------------------------------------------
To unsubscribe, e-mail: [hidden email]
For additional commands, e-mail: [hidden email]
Reply | Threaded
Open this post in threaded view
|

Re: [JENKINS] Lucene-Solr-tests-only-trunk - Build # 12492 - Failure

Robert Muir
In reply to this post by Robert Muir
OK for the TestIndexWriterNRTisCurrent, it reproduces better if you
make your computer busy (run it with -Dtests.iter=100 or so at the
same time as running 'ant test' in another checkout)

improving the assert a bit:
    [junit] Caused by: java.lang.AssertionError: out of bounds:
docid=0,liveDocsLength=0
    [junit] at
org.apache.lucene.index.IndexWriter$ReadersAndLiveDocs.delete(IndexWriter.java:535)
    [junit] at
org.apache.lucene.index.IndexWriter.commitMergedDeletes(IndexWriter.java:3062)
    [junit] at
org.apache.lucene.index.IndexWriter.commitMerge(IndexWriter.java:3136)

seems bogus that we have a 0-length bitvector...

On Wed, Feb 22, 2012 at 6:15 AM, Robert Muir <[hidden email]> wrote:

> There are actually 2 failures here... TestDeletionPolicy was a bug in
> LuceneTestCase.
> TestIndexWriterNRTIsCurrent is something else, and it doesnt reproduce
> easily yet
>
> On Wed, Feb 22, 2012 at 4:11 AM, Apache Jenkins Server
> <[hidden email]> wrote:
>> Build: https://builds.apache.org/job/Lucene-Solr-tests-only-trunk/12492/
>>
>> 2 tests failed.
>> REGRESSION:  org.apache.lucene.index.TestDeletionPolicy.testKeepLastNDeletionPolicyWithCreates
>>
>> Error Message:
>> null
>>
>> Stack Trace:
>> java.lang.NullPointerException
>>        at org.apache.lucene.index.FilterAtomicReader$FilterFields.terms(FilterAtomicReader.java:53)
>>        at org.apache.lucene.util.TermContext.build(TermContext.java:94)
>>        at org.apache.lucene.search.TermQuery.createWeight(TermQuery.java:180)
>>        at org.apache.lucene.search.IndexSearcher.createNormalizedWeight(IndexSearcher.java:584)
>>        at org.apache.lucene.search.AssertingIndexSearcher.createNormalizedWeight(AssertingIndexSearcher.java:59)
>>        at org.apache.lucene.search.IndexSearcher.search(IndexSearcher.java:258)
>>        at org.apache.lucene.index.TestDeletionPolicy.testKeepLastNDeletionPolicyWithCreates(TestDeletionPolicy.java:701)
>>        at org.apache.lucene.util.LuceneTestCase$SubclassSetupTeardownRule$1.evaluate(LuceneTestCase.java:707)
>>        at org.apache.lucene.util.LuceneTestCase$InternalSetupTeardownRule$1.evaluate(LuceneTestCase.java:606)
>>        at org.apache.lucene.util.LuceneTestCase$TestResultInterceptorRule$1.evaluate(LuceneTestCase.java:511)
>>        at org.apache.lucene.util.LuceneTestCase$RememberThreadRule$1.evaluate(LuceneTestCase.java:569)
>>        at org.apache.lucene.util.LuceneTestCaseRunner.runChild(LuceneTestCaseRunner.java:165)
>>        at org.apache.lucene.util.LuceneTestCaseRunner.runChild(LuceneTestCaseRunner.java:57)
>>
>>
>> REGRESSION:  org.apache.lucene.index.TestIndexWriterNRTIsCurrent.testIsCurrentWithThreads
>>
>> Error Message:
>> java.lang.AssertionError: Some threads threw uncaught exceptions!
>>
>> Stack Trace:
>> java.lang.RuntimeException: java.lang.AssertionError: Some threads threw uncaught exceptions!
>>        at org.apache.lucene.util.LuceneTestCase.tearDownInternal(LuceneTestCase.java:780)
>>        at org.apache.lucene.util.LuceneTestCase.access$1000(LuceneTestCase.java:138)
>>        at org.apache.lucene.util.LuceneTestCase$InternalSetupTeardownRule$1.evaluate(LuceneTestCase.java:607)
>>        at org.apache.lucene.util.LuceneTestCase$TestResultInterceptorRule$1.evaluate(LuceneTestCase.java:511)
>>        at org.apache.lucene.util.LuceneTestCase$RememberThreadRule$1.evaluate(LuceneTestCase.java:569)
>>        at org.apache.lucene.util.LuceneTestCaseRunner.runChild(LuceneTestCaseRunner.java:165)
>>        at org.apache.lucene.util.LuceneTestCaseRunner.runChild(LuceneTestCaseRunner.java:57)
>>        at org.apache.lucene.util.LuceneTestCase.checkUncaughtExceptionsAfter(LuceneTestCase.java:808)
>>        at org.apache.lucene.util.LuceneTestCase.tearDownInternal(LuceneTestCase.java:752)
>>
>>
>>
>>
>> Build Log (for compile errors):
>> [...truncated 1547 lines...]
>>
>>
>>
>>
>> ---------------------------------------------------------------------
>> To unsubscribe, e-mail: [hidden email]
>> For additional commands, e-mail: [hidden email]
>
>
>
> --
> lucidimagination.com



--
lucidimagination.com

---------------------------------------------------------------------
To unsubscribe, e-mail: [hidden email]
For additional commands, e-mail: [hidden email]