[JENKINS] Lucene-Solr-tests-only-trunk-java7 - Build # 1681 - Failure

classic Classic list List threaded Threaded
1 message Options
Reply | Threaded
Open this post in threaded view
|

[JENKINS] Lucene-Solr-tests-only-trunk-java7 - Build # 1681 - Failure

Apache Jenkins Server-2
Build: https://builds.apache.org/job/Lucene-Solr-tests-only-trunk-java7/1681/

1 tests failed.
REGRESSION:  org.apache.solr.client.solrj.embedded.LargeVolumeBinaryJettyTest.testMultiThreaded

Error Message:
java.lang.AssertionError: Some threads threw uncaught exceptions!

Stack Trace:
java.lang.RuntimeException: java.lang.AssertionError: Some threads threw uncaught exceptions!
        at org.apache.lucene.util.LuceneTestCase.tearDown(LuceneTestCase.java:677)
        at org.apache.solr.SolrTestCaseJ4.tearDown(SolrTestCaseJ4.java:89)
        at org.apache.lucene.util.LuceneTestCaseRunner.runChild(LuceneTestCaseRunner.java:165)
        at org.apache.lucene.util.LuceneTestCaseRunner.runChild(LuceneTestCaseRunner.java:57)
        at org.apache.lucene.util.LuceneTestCase.checkUncaughtExceptionsAfter(LuceneTestCase.java:705)
        at org.apache.lucene.util.LuceneTestCase.tearDown(LuceneTestCase.java:649)




Build Log (for compile errors):
[...truncated 10675 lines...]



---------------------------------------------------------------------
To unsubscribe, e-mail: [hidden email]
For additional commands, e-mail: [hidden email]