[JENKINS] Lucene-Solr-tests-only-trunk-java7 - Build # 1781 - Failure

classic Classic list List threaded Threaded
2 messages Options
Reply | Threaded
Open this post in threaded view
|

[JENKINS] Lucene-Solr-tests-only-trunk-java7 - Build # 1781 - Failure

Apache Jenkins Server-2
Build: https://builds.apache.org/job/Lucene-Solr-tests-only-trunk-java7/1781/

1 tests failed.
REGRESSION:  org.apache.lucene.queries.function.TestOrdValues.testOrdFieldRank

Error Message:
java.lang.AssertionError: org.apache.lucene.queries.function.TestOrdValues.testOrdFieldRank: Insane FieldCache usage(s) found expected:<0> but was:<1>

Stack Trace:
java.lang.RuntimeException: java.lang.AssertionError: org.apache.lucene.queries.function.TestOrdValues.testOrdFieldRank: Insane FieldCache usage(s) found expected:<0> but was:<1>
        at org.apache.lucene.util.LuceneTestCase.tearDownInternal(LuceneTestCase.java:780)
        at org.apache.lucene.util.LuceneTestCase.access$1000(LuceneTestCase.java:138)
        at org.apache.lucene.util.LuceneTestCase$InternalSetupTeardownRule$1.evaluate(LuceneTestCase.java:607)
        at org.apache.lucene.util.LuceneTestCase$TestResultInterceptorRule$1.evaluate(LuceneTestCase.java:511)
        at org.apache.lucene.util.LuceneTestCase$RememberThreadRule$1.evaluate(LuceneTestCase.java:569)
        at org.apache.lucene.util.LuceneTestCaseRunner.runChild(LuceneTestCaseRunner.java:165)
        at org.apache.lucene.util.LuceneTestCaseRunner.runChild(LuceneTestCaseRunner.java:57)
        at org.apache.lucene.util.LuceneTestCase.assertSaneFieldCaches(LuceneTestCase.java:907)
        at org.apache.lucene.util.LuceneTestCase.tearDownInternal(LuceneTestCase.java:770)




Build Log (for compile errors):
[...truncated 7133 lines...]




---------------------------------------------------------------------
To unsubscribe, e-mail: [hidden email]
For additional commands, e-mail: [hidden email]
Reply | Threaded
Open this post in threaded view
|

[JENKINS] Lucene-Solr-tests-only-trunk-java7 - Build # 1782 - Still Failing

Apache Jenkins Server-2
Build: https://builds.apache.org/job/Lucene-Solr-tests-only-trunk-java7/1782/

1 tests failed.
REGRESSION:  org.apache.lucene.search.TestComplexExplanations.testFQ5

Error Message:
java.lang.AssertionError: org.apache.lucene.search.TestComplexExplanations.testFQ5: Insane FieldCache usage(s) found expected:<0> but was:<1>

Stack Trace:
java.lang.RuntimeException: java.lang.AssertionError: org.apache.lucene.search.TestComplexExplanations.testFQ5: Insane FieldCache usage(s) found expected:<0> but was:<1>
        at org.apache.lucene.util.LuceneTestCase.tearDownInternal(LuceneTestCase.java:780)
        at org.apache.lucene.util.LuceneTestCase.access$1000(LuceneTestCase.java:138)
        at org.apache.lucene.util.LuceneTestCase$InternalSetupTeardownRule$1.evaluate(LuceneTestCase.java:607)
        at org.apache.lucene.util.LuceneTestCase$TestResultInterceptorRule$1.evaluate(LuceneTestCase.java:511)
        at org.apache.lucene.util.LuceneTestCase$RememberThreadRule$1.evaluate(LuceneTestCase.java:569)
        at org.apache.lucene.util.LuceneTestCaseRunner.runChild(LuceneTestCaseRunner.java:165)
        at org.apache.lucene.util.LuceneTestCaseRunner.runChild(LuceneTestCaseRunner.java:57)
        at org.apache.lucene.util.LuceneTestCase.assertSaneFieldCaches(LuceneTestCase.java:907)
        at org.apache.lucene.util.LuceneTestCase.tearDownInternal(LuceneTestCase.java:770)




Build Log (for compile errors):
[...truncated 1919 lines...]




---------------------------------------------------------------------
To unsubscribe, e-mail: [hidden email]
For additional commands, e-mail: [hidden email]