[JENKINS] Lucene-Solr-trunk-Linux (32bit/jdk1.7.0_25) - Build # 6852 - Failure!

classic Classic list List threaded Threaded
2 messages Options
Reply | Threaded
Open this post in threaded view
|

[JENKINS] Lucene-Solr-trunk-Linux (32bit/jdk1.7.0_25) - Build # 6852 - Failure!

Policeman Jenkins Server-2
Build: http://jenkins.thetaphi.de/job/Lucene-Solr-trunk-Linux/6852/
Java: 32bit/jdk1.7.0_25 -server -XX:+UseSerialGC

1 tests failed.
FAILED:  org.apache.solr.cloud.CollectionsAPIDistributedZkTest.testDistribSearch

Error Message:
Server refused connection at: http://127.0.0.1:39200/yyhb/my

Stack Trace:
org.apache.solr.client.solrj.SolrServerException: Server refused connection at: http://127.0.0.1:39200/yyhb/my
        at __randomizedtesting.SeedInfo.seed([6562A0F73CF9AEED:E4842EEF4BA6CED1]:0)
        at org.apache.solr.client.solrj.impl.HttpSolrServer.request(HttpSolrServer.java:428)
        at org.apache.solr.client.solrj.impl.HttpSolrServer.request(HttpSolrServer.java:180)
        at org.apache.solr.cloud.AbstractFullDistribZkTestBase.createCollection(AbstractFullDistribZkTestBase.java:1535)
        at org.apache.solr.cloud.CollectionsAPIDistributedZkTest.testCustomCollectionsAPI(CollectionsAPIDistributedZkTest.java:677)
        at org.apache.solr.cloud.CollectionsAPIDistributedZkTest.doTest(CollectionsAPIDistributedZkTest.java:159)
        at org.apache.solr.BaseDistributedSearchTestCase.testDistribSearch(BaseDistributedSearchTestCase.java:835)
        at sun.reflect.NativeMethodAccessorImpl.invoke0(Native Method)
        at sun.reflect.NativeMethodAccessorImpl.invoke(NativeMethodAccessorImpl.java:57)
        at sun.reflect.DelegatingMethodAccessorImpl.invoke(DelegatingMethodAccessorImpl.java:43)
        at java.lang.reflect.Method.invoke(Method.java:606)
        at com.carrotsearch.randomizedtesting.RandomizedRunner.invoke(RandomizedRunner.java:1559)
        at com.carrotsearch.randomizedtesting.RandomizedRunner.access$600(RandomizedRunner.java:79)
        at com.carrotsearch.randomizedtesting.RandomizedRunner$6.evaluate(RandomizedRunner.java:737)
        at com.carrotsearch.randomizedtesting.RandomizedRunner$7.evaluate(RandomizedRunner.java:773)
        at com.carrotsearch.randomizedtesting.RandomizedRunner$8.evaluate(RandomizedRunner.java:787)
        at com.carrotsearch.randomizedtesting.rules.SystemPropertiesRestoreRule$1.evaluate(SystemPropertiesRestoreRule.java:53)
        at org.apache.lucene.util.TestRuleSetupTeardownChained$1.evaluate(TestRuleSetupTeardownChained.java:50)
        at org.apache.lucene.util.TestRuleFieldCacheSanity$1.evaluate(TestRuleFieldCacheSanity.java:51)
        at org.apache.lucene.util.AbstractBeforeAfterRule$1.evaluate(AbstractBeforeAfterRule.java:46)
        at com.carrotsearch.randomizedtesting.rules.SystemPropertiesInvariantRule$1.evaluate(SystemPropertiesInvariantRule.java:55)
        at org.apache.lucene.util.TestRuleThreadAndTestName$1.evaluate(TestRuleThreadAndTestName.java:49)
        at org.apache.lucene.util.TestRuleIgnoreAfterMaxFailures$1.evaluate(TestRuleIgnoreAfterMaxFailures.java:70)
        at org.apache.lucene.util.TestRuleMarkFailure$1.evaluate(TestRuleMarkFailure.java:48)
        at com.carrotsearch.randomizedtesting.rules.StatementAdapter.evaluate(StatementAdapter.java:36)
        at com.carrotsearch.randomizedtesting.ThreadLeakControl$StatementRunner.run(ThreadLeakControl.java:358)
        at com.carrotsearch.randomizedtesting.ThreadLeakControl.forkTimeoutingTask(ThreadLeakControl.java:782)
        at com.carrotsearch.randomizedtesting.ThreadLeakControl$3.evaluate(ThreadLeakControl.java:442)
        at com.carrotsearch.randomizedtesting.RandomizedRunner.runSingleTest(RandomizedRunner.java:746)
        at com.carrotsearch.randomizedtesting.RandomizedRunner$3.evaluate(RandomizedRunner.java:648)
        at com.carrotsearch.randomizedtesting.RandomizedRunner$4.evaluate(RandomizedRunner.java:682)
        at com.carrotsearch.randomizedtesting.RandomizedRunner$5.evaluate(RandomizedRunner.java:693)
        at com.carrotsearch.randomizedtesting.rules.StatementAdapter.evaluate(StatementAdapter.java:36)
        at com.carrotsearch.randomizedtesting.rules.SystemPropertiesRestoreRule$1.evaluate(SystemPropertiesRestoreRule.java:53)
        at org.apache.lucene.util.AbstractBeforeAfterRule$1.evaluate(AbstractBeforeAfterRule.java:46)
        at org.apache.lucene.util.TestRuleStoreClassName$1.evaluate(TestRuleStoreClassName.java:42)
        at com.carrotsearch.randomizedtesting.rules.SystemPropertiesInvariantRule$1.evaluate(SystemPropertiesInvariantRule.java:55)
        at com.carrotsearch.randomizedtesting.rules.NoShadowingOrOverridesOnMethodsRule$1.evaluate(NoShadowingOrOverridesOnMethodsRule.java:39)
        at com.carrotsearch.randomizedtesting.rules.NoShadowingOrOverridesOnMethodsRule$1.evaluate(NoShadowingOrOverridesOnMethodsRule.java:39)
        at com.carrotsearch.randomizedtesting.rules.StatementAdapter.evaluate(StatementAdapter.java:36)
        at org.apache.lucene.util.TestRuleAssertionsRequired$1.evaluate(TestRuleAssertionsRequired.java:43)
        at org.apache.lucene.util.TestRuleMarkFailure$1.evaluate(TestRuleMarkFailure.java:48)
        at org.apache.lucene.util.TestRuleIgnoreAfterMaxFailures$1.evaluate(TestRuleIgnoreAfterMaxFailures.java:70)
        at org.apache.lucene.util.TestRuleIgnoreTestSuites$1.evaluate(TestRuleIgnoreTestSuites.java:55)
        at com.carrotsearch.randomizedtesting.rules.StatementAdapter.evaluate(StatementAdapter.java:36)
        at com.carrotsearch.randomizedtesting.ThreadLeakControl$StatementRunner.run(ThreadLeakControl.java:358)
        at java.lang.Thread.run(Thread.java:724)
Caused by: org.apache.http.conn.HttpHostConnectException: Connection to http://127.0.0.1:39200 refused
        at org.apache.http.impl.conn.DefaultClientConnectionOperator.openConnection(DefaultClientConnectionOperator.java:190)
        at org.apache.http.impl.conn.ManagedClientConnectionImpl.open(ManagedClientConnectionImpl.java:294)
        at org.apache.http.impl.client.DefaultRequestDirector.tryConnect(DefaultRequestDirector.java:645)
        at org.apache.http.impl.client.DefaultRequestDirector.execute(DefaultRequestDirector.java:480)
        at org.apache.http.impl.client.AbstractHttpClient.execute(AbstractHttpClient.java:906)
        at org.apache.http.impl.client.AbstractHttpClient.execute(AbstractHttpClient.java:805)
        at org.apache.http.impl.client.AbstractHttpClient.execute(AbstractHttpClient.java:784)
        at org.apache.solr.client.solrj.impl.HttpSolrServer.request(HttpSolrServer.java:365)
        ... 45 more
Caused by: java.net.ConnectException: Connection refused
        at java.net.PlainSocketImpl.socketConnect(Native Method)
        at java.net.AbstractPlainSocketImpl.doConnect(AbstractPlainSocketImpl.java:339)
        at java.net.AbstractPlainSocketImpl.connectToAddress(AbstractPlainSocketImpl.java:200)
        at java.net.AbstractPlainSocketImpl.connect(AbstractPlainSocketImpl.java:182)
        at java.net.SocksSocketImpl.connect(SocksSocketImpl.java:392)
        at java.net.Socket.connect(Socket.java:579)
        at org.apache.http.conn.scheme.PlainSocketFactory.connectSocket(PlainSocketFactory.java:127)
        at org.apache.http.impl.conn.DefaultClientConnectionOperator.openConnection(DefaultClientConnectionOperator.java:180)
        ... 52 more




Build Log:
[...truncated 9746 lines...]
   [junit4] Suite: org.apache.solr.cloud.CollectionsAPIDistributedZkTest
   [junit4]   2> 385223 T1241 oas.BaseDistributedSearchTestCase.initHostContext Setting hostContext system property: /yyhb/my
   [junit4]   2> 385226 T1241 oas.SolrTestCaseJ4.setUp ###Starting testDistribSearch
   [junit4]   2> Creating dataDir: /mnt/ssd/jenkins/workspace/Lucene-Solr-trunk-Linux/solr/build/solr-core/test/J1/./solrtest-CollectionsAPIDistributedZkTest-1375487312170
   [junit4]   2> 385227 T1241 oasc.ZkTestServer.run STARTING ZK TEST SERVER
   [junit4]   2> 385227 T1242 oasc.ZkTestServer$ZKServerMain.runFromConfig Starting server
   [junit4]   2> 385327 T1241 oasc.ZkTestServer.run start zk server on port:45464
   [junit4]   2> 385328 T1241 oascc.ConnectionManager.waitForConnected Waiting for client to connect to ZooKeeper
   [junit4]   2> 385331 T1248 oascc.ConnectionManager.process Watcher org.apache.solr.common.cloud.ConnectionManager@ebb115 name:ZooKeeperConnection Watcher:127.0.0.1:45464 got event WatchedEvent state:SyncConnected type:None path:null path:null type:None
   [junit4]   2> 385331 T1241 oascc.ConnectionManager.waitForConnected Client is connected to ZooKeeper
   [junit4]   2> 385332 T1241 oascc.SolrZkClient.makePath makePath: /solr
   [junit4]   2> 385335 T1241 oascc.ConnectionManager.waitForConnected Waiting for client to connect to ZooKeeper
   [junit4]   2> 385336 T1250 oascc.ConnectionManager.process Watcher org.apache.solr.common.cloud.ConnectionManager@1a62b53 name:ZooKeeperConnection Watcher:127.0.0.1:45464/solr got event WatchedEvent state:SyncConnected type:None path:null path:null type:None
   [junit4]   2> 385336 T1241 oascc.ConnectionManager.waitForConnected Client is connected to ZooKeeper
   [junit4]   2> 385337 T1241 oascc.SolrZkClient.makePath makePath: /collections/collection1
   [junit4]   2> 385339 T1241 oascc.SolrZkClient.makePath makePath: /collections/collection1/shards
   [junit4]   2> 385341 T1241 oascc.SolrZkClient.makePath makePath: /collections/control_collection
   [junit4]   2> 385342 T1241 oascc.SolrZkClient.makePath makePath: /collections/control_collection/shards
   [junit4]   2> 385344 T1241 oasc.AbstractZkTestCase.putConfig put /mnt/ssd/jenkins/workspace/Lucene-Solr-trunk-Linux/solr/build/solr-core/test-files/solr/collection1/conf/solrconfig-tlog.xml to /configs/conf1/solrconfig.xml
   [junit4]   2> 385344 T1241 oascc.SolrZkClient.makePath makePath: /configs/conf1/solrconfig.xml
   [junit4]   2> 385347 T1241 oasc.AbstractZkTestCase.putConfig put /mnt/ssd/jenkins/workspace/Lucene-Solr-trunk-Linux/solr/build/solr-core/test-files/solr/collection1/conf/schema.xml to /configs/conf1/schema.xml
   [junit4]   2> 385348 T1241 oascc.SolrZkClient.makePath makePath: /configs/conf1/schema.xml
   [junit4]   2> 385350 T1241 oasc.AbstractZkTestCase.putConfig put /mnt/ssd/jenkins/workspace/Lucene-Solr-trunk-Linux/solr/build/solr-core/test-files/solr/collection1/conf/stopwords.txt to /configs/conf1/stopwords.txt
   [junit4]   2> 385350 T1241 oascc.SolrZkClient.makePath makePath: /configs/conf1/stopwords.txt
   [junit4]   2> 385352 T1241 oasc.AbstractZkTestCase.putConfig put /mnt/ssd/jenkins/workspace/Lucene-Solr-trunk-Linux/solr/build/solr-core/test-files/solr/collection1/conf/protwords.txt to /configs/conf1/protwords.txt
   [junit4]   2> 385353 T1241 oascc.SolrZkClient.makePath makePath: /configs/conf1/protwords.txt
   [junit4]   2> 385355 T1241 oasc.AbstractZkTestCase.putConfig put /mnt/ssd/jenkins/workspace/Lucene-Solr-trunk-Linux/solr/build/solr-core/test-files/solr/collection1/conf/currency.xml to /configs/conf1/currency.xml
   [junit4]   2> 385355 T1241 oascc.SolrZkClient.makePath makePath: /configs/conf1/currency.xml
   [junit4]   2> 385357 T1241 oasc.AbstractZkTestCase.putConfig put /mnt/ssd/jenkins/workspace/Lucene-Solr-trunk-Linux/solr/build/solr-core/test-files/solr/collection1/conf/open-exchange-rates.json to /configs/conf1/open-exchange-rates.json
   [junit4]   2> 385357 T1241 oascc.SolrZkClient.makePath makePath: /configs/conf1/open-exchange-rates.json
   [junit4]   2> 385359 T1241 oasc.AbstractZkTestCase.putConfig put /mnt/ssd/jenkins/workspace/Lucene-Solr-trunk-Linux/solr/build/solr-core/test-files/solr/collection1/conf/mapping-ISOLatin1Accent.txt to /configs/conf1/mapping-ISOLatin1Accent.txt
   [junit4]   2> 385359 T1241 oascc.SolrZkClient.makePath makePath: /configs/conf1/mapping-ISOLatin1Accent.txt
   [junit4]   2> 385361 T1241 oasc.AbstractZkTestCase.putConfig put /mnt/ssd/jenkins/workspace/Lucene-Solr-trunk-Linux/solr/build/solr-core/test-files/solr/collection1/conf/old_synonyms.txt to /configs/conf1/old_synonyms.txt
   [junit4]   2> 385362 T1241 oascc.SolrZkClient.makePath makePath: /configs/conf1/old_synonyms.txt
   [junit4]   2> 385363 T1241 oasc.AbstractZkTestCase.putConfig put /mnt/ssd/jenkins/workspace/Lucene-Solr-trunk-Linux/solr/build/solr-core/test-files/solr/collection1/conf/synonyms.txt to /configs/conf1/synonyms.txt
   [junit4]   2> 385364 T1241 oascc.SolrZkClient.makePath makePath: /configs/conf1/synonyms.txt
   [junit4]   2> 385452 T1241 oejs.Server.doStart jetty-8.1.10.v20130312
   [junit4]   2> 385455 T1241 oejs.AbstractConnector.doStart Started SelectChannelConnector@127.0.0.1:56259
   [junit4]   2> 385456 T1241 oass.SolrDispatchFilter.init SolrDispatchFilter.init()
   [junit4]   2> 385456 T1241 oasc.SolrResourceLoader.locateSolrHome JNDI not configured for solr (NoInitialContextEx)
   [junit4]   2> 385456 T1241 oasc.SolrResourceLoader.locateSolrHome using system property solr.solr.home: /mnt/ssd/jenkins/workspace/Lucene-Solr-trunk-Linux/solr/build/solr-core/test/J1/./org.apache.solr.cloud.CollectionsAPIDistributedZkTest-controljetty-1375487312309
   [junit4]   2> 385457 T1241 oasc.SolrResourceLoader.<init> new SolrResourceLoader for directory: '/mnt/ssd/jenkins/workspace/Lucene-Solr-trunk-Linux/solr/build/solr-core/test/J1/./org.apache.solr.cloud.CollectionsAPIDistributedZkTest-controljetty-1375487312309/'
   [junit4]   2> 385467 T1241 oasc.ConfigSolr.fromFile Loading container configuration from /mnt/ssd/jenkins/workspace/Lucene-Solr-trunk-Linux/solr/build/solr-core/test/J1/./org.apache.solr.cloud.CollectionsAPIDistributedZkTest-controljetty-1375487312309/solr.xml
   [junit4]   2> 385507 T1241 oasc.ConfigSolrXml.<init> Config-defined core root directory:
   [junit4]   2> 385507 T1241 oasc.CoreContainer.<init> New CoreContainer 23708956
   [junit4]   2> 385507 T1241 oasc.CoreContainer.load Loading cores into CoreContainer [instanceDir=/mnt/ssd/jenkins/workspace/Lucene-Solr-trunk-Linux/solr/build/solr-core/test/J1/./org.apache.solr.cloud.CollectionsAPIDistributedZkTest-controljetty-1375487312309/]
   [junit4]   2> 385508 T1241 oashc.HttpShardHandlerFactory.getParameter Setting socketTimeout to: 120000
   [junit4]   2> 385509 T1241 oashc.HttpShardHandlerFactory.getParameter Setting urlScheme to: http://
   [junit4]   2> 385509 T1241 oashc.HttpShardHandlerFactory.getParameter Setting connTimeout to: 15000
   [junit4]   2> 385509 T1241 oashc.HttpShardHandlerFactory.getParameter Setting maxConnectionsPerHost to: 20
   [junit4]   2> 385509 T1241 oashc.HttpShardHandlerFactory.getParameter Setting corePoolSize to: 0
   [junit4]   2> 385510 T1241 oashc.HttpShardHandlerFactory.getParameter Setting maximumPoolSize to: 2147483647
   [junit4]   2> 385510 T1241 oashc.HttpShardHandlerFactory.getParameter Setting maxThreadIdleTime to: 5
   [junit4]   2> 385510 T1241 oashc.HttpShardHandlerFactory.getParameter Setting sizeOfQueue to: -1
   [junit4]   2> 385510 T1241 oashc.HttpShardHandlerFactory.getParameter Setting fairnessPolicy to: false
   [junit4]   2> 385511 T1241 oascsi.HttpClientUtil.createClient Creating new http client, config:maxConnectionsPerHost=20&maxConnections=10000&socketTimeout=120000&connTimeout=15000&retry=false
   [junit4]   2> 385514 T1241 oasc.ZkContainer.initZooKeeper Zookeeper client=127.0.0.1:45464/solr
   [junit4]   2> 385514 T1241 oasc.ZkController.checkChrootPath zkHost includes chroot
   [junit4]   2> 385515 T1241 oascc.ConnectionManager.waitForConnected Waiting for client to connect to ZooKeeper
   [junit4]   2> 385516 T1261 oascc.ConnectionManager.process Watcher org.apache.solr.common.cloud.ConnectionManager@3e9d6e name:ZooKeeperConnection Watcher:127.0.0.1:45464 got event WatchedEvent state:SyncConnected type:None path:null path:null type:None
   [junit4]   2> 385517 T1241 oascc.ConnectionManager.waitForConnected Client is connected to ZooKeeper
   [junit4]   2> 385518 T1241 oascsi.HttpClientUtil.createClient Creating new http client, config:maxConnections=500&maxConnectionsPerHost=16&socketTimeout=120000&connTimeout=15000
   [junit4]   2> 385522 T1241 oascc.ConnectionManager.waitForConnected Waiting for client to connect to ZooKeeper
   [junit4]   2> 385523 T1263 oascc.ConnectionManager.process Watcher org.apache.solr.common.cloud.ConnectionManager@5b3a16 name:ZooKeeperConnection Watcher:127.0.0.1:45464/solr got event WatchedEvent state:SyncConnected type:None path:null path:null type:None
   [junit4]   2> 385523 T1241 oascc.ConnectionManager.waitForConnected Client is connected to ZooKeeper
   [junit4]   2> 385525 T1241 oascc.SolrZkClient.makePath makePath: /overseer/queue
   [junit4]   2> 385527 T1241 oascc.SolrZkClient.makePath makePath: /overseer/collection-queue-work
   [junit4]   2> 385529 T1241 oascc.SolrZkClient.makePath makePath: /live_nodes
   [junit4]   2> 385531 T1241 oasc.ZkController.createEphemeralLiveNode Register node as live in ZooKeeper:/live_nodes/127.0.0.1:56259_yyhb%2Fmy
   [junit4]   2> 385532 T1241 oascc.SolrZkClient.makePath makePath: /live_nodes/127.0.0.1:56259_yyhb%2Fmy
   [junit4]   2> 385535 T1241 oascc.SolrZkClient.makePath makePath: /overseer_elect/election
   [junit4]   2> 385539 T1241 oascc.SolrZkClient.makePath makePath: /overseer_elect/leader
   [junit4]   2> 385542 T1241 oasc.Overseer.start Overseer (id=90143936490504195-127.0.0.1:56259_yyhb%2Fmy-n_0000000000) starting
   [junit4]   2> 385546 T1241 oascc.SolrZkClient.makePath makePath: /overseer/queue-work
   [junit4]   2> 385551 T1265 oasc.OverseerCollectionProcessor.run Process current queue of collection creations
   [junit4]   2> 385552 T1241 oascc.SolrZkClient.makePath makePath: /clusterstate.json
   [junit4]   2> 385555 T1241 oascc.SolrZkClient.makePath makePath: /aliases.json
   [junit4]   2> 385558 T1241 oascc.ZkStateReader.createClusterStateWatchersAndUpdate Updating cluster state from ZooKeeper...
   [junit4]   2> 385561 T1264 oasc.Overseer$ClusterStateUpdater.run Starting to work on the main queue
   [junit4]   2> 385563 T1241 oasc.CorePropertiesLocator.discover Looking for core definitions underneath /mnt/ssd/jenkins/workspace/Lucene-Solr-trunk-Linux/solr/build/solr-core/test/J1/./org.apache.solr.cloud.CollectionsAPIDistributedZkTest-controljetty-1375487312309
   [junit4]   2> 385593 T1241 oasc.CorePropertiesLocator.discoverUnder Found core conf in /mnt/ssd/jenkins/workspace/Lucene-Solr-trunk-Linux/solr/build/solr-core/test/J1/./org.apache.solr.cloud.CollectionsAPIDistributedZkTest-controljetty-1375487312309/conf/
   [junit4]   2> 385594 T1241 oasc.CorePropertiesLocator.discover Found 1 core definitions
   [junit4]   2> 385594 T1241 oass.SolrDispatchFilter.init user.dir=/mnt/ssd/jenkins/workspace/Lucene-Solr-trunk-Linux/solr/build/solr-core/test/J1
   [junit4]   2> 385594 T1241 oass.SolrDispatchFilter.init SolrDispatchFilter.init() done
   [junit4]   2> 385595 T1241 oascsi.HttpClientUtil.createClient Creating new http client, config:maxConnections=128&maxConnectionsPerHost=32&followRedirects=false
   [junit4]   2> 385598 T1241 oascsi.HttpClientUtil.createClient Creating new http client, config:
   [junit4]   2> 385599 T1241 oascc.ConnectionManager.waitForConnected Waiting for client to connect to ZooKeeper
   [junit4]   2> 385600 T1268 oascc.ConnectionManager.process Watcher org.apache.solr.common.cloud.ConnectionManager@432f6e name:ZooKeeperConnection Watcher:127.0.0.1:45464/solr got event WatchedEvent state:SyncConnected type:None path:null path:null type:None
   [junit4]   2> 385600 T1241 oascc.ConnectionManager.waitForConnected Client is connected to ZooKeeper
   [junit4]   2> 385601 T1241 oascc.ZkStateReader.createClusterStateWatchersAndUpdate Updating cluster state from ZooKeeper...
   [junit4]   2> 385603 T1241 oasc.ChaosMonkey.monkeyLog monkey: init - expire sessions:true cause connection loss:true
   [junit4]   2> 385688 T1241 oejs.Server.doStart jetty-8.1.10.v20130312
   [junit4]   2> 385690 T1241 oejs.AbstractConnector.doStart Started SelectChannelConnector@127.0.0.1:39200
   [junit4]   2> 385691 T1241 oass.SolrDispatchFilter.init SolrDispatchFilter.init()
   [junit4]   2> 385691 T1241 oasc.SolrResourceLoader.locateSolrHome JNDI not configured for solr (NoInitialContextEx)
   [junit4]   2> 385691 T1241 oasc.SolrResourceLoader.locateSolrHome using system property solr.solr.home: /mnt/ssd/jenkins/workspace/Lucene-Solr-trunk-Linux/solr/build/solr-core/test/J1/./org.apache.solr.cloud.CollectionsAPIDistributedZkTest-jetty1-1375487312546
   [junit4]   2> 385692 T1241 oasc.SolrResourceLoader.<init> new SolrResourceLoader for directory: '/mnt/ssd/jenkins/workspace/Lucene-Solr-trunk-Linux/solr/build/solr-core/test/J1/./org.apache.solr.cloud.CollectionsAPIDistributedZkTest-jetty1-1375487312546/'
   [junit4]   2> 385703 T1241 oasc.ConfigSolr.fromFile Loading container configuration from /mnt/ssd/jenkins/workspace/Lucene-Solr-trunk-Linux/solr/build/solr-core/test/J1/./org.apache.solr.cloud.CollectionsAPIDistributedZkTest-jetty1-1375487312546/solr.xml
   [junit4]   2> 385748 T1241 oasc.ConfigSolrXml.<init> Config-defined core root directory:
   [junit4]   2> 385749 T1241 oasc.CoreContainer.<init> New CoreContainer 385264
   [junit4]   2> 385749 T1241 oasc.CoreContainer.load Loading cores into CoreContainer [instanceDir=/mnt/ssd/jenkins/workspace/Lucene-Solr-trunk-Linux/solr/build/solr-core/test/J1/./org.apache.solr.cloud.CollectionsAPIDistributedZkTest-jetty1-1375487312546/]
   [junit4]   2> 385751 T1241 oashc.HttpShardHandlerFactory.getParameter Setting socketTimeout to: 120000
   [junit4]   2> 385751 T1241 oashc.HttpShardHandlerFactory.getParameter Setting urlScheme to: http://
   [junit4]   2> 385752 T1241 oashc.HttpShardHandlerFactory.getParameter Setting connTimeout to: 15000
   [junit4]   2> 385752 T1241 oashc.HttpShardHandlerFactory.getParameter Setting maxConnectionsPerHost to: 20
   [junit4]   2> 385752 T1241 oashc.HttpShardHandlerFactory.getParameter Setting corePoolSize to: 0
   [junit4]   2> 385753 T1241 oashc.HttpShardHandlerFactory.getParameter Setting maximumPoolSize to: 2147483647
   [junit4]   2> 385753 T1241 oashc.HttpShardHandlerFactory.getParameter Setting maxThreadIdleTime to: 5
   [junit4]   2> 385753 T1241 oashc.HttpShardHandlerFactory.getParameter Setting sizeOfQueue to: -1
   [junit4]   2> 385754 T1241 oashc.HttpShardHandlerFactory.getParameter Setting fairnessPolicy to: false
   [junit4]   2> 385754 T1241 oascsi.HttpClientUtil.createClient Creating new http client, config:maxConnectionsPerHost=20&maxConnections=10000&socketTimeout=120000&connTimeout=15000&retry=false
   [junit4]   2> 385759 T1241 oasc.ZkContainer.initZooKeeper Zookeeper client=127.0.0.1:45464/solr
   [junit4]   2> 385759 T1241 oasc.ZkController.checkChrootPath zkHost includes chroot
   [junit4]   2> 385760 T1241 oascc.ConnectionManager.waitForConnected Waiting for client to connect to ZooKeeper
   [junit4]   2> 385761 T1279 oascc.ConnectionManager.process Watcher org.apache.solr.common.cloud.ConnectionManager@1c8522e name:ZooKeeperConnection Watcher:127.0.0.1:45464 got event WatchedEvent state:SyncConnected type:None path:null path:null type:None
   [junit4]   2> 385762 T1241 oascc.ConnectionManager.waitForConnected Client is connected to ZooKeeper
   [junit4]   2> 385763 T1241 oascsi.HttpClientUtil.createClient Creating new http client, config:maxConnections=500&maxConnectionsPerHost=16&socketTimeout=120000&connTimeout=15000
   [junit4]   2> 385766 T1241 oascc.ConnectionManager.waitForConnected Waiting for client to connect to ZooKeeper
   [junit4]   2> 385768 T1281 oascc.ConnectionManager.process Watcher org.apache.solr.common.cloud.ConnectionManager@e073a7 name:ZooKeeperConnection Watcher:127.0.0.1:45464/solr got event WatchedEvent state:SyncConnected type:None path:null path:null type:None
   [junit4]   2> 385768 T1241 oascc.ConnectionManager.waitForConnected Client is connected to ZooKeeper
   [junit4]   2> 385771 T1241 oascc.ZkStateReader.createClusterStateWatchersAndUpdate Updating cluster state from ZooKeeper...
   [junit4]   2> 386774 T1241 oasc.ZkController.createEphemeralLiveNode Register node as live in ZooKeeper:/live_nodes/127.0.0.1:39200_yyhb%2Fmy
   [junit4]   2> 386775 T1241 oascc.SolrZkClient.makePath makePath: /live_nodes/127.0.0.1:39200_yyhb%2Fmy
   [junit4]   2> 386778 T1268 oascc.ZkStateReader$3.process Updating live nodes... (2)
   [junit4]   2> 386778 T1263 oascc.ZkStateReader$3.process Updating live nodes... (2)
   [junit4]   2> 386778 T1281 oascc.ZkStateReader$3.process Updating live nodes... (2)
   [junit4]   2> 386783 T1241 oasc.CorePropertiesLocator.discover Looking for core definitions underneath /mnt/ssd/jenkins/workspace/Lucene-Solr-trunk-Linux/solr/build/solr-core/test/J1/./org.apache.solr.cloud.CollectionsAPIDistributedZkTest-jetty1-1375487312546
   [junit4]   2> 386816 T1241 oasc.CorePropertiesLocator.discoverUnder Found core conf in /mnt/ssd/jenkins/workspace/Lucene-Solr-trunk-Linux/solr/build/solr-core/test/J1/./org.apache.solr.cloud.CollectionsAPIDistributedZkTest-jetty1-1375487312546/conf/
   [junit4]   2> 386816 T1241 oasc.CorePropertiesLocator.discover Found 1 core definitions
   [junit4]   2> 386817 T1241 oass.SolrDispatchFilter.init user.dir=/mnt/ssd/jenkins/workspace/Lucene-Solr-trunk-Linux/solr/build/solr-core/test/J1
   [junit4]   2> 386817 T1241 oass.SolrDispatchFilter.init SolrDispatchFilter.init() done
   [junit4]   2> 386817 T1241 oascsi.HttpClientUtil.createClient Creating new http client, config:maxConnections=128&maxConnectionsPerHost=32&followRedirects=false
   [junit4]   2> 386889 T1241 oejs.Server.doStart jetty-8.1.10.v20130312
   [junit4]   2> 386891 T1241 oejs.AbstractConnector.doStart Started SelectChannelConnector@127.0.0.1:41075
   [junit4]   2> 386892 T1241 oass.SolrDispatchFilter.init SolrDispatchFilter.init()
   [junit4]   2> 386892 T1241 oasc.SolrResourceLoader.locateSolrHome JNDI not configured for solr (NoInitialContextEx)
   [junit4]   2> 386892 T1241 oasc.SolrResourceLoader.locateSolrHome using system property solr.solr.home: /mnt/ssd/jenkins/workspace/Lucene-Solr-trunk-Linux/solr/build/solr-core/test/J1/./org.apache.solr.cloud.CollectionsAPIDistributedZkTest-jetty2-1375487313763
   [junit4]   2> 386892 T1241 oasc.SolrResourceLoader.<init> new SolrResourceLoader for directory: '/mnt/ssd/jenkins/workspace/Lucene-Solr-trunk-Linux/solr/build/solr-core/test/J1/./org.apache.solr.cloud.CollectionsAPIDistributedZkTest-jetty2-1375487313763/'
   [junit4]   2> 386902 T1241 oasc.ConfigSolr.fromFile Loading container configuration from /mnt/ssd/jenkins/workspace/Lucene-Solr-trunk-Linux/solr/build/solr-core/test/J1/./org.apache.solr.cloud.CollectionsAPIDistributedZkTest-jetty2-1375487313763/solr.xml
   [junit4]   2> 386940 T1241 oasc.ConfigSolrXml.<init> Config-defined core root directory:
   [junit4]   2> 386940 T1241 oasc.CoreContainer.<init> New CoreContainer 3993685
   [junit4]   2> 386940 T1241 oasc.CoreContainer.load Loading cores into CoreContainer [instanceDir=/mnt/ssd/jenkins/workspace/Lucene-Solr-trunk-Linux/solr/build/solr-core/test/J1/./org.apache.solr.cloud.CollectionsAPIDistributedZkTest-jetty2-1375487313763/]
   [junit4]   2> 386941 T1241 oashc.HttpShardHandlerFactory.getParameter Setting socketTimeout to: 120000
   [junit4]   2> 386941 T1241 oashc.HttpShardHandlerFactory.getParameter Setting urlScheme to: http://
   [junit4]   2> 386942 T1241 oashc.HttpShardHandlerFactory.getParameter Setting connTimeout to: 15000
   [junit4]   2> 386942 T1241 oashc.HttpShardHandlerFactory.getParameter Setting maxConnectionsPerHost to: 20
   [junit4]   2> 386942 T1241 oashc.HttpShardHandlerFactory.getParameter Setting corePoolSize to: 0
   [junit4]   2> 386942 T1241 oashc.HttpShardHandlerFactory.getParameter Setting maximumPoolSize to: 2147483647
   [junit4]   2> 386943 T1241 oashc.HttpShardHandlerFactory.getParameter Setting maxThreadIdleTime to: 5
   [junit4]   2> 386943 T1241 oashc.HttpShardHandlerFactory.getParameter Setting sizeOfQueue to: -1
   [junit4]   2> 386943 T1241 oashc.HttpShardHandlerFactory.getParameter Setting fairnessPolicy to: false
   [junit4]   2> 386944 T1241 oascsi.HttpClientUtil.createClient Creating new http client, config:maxConnectionsPerHost=20&maxConnections=10000&socketTimeout=120000&connTimeout=15000&retry=false
   [junit4]   2> 386947 T1241 oasc.ZkContainer.initZooKeeper Zookeeper client=127.0.0.1:45464/solr
   [junit4]   2> 386947 T1241 oasc.ZkController.checkChrootPath zkHost includes chroot
   [junit4]   2> 386948 T1241 oascc.ConnectionManager.waitForConnected Waiting for client to connect to ZooKeeper
   [junit4]   2> 386949 T1293 oascc.ConnectionManager.process Watcher org.apache.solr.common.cloud.ConnectionManager@1d5a8c name:ZooKeeperConnection Watcher:127.0.0.1:45464 got event WatchedEvent state:SyncConnected type:None path:null path:null type:None
   [junit4]   2> 386949 T1241 oascc.ConnectionManager.waitForConnected Client is connected to ZooKeeper
   [junit4]   2> 386951 T1241 oascsi.HttpClientUtil.createClient Creating new http client, config:maxConnections=500&maxConnectionsPerHost=16&socketTimeout=120000&connTimeout=15000
   [junit4]   2> 386954 T1241 oascc.ConnectionManager.waitForConnected Waiting for client to connect to ZooKeeper
   [junit4]   2> 386955 T1295 oascc.ConnectionManager.process Watcher org.apache.solr.common.cloud.ConnectionManager@cdc6ce name:ZooKeeperConnection Watcher:127.0.0.1:45464/solr got event WatchedEvent state:SyncConnected type:None path:null path:null type:None
   [junit4]   2> 386955 T1241 oascc.ConnectionManager.waitForConnected Client is connected to ZooKeeper
   [junit4]   2> 386959 T1241 oascc.ZkStateReader.createClusterStateWatchersAndUpdate Updating cluster state from ZooKeeper...
   [junit4]   2> 387961 T1241 oasc.ZkController.createEphemeralLiveNode Register node as live in ZooKeeper:/live_nodes/127.0.0.1:41075_yyhb%2Fmy
   [junit4]   2> 387968 T1241 oascc.SolrZkClient.makePath makePath: /live_nodes/127.0.0.1:41075_yyhb%2Fmy
   [junit4]   2> 387986 T1281 oascc.ZkStateReader$3.process Updating live nodes... (3)
   [junit4]   2> 387986 T1268 oascc.ZkStateReader$3.process Updating live nodes... (3)
   [junit4]   2> 387986 T1295 oascc.ZkStateReader$3.process Updating live nodes... (3)
   [junit4]   2> 387986 T1263 oascc.ZkStateReader$3.process Updating live nodes... (3)
   [junit4]   2> 387992 T1241 oasc.CorePropertiesLocator.discover Looking for core definitions underneath /mnt/ssd/jenkins/workspace/Lucene-Solr-trunk-Linux/solr/build/solr-core/test/J1/./org.apache.solr.cloud.CollectionsAPIDistributedZkTest-jetty2-1375487313763
   [junit4]   2> 388025 T1241 oasc.CorePropertiesLocator.discoverUnder Found core conf in /mnt/ssd/jenkins/workspace/Lucene-Solr-trunk-Linux/solr/build/solr-core/test/J1/./org.apache.solr.cloud.CollectionsAPIDistributedZkTest-jetty2-1375487313763/conf/
   [junit4]   2> 388025 T1241 oasc.CorePropertiesLocator.discover Found 1 core definitions
   [junit4]   2> 388026 T1241 oass.SolrDispatchFilter.init user.dir=/mnt/ssd/jenkins/workspace/Lucene-Solr-trunk-Linux/solr/build/solr-core/test/J1
   [junit4]   2> 388026 T1241 oass.SolrDispatchFilter.init SolrDispatchFilter.init() done
   [junit4]   2> 388026 T1241 oascsi.HttpClientUtil.createClient Creating new http client, config:maxConnections=128&maxConnectionsPerHost=32&followRedirects=false
   [junit4]   2> 388102 T1241 oejs.Server.doStart jetty-8.1.10.v20130312
   [junit4]   2> 388106 T1241 oejs.AbstractConnector.doStart Started SelectChannelConnector@127.0.0.1:41024
   [junit4]   2> 388106 T1241 oass.SolrDispatchFilter.init SolrDispatchFilter.init()
   [junit4]   2> 388107 T1241 oasc.SolrResourceLoader.locateSolrHome JNDI not configured for solr (NoInitialContextEx)
   [junit4]   2> 388107 T1241 oasc.SolrResourceLoader.locateSolrHome using system property solr.solr.home: /mnt/ssd/jenkins/workspace/Lucene-Solr-trunk-Linux/solr/build/solr-core/test/J1/./org.apache.solr.cloud.CollectionsAPIDistributedZkTest-jetty3-1375487314972
   [junit4]   2> 388107 T1241 oasc.SolrResourceLoader.<init> new SolrResourceLoader for directory: '/mnt/ssd/jenkins/workspace/Lucene-Solr-trunk-Linux/solr/build/solr-core/test/J1/./org.apache.solr.cloud.CollectionsAPIDistributedZkTest-jetty3-1375487314972/'
   [junit4]   2> 388116 T1241 oasc.ConfigSolr.fromFile Loading container configuration from /mnt/ssd/jenkins/workspace/Lucene-Solr-trunk-Linux/solr/build/solr-core/test/J1/./org.apache.solr.cloud.CollectionsAPIDistributedZkTest-jetty3-1375487314972/solr.xml
   [junit4]   2> 388144 T1241 oasc.ConfigSolrXml.<init> Config-defined core root directory:
   [junit4]   2> 388145 T1241 oasc.CoreContainer.<init> New CoreContainer 17996021
   [junit4]   2> 388145 T1241 oasc.CoreContainer.load Loading cores into CoreContainer [instanceDir=/mnt/ssd/jenkins/workspace/Lucene-Solr-trunk-Linux/solr/build/solr-core/test/J1/./org.apache.solr.cloud.CollectionsAPIDistributedZkTest-jetty3-1375487314972/]
   [junit4]   2> 388146 T1241 oashc.HttpShardHandlerFactory.getParameter Setting socketTimeout to: 120000
   [junit4]   2> 388146 T1241 oashc.HttpShardHandlerFactory.getParameter Setting urlScheme to: http://
   [junit4]   2> 388146 T1241 oashc.HttpShardHandlerFactory.getParameter Setting connTimeout to: 15000
   [junit4]   2> 388147 T1241 oashc.HttpShardHandlerFactory.getParameter Setting maxConnectionsPerHost to: 20
   [junit4]   2> 388147 T1241 oashc.HttpShardHandlerFactory.getParameter Setting corePoolSize to: 0
   [junit4]   2> 388147 T1241 oashc.HttpShardHandlerFactory.getParameter Setting maximumPoolSize to: 2147483647
   [junit4]   2> 388148 T1241 oashc.HttpShardHandlerFactory.getParameter Setting maxThreadIdleTime to: 5
   [junit4]   2> 388148 T1241 oashc.HttpShardHandlerFactory.getParameter Setting sizeOfQueue to: -1
   [junit4]   2> 388148 T1241 oashc.HttpShardHandlerFactory.getParameter Setting fairnessPolicy to: false
   [junit4]   2> 388148 T1241 oascsi.HttpClientUtil.createClient Creating new http client, config:maxConnectionsPerHost=20&maxConnections=10000&socketTimeout=120000&connTimeout=15000&retry=false
   [junit4]   2> 388153 T1241 oasc.ZkContainer.initZooKeeper Zookeeper client=127.0.0.1:45464/solr
   [junit4]   2> 388153 T1241 oasc.ZkController.checkChrootPath zkHost includes chroot
   [junit4]   2> 388154 T1241 oascc.ConnectionManager.waitForConnected Waiting for client to connect to ZooKeeper
   [junit4]   2> 388156 T1307 oascc.ConnectionManager.process Watcher org.apache.solr.common.cloud.ConnectionManager@18760c4 name:ZooKeeperConnection Watcher:127.0.0.1:45464 got event WatchedEvent state:SyncConnected type:None path:null path:null type:None
   [junit4]   2> 388156 T1241 oascc.ConnectionManager.waitForConnected Client is connected to ZooKeeper
   [junit4]   2> 388158 T1241 oascsi.HttpClientUtil.createClient Creating new http client, config:maxConnections=500&maxConnectionsPerHost=16&socketTimeout=120000&connTimeout=15000
   [junit4]   2> 388161 T1241 oascc.ConnectionManager.waitForConnected Waiting for client to connect to ZooKeeper
   [junit4]   2> 388162 T1309 oascc.ConnectionManager.process Watcher org.apache.solr.common.cloud.ConnectionManager@1019c3e name:ZooKeeperConnection Watcher:127.0.0.1:45464/solr got event WatchedEvent state:SyncConnected type:None path:null path:null type:None
   [junit4]   2> 388162 T1241 oascc.ConnectionManager.waitForConnected Client is connected to ZooKeeper
   [junit4]   2> 388166 T1241 oascc.ZkStateReader.createClusterStateWatchersAndUpdate Updating cluster state from ZooKeeper...
   [junit4]   2> 389168 T1241 oasc.ZkController.createEphemeralLiveNode Register node as live in ZooKeeper:/live_nodes/127.0.0.1:41024_yyhb%2Fmy
   [junit4]   2> 389170 T1241 oascc.SolrZkClient.makePath makePath: /live_nodes/127.0.0.1:41024_yyhb%2Fmy
   [junit4]   2> 389172 T1263 oascc.ZkStateReader$3.process Updating live nodes... (4)
   [junit4]   2> 389173 T1295 oascc.ZkStateReader$3.process Updating live nodes... (4)
   [junit4]   2> 389173 T1268 oascc.ZkStateReader$3.process Updating live nodes... (4)
   [junit4]   2> 389173 T1281 oascc.ZkStateReader$3.process Updating live nodes... (4)
   [junit4]   2> 389173 T1309 oascc.ZkStateReader$3.process Updating live nodes... (4)
   [junit4]   2> 389181 T1241 oasc.CorePropertiesLocator.discover Looking for core definitions underneath /mnt/ssd/jenkins/workspace/Lucene-Solr-trunk-Linux/solr/build/solr-core/test/J1/./org.apache.solr.cloud.CollectionsAPIDistributedZkTest-jetty3-1375487314972
   [junit4]   2> 389220 T1241 oasc.CorePropertiesLocator.discoverUnder Found core conf in /mnt/ssd/jenkins/workspace/Lucene-Solr-trunk-Linux/solr/build/solr-core/test/J1/./org.apache.solr.cloud.CollectionsAPIDistributedZkTest-jetty3-1375487314972/conf/
   [junit4]   2> 389221 T1241 oasc.CorePropertiesLocator.discover Found 1 core definitions
   [junit4]   2> 389222 T1241 oass.SolrDispatchFilter.init user.dir=/mnt/ssd/jenkins/workspace/Lucene-Solr-trunk-Linux/solr/build/solr-core/test/J1
   [junit4]   2> 389222 T1241 oass.SolrDispatchFilter.init SolrDispatchFilter.init() done
   [junit4]   2> 389222 T1241 oascsi.HttpClientUtil.createClient Creating new http client, config:maxConnections=128&maxConnectionsPerHost=32&followRedirects=false
   [junit4]   2> 389296 T1241 oejs.Server.doStart jetty-8.1.10.v20130312
   [junit4]   2> 389298 T1241 oejs.AbstractConnector.doStart Started SelectChannelConnector@127.0.0.1:40533
   [junit4]   2> 389299 T1241 oass.SolrDispatchFilter.init SolrDispatchFilter.init()
   [junit4]   2> 389299 T1241 oasc.SolrResourceLoader.locateSolrHome JNDI not configured for solr (NoInitialContextEx)
   [junit4]   2> 389299 T1241 oasc.SolrResourceLoader.locateSolrHome using system property solr.solr.home: /mnt/ssd/jenkins/workspace/Lucene-Solr-trunk-Linux/solr/build/solr-core/test/J1/./org.apache.solr.cloud.CollectionsAPIDistributedZkTest-jetty4-1375487316169
   [junit4]   2> 389299 T1241 oasc.SolrResourceLoader.<init> new SolrResourceLoader for directory: '/mnt/ssd/jenkins/workspace/Lucene-Solr-trunk-Linux/solr/build/solr-core/test/J1/./org.apache.solr.cloud.CollectionsAPIDistributedZkTest-jetty4-1375487316169/'
   [junit4]   2> 389309 T1241 oasc.ConfigSolr.fromFile Loading container configuration from /mnt/ssd/jenkins/workspace/Lucene-Solr-trunk-Linux/solr/build/solr-core/test/J1/./org.apache.solr.cloud.CollectionsAPIDistributedZkTest-jetty4-1375487316169/solr.xml
   [junit4]   2> 389339 T1241 oasc.ConfigSolrXml.<init> Config-defined core root directory:
   [junit4]   2> 389339 T1241 oasc.CoreContainer.<init> New CoreContainer 24377731
   [junit4]   2> 389340 T1241 oasc.CoreContainer.load Loading cores into CoreContainer [instanceDir=/mnt/ssd/jenkins/workspace/Lucene-Solr-trunk-Linux/solr/build/solr-core/test/J1/./org.apache.solr.cloud.CollectionsAPIDistributedZkTest-jetty4-1375487316169/]
   [junit4]   2> 389341 T1241 oashc.HttpShardHandlerFactory.getParameter Setting socketTimeout to: 120000
   [junit4]   2> 389341 T1241 oashc.HttpShardHandlerFactory.getParameter Setting urlScheme to: http://
   [junit4]   2> 389341 T1241 oashc.HttpShardHandlerFactory.getParameter Setting connTimeout to: 15000
   [junit4]   2> 389341 T1241 oashc.HttpShardHandlerFactory.getParameter Setting maxConnectionsPerHost to: 20
   [junit4]   2> 389342 T1241 oashc.HttpShardHandlerFactory.getParameter Setting corePoolSize to: 0
   [junit4]   2> 389342 T1241 oashc.HttpShardHandlerFactory.getParameter Setting maximumPoolSize to: 2147483647
   [junit4]   2> 389342 T1241 oashc.HttpShardHandlerFactory.getParameter Setting maxThreadIdleTime to: 5
   [junit4]   2> 389342 T1241 oashc.HttpShardHandlerFactory.getParameter Setting sizeOfQueue to: -1
   [junit4]   2> 389343 T1241 oashc.HttpShardHandlerFactory.getParameter Setting fairnessPolicy to: false
   [junit4]   2> 389343 T1241 oascsi.HttpClientUtil.createClient Creating new http client, config:maxConnectionsPerHost=20&maxConnections=10000&socketTimeout=120000&connTimeout=15000&retry=false
   [junit4]   2> 389355 T1241 oasc.ZkContainer.initZooKeeper Zookeeper client=127.0.0.1:45464/solr
   [junit4]   2> 389356 T1241 oasc.ZkController.checkChrootPath zkHost includes chroot
   [junit4]   2> 389356 T1241 oascc.ConnectionManager.waitForConnected Waiting for client to connect to ZooKeeper
   [junit4]   2> 389357 T1321 oascc.ConnectionManager.process Watcher org.apache.solr.common.cloud.ConnectionManager@1a09cc2 name:ZooKeeperConnection Watcher:127.0.0.1:45464 got event WatchedEvent state:SyncConnected type:None path:null path:null type:None
   [junit4]   2> 389358 T1241 oascc.ConnectionManager.waitForConnected Client is connected to ZooKeeper
   [junit4]   2> 389359 T1241 oascsi.HttpClientUtil.createClient Creating new http client, config:maxConnections=500&maxConnectionsPerHost=16&socketTimeout=120000&connTimeout=15000
   [junit4]   2> 389362 T1241 oascc.ConnectionManager.waitForConnected Waiting for client to connect to ZooKeeper
   [junit4]   2> 389363 T1323 oascc.ConnectionManager.process Watcher org.apache.solr.common.cloud.ConnectionManager@d597a5 name:ZooKeeperConnection Watcher:127.0.0.1:45464/solr got event WatchedEvent state:SyncConnected type:None path:null path:null type:None
   [junit4]   2> 389364 T1241 oascc.ConnectionManager.waitForConnected Client is connected to ZooKeeper
   [junit4]   2> 389367 T1241 oascc.ZkStateReader.createClusterStateWatchersAndUpdate Updating cluster state from ZooKeeper...
   [junit4]   2> 390370 T1241 oasc.ZkController.createEphemeralLiveNode Register node as live in ZooKeeper:/live_nodes/127.0.0.1:40533_yyhb%2Fmy
   [junit4]   2> 390372 T1241 oascc.SolrZkClient.makePath makePath: /live_nodes/127.0.0.1:40533_yyhb%2Fmy
   [junit4]   2> 390375 T1295 oascc.ZkStateReader$3.process Updating live nodes... (5)
   [junit4]   2> 390375 T1268 oascc.ZkStateReader$3.process Updating live nodes... (5)
   [junit4]   2> 390375 T1309 oascc.ZkStateReader$3.process Updating live nodes... (5)
   [junit4]   2> 390375 T1263 oascc.ZkStateReader$3.process Updating live nodes... (5)
   [junit4]   2> 390375 T1323 oascc.ZkStateReader$3.process Updating live nodes... (5)
   [junit4]   2> 390375 T1281 oascc.ZkStateReader$3.process Updating live nodes... (5)
   [junit4]   2> 390380 T1241 oasc.CorePropertiesLocator.discover Looking for core definitions underneath /mnt/ssd/jenkins/workspace/Lucene-Solr-trunk-Linux/solr/build/solr-core/test/J1/./org.apache.solr.cloud.CollectionsAPIDistributedZkTest-jetty4-1375487316169
   [junit4]   2> 390401 T1241 oasc.CorePropertiesLocator.discoverUnder Found core conf in /mnt/ssd/jenkins/workspace/Lucene-Solr-trunk-Linux/solr/build/solr-core/test/J1/./org.apache.solr.cloud.CollectionsAPIDistributedZkTest-jetty4-1375487316169/conf/
   [junit4]   2> 390402 T1241 oasc.CorePropertiesLocator.discover Found 1 core definitions
   [junit4]   2> 390402 T1241 oass.SolrDispatchFilter.init user.dir=/mnt/ssd/jenkins/workspace/Lucene-Solr-trunk-Linux/solr/build/solr-core/test/J1
   [junit4]   2> 390403 T1241 oass.SolrDispatchFilter.init SolrDispatchFilter.init() done
   [junit4]   2> 390403 T1241 oascsi.HttpClientUtil.createClient Creating new http client, config:maxConnections=128&maxConnectionsPerHost=32&followRedirects=false
   [junit4]   2> 390407 T1241 oascsi.HttpClientUtil.createClient Creating new http client, config:maxConnections=128&maxConnectionsPerHost=32&followRedirects=false
   [junit4]   2> 390411 T1274 oasha.CollectionsHandler.handleCreateAction Creating Collection : numShards=2&name=nodes_used_collection&replicationFactor=2&action=CREATE&wt=javabin&version=2
   [junit4]   2> 390413 T1263 oasc.DistributedQueue$LatchChildWatcher.process Watcher fired on path: /overseer/collection-queue-work state: SyncConnected type NodeChildrenChanged
   [junit4]   2> 390414 T1265 oasc.OverseerCollectionProcessor.run Overseer Collection Processor: Get the message id:/overseer/collection-queue-work/qn-0000000000 message:{
   [junit4]   2>  "operation":"createcollection",
   [junit4]   2>  "numShards":"2",
   [junit4]   2>  "name":"nodes_used_collection",
   [junit4]   2>  "replicationFactor":"2"}
   [junit4]   2> 390414 T1265 oasc.OverseerCollectionProcessor.processMessage WARN OverseerCollectionProcessor.processMessage : createcollection , {
   [junit4]   2>  "operation":"createcollection",
   [junit4]   2>  "numShards":"2",
   [junit4]   2>  "name":"nodes_used_collection",
   [junit4]   2>  "replicationFactor":"2"}
   [junit4]   2> 391569 T1264 oascc.ZkStateReader.updateClusterState Updating cloud state from ZooKeeper...
   [junit4]   2> 391570 T1264 oasc.Overseer$ClusterStateUpdater.buildCollection building a new collection: nodes_used_collection
   [junit4]   2> 391570 T1264 oasc.Overseer$ClusterStateUpdater.createCollection Create collection nodes_used_collection with shards [shard1, shard2]
   [junit4]   2> 391575 T1281 oascc.ZkStateReader$2.process A cluster state change: WatchedEvent state:SyncConnected type:NodeDataChanged path:/clusterstate.json, has occurred - updating... (live nodes size: 5)
   [junit4]   2> 391575 T1323 oascc.ZkStateReader$2.process A cluster state change: WatchedEvent state:SyncConnected type:NodeDataChanged path:/clusterstate.json, has occurred - updating... (live nodes size: 5)
   [junit4]   2> 391575 T1268 oascc.ZkStateReader$2.process A cluster state change: WatchedEvent state:SyncConnected type:NodeDataChanged path:/clusterstate.json, has occurred - updating... (live nodes size: 5)
   [junit4]   2> 391575 T1295 oascc.ZkStateReader$2.process A cluster state change: WatchedEvent state:SyncConnected type:NodeDataChanged path:/clusterstate.json, has occurred - updating... (live nodes size: 5)
   [junit4]   2> 391575 T1263 oascc.ZkStateReader$2.process A cluster state change: WatchedEvent state:SyncConnected type:NodeDataChanged path:/clusterstate.json, has occurred - updating... (live nodes size: 5)
   [junit4]   2> 391575 T1309 oascc.ZkStateReader$2.process A cluster state change: WatchedEvent state:SyncConnected type:NodeDataChanged path:/clusterstate.json, has occurred - updating... (live nodes size: 5)
   [junit4]   2> 391618 T1265 oasc.OverseerCollectionProcessor.createCollection going to create cores replicas shardNames [shard1, shard2] , repFactor : 2
   [junit4]   2> 391618 T1265 oasc.OverseerCollectionProcessor.createCollection Creating shard nodes_used_collection_shard1_replica1 as part of slice shard1 of collection nodes_used_collection on 127.0.0.1:41075_yyhb%2Fmy
   [junit4]   2> 391619 T1265 oasc.OverseerCollectionProcessor.createCollection Creating shard nodes_used_collection_shard1_replica2 as part of slice shard1 of collection nodes_used_collection on 127.0.0.1:40533_yyhb%2Fmy
   [junit4]   2> 391619 T1265 oasc.OverseerCollectionProcessor.createCollection Creating shard nodes_used_collection_shard2_replica1 as part of slice shard2 of collection nodes_used_collection on 127.0.0.1:56259_yyhb%2Fmy
   [junit4]   2> 391620 T1265 oasc.OverseerCollectionProcessor.createCollection Creating shard nodes_used_collection_shard2_replica2 as part of slice shard2 of collection nodes_used_collection on 127.0.0.1:41024_yyhb%2Fmy
   [junit4]   2> 391624 T1304 oasc.ZkController.publish publishing core=nodes_used_collection_shard2_replica2 state=down
   [junit4]   2> 391624 T1257 oasc.ZkController.publish publishing core=nodes_used_collection_shard2_replica1 state=down
   [junit4]   2> 391624 T1289 oasc.ZkController.publish publishing core=nodes_used_collection_shard1_replica1 state=down
   [junit4]   2> 391624 T1316 oasc.ZkController.publish publishing core=nodes_used_collection_shard1_replica2 state=down
   [junit4]   2> 391625 T1304 oasc.ZkController.waitForCoreNodeName look for our core node name
   [junit4]   2> 391625 T1257 oasc.ZkController.waitForCoreNodeName look for our core node name
   [junit4]   2> 391626 T1289 oasc.ZkController.waitForCoreNodeName look for our core node name
   [junit4]   2> 391626 T1316 oasc.ZkController.waitForCoreNodeName look for our core node name
   [junit4]   2> 393080 T1264 oascc.ZkStateReader.updateClusterState Updating cloud state from ZooKeeper...
   [junit4]   2> 393081 T1264 oasc.Overseer$ClusterStateUpdater.updateState WARN Could not find collection node for nodes_used_collection, skipping publish state
   [junit4]   2> 393081 T1264 oasc.Overseer$ClusterStateUpdater.updateState Update state numShards=2 message={
   [junit4]   2>  "operation":"state",
   [junit4]   2>  "core_node_name":"core_node1",
   [junit4]   2>  "numShards":"2",
   [junit4]   2>  "shard":"shard2",
   [junit4]   2>  "roles":null,
   [junit4]   2>  "state":"down",
   [junit4]   2>  "shard_state":"active",
   [junit4]   2>  "core":"nodes_used_collection_shard2_replica2",
   [junit4]   2>  "collection":"nodes_used_collection",
   [junit4]   2>  "shard_range":null,
   [junit4]   2>  "node_name":"127.0.0.1:41024_yyhb%2Fmy",
   [junit4]   2>  "base_url":"http://127.0.0.1:41024/yyhb/my"}
   [junit4]   2> 393085 T1264 oasc.Overseer$ClusterStateUpdater.updateState WARN Could not find collection node for nodes_used_collection, skipping publish state
   [junit4]   2> 393085 T1264 oasc.Overseer$ClusterStateUpdater.updateState Update state numShards=2 message={
   [junit4]   2>  "operation":"state",
   [junit4]   2>  "core_node_name":"core_node2",
   [junit4]   2>  "numShards":"2",
   [junit4]   2>  "shard":"shard2",
   [junit4]   2>  "roles":null,
   [junit4]   2>  "state":"down",
   [junit4]   2>  "shard_state":"active",
   [junit4]   2>  "core":"nodes_used_collection_shard2_replica1",
   [junit4]   2>  "collection":"nodes_used_collection",
   [junit4]   2>  "shard_range":null,
   [junit4]   2>  "node_name":"127.0.0.1:56259_yyhb%2Fmy",
   [junit4]   2>  "base_url":"http://127.0.0.1:56259/yyhb/my"}
   [junit4]   2> 393088 T1264 oasc.Overseer$ClusterStateUpdater.updateState WARN Could not find collection node for nodes_used_collection, skipping publish state
   [junit4]   2> 393088 T1264 oasc.Overseer$ClusterStateUpdater.updateState Update state numShards=2 message={
   [junit4]   2>  "operation":"state",
   [junit4]   2>  "core_node_name":"core_node3",
   [junit4]   2>  "numShards":"2",
   [junit4]   2>  "shard":"shard1",
   [junit4]   2>  "roles":null,
   [junit4]   2>  "state":"down",
   [junit4]   2>  "shard_state":"active",
   [junit4]   2>  "core":"nodes_used_collection_shard1_replica1",
   [junit4]   2>  "collection":"nodes_used_collection",
   [junit4]   2>  "shard_range":null,
   [junit4]   2>  "node_name":"127.0.0.1:41075_yyhb%2Fmy",
   [junit4]   2>  "base_url":"http://127.0.0.1:41075/yyhb/my"}
   [junit4]   2> 393091 T1264 oasc.Overseer$ClusterStateUpdater.updateState WARN Could not find collection node for nodes_used_collection, skipping publish state
   [junit4]   2> 393092 T1264 oasc.Overseer$ClusterStateUpdater.updateState Update state numShards=2 message={
   [junit4]   2>  "operation":"state",
   [junit4]   2>  "core_node_name":"core_node4",
   [junit4]   2>  "numShards":"2",
   [junit4]   2>  "shard":"shard1",
   [junit4]   2>  "roles":null,
   [junit4]   2>  "state":"down",
   [junit4]   2>  "shard_state":"active",
   [junit4]   2>  "core":"nodes_used_collection_shard1_replica2",
   [junit4]   2>  "collection":"nodes_used_collection",
   [junit4]   2>  "shard_range":null,
   [junit4]   2>  "node_name":"127.0.0.1:40533_yyhb%2Fmy",
   [junit4]   2>  "base_url":"http://127.0.0.1:40533/yyhb/my"}
   [junit4]   2> 393095 T1281 oascc.ZkStateReader$2.process A cluster state change: WatchedEvent state:SyncConnected type:NodeDataChanged path:/clusterstate.json, has occurred - updating... (live nodes size: 5)
   [junit4]   2> 393095 T1295 oascc.ZkStateReader$2.process A cluster state change: WatchedEvent state:SyncConnected type:NodeDataChanged path:/clusterstate.json, has occurred - updating... (live nodes size: 5)
   [junit4]   2> 393096 T1268 oascc.ZkStateReader$2.process A cluster state change: WatchedEvent state:SyncConnected type:NodeDataChanged path:/clusterstate.json, has occurred - updating... (live nodes size: 5)
   [junit4]   2> 393096 T1309 oascc.ZkStateReader$2.process A cluster state change: WatchedEvent state:SyncConnected type:NodeDataChanged path:/clusterstate.json, has occurred - updating... (live nodes size: 5)
   [junit4]   2> 393096 T1323 oascc.ZkStateReader$2.process A cluster state change: WatchedEvent state:SyncConnected type:NodeDataChanged path:/clusterstate.json, has occurred - updating... (live nodes size: 5)
   [junit4]   2> 393095 T1263 oascc.ZkStateReader$2.process A cluster state change: WatchedEvent state:SyncConnected type:NodeDataChanged path:/clusterstate.json, has occurred - updating... (live nodes size: 5)
   [junit4]   2> 393626 T1304 oasc.ZkController.waitForShardId waiting to find shard id in clusterstate for nodes_used_collection_shard2_replica2
   [junit4]   2> 393626 T1257 oasc.ZkController.waitForShardId waiting to find shard id in clusterstate for nodes_used_collection_shard2_replica1
   [junit4]   2> 393626 T1289 oasc.ZkController.waitForShardId waiting to find shard id in clusterstate for nodes_used_collection_shard1_replica1
   [junit4]   2> 393627 T1257 oasc.CorePropertiesLocator.writePropertiesFile ERROR Couldn't persist core properties to /mnt/ssd/jenkins/workspace/Lucene-Solr-trunk-Linux/solr/build/solr-core/test/J1/./org.apache.solr.cloud.CollectionsAPIDistributedZkTest-controljetty-1375487312309/nodes_used_collection_shard2_replica1/core.properties: java.io.FileNotFoundException: /mnt/ssd/jenkins/workspace/Lucene-Solr-trunk-Linux/solr/build/solr-core/test/J1/./org.apache.solr.cloud.CollectionsAPIDistributedZkTest-controljetty-1375487312309/nodes_used_collection_shard2_replica1/core.properties (No such file or directory)
   [junit4]   2> 393626 T1316 oasc.ZkController.waitForShardId waiting to find shard id in clusterstate for nodes_used_collection_shard1_replica2
   [junit4]   2> 393627 T1304 oasc.CorePropertiesLocator.writePropertiesFile ERROR Couldn't persist core properties to /mnt/ssd/jenkins/workspace/Lucene-Solr-trunk-Linux/solr/build/solr-core/test/J1/./org.apache.solr.cloud.CollectionsAPIDistributedZkTest-jetty3-1375487314972/nodes_used_collection_shard2_replica2/core.properties: java.io.FileNotFoundException: /mnt/ssd/jenkins/workspace/Lucene-Solr-trunk-Linux/solr/build/solr-core/test/J1/./org.apache.solr.cloud.CollectionsAPIDistributedZkTest-jetty3-1375487314972/nodes_used_collection_shard2_replica2/core.properties (No such file or directory)
   [junit4]   2> 393628 T1316 oasc.CorePropertiesLocator.writePropertiesFile ERROR Couldn't persist core properties to /mnt/ssd/jenkins/workspace/Lucene-Solr-trunk-Linux/solr/build/solr-core/test/J1/./org.apache.solr.cloud.CollectionsAPIDistributedZkTest-jetty4-1375487316169/nodes_used_collection_shard1_replica2/core.properties: java.io.FileNotFoundException: /mnt/ssd/jenkins/workspace/Lucene-Solr-trunk-Linux/solr/build/solr-core/test/J1/./org.apache.solr.cloud.CollectionsAPIDistributedZkTest-jetty4-1375487316169/nodes_used_collection_shard1_replica2/core.properties (No such file or directory)
   [junit4]   2> 393628 T1257 oasc.CoreContainer.create Creating SolrCore 'nodes_used_collection_shard2_replica1' using instanceDir: /mnt/ssd/jenkins/workspace/Lucene-Solr-trunk-Linux/solr/build/solr-core/test/J1/./org.apache.solr.cloud.CollectionsAPIDistributedZkTest-controljetty-1375487312309/nodes_used_collection_shard2_replica1
   [junit4]   2> 393629 T1257 oasc.ZkController.createCollectionZkNode Check for collection zkNode:nodes_used_collection
   [junit4]   2> 393627 T1289 oasc.CorePropertiesLocator.writePropertiesFile ERROR Couldn't persist core properties to /mnt/ssd/jenkins/workspace/Lucene-Solr-trunk-Linux/solr/build/solr-core/test/J1/./org.apache.solr.cloud.CollectionsAPIDistributedZkTest-jetty2-1375487313763/nodes_used_collection_shard1_replica1/core.properties: java.io.FileNotFoundException: /mnt/ssd/jenkins/workspace/Lucene-Solr-trunk-Linux/solr/build/solr-core/test/J1/./org.apache.solr.cloud.CollectionsAPIDistributedZkTest-jetty2-1375487313763/nodes_used_collection_shard1_replica1/core.properties (No such file or directory)
   [junit4]   2> 393628 T1316 oasc.CoreContainer.create Creating SolrCore 'nodes_used_collection_shard1_replica2' using instanceDir: /mnt/ssd/jenkins/workspace/Lucene-Solr-trunk-Linux/solr/build/solr-core/test/J1/./org.apache.solr.cloud.CollectionsAPIDistributedZkTest-jetty4-1375487316169/nodes_used_collection_shard1_replica2
   [junit4]   2> 393628 T1304 oasc.CoreContainer.create Creating SolrCore 'nodes_used_collection_shard2_replica2' using instanceDir: /mnt/ssd/jenkins/workspace/Lucene-Solr-trunk-Linux/solr/build/solr-core/test/J1/./org.apache.solr.cloud.CollectionsAPIDistributedZkTest-jetty3-1375487314972/nodes_used_collection_shard2_replica2
   [junit4]   2> 393630 T1304 oasc.ZkController.createCollectionZkNode Check for collection zkNode:nodes_used_collection
   [junit4]   2> 393630 T1316 oasc.ZkController.createCollectionZkNode Check for collection zkNode:nodes_used_collection
   [junit4]   2> 393629 T1257 oasc.ZkController.createCollectionZkNode Creating collection in ZooKeeper:nodes_used_collection
   [junit4]   2> 393631 T1316 oasc.ZkController.createCollectionZkNode Creating collection in ZooKeeper:nodes_used_collection
   [junit4]   2> 393629 T1289 oasc.CoreContainer.create Creating SolrCore 'nodes_used_collection_shard1_replica1' using instanceDir: /mnt/ssd/jenkins/workspace/Lucene-Solr-trunk-Linux/solr/build/solr-core/test/J1/./org.apache.solr.cloud.CollectionsAPIDistributedZkTest-jetty2-1375487313763/nodes_used_collection_shard1_replica1
   [junit4]   2> 393631 T1289 oasc.ZkController.createCollectionZkNode Check for collection zkNode:nodes_used_collection
   [junit4]   2> 393631 T1316 oasc.ZkController.getConfName Looking for collection configName
   [junit4]   2> 393631 T1257 oasc.ZkController.getConfName Looking for collection configName
   [junit4]   2> 393630 T1304 oasc.ZkController.createCollectionZkNode Creating collection in ZooKeeper:nodes_used_collection
   [junit4]   2> 393632 T1289 oasc.ZkController.createCollectionZkNode Creating collection in ZooKeeper:nodes_used_collection
   [junit4]   2> 393632 T1304 oasc.ZkController.getConfName Looking for collection configName
   [junit4]   2> 393633 T1289 oasc.ZkController.getConfName Looking for collection configName
   [junit4]   2> 393633 T1316 oasc.ZkController.getConfName Only one config set found in zk - using it:conf1
   [junit4]   2> 393633 T1257 oasc.ZkController.getConfName Only one config set found in zk - using it:conf1
   [junit4]   2> 393633 T1316 oascc.SolrZkClient.makePath makePath: /collections/nodes_used_collection
   [junit4]   2> 393634 T1304 oasc.ZkController.getConfName Only one config set found in zk - using it:conf1
   [junit4]   2> 393634 T1257 oascc.SolrZkClient.makePath makePath: /collections/nodes_used_collection
   [junit4]   2> 393634 T1304 oascc.SolrZkClient.makePath makePath: /collections/nodes_used_collection
   [junit4]   2> 393634 T1289 oasc.ZkController.getConfName Only one config set found in zk - using it:conf1
   [junit4]   2> 393635 T1289 oascc.SolrZkClient.makePath makePath: /collections/nodes_used_collection
   [junit4]   2> 393637 T1289 oasc.ZkController.readConfigName Load collection config from:/collections/nodes_used_collection
   [junit4]   2> 393638 T1304 oasc.ZkController.readConfigName Load collection config from:/collections/nodes_used_collection
   [junit4]   2> 393638 T1316 oasc.ZkController.readConfigName Load collection config from:/collections/nodes_used_collection
   [junit4]   2> 393638 T1257 oasc.ZkController.readConfigName Load collection config from:/collections/nodes_used_collection
   [junit4]   2> 393639 T1289 oasc.SolrResourceLoader.<init> new SolrResourceLoader for directory: '/mnt/ssd/jenkins/workspace/Lucene-Solr-trunk-Linux/solr/build/solr-core/test/J1/./org.apache.solr.cloud.CollectionsAPIDistributedZkTest-jetty2-1375487313763/nodes_used_collection_shard1_replica1/'
   [junit4]   2> 393640 T1304 oasc.SolrResourceLoader.<init> new SolrResourceLoader for directory: '/mnt/ssd/jenkins/workspace/Lucene-Solr-trunk-Linux/solr/build/solr-core/test/J1/./org.apache.solr.cloud.CollectionsAPIDistributedZkTest-jetty3-1375487314972/nodes_used_collection_shard2_replica2/'
   [junit4]   2> 393641 T1316 oasc.SolrResourceLoader.<init> new SolrResourceLoader for directory: '/mnt/ssd/jenkins/workspace/Lucene-Solr-trunk-Linux/solr/build/solr-core/test/J1/./org.apache.solr.cloud.CollectionsAPIDistributedZkTest-jetty4-1375487316169/nodes_used_collection_shard1_replica2/'
   [junit4]   2> 393641 T1257 oasc.SolrResourceLoader.<init> new SolrResourceLoader for directory: '/mnt/ssd/jenkins/workspace/Lucene-Solr-trunk-Linux/solr/build/solr-core/test/J1/./org.apache.solr.cloud.CollectionsAPIDistributedZkTest-controljetty-1375487312309/nodes_used_collection_shard2_replica1/'
   [junit4]   2> 393704 T1304 oasc.SolrConfig.<init> Using Lucene MatchVersion: LUCENE_50
   [junit4]   2> 393704 T1316 oasc.SolrConfig.<init> Using Lucene MatchVersion: LUCENE_50
   [junit4]   2> 393705 T1289 oasc.SolrConfig.<init> Using Lucene MatchVersion: LUCENE_50
   [junit4]   2> 393715 T1257 oasc.SolrConfig.<init> Using Lucene MatchVersion: LUCENE_50
   [junit4]   2> 393760 T1289 oasc.SolrConfig.<init> Loaded SolrConfig: solrconfig.xml
   [junit4]   2> 393769 T1289 oass.IndexSchema.readSchema Reading Solr Schema from schema.xml
   [junit4]   2> 393770 T1304 oasc.SolrConfig.<init> Loaded SolrConfig: solrconfig.xml
   [junit4]   2> 393772 T1304 oass.IndexSchema.readSchema Reading Solr Schema from schema.xml
   [junit4]   2> 393772 T1316 oasc.SolrConfig.<init> Loaded SolrConfig: solrconfig.xml
   [junit4]   2> 393774 T1316 oass.IndexSchema.readSchema Reading Solr Schema from schema.xml
   [junit4]   2> 393777 T1304 oass.IndexSchema.readSchema [nodes_used_collection_shard2_replica2] Schema name=test
   [junit4]   2> 393778 T1289 oass.IndexSchema.readSchema [nodes_used_collection_shard1_replica1] Schema name=test
   [junit4]   2> 393783 T1316 oass.IndexSchema.readSchema [nodes_used_collection_shard1_replica2] Schema name=test
   [junit4]   2> 393784 T1257 oasc.SolrConfig.<init> Loaded SolrConfig: solrconfig.xml
   [junit4]   2> 393786 T1257 oass.IndexSchema.readSchema Reading Solr Schema from schema.xml
   [junit4]   2> 393803 T1257 oass.IndexSchema.readSchema [nodes_used_collection_shard2_replica1] Schema name=test
   [junit4]   2> 394217 T1304 oass.OpenExchangeRatesOrgProvider.init Initialized with rates=open-exchange-rates.json, refreshInterval=1440.
   [junit4]   2> 394222 T1304 oass.IndexSchema.readSchema default search field in schema is text
   [junit4]   2> 394229 T1304 oass.IndexSchema.readSchema unique key field: id
   [junit4]   2> 394240 T1304 oass.FileExchangeRateProvider.reload Reloading exchange rates from file currency.xml
   [junit4]   2> 394243 T1304 oass.FileExchangeRateProvider.reload Reloading exchange rates from file currency.xml
   [junit4]   2> 394246 T1304 oass.OpenExchangeRatesOrgProvider.reload Reloading exchange rates from open-exchange-rates.json
   [junit4]   2> 394247 T1304 oass.OpenExchangeRatesOrgProvider$OpenExchangeRates.<init> WARN Unknown key IMPORTANT NOTE
   [junit4]   2> 394247 T1304 oass.OpenExchangeRatesOrgProvider$OpenExchangeRates.<init> WARN Expected key, got STRING
   [junit4]   2> 394247 T1304 oass.OpenExchangeRatesOrgProvider.reload Reloading exchange rates from open-exchange-rates.json
   [junit4]   2> 394248 T1304 oass.OpenExchangeRatesOrgProvider$OpenExchangeRates.<init> WARN Unknown key IMPORTANT NOTE
   [junit4]   2> 394248 T1304 oass.OpenExchangeRatesOrgProvider$OpenExchangeRates.<init> WARN Expected key, got STRING
   [junit4]   2> 394249 T1304 oasc.SolrCore.initDirectoryFactory org.apache.solr.core.MockDirectoryFactory
   [junit4]   2> 394249 T1304 oasc.SolrCore.<init> [nodes_used_collection_shard2_replica2] Opening new SolrCore at /mnt/ssd/jenkins/workspace/Lucene-Solr-trunk-Linux/solr/build/solr-core/test/J1/./org.apache.solr.cloud.CollectionsAPIDistributedZkTest-jetty3-1375487314972/nodes_used_collection_shard2_replica2/, dataDir=/mnt/ssd/jenkins/workspace/Lucene-Solr-trunk-Linux/solr/build/solr-core/test/J1/./org.apache.solr.cloud.CollectionsAPIDistributedZkTest-jetty3-1375487314972//nodes_used_collection_shard2_replica2/data/
   [junit4]   2> 394249 T1304 oasc.JmxMonitoredMap.<init> JMX monitoring is enabled. Adding Solr mbeans to JMX Server: com.sun.jmx.mbeanserver.JmxMBeanServer@a1c384
   [junit4]   2> 394255 T1304 oasc.CachingDirectoryFactory.get return new directory for /mnt/ssd/jenkins/workspace/Lucene-Solr-trunk-Linux/solr/build/solr-core/test/J1/./org.apache.solr.cloud.CollectionsAPIDistributedZkTest-jetty3-1375487314972//nodes_used_collection_shard2_replica2/data
   [junit4]   2> 394255 T1304 oasc.SolrCore.getNewIndexDir New index directory detected: old=null new=/mnt/ssd/jenkins/workspace/Lucene-Solr-trunk-Linux/solr/build/solr-core/test/J1/./org.apache.solr.cloud.CollectionsAPIDistributedZkTest-jetty3-1375487314972//nodes_used_collection_shard2_replica2/data/index/
   [junit4]   2> 394256 T1304 oasc.SolrCore.initIndex WARN [nodes_used_collection_shard2_replica2] Solr index directory '/mnt/ssd/jenkins/workspace/Lucene-Solr-trunk-Linux/solr/build/solr-core/test/J1/./org.apache.solr.cloud.CollectionsAPIDistributedZkTest-jetty3-1375487314972/nodes_used_collection_shard2_replica2/data/index' doesn't exist. Creating new index...
   [junit4]   2> 394256 T1304 oasc.CachingDirectoryFactory.get return new directory for /mnt/ssd/jenkins/workspace/Lucene-Solr-trunk-Linux/solr/build/solr-core/test/J1/./org.apache.solr.cloud.CollectionsAPIDistributedZkTest-jetty3-1375487314972//nodes_used_collection_shard2_replica2/data/index
   [junit4]   2> 394258 T1304 oasc.SolrDeletionPolicy.onCommit SolrDeletionPolicy.onCommit: commits: num=1
   [junit4]   2> commit{dir=MockDirWrapper(org.apache.lucene.store.RAMDirectory@112f68d lockFactory=org.apache.lucene.store.NativeFSLockFactory@c74906),segFN=segments_1,generation=1}
   [junit4]   2> 394258 T1304 oasc.SolrDeletionPolicy.updateCommits newest commit generation = 1
   [junit4]   2> 394261 T1304 oasup.UpdateRequestProcessorChain.init inserting DistributedUpdateProcessorFactory into updateRequestProcessorChain "dedupe"
   [junit4]   2> 394261 T1304 oasup.UpdateRequestProcessorChain.init inserting DistributedUpdateProcessorFactory into updateRequestProcessorChain "stored_sig"
   [junit4]   2> 394262 T1304 oasup.UpdateRequestProcessorChain.init inserting DistributedUpdateProcessorFactory into updateRequestProcessorChain "distrib-dup-test-chain-implicit"
   [junit4]   2> 394262 T1304 oasc.RequestHandlers.initHandlersFromConfig created standard: solr.StandardRequestHandler
   [junit4]   2> 394263 T1304 oasc.RequestHandlers.initHandlersFromConfig created /get: solr.RealTimeGetHandler
   [junit4]   2> 394263 T1304 oasc.RequestHandlers.initHandlersFromConfig adding lazy requestHandler: solr.ReplicationHandler
   [junit4]   2> 394263 T1304 oasc.RequestHandlers.initHandlersFromConfig created /replication: solr.ReplicationHandler
   [junit4]   2> 394264 T1304 oasc.RequestHandlers.initHandlersFromConfig created /update: solr.UpdateRequestHandler
   [junit4]   2> 394264 T1304 oasc.RequestHandlers.initHandlersFromConfig created /admin/: org.apache.solr.handler.admin.AdminHandlers
   [junit4]   2> 394266 T1304 oashl.XMLLoader.init xsltCacheLifetimeSeconds=60
   [junit4]   2> 394268 T1304 oass.SolrIndexSearcher.<init> Opening Searcher@286a28 main
   [junit4]   2> 394269 T1304 oasu.CommitTracker.<init> Hard AutoCommit: disabled
   [junit4]   2> 394269 T1304 oasu.CommitTracker.<init> Soft AutoCommit: disabled
   [junit4]   2> 394288 T1329 oasc.SolrCore.registerSearcher [nodes_used_collection_shard2_replica2] Registered new searcher Searcher@286a28 main{StandardDirectoryReader(segments_1:1)}
   [junit4]   2> 394289 T1304 oasc.CoreContainer.registerCore registering core: nodes_used_collection_shard2_replica2
   [junit4]   2> 394290 T1304 oasc.ZkController.register Register replica - core:nodes_used_collection_shard2_replica2 address:http://127.0.0.1:41024/yyhb/my collection:nodes_used_collection shard:shard2
   [junit4]   2> 394290 T1304 oascsi.HttpClientUtil.createClient Creating new http client, config:maxConnections=10000&maxConnectionsPerHost=20&connTimeout=15000&socketTimeout=30000&retry=false
   [junit4]   2> 394294 T1304 oascc.SolrZkClient.makePath makePath: /collections/nodes_used_collection/leader_elect/shard2/election
   [junit4]   2> 394301 T1304 oasc.ShardLeaderElectionContext.runLeaderProcess Running the leader process for shard shard2
   [junit4]   2> 394304 T1304 oasc.ShardLeaderElectionContext.waitForReplicasToComeUp Waiting until we see more replicas up for shard shard2: total=2 found=1 timeoutin=179999
   [junit4]   2> 394382 T1257 oass.OpenExchangeRatesOrgProvider.init Initialized with rates=open-exchange-rates.json, refreshInterval=1440.
   [junit4]   2> 394390 T1257 oass.IndexSchema.readSchema default search field in schema is text
   [junit4]   2> 394392 T1257 oass.IndexSchema.readSchema unique key field: id
   [junit4]   2> 394408 T1257 oass.FileExchangeRateProvider.reload Reloading exchange rates from file currency.xml
   [junit4]   2> 394409 T1289 oass.OpenExchangeRatesOrgProvider.init Initialized with rates=open-exchange-rates.json, refreshInterval=1440.
   [junit4]   2> 394414 T1257 oass.FileExchangeRateProvider.reload Reloading exchange rates from file currency.xml
   [junit4]   2> 394416 T1289 oass.IndexSchema.readSchema default search field in schema is text
   [junit4]   2> 394418 T1257 oass.OpenExchangeRatesOrgProvider.reload Reloading exchange rates from open-exchange-rates.json
   [junit4]   2> 394419 T1257 oass.OpenExchangeRatesOrgProvider$OpenExchangeRates.<init> WARN Unknown key IMPORTANT NOTE
   [junit4]   2> 394420 T1257 oass.OpenExchangeRatesOrgProvider$OpenExchangeRates.<init> WARN Expected key, got STRING
   [junit4]   2> 394420 T1289 oass.IndexSchema.readSchema unique key field: id
   [junit4]   2> 394420 T1257 oass.OpenExchangeRatesOrgProvider.reload Reloading exchange rates from open-exchange-rates.json
   [junit4]   2> 394422 T1257 oass.OpenExchangeRatesOrgProvider$OpenExchangeRates.<init> WARN Unknown key IMPORTANT NOTE
   [junit4]   2> 394422 T1257 oass.OpenExchangeRatesOrgProvider$OpenExchangeRates.<init> WARN Expected key, got STRING
   [junit4]   2> 394422 T1257 oasc.SolrCore.initDirectoryFactory org.apache.solr.core.MockDirectoryFactory
   [junit4]   2> 394423 T1257 oasc.SolrCore.<init> [nodes_used_collection_shard2_replica1] Opening new SolrCore at /mnt/ssd/jenkins/workspace/Lucene-Solr-trunk-Linux/solr/build/solr-core/test/J1/./org.apache.solr.cloud.CollectionsAPIDistributedZkTest-controljetty-1375487312309/nodes_used_collection_shard2_replica1/, dataDir=/mnt/ssd/jenkins/workspace/Lucene-Solr-trunk-Linux/solr/build/solr-core/test/J1/./org.apache.solr.cloud.CollectionsAPIDistributedZkTest-controljetty-1375487312309//nodes_used_collection_shard2_replica1/data/
   [junit4]   2> 394424 T1257 oasc.JmxMonitoredMap.<init> JMX monitoring is enabled. Adding Solr mbeans to JMX Server: com.sun.jmx.mbeanserver.JmxMBeanServer@a1c384
   [junit4]   2> 394426 T1257 oasc.CachingDirectoryFactory.get return new directory for /mnt/ssd/jenkins/workspace/Lucene-Solr-trunk-Linux/solr/build/solr-core/test/J1/./org.apache.solr.cloud.CollectionsAPIDistributedZkTest-controljetty-1375487312309//nodes_used_collection_shard2_replica1/data
   [junit4]   2> 394427 T1257 oasc.SolrCore.getNewIndexDir New index directory detected: old=null new=/mnt/ssd/jenkins/workspace/Lucene-Solr-trunk-Linux/solr/build/solr-core/test/J1/./org.apache.solr.cloud.CollectionsAPIDistributedZkTest-controljetty-1375487312309//nodes_used_collection_shard2_replica1/data/index/
   [junit4]   2> 394427 T1316 oass.OpenExchangeRatesOrgProvider.init Initialized with rates=open-exchange-rates.json, refreshInterval=1440.
   [junit4]   2> 394428 T1257 oasc.SolrCore.initIndex WARN [nodes_used_collection_shard2_replica1] Solr index directory '/mnt/ssd/jenkins/workspace/Lucene-Solr-trunk-Linux/solr/build/solr-core/test/J1/./org.apache.solr.cloud.CollectionsAPIDistributedZkTest-controljetty-1375487312309/nodes_used_collection_shard2_replica1/data/index' doesn't exist. Creating new index...
   [junit4]   2> 394429 T1257 oasc.CachingDirectoryFactory.get return new directory for /mnt/ssd/jenkins/workspace/Lucene-Solr-trunk-Linux/solr/build/solr-core/test/J1/./org.apache.solr.cloud.CollectionsAPIDistributedZkTest-controljetty-1375487312309//nodes_used_collection_shard2_replica1/data/index
   [junit4]   2> 394431 T1257 oasc.SolrDeletionPolicy.onCommit SolrDeletionPolicy.onCommit: commits: num=1
   [junit4]   2> commit{dir=MockDirWrapper(org.apache.lucene.store.RAMDirectory@50cd56 lockFactory=org.apache.lucene.store.NativeFSLockFactory@137842f),segFN=segments_1,generation=1}
   [junit4]   2> 394431 T1257 oasc.SolrDeletionPolicy.updateCommits newest commit generation = 1
   [junit4]   2> 394434 T1289 oass.FileExchangeRateProvider.reload Reloading exchange rates from file currency.xml
   [junit4]   2> 394435 T1257 oasup.UpdateRequestProcessorChain.init inserting DistributedUpdateProcessorFactory into updateRequestProcessorChain "dedupe"
   [junit4]   2> 394436 T1257 oasup.UpdateRequestProcessorChain.init inserting DistributedUpdateProcessorFactory into updateRequestProcessorChain "stored_sig"
   [junit4]   2> 394436 T1316 oass.IndexSchema.readSchema default search field in schema is text
   [junit4]   2> 394437 T1257 oasup.UpdateRequestProcessorChain.init inserting DistributedUpdateProcessorFactory into updateRequestProcessorChain "distrib-dup-test-chain-implicit"
   [junit4]   2> 394437 T1257 oasc.RequestHandlers.initHandlersFromConfig created standard: solr.StandardRequestHandler
   [junit4]   2> 394438 T1257 oasc.RequestHandlers.initHandlersFromConfig created /get: solr.RealTimeGetHandler
   [junit4]   2> 394438 T1257 oasc.RequestHandlers.initHandlersFromConfig adding lazy requestHandler: solr.ReplicationHandler
   [junit4]   2> 394439 T1316 oass.IndexSchema.readSchema unique key field: id
   [junit4]   2> 394439 T1257 oasc.RequestHandlers.initHandlersFromConfig created /replication: solr.ReplicationHandler
   [junit4]   2> 394439 T1257 oasc.RequestHandlers.initHandlersFromConfig created /update: solr.UpdateRequestHandler
   [junit4]   2> 394440 T1257 oasc.RequestHandlers.initHandlersFromConfig created /admin/: org.apache.solr.handler.admin.AdminHandlers
   [junit4]   2> 394441 T1289 oass.FileExchangeRateProvider.reload Reloading exchange rates from file currency.xml
   [junit4]   2> 394442 T1257 oashl.XMLLoader.init xsltCacheLifetimeSeconds=60
   [junit4]   2> 394444 T1257 oass.SolrIndexSearcher.<init> Opening Searcher@1573d03 main
   [junit4]   2> 394445 T1257 oasu.CommitTracker.<init> Hard AutoCommit: disabled
   [junit4]   2> 394445 T1257 oasu.CommitTracker.<init> Soft AutoCommit: disabled
   [junit4]   2> 394447 T1289 oass.OpenExchangeRatesOrgProvider.reload Reloading exchange rates from open-exchange-rates.json
   [junit4]   2> 394449 T1330 oasc.SolrCore.registerSearcher [nodes_used_collection_shard2_replica1] Registered new searcher Searcher@1573d03 main{StandardDirectoryReader(segments_1:1)}
   [junit4]   2> 394449 T1289 oass.OpenExchangeRatesOrgProvider$OpenExchangeRates.<init> WARN Unknown key IMPORTANT NOTE
   [junit4]   2> 394450 T1289 oass.OpenExchangeRatesOrgProvider$OpenExchangeRates.<init> WARN Expected key, got STRING
   [junit4]   2> 394450 T1289 oass.OpenExchangeRatesOrgProvider.reload Reloading exchange rates from open-exchange-rates.json
   [junit4]   2> 394451 T1257 oasc.CoreContainer.registerCore registering core: nodes_used_collection_shard2_replica1
   [junit4]   2> 394451 T1257 oasc.ZkController.register Register replica - core:nodes_used_collection_shard2_replica1 address:http://127.0.0.1:56259/yyhb/my collection:nodes_used_collection shard:shard2
   [junit4]   2> 394451 T1289 oass.OpenExchangeRatesOrgProvider$OpenExchangeRates.<init> WARN Unknown key IMPORTANT NOTE
   [junit4]   2> 394452 T1289 oass.OpenExchangeRatesOrgProvider$OpenExchangeRates.<init> WARN Expected key, got STRING
   [junit4]   2> 394452 T1257 oascsi.HttpClientUtil.createClient Creating new http client, config:maxConnections=10000&maxConnectionsPerHost=20&connTimeout=15000&socketTimeout=30000&retry=false
   [junit4]   2> 394452 T1289 oasc.SolrCore.initDirectoryFactory org.apache.solr.core.MockDirectoryFactory
   [junit4]   2> 394453 T1289 oasc.SolrCore.<init> [nodes_used_collection_shard1_replica1] Opening new SolrCore at /mnt/ssd/jenkins/workspace/Lucene-Solr-trunk-Linux/solr/build/solr-core/test/J1/./org.apache.solr.cloud.CollectionsAPIDistributedZkTest-jetty2-1375487313763/nodes_used_collection_shard1_replica1/, dataDir=/mnt/ssd/jenkins/workspace/Lucene-Solr-trunk-Linux/solr/build/solr-core/test/J1/./org.apache.solr.cloud.CollectionsAPIDistributedZkTest-jetty2-1375487313763//nodes_used_collection_shard1_replica1/data/
   [junit4]   2> 394453 T1289 oasc.JmxMonitoredMap.<init> JMX monitoring is enabled. Adding Solr mbeans to JMX Server: com.sun.jmx.mbeanserver.JmxMBeanServer@a1c384
   [junit4]   2> 394454 T1289 oasc.CachingDirectoryFactory.get return new directory for /mnt/ssd/jenkins/workspace/Lucene-Solr-trunk-Linux/solr/build/solr-core/test/J1/./org.apache.solr.cloud.CollectionsAPIDistributedZkTest-jetty2-1375487313763//nodes_used_collection_shard1_replica1/data
   [junit4]   2> 394454 T1289 oasc.SolrCore.getNewIndexDir New index directory detected: old=null new=/mnt/ssd/jenkins/workspace/Lucene-Solr-trunk-Linux/solr/build/solr-core/test/J1/./org.apache.solr.cloud.CollectionsAPIDistributedZkTest-jetty2-1375487313763//nodes_used_collection_shard1_replica1/data/index/
   [junit4]   2> 394455 T1289 oasc.SolrCore.initIndex WARN [nodes_used_collection_shard1_replica1] Solr index directory '/mnt/ssd/jenkins/workspace/Lucene-Solr-trunk-Linux/solr/build/solr-core/test/J1/./org.apache.solr.cloud.CollectionsAPIDistributedZkTest-jetty2-1375487313763/nodes_used_collection_shard1_replica1/data/index' doesn't exist. Creating new index...
   [junit4]   2> 394455 T1289 oasc.CachingDirectoryFactory.get return new directory for /mnt/ssd/jenkins/workspace/Lucene-Solr-trunk-Linux/solr/build/solr-core/test/J1/./org.apache.solr.cloud.CollectionsAPIDistributedZkTest-jetty2-1375487313763//nodes_used_collection_shard1_replica1/data/index
   [junit4]   2> 394456 T1316 oass.FileExchangeRateProvider.reload Reloading exchange rates from file currency.xml
   [junit4]   2> 394461 T1289 oasc.SolrDeletionPolicy.onCommit SolrDeletionPolicy.onCommit: commits: num=1
   [junit4]   2> commit{dir=MockDirWrapper(org.apache.lucene.store.RAMDirectory@1acdb89 lockFactory=org.apache.lucene.store.NativeFSLockFactory@10c697f),segFN=segments_1,generation=1}
   [junit4]   2> 394461 T1289 oasc.SolrDeletionPolicy.updateCommits newest commit generation = 1
   [junit4]   2> 394473 T1316 oass.FileExchangeRateProvider.reload Reloading exchange rates from file currency.xml
   [junit4]   2> 394474 T1289 oasup.UpdateRequestProcessorChain.init inserting DistributedUpdateProcessorFactory into updateRequestProcessorChain "dedupe"
   [junit4]   2> 394475 T1289 oasup.UpdateRequestProcessorChain.init inserting DistributedUpdateProcessorFactory into updateRequestProcessorChain "stored_sig"
   [junit4]   2> 394476 T1289 oasup.UpdateRequestProcessorChain.init inserting DistributedUpdateProcessorFactory into updateRequestProcessorChain "distrib-dup-test-chain-implicit"
   [junit4]   2> 394476 T1289 oasc.RequestHandlers.initHandlersFromConfig created standard: solr.StandardRequestHandler
   [junit4]   2> 394477 T1289 oasc.RequestHandlers.initHandlersFromConfig created /get: solr.RealTimeGetHandler
   [junit4]   2> 394477 T1289 oasc.RequestHandlers.initHandlersFromConfig adding lazy requestHandler: solr.ReplicationHandler
   [junit4]   2> 394478 T1289 oasc.RequestHandlers.initHandlersFromConfig created /replication: solr.ReplicationHandler
   [junit4]   2> 394478 T1289 oasc.RequestHandlers.initHandlersFromConfig created /update: solr.UpdateRequestHandler
   [junit4]   2> 394479 T1289 oasc.RequestHandlers.initHandlersFromConfig created /admin/: org.apache.solr.handler.admin.AdminHandlers
   [junit4]   2> 394479 T1316 oass.OpenExchangeRatesOrgProvider.reload Reloading exchange rates from open-exchange-rates.json
   [junit4]   2> 394481 T1316 oass.OpenExchangeRatesOrgProvider$OpenExchangeRates.<init> WARN Unknown key IMPORTANT NOTE
   [junit4]   2> 394481 T1316 oass.OpenExchangeRatesOrgProvider$OpenExchangeRates.<init> WARN Expected key, got STRING
   [junit4]   2> 394481 T1316 oass.OpenExchangeRatesOrgProvider.reload Reloading exchange rates from open-exchange-rates.json
   [junit4]   2> 394482 T1289 oashl.XMLLoader.init xsltCacheLifetimeSeconds=60
   [junit4]   2> 394482 T1316 oass.OpenExchangeRatesOrgProvider$OpenExchangeRates.<init> WARN Unknown key IMPORTANT NOTE
   [junit4]   2> 394483 T1316 oass.OpenExchangeRatesOrgProvider$OpenExchangeRates.<init> WARN Expected key, got STRING
   [junit4]   2> 394483 T1316 oasc.SolrCore.initDirectoryFactory org.apache.solr.core.MockDirectoryFactory
   [junit4]   2> 394484 T1316 oasc.SolrCore.<init> [nodes_used_collection_shard1_replica2] Opening new SolrCore at /mnt/ssd/jenkins/workspace/Lucene-Solr-trunk-Linux/solr/build/solr-core/test/J1/./org.apache.solr.cloud.CollectionsAPIDistributedZkTest-jetty4-1375487316169/nodes_used_collection_shard1_replica2/, dataDir=/mnt/ssd/jenkins/workspace/Lucene-Solr-trunk-Linux/solr/build/solr-core/test/J1/./org.apache.solr.cloud.CollectionsAPIDistributedZkTest-jetty4-1375487316169//nodes_used_collection_shard1_replica2/data/
   [junit4]   2> 394484 T1316 oasc.JmxMonitoredMap.<init> JMX monitoring is enabled. Adding Solr mbeans to JMX Server: com.sun.jmx.mbeanserver.JmxMBeanServer@a1c384
   [junit4]   2> 394484 T1289 oass.SolrIndexSearcher.<init> Opening Searcher@11fe7c main
   [junit4]   2> 394485 T1316 oasc.CachingDirectoryFactory.get return new directory for /mnt/ssd/jenkins/workspace/Lucene-Solr-trunk-Linux/solr/build/solr-core/test/J1/./org.apache.solr.cloud.CollectionsAPIDistributedZkTest-jetty4-1375487316169//nodes_used_collection_shard1_replica2/data
   [junit4]   2> 394485 T1289 oasu.CommitTracker.<init> Hard AutoCommit: disabled
   [junit4]   2> 394485 T1316 oasc.SolrCore.getNewIndexDir New index directory detected: old=null new=/mnt/ssd/jenkins/workspace/Lucene-Solr-trunk-Linux/solr/build/solr-core/test/J1/./org.apache.solr.cloud.CollectionsAPIDistributedZkTest-jetty4-1375487316169//nodes_used_collection_shard1_replica2/data/index/
   [junit4]   2> 394486 T1289 oasu.CommitTracker.<init> Soft AutoCommit: disabled
   [junit4]   2> 394486 T1316 oasc.SolrCore.initIndex WARN [nodes_used_collection_shard1_replica2] Solr index directory '/mnt/ssd/jenkins/workspace/Lucene-Solr-trunk-Linux/solr/build/solr-core/test/J1/./org.apache.solr.cloud.CollectionsAPIDistributedZkTest-jetty4-1375487316169/nodes_used_collection_shard1_replica2/data/index' doesn't exist. Creating new index...
   [junit4]   2> 394487 T1316 oasc.CachingDirectoryFactory.get return new directory for /mnt/ssd/jenkins/workspace/Lucene-Solr-trunk-Linux/solr/build/solr-core/test/J1/./org.apache.solr.cloud.CollectionsAPIDistributedZkTest-jetty4-1375487316169//nodes_used_collection_shard1_replica2/data/index
   [junit4]   2> 394488 T1316 oasc.SolrDeletionPolicy.onCommit SolrDeletionPolicy.onCommit: commits: num=1
   [junit4]   2> commit{dir=MockDirWrapper(org.apache.lucene.store.RAMDirectory@29c038 lockFactory=org.apache.lucene.store.NativeFSLockFactory@1e2a2c),segFN=segments_1,generation=1}
   [junit4]   2> 394489 T1316 oasc.SolrDeletionPolicy.updateCommits newest commit generation = 1
   [junit4]   2> 394490 T1331 oasc.SolrCore.registerSearcher [nodes_used_collection_shard1_replica1] Registered new searcher Searcher@11fe7c main{StandardDirectoryReader(segments_1:1)}
   [junit4]   2> 394491 T1289 oasc.CoreContainer.registerCore registering core: nodes_used_collection_shard1_replica1
   [junit4]   2> 394492 T1289 oasc.ZkController.register Register replica - core:nodes_used_collection_shard1_replica1 address:http://127.0.0.1:41075/yyhb/my collection:nodes_used_collection shard:shard1
   [junit4]   2> 394492 T1289 oascsi.HttpClientUtil.createClient Creating new http client, config:maxConnections=10000&maxConnectionsPerHost=20&connTimeout=15000&socketTimeout=30000&retry=false
   [junit4]   2> 394493 T1316 oasup.UpdateRequestProcessorChain.init inserting DistributedUpdateProcessorFactory into updateRequestProcessorChain "dedupe"
   [junit4]   2> 394493 T1316 oasup.UpdateRequestProcessorChain.init inserting DistributedUpdateProcessorFactory into updateRequestProcessorChain "stored_sig"
   [junit4]   2> 394494 T1316 oasup.UpdateRequestProcessorChain.init inserting DistributedUpdateProcessorFactory into updateRequestProcessorChain "distrib-dup-test-chain-implicit"
   [junit4]   2> 394495 T1316 oasc.RequestHandlers.initHandlersFromConfig created standard: solr.StandardRequestHandler
   [junit4]   2> 394495 T1316 oasc.RequestHandlers.initHandlersFromConfig created /get: solr.RealTimeGetHandler
   [junit4]   2> 394496 T1316 oasc.RequestHandlers.initHandlersFromConfig adding lazy requestHandler: solr.ReplicationHandler
   [junit4]   2> 394496 T1316 oasc.RequestHandlers.initHandlersFromConfig created /replication: solr.ReplicationHandler
   [junit4]   2> 394497 T1316 oasc.RequestHandlers.initHandlersFromConfig created /update: solr.UpdateRequestHandler
   [junit4]   2> 394497 T1316 oasc.RequestHandlers.initHandlersFromConfig created /admin/: org.apache.solr.handler.admin.AdminHandlers
   [junit4]   2> 394497 T1289 oascc.SolrZkClient.makePath makePath: /collections/nodes_used_collection/leader_elect/shard1/election
   [junit4]   2> 394501 T1316 oashl.XMLLoader.init xsltCacheLifetimeSeconds=60
   [junit4]   2> 394503 T1316 oass.SolrIndexSearcher.<init> Opening Searcher@11db1ab main
   [junit4]   2> 394504 T1316 oasu.CommitTracker.<init> Hard AutoCommit: disabled
   [junit4]   2> 394504 T1316 oasu.CommitTracker.<init> Soft AutoCommit: disabled
   [junit4]   2> 394508 T1332 oasc.SolrCore.registerSearcher [nodes_used_collection_shard1_replica2] Registered new searcher Searcher@11db1ab main{StandardDirectoryReader(segments_1:1)}
   [junit4]   2> 394508 T1289 oasc.ShardLeaderElectionContext.runLeaderProcess Running the leader process for shard shard1
   [junit4]   2> 394509 T1316 oasc.CoreContainer.registerCore registering core: nodes_used_collection_shard1_replica2
   [junit4]   2> 394509 T1316 oasc.ZkController.register Register replica - core:nodes_used_collection_shard1_replica2 address:http://127.0.0.1:40533/yyhb/my collection:nodes_used_collection shard:shard1
   [junit4]   2> 394509 T1316 oascsi.HttpClientUtil.createClient Creating new http client, config:maxConnections=10000&maxConnectionsPerHost=20&connTimeout=15000&socketTimeout=30000&retry=false
   [junit4]   2> 394511 T1289 oasc.ShardLeaderElectionContext.waitForReplicasToComeUp Waiting until we see more replicas up for shard shard1: total=2 found=1 timeoutin=180000
   [junit4]   2> 394606 T1264 oascc.ZkStateReader.updateClusterState Updating cloud state from ZooKeeper...
   [junit4]   2> 394612 T1281 oascc.ZkStateReader$2.process A cluster state change: WatchedEvent state:SyncConnected type:NodeDataChanged path:/clusterstate.json, has occurred - updating... (live nodes size: 5)
   [junit4]   2> 394612 T1295 oascc.ZkStateReader$2.process A cluster state change: WatchedEvent state:SyncConnected type:NodeDataChanged path:/clusterstate.json, has occurred - updating... (live nodes size: 5)
   [junit4]   2> 394612 T1309 oascc.ZkStateReader$2.process A cluster state change: WatchedEvent state:SyncConnected type:NodeDataChanged path:/clusterstate.json, has occurred - updating... (live nodes size: 5)
   [junit4]   2> 394612 T1323 oascc.ZkStateReader$2.process A cluster state change: WatchedEvent state:SyncConnected type:NodeDataChanged path:/clusterstate.json, has occurred - updating... (live nodes size: 5)
   [junit4]   2> 394612 T1268 oascc.ZkStateReader$2.process A cluster state change: WatchedEvent state:SyncConnected type:NodeDataChanged path:/clusterstate.json, has occurred - updating... (live nodes size: 5)
   [junit4]   2> 394612 T1263 oascc.ZkStateReader$2.process A cluster state change: WatchedEvent state:SyncConnected type:NodeDataChanged path:/clusterstate.json, has occurred - updating... (live nodes size: 5)
   [junit4]   2> 394805 T1304 oasc.ShardLeaderElectionContext.waitForReplicasToComeUp Enough replicas found to continue.
   [junit4]   2> 394805 T1304 oasc.ShardLeaderElectionContext.runLeaderProcess I may be the new leader - try and sync
   [junit4]   2> 394806 T1304 oasc.SyncStrategy.sync Sync replicas to http://127.0.0.1:41024/yyhb/my/nodes_used_collection_shard2_replica2/
   [junit4]   2> 394806 T1304 oasu.PeerSync.sync PeerSync: core=nodes_used_collection_shard2_replica2 url=http://127.0.0.1:41024/yyhb/my START replicas=[http://127.0.0.1:56259/yyhb/my/nodes_used_collection_shard2_replica1/] nUpdates=100
   [junit4]   2> 394806 T1304 oasu.PeerSync.sync PeerSync: core=nodes_used_collection_shard2_replica2 url=http://127.0.0.1:41024/yyhb/my DONE.  We have no versions.  sync failed.
   [junit4]   2> 394807 T1304 oasc.SyncStrategy.syncReplicas Leader's attempt to sync with shard failed, moving to the next candidate
   [junit4]   2> 394807 T1304 oasc.ShardLeaderElectionContext.runLeaderProcess We failed sync, but we have no versions - we can't sync in that case - we were active before, so become leader anyway
   [junit4]   2> 394807 T1304 oasc.ShardLeaderElectionContext.runLeaderProcess I am the new leader: http://127.0.0.1:41024/yyhb/my/nodes_used_collection_shard2_replica2/ shard2
   [junit4]   2> 394807 T1304 oascc.SolrZkClient.makePath makePath: /collections/nodes_used_collection/leaders/shard2
   [junit4]   2> ASYNC  NEW_CORE C9828 name=nodes_used_collection_shard2_replica1 org.apache.solr.core.SolrCore@9d9b0c url=http://127.0.0.1:56259/yyhb/my/nodes_used_collection_shard2_replica1 node=127.0.0.1:56259_yyhb%2Fmy C9828_STATE=coll:nodes_used_collection core:nodes_used_collection_shard2_replica1 props:{state=down, core=nodes_used_collection_shard2_replica1, node_name=127.0.0.1:56259_yyhb%2Fmy, base_url=http://127.0.0.1:56259/yyhb/my}
   [junit4]   2> 394812 T1258 C9828 P56259 oasc.SolrCore.execute [nodes_used_collection_shard2_replica1] webapp=/yyhb/my path=/get params={getVersions=100&distrib=false&wt=javabin&qt=/g

[...truncated too long message...]

1375487316169//new_implicit_coll_1_d_replica2/data/index [CachedDir<<refCount=0;path=/mnt/ssd/jenkins/workspace/Lucene-Solr-trunk-Linux/solr/build/solr-core/test/J1/./org.apache.solr.cloud.CollectionsAPIDistributedZkTest-jetty4-1375487316169//new_implicit_coll_1_d_replica2/data/index;done=false>>]
   [junit4]   2> 502035 T1241 oasc.CachingDirectoryFactory.close Closing directory: /mnt/ssd/jenkins/workspace/Lucene-Solr-trunk-Linux/solr/build/solr-core/test/J1/./org.apache.solr.cloud.CollectionsAPIDistributedZkTest-jetty4-1375487316169//new_implicit_coll_1_d_replica2/data/index
   [junit4]   2> 502035 T1241 oasc.CachingDirectoryFactory.closeCacheValue looking to close /mnt/ssd/jenkins/workspace/Lucene-Solr-trunk-Linux/solr/build/solr-core/test/J1/./org.apache.solr.cloud.CollectionsAPIDistributedZkTest-jetty4-1375487316169//new_implicit_coll_1_d_replica2/data [CachedDir<<refCount=0;path=/mnt/ssd/jenkins/workspace/Lucene-Solr-trunk-Linux/solr/build/solr-core/test/J1/./org.apache.solr.cloud.CollectionsAPIDistributedZkTest-jetty4-1375487316169//new_implicit_coll_1_d_replica2/data;done=false>>]
   [junit4]   2> 502035 T1241 oasc.CachingDirectoryFactory.close Closing directory: /mnt/ssd/jenkins/workspace/Lucene-Solr-trunk-Linux/solr/build/solr-core/test/J1/./org.apache.solr.cloud.CollectionsAPIDistributedZkTest-jetty4-1375487316169//new_implicit_coll_1_d_replica2/data
   [junit4]   2> 502036 T1715 oasc.Overseer$ClusterStateUpdater.amILeader According to ZK I (id=90143936490504204-127.0.0.1:40533_yyhb%2Fmy-n_0000000004) am no longer a leader.
   [junit4]   2> 502038 T1323 oascc.ZkStateReader$3.process WARN ZooKeeper watch triggered, but Solr cannot talk to ZK
   [junit4]   2> 502038 T1243 oazs.NIOServerCnxn.doIO WARN caught end of stream exception EndOfStreamException: Unable to read additional data from client sessionid 0x140416ec12c000c, likely client has closed socket
   [junit4]   2> at org.apache.zookeeper.server.NIOServerCnxn.doIO(NIOServerCnxn.java:220)
   [junit4]   2> at org.apache.zookeeper.server.NIOServerCnxnFactory.run(NIOServerCnxnFactory.java:208)
   [junit4]   2> at java.lang.Thread.run(Thread.java:724)
   [junit4]   2>
   [junit4]   2> 502038 T1323 oascc.ZkStateReader$2.process A cluster state change: WatchedEvent state:SyncConnected type:NodeChildrenChanged path:/live_nodes, has occurred - updating... (live nodes size: 1)
   [junit4]   2> 502038 T1323 oascc.ZkStateReader$2.process WARN ZooKeeper watch triggered, but Solr cannot talk to ZK
   [junit4]   2> 502060 T1241 oejsh.ContextHandler.doStop stopped o.e.j.s.ServletContextHandler{/yyhb/my,null}
   [junit4]   2> 502113 T1241 oas.SolrTestCaseJ4.tearDown ###Ending testDistribSearch
   [junit4]   2> 502114 T1241 oasc.ZkTestServer.send4LetterWord connecting to 127.0.0.1:45464 45464
   [junit4]   1> client port:0.0.0.0/0.0.0.0:0
   [junit4]   2> NOTE: reproduce with: ant test  -Dtestcase=CollectionsAPIDistributedZkTest -Dtests.method=testDistribSearch -Dtests.seed=6562A0F73CF9AEED -Dtests.multiplier=3 -Dtests.slow=true -Dtests.locale=ro_RO -Dtests.timezone=Indian/Maldives -Dtests.file.encoding=UTF-8
   [junit4] ERROR    117s J1 | CollectionsAPIDistributedZkTest.testDistribSearch <<<
   [junit4]    > Throwable #1: org.apache.solr.client.solrj.SolrServerException: Server refused connection at: http://127.0.0.1:39200/yyhb/my
   [junit4]    > at __randomizedtesting.SeedInfo.seed([6562A0F73CF9AEED:E4842EEF4BA6CED1]:0)
   [junit4]    > at org.apache.solr.client.solrj.impl.HttpSolrServer.request(HttpSolrServer.java:428)
   [junit4]    > at org.apache.solr.client.solrj.impl.HttpSolrServer.request(HttpSolrServer.java:180)
   [junit4]    > at org.apache.solr.cloud.AbstractFullDistribZkTestBase.createCollection(AbstractFullDistribZkTestBase.java:1535)
   [junit4]    > at org.apache.solr.cloud.CollectionsAPIDistributedZkTest.testCustomCollectionsAPI(CollectionsAPIDistributedZkTest.java:677)
   [junit4]    > at org.apache.solr.cloud.CollectionsAPIDistributedZkTest.doTest(CollectionsAPIDistributedZkTest.java:159)
   [junit4]    > at org.apache.solr.BaseDistributedSearchTestCase.testDistribSearch(BaseDistributedSearchTestCase.java:835)
   [junit4]    > at java.lang.Thread.run(Thread.java:724)
   [junit4]    > Caused by: org.apache.http.conn.HttpHostConnectException: Connection to http://127.0.0.1:39200 refused
   [junit4]    > at org.apache.http.impl.conn.DefaultClientConnectionOperator.openConnection(DefaultClientConnectionOperator.java:190)
   [junit4]    > at org.apache.http.impl.conn.ManagedClientConnectionImpl.open(ManagedClientConnectionImpl.java:294)
   [junit4]    > at org.apache.http.impl.client.DefaultRequestDirector.tryConnect(DefaultRequestDirector.java:645)
   [junit4]    > at org.apache.http.impl.client.DefaultRequestDirector.execute(DefaultRequestDirector.java:480)
   [junit4]    > at org.apache.http.impl.client.AbstractHttpClient.execute(AbstractHttpClient.java:906)
   [junit4]    > at org.apache.http.impl.client.AbstractHttpClient.execute(AbstractHttpClient.java:805)
   [junit4]    > at org.apache.http.impl.client.AbstractHttpClient.execute(AbstractHttpClient.java:784)
   [junit4]    > at org.apache.solr.client.solrj.impl.HttpSolrServer.request(HttpSolrServer.java:365)
   [junit4]    > ... 45 more
   [junit4]    > Caused by: java.net.ConnectException: Connection refused
   [junit4]    > at java.net.PlainSocketImpl.socketConnect(Native Method)
   [junit4]    > at java.net.AbstractPlainSocketImpl.doConnect(AbstractPlainSocketImpl.java:339)
   [junit4]    > at java.net.AbstractPlainSocketImpl.connectToAddress(AbstractPlainSocketImpl.java:200)
   [junit4]    > at java.net.AbstractPlainSocketImpl.connect(AbstractPlainSocketImpl.java:182)
   [junit4]    > at java.net.SocksSocketImpl.connect(SocksSocketImpl.java:392)
   [junit4]    > at java.net.Socket.connect(Socket.java:579)
   [junit4]    > at org.apache.http.conn.scheme.PlainSocketFactory.connectSocket(PlainSocketFactory.java:127)
   [junit4]    > at org.apache.http.impl.conn.DefaultClientConnectionOperator.openConnection(DefaultClientConnectionOperator.java:180)
   [junit4]    > ... 52 more
   [junit4]   2> 502128 T1241 oas.SolrTestCaseJ4.deleteCore ###deleteCore
   [junit4]   2> 116911 T1240 ccr.ThreadLeakControl.checkThreadLeaks WARNING Will linger awaiting termination of 2 leaked thread(s).
   [junit4]   2> NOTE: test params are: codec=Lucene42: {timestamp=MockVariableIntBlock(baseBlockSize=123), range_facet_l=MockVariableIntBlock(baseBlockSize=123), id=PostingsFormat(name=Lucene41VarGapFixedInterval), range_facet_sl=PostingsFormat(name=MockRandom), a_t=MockVariableIntBlock(baseBlockSize=123), text=PostingsFormat(name=MockRandom), range_facet_si=PostingsFormat(name=MockSep), _version_=MockVariableIntBlock(baseBlockSize=123), other_tl1=MockVariableIntBlock(baseBlockSize=123), multiDefault=PostingsFormat(name=MockSep), a_si=PostingsFormat(name=MockSep), intDefault=MockVariableIntBlock(baseBlockSize=123)}, docValues:{timestamp=DocValuesFormat(name=Asserting)}, sim=RandomSimilarityProvider(queryNorm=false,coord=crazy): {}, locale=ro_RO, timezone=Indian/Maldives
   [junit4]   2> NOTE: Linux 3.2.0-51-generic i386/Oracle Corporation 1.7.0_25 (32-bit)/cpus=8,threads=3,free=65512672,total=193007616
   [junit4]   2> NOTE: All tests run in this JVM: [RequestHandlersTest, BasicZkTest, ConvertedLegacyTest, TestPartialUpdateDeduplication, TestSchemaResource, DirectUpdateHandlerTest, SortByFunctionTest, TestLuceneMatchVersion, SolrCoreCheckLockOnStartupTest, TestZkChroot, SuggesterWFSTTest, TestManagedSchemaFieldResource, TestAddFieldRealTimeGet, TestCopyFieldCollectionResource, BadIndexSchemaTest, TestRecoveryHdfs, TestJmxMonitoredMap, FileUtilsTest, TestRecovery, FullSolrCloudDistribCmdsTest, TermVectorComponentDistributedTest, DefaultValueUpdateProcessorTest, OpenCloseCoreStressTest, StandardRequestHandlerTest, TestManagedSchema, TestCodecSupport, SampleTest, QueryResultKeyTest, DocValuesMultiTest, TestCSVLoader, TestStressLucene, TestQuerySenderNoQuery, NumericFieldsTest, XmlUpdateRequestHandlerTest, CurrencyFieldOpenExchangeTest, HdfsDirectoryTest, TestClassNameShortening, DocumentAnalysisRequestHandlerTest, LeaderElectionIntegrationTest, TestComponentsName, NoCacheHeaderTest, TestBM25SimilarityFactory, TestReloadAndDeleteDocs, IndexReaderFactoryTest, TestSystemIdResolver, SolrIndexConfigTest, BlockCacheTest, TestCollationField, TestSuggestSpellingConverter, SimplePostToolTest, HardAutoCommitTest, TestFiltering, URLClassifyProcessorTest, HdfsUnloadDistributedZkTest, MultiTermTest, TestJmxIntegration, HdfsRecoveryZkTest, OpenExchangeRatesOrgProviderTest, ClusterStateTest, CollectionsAPIDistributedZkTest]
   [junit4] Completed on J1 in 117.94s, 1 test, 1 error <<< FAILURES!

[...truncated 561 lines...]
BUILD FAILED
/mnt/ssd/jenkins/workspace/Lucene-Solr-trunk-Linux/build.xml:389: The following error occurred while executing this line:
/mnt/ssd/jenkins/workspace/Lucene-Solr-trunk-Linux/build.xml:369: The following error occurred while executing this line:
/mnt/ssd/jenkins/workspace/Lucene-Solr-trunk-Linux/build.xml:39: The following error occurred while executing this line:
/mnt/ssd/jenkins/workspace/Lucene-Solr-trunk-Linux/solr/build.xml:181: The following error occurred while executing this line:
/mnt/ssd/jenkins/workspace/Lucene-Solr-trunk-Linux/solr/common-build.xml:449: The following error occurred while executing this line:
/mnt/ssd/jenkins/workspace/Lucene-Solr-trunk-Linux/lucene/common-build.xml:1230: The following error occurred while executing this line:
/mnt/ssd/jenkins/workspace/Lucene-Solr-trunk-Linux/lucene/common-build.xml:873: There were test failures: 320 suites, 1347 tests, 1 error, 34 ignored (6 assumptions)

Total time: 41 minutes 35 seconds
Build step 'Invoke Ant' marked build as failure
Description set: Java: 32bit/jdk1.7.0_25 -server -XX:+UseSerialGC
Archiving artifacts
Recording test results
Email was triggered for: Failure
Sending email for trigger: Failure




---------------------------------------------------------------------
To unsubscribe, e-mail: [hidden email]
For additional commands, e-mail: [hidden email]
Reply | Threaded
Open this post in threaded view
|

[JENKINS] Lucene-Solr-trunk-Linux (32bit/jdk1.8.0-ea-b99) - Build # 6853 - Still Failing!

Policeman Jenkins Server-2
Build: http://jenkins.thetaphi.de/job/Lucene-Solr-trunk-Linux/6853/
Java: 32bit/jdk1.8.0-ea-b99 -client -XX:+UseG1GC

1 tests failed.
REGRESSION:  org.apache.solr.cloud.SliceStateUpdateTest.testSliceStateUpdate

Error Message:
expected:<[in]active> but was:<[]active>

Stack Trace:
org.junit.ComparisonFailure: expected:<[in]active> but was:<[]active>
        at __randomizedtesting.SeedInfo.seed([57A23F39F6A09DF7:87C0B275A8754773]:0)
        at org.junit.Assert.assertEquals(Assert.java:125)
        at org.junit.Assert.assertEquals(Assert.java:147)
        at org.apache.solr.cloud.SliceStateUpdateTest.testSliceStateUpdate(SliceStateUpdateTest.java:183)
        at sun.reflect.NativeMethodAccessorImpl.invoke0(Native Method)
        at sun.reflect.NativeMethodAccessorImpl.invoke(NativeMethodAccessorImpl.java:57)
        at sun.reflect.DelegatingMethodAccessorImpl.invoke(DelegatingMethodAccessorImpl.java:43)
        at java.lang.reflect.Method.invoke(Method.java:491)
        at com.carrotsearch.randomizedtesting.RandomizedRunner.invoke(RandomizedRunner.java:1559)
        at com.carrotsearch.randomizedtesting.RandomizedRunner.access$600(RandomizedRunner.java:79)
        at com.carrotsearch.randomizedtesting.RandomizedRunner$6.evaluate(RandomizedRunner.java:737)
        at com.carrotsearch.randomizedtesting.RandomizedRunner$7.evaluate(RandomizedRunner.java:773)
        at com.carrotsearch.randomizedtesting.RandomizedRunner$8.evaluate(RandomizedRunner.java:787)
        at com.carrotsearch.randomizedtesting.rules.SystemPropertiesRestoreRule$1.evaluate(SystemPropertiesRestoreRule.java:53)
        at org.apache.lucene.util.TestRuleSetupTeardownChained$1.evaluate(TestRuleSetupTeardownChained.java:50)
        at org.apache.lucene.util.TestRuleFieldCacheSanity$1.evaluate(TestRuleFieldCacheSanity.java:51)
        at org.apache.lucene.util.AbstractBeforeAfterRule$1.evaluate(AbstractBeforeAfterRule.java:46)
        at com.carrotsearch.randomizedtesting.rules.SystemPropertiesInvariantRule$1.evaluate(SystemPropertiesInvariantRule.java:55)
        at org.apache.lucene.util.TestRuleThreadAndTestName$1.evaluate(TestRuleThreadAndTestName.java:49)
        at org.apache.lucene.util.TestRuleIgnoreAfterMaxFailures$1.evaluate(TestRuleIgnoreAfterMaxFailures.java:70)
        at org.apache.lucene.util.TestRuleMarkFailure$1.evaluate(TestRuleMarkFailure.java:48)
        at com.carrotsearch.randomizedtesting.rules.StatementAdapter.evaluate(StatementAdapter.java:36)
        at com.carrotsearch.randomizedtesting.ThreadLeakControl$StatementRunner.run(ThreadLeakControl.java:358)
        at com.carrotsearch.randomizedtesting.ThreadLeakControl.forkTimeoutingTask(ThreadLeakControl.java:782)
        at com.carrotsearch.randomizedtesting.ThreadLeakControl$3.evaluate(ThreadLeakControl.java:442)
        at com.carrotsearch.randomizedtesting.RandomizedRunner.runSingleTest(RandomizedRunner.java:746)
        at com.carrotsearch.randomizedtesting.RandomizedRunner$3.evaluate(RandomizedRunner.java:648)
        at com.carrotsearch.randomizedtesting.RandomizedRunner$4.evaluate(RandomizedRunner.java:682)
        at com.carrotsearch.randomizedtesting.RandomizedRunner$5.evaluate(RandomizedRunner.java:693)
        at com.carrotsearch.randomizedtesting.rules.StatementAdapter.evaluate(StatementAdapter.java:36)
        at com.carrotsearch.randomizedtesting.rules.SystemPropertiesRestoreRule$1.evaluate(SystemPropertiesRestoreRule.java:53)
        at org.apache.lucene.util.AbstractBeforeAfterRule$1.evaluate(AbstractBeforeAfterRule.java:46)
        at org.apache.lucene.util.TestRuleStoreClassName$1.evaluate(TestRuleStoreClassName.java:42)
        at com.carrotsearch.randomizedtesting.rules.SystemPropertiesInvariantRule$1.evaluate(SystemPropertiesInvariantRule.java:55)
        at com.carrotsearch.randomizedtesting.rules.NoShadowingOrOverridesOnMethodsRule$1.evaluate(NoShadowingOrOverridesOnMethodsRule.java:39)
        at com.carrotsearch.randomizedtesting.rules.NoShadowingOrOverridesOnMethodsRule$1.evaluate(NoShadowingOrOverridesOnMethodsRule.java:39)
        at com.carrotsearch.randomizedtesting.rules.StatementAdapter.evaluate(StatementAdapter.java:36)
        at org.apache.lucene.util.TestRuleAssertionsRequired$1.evaluate(TestRuleAssertionsRequired.java:43)
        at org.apache.lucene.util.TestRuleMarkFailure$1.evaluate(TestRuleMarkFailure.java:48)
        at org.apache.lucene.util.TestRuleIgnoreAfterMaxFailures$1.evaluate(TestRuleIgnoreAfterMaxFailures.java:70)
        at org.apache.lucene.util.TestRuleIgnoreTestSuites$1.evaluate(TestRuleIgnoreTestSuites.java:55)
        at com.carrotsearch.randomizedtesting.rules.StatementAdapter.evaluate(StatementAdapter.java:36)
        at com.carrotsearch.randomizedtesting.ThreadLeakControl$StatementRunner.run(ThreadLeakControl.java:358)
        at java.lang.Thread.run(Thread.java:724)




Build Log:
[...truncated 9501 lines...]
   [junit4] Suite: org.apache.solr.cloud.SliceStateUpdateTest
   [junit4]   2> 353559 T1563 oas.SolrTestCaseJ4.setUp ###Starting testSliceStateUpdate
   [junit4]   2> Creating dataDir: /mnt/ssd/jenkins/workspace/Lucene-Solr-trunk-Linux/solr/build/solr-core/test/J0/./solrtest-SliceStateUpdateTest-1375492541711
   [junit4]   2> 353560 T1563 oasc.ZkTestServer.run STARTING ZK TEST SERVER
   [junit4]   2> 353560 T1564 oasc.ZkTestServer$ZKServerMain.runFromConfig Starting server
   [junit4]   2> 353660 T1563 oasc.ZkTestServer.run start zk server on port:58096
   [junit4]   2> 353662 T1563 oascc.ConnectionManager.waitForConnected Waiting for client to connect to ZooKeeper
   [junit4]   2> 353672 T1570 oascc.ConnectionManager.process Watcher org.apache.solr.common.cloud.ConnectionManager@2fa664 name:ZooKeeperConnection Watcher:127.0.0.1:58096 got event WatchedEvent state:SyncConnected type:None path:null path:null type:None
   [junit4]   2> 353672 T1563 oascc.ConnectionManager.waitForConnected Client is connected to ZooKeeper
   [junit4]   2> 353672 T1563 oascc.SolrZkClient.makePath makePath: /solr
   [junit4]   2> 353677 T1563 oascc.ConnectionManager.waitForConnected Waiting for client to connect to ZooKeeper
   [junit4]   2> 353678 T1572 oascc.ConnectionManager.process Watcher org.apache.solr.common.cloud.ConnectionManager@e842d1 name:ZooKeeperConnection Watcher:127.0.0.1:58096/solr got event WatchedEvent state:SyncConnected type:None path:null path:null type:None
   [junit4]   2> 353678 T1563 oascc.ConnectionManager.waitForConnected Client is connected to ZooKeeper
   [junit4]   2> 353679 T1563 oascc.SolrZkClient.makePath makePath: /collections/collection1
   [junit4]   2> 353681 T1563 oascc.SolrZkClient.makePath makePath: /collections/collection1/shards
   [junit4]   2> 353682 T1563 oascc.SolrZkClient.makePath makePath: /collections/control_collection
   [junit4]   2> 353684 T1563 oascc.SolrZkClient.makePath makePath: /collections/control_collection/shards
   [junit4]   2> 353686 T1563 oasc.AbstractZkTestCase.putConfig put /mnt/ssd/jenkins/workspace/Lucene-Solr-trunk-Linux/solr/build/solr-core/test-files/solr/collection1/conf/solrconfig.xml to /configs/conf1/solrconfig.xml
   [junit4]   2> 353687 T1563 oascc.SolrZkClient.makePath makePath: /configs/conf1/solrconfig.xml
   [junit4]   2> 353691 T1563 oasc.AbstractZkTestCase.putConfig put /mnt/ssd/jenkins/workspace/Lucene-Solr-trunk-Linux/solr/build/solr-core/test-files/solr/collection1/conf/schema.xml to /configs/conf1/schema.xml
   [junit4]   2> 353692 T1563 oascc.SolrZkClient.makePath makePath: /configs/conf1/schema.xml
   [junit4]   2> 353695 T1563 oasc.AbstractZkTestCase.putConfig put /mnt/ssd/jenkins/workspace/Lucene-Solr-trunk-Linux/solr/build/solr-core/test-files/solr/collection1/conf/stopwords.txt to /configs/conf1/stopwords.txt
   [junit4]   2> 353695 T1563 oascc.SolrZkClient.makePath makePath: /configs/conf1/stopwords.txt
   [junit4]   2> 353698 T1563 oasc.AbstractZkTestCase.putConfig put /mnt/ssd/jenkins/workspace/Lucene-Solr-trunk-Linux/solr/build/solr-core/test-files/solr/collection1/conf/protwords.txt to /configs/conf1/protwords.txt
   [junit4]   2> 353698 T1563 oascc.SolrZkClient.makePath makePath: /configs/conf1/protwords.txt
   [junit4]   2> 353701 T1563 oasc.AbstractZkTestCase.putConfig put /mnt/ssd/jenkins/workspace/Lucene-Solr-trunk-Linux/solr/build/solr-core/test-files/solr/collection1/conf/currency.xml to /configs/conf1/currency.xml
   [junit4]   2> 353701 T1563 oascc.SolrZkClient.makePath makePath: /configs/conf1/currency.xml
   [junit4]   2> 353704 T1563 oasc.AbstractZkTestCase.putConfig put /mnt/ssd/jenkins/workspace/Lucene-Solr-trunk-Linux/solr/build/solr-core/test-files/solr/collection1/conf/open-exchange-rates.json to /configs/conf1/open-exchange-rates.json
   [junit4]   2> 353704 T1563 oascc.SolrZkClient.makePath makePath: /configs/conf1/open-exchange-rates.json
   [junit4]   2> 353707 T1563 oasc.AbstractZkTestCase.putConfig put /mnt/ssd/jenkins/workspace/Lucene-Solr-trunk-Linux/solr/build/solr-core/test-files/solr/collection1/conf/mapping-ISOLatin1Accent.txt to /configs/conf1/mapping-ISOLatin1Accent.txt
   [junit4]   2> 353707 T1563 oascc.SolrZkClient.makePath makePath: /configs/conf1/mapping-ISOLatin1Accent.txt
   [junit4]   2> 353710 T1563 oasc.AbstractZkTestCase.putConfig put /mnt/ssd/jenkins/workspace/Lucene-Solr-trunk-Linux/solr/build/solr-core/test-files/solr/collection1/conf/old_synonyms.txt to /configs/conf1/old_synonyms.txt
   [junit4]   2> 353711 T1563 oascc.SolrZkClient.makePath makePath: /configs/conf1/old_synonyms.txt
   [junit4]   2> 353713 T1563 oasc.AbstractZkTestCase.putConfig put /mnt/ssd/jenkins/workspace/Lucene-Solr-trunk-Linux/solr/build/solr-core/test-files/solr/collection1/conf/synonyms.txt to /configs/conf1/synonyms.txt
   [junit4]   2> 353714 T1563 oascc.SolrZkClient.makePath makePath: /configs/conf1/synonyms.txt
   [junit4]   2> 353716 T1563 oasc.SliceStateUpdateTest.setUp ####SETUP_START testSliceStateUpdate
   [junit4]   2> 353717 T1563 oascc.ConnectionManager.waitForConnected Waiting for client to connect to ZooKeeper
   [junit4]   2> 353718 T1574 oascc.ConnectionManager.process Watcher org.apache.solr.common.cloud.ConnectionManager@d7cd14 name:ZooKeeperConnection Watcher:127.0.0.1:58096/solr got event WatchedEvent state:SyncConnected type:None path:null path:null type:None
   [junit4]   2> 353718 T1563 oascc.ConnectionManager.waitForConnected Client is connected to ZooKeeper
   [junit4]   2> 353719 T1563 oascc.SolrZkClient.makePath makePath: /collections/testcore
   [junit4]   2> 353721 T1563 oascc.SolrZkClient.makePath makePath: /collections/testcore/shards
   [junit4]   2> 353725 T1563 oasc.SolrResourceLoader.locateSolrHome JNDI not configured for solr (NoInitialContextEx)
   [junit4]   2> 353725 T1563 oasc.SolrResourceLoader.locateSolrHome using system property solr.solr.home: /mnt/ssd/jenkins/workspace/Lucene-Solr-trunk-Linux/solr/build/solr-core/test-files/solr
   [junit4]   2> 353725 T1563 oasc.SolrResourceLoader.<init> new SolrResourceLoader for directory: '/mnt/ssd/jenkins/workspace/Lucene-Solr-trunk-Linux/solr/build/solr-core/test-files/solr/'
   [junit4]   2> 353738 T1563 oasc.ConfigSolr.fromFile Loading container configuration from /mnt/ssd/jenkins/workspace/Lucene-Solr-trunk-Linux/solr/build/solr-core/test-files/solr/solr.xml
   [junit4]   2> 353762 T1563 oasc.CoreContainer.<init> New CoreContainer 9506903
   [junit4]   2> 353763 T1563 oasc.SolrResourceLoader.locateSolrHome JNDI not configured for solr (NoInitialContextEx)
   [junit4]   2> 353763 T1563 oasc.SolrResourceLoader.locateSolrHome using system property solr.solr.home: /mnt/ssd/jenkins/workspace/Lucene-Solr-trunk-Linux/solr/build/solr-core/test-files/solr
   [junit4]   2> 353763 T1563 oasc.SolrResourceLoader.<init> new SolrResourceLoader for directory: '/mnt/ssd/jenkins/workspace/Lucene-Solr-trunk-Linux/solr/build/solr-core/test-files/solr/'
   [junit4]   2> 353780 T1563 oasc.ConfigSolr.fromFile Loading container configuration from /mnt/ssd/jenkins/workspace/Lucene-Solr-trunk-Linux/solr/build/solr-core/test-files/solr/solr.xml
   [junit4]   2> 353792 T1563 oasc.CoreContainer.<init> New CoreContainer 32565094
   [junit4]   2> 353792 T1563 oasc.CoreContainer.load Loading cores into CoreContainer [instanceDir=/mnt/ssd/jenkins/workspace/Lucene-Solr-trunk-Linux/solr/build/solr-core/test-files/solr/]
   [junit4]   2> 353793 T1563 oashc.HttpShardHandlerFactory.getParameter Setting socketTimeout to: 120000
   [junit4]   2> 353794 T1563 oashc.HttpShardHandlerFactory.getParameter Setting urlScheme to: http://
   [junit4]   2> 353794 T1563 oashc.HttpShardHandlerFactory.getParameter Setting connTimeout to: 15000
   [junit4]   2> 353794 T1563 oashc.HttpShardHandlerFactory.getParameter Setting maxConnectionsPerHost to: 20
   [junit4]   2> 353795 T1563 oashc.HttpShardHandlerFactory.getParameter Setting corePoolSize to: 0
   [junit4]   2> 353795 T1563 oashc.HttpShardHandlerFactory.getParameter Setting maximumPoolSize to: 2147483647
   [junit4]   2> 353795 T1563 oashc.HttpShardHandlerFactory.getParameter Setting maxThreadIdleTime to: 5
   [junit4]   2> 353796 T1563 oashc.HttpShardHandlerFactory.getParameter Setting sizeOfQueue to: -1
   [junit4]   2> 353796 T1563 oashc.HttpShardHandlerFactory.getParameter Setting fairnessPolicy to: false
   [junit4]   2> 353796 T1563 oascsi.HttpClientUtil.createClient Creating new http client, config:maxConnectionsPerHost=20&maxConnections=10000&socketTimeout=120000&connTimeout=15000&retry=false
   [junit4]   2> 353800 T1563 oasc.ZkContainer.initZooKeeper Zookeeper client=127.0.0.1:58096/solr
   [junit4]   2> 353800 T1563 oasc.ZkController.checkChrootPath zkHost includes chroot
   [junit4]   2> 353801 T1563 oascc.ConnectionManager.waitForConnected Waiting for client to connect to ZooKeeper
   [junit4]   2> 353802 T1576 oascc.ConnectionManager.process Watcher org.apache.solr.common.cloud.ConnectionManager@15160a9 name:ZooKeeperConnection Watcher:127.0.0.1:58096 got event WatchedEvent state:SyncConnected type:None path:null path:null type:None
   [junit4]   2> 353802 T1563 oascc.ConnectionManager.waitForConnected Client is connected to ZooKeeper
   [junit4]   2> 353804 T1563 oascsi.HttpClientUtil.createClient Creating new http client, config:maxConnections=500&maxConnectionsPerHost=16&socketTimeout=120000&connTimeout=15000
   [junit4]   2> 353807 T1563 oascc.ConnectionManager.waitForConnected Waiting for client to connect to ZooKeeper
   [junit4]   2> 353808 T1578 oascc.ConnectionManager.process Watcher org.apache.solr.common.cloud.ConnectionManager@aa7b53 name:ZooKeeperConnection Watcher:127.0.0.1:58096/solr got event WatchedEvent state:SyncConnected type:None path:null path:null type:None
   [junit4]   2> 353808 T1563 oascc.ConnectionManager.waitForConnected Client is connected to ZooKeeper
   [junit4]   2> 353809 T1563 oascc.SolrZkClient.makePath makePath: /overseer/queue
   [junit4]   2> 353811 T1563 oascc.SolrZkClient.makePath makePath: /overseer/collection-queue-work
   [junit4]   2> 353814 T1563 oascc.SolrZkClient.makePath makePath: /live_nodes
   [junit4]   2> 353815 T1563 oasc.ZkController.createEphemeralLiveNode Register node as live in ZooKeeper:/live_nodes/127.0.0.1:8983_solr
   [junit4]   2> 353815 T1563 oascc.SolrZkClient.makePath makePath: /live_nodes/127.0.0.1:8983_solr
   [junit4]   2> 353817 T1563 oascc.SolrZkClient.makePath makePath: /overseer_elect/election
   [junit4]   2> 353821 T1563 oascc.SolrZkClient.makePath makePath: /overseer_elect/leader
   [junit4]   2> 353822 T1563 oasc.Overseer.start Overseer (id=90144279213834244-127.0.0.1:8983_solr-n_0000000000) starting
   [junit4]   2> 353825 T1563 oascc.SolrZkClient.makePath makePath: /overseer/queue-work
   [junit4]   2> 353827 T1580 oasc.OverseerCollectionProcessor.run Process current queue of collection creations
   [junit4]   2> 353828 T1563 oascc.SolrZkClient.makePath makePath: /clusterstate.json
   [junit4]   2> 353830 T1563 oascc.SolrZkClient.makePath makePath: /aliases.json
   [junit4]   2> 353832 T1563 oascc.ZkStateReader.createClusterStateWatchersAndUpdate Updating cluster state from ZooKeeper...
   [junit4]   2> 353835 T1579 oasc.Overseer$ClusterStateUpdater.run Starting to work on the main queue
   [junit4]   2> 353837 T1581 oasc.ZkController.publish publishing core=collection1 state=down
   [junit4]   2> 353837 T1581 oasc.ZkController.publish numShards not found on descriptor - reading it from system property
   [junit4]   2> 353838 T1581 oasc.ZkController.waitForCoreNodeName look for our core node name
   [junit4]   2> 355338 T1579 oascc.ZkStateReader.updateClusterState Updating cloud state from ZooKeeper...
   [junit4]   2> 355339 T1579 oasc.Overseer$ClusterStateUpdater.updateState Update state numShards=null message={
   [junit4]   2>  "operation":"state",
   [junit4]   2>  "core_node_name":"core_node1",
   [junit4]   2>  "numShards":null,
   [junit4]   2>  "shard":null,
   [junit4]   2>  "roles":null,
   [junit4]   2>  "state":"down",
   [junit4]   2>  "shard_state":"active",
   [junit4]   2>  "core":"collection1",
   [junit4]   2>  "collection":"collection1",
   [junit4]   2>  "shard_range":null,
   [junit4]   2>  "node_name":"127.0.0.1:8983_solr",
   [junit4]   2>  "base_url":"http://127.0.0.1:8983/solr"}
   [junit4]   2> 355339 T1579 oasc.Overseer$ClusterStateUpdater.updateState Assigning new node to shard shard=shard1
   [junit4]   2> 355342 T1578 oascc.ZkStateReader$2.process A cluster state change: WatchedEvent state:SyncConnected type:NodeDataChanged path:/clusterstate.json, has occurred - updating... (live nodes size: 1)
   [junit4]   2> 355838 T1581 oasc.ZkController.waitForShardId waiting to find shard id in clusterstate for collection1
   [junit4]   2> 355839 T1581 oasc.CoreContainer.create Creating SolrCore 'collection1' using instanceDir: /mnt/ssd/jenkins/workspace/Lucene-Solr-trunk-Linux/solr/build/solr-core/test-files/solr/collection1
   [junit4]   2> 355839 T1581 oasc.ZkController.createCollectionZkNode Check for collection zkNode:collection1
   [junit4]   2> 355840 T1581 oasc.ZkController.createCollectionZkNode Collection zkNode exists
   [junit4]   2> 355840 T1581 oasc.ZkController.readConfigName Load collection config from:/collections/collection1
   [junit4]   2> 355841 T1581 oasc.SolrResourceLoader.<init> new SolrResourceLoader for directory: '/mnt/ssd/jenkins/workspace/Lucene-Solr-trunk-Linux/solr/build/solr-core/test-files/solr/collection1/'
   [junit4]   2> 355841 T1581 oasc.SolrResourceLoader.replaceClassLoader Adding 'file:/mnt/ssd/jenkins/workspace/Lucene-Solr-trunk-Linux/solr/build/solr-core/test-files/solr/collection1/lib/README' to classloader
   [junit4]   2> 355842 T1581 oasc.SolrResourceLoader.replaceClassLoader Adding 'file:/mnt/ssd/jenkins/workspace/Lucene-Solr-trunk-Linux/solr/build/solr-core/test-files/solr/collection1/lib/classes/' to classloader
   [junit4]   2> 355884 T1581 oasc.SolrConfig.<init> Using Lucene MatchVersion: LUCENE_50
   [junit4]   2> 355921 T1581 oasc.SolrConfig.<init> Loaded SolrConfig: solrconfig.xml
   [junit4]   2> 355923 T1581 oass.IndexSchema.readSchema Reading Solr Schema from schema.xml
   [junit4]   2> 355933 T1581 oass.IndexSchema.readSchema [collection1] Schema name=test
   [junit4]   2> 356136 T1581 oass.OpenExchangeRatesOrgProvider.init Initialized with rates=open-exchange-rates.json, refreshInterval=1440.
   [junit4]   2> 356143 T1581 oass.IndexSchema.readSchema default search field in schema is text
   [junit4]   2> 356146 T1581 oass.IndexSchema.readSchema unique key field: id
   [junit4]   2> 356157 T1581 oass.FileExchangeRateProvider.reload Reloading exchange rates from file currency.xml
   [junit4]   2> 356160 T1581 oass.FileExchangeRateProvider.reload Reloading exchange rates from file currency.xml
   [junit4]   2> 356163 T1581 oass.OpenExchangeRatesOrgProvider.reload Reloading exchange rates from open-exchange-rates.json
   [junit4]   2> 356164 T1581 oass.OpenExchangeRatesOrgProvider$OpenExchangeRates.<init> WARN Unknown key IMPORTANT NOTE
   [junit4]   2> 356164 T1581 oass.OpenExchangeRatesOrgProvider$OpenExchangeRates.<init> WARN Expected key, got STRING
   [junit4]   2> 356165 T1581 oass.OpenExchangeRatesOrgProvider.reload Reloading exchange rates from open-exchange-rates.json
   [junit4]   2> 356165 T1581 oass.OpenExchangeRatesOrgProvider$OpenExchangeRates.<init> WARN Unknown key IMPORTANT NOTE
   [junit4]   2> 356166 T1581 oass.OpenExchangeRatesOrgProvider$OpenExchangeRates.<init> WARN Expected key, got STRING
   [junit4]   2> 356166 T1581 oasc.SolrCore.initDirectoryFactory org.apache.solr.core.MockDirectoryFactory
   [junit4]   2> 356166 T1581 oasc.SolrCore.<init> [collection1] Opening new SolrCore at /mnt/ssd/jenkins/workspace/Lucene-Solr-trunk-Linux/solr/build/solr-core/test-files/solr/collection1/, dataDir=/mnt/ssd/jenkins/workspace/Lucene-Solr-trunk-Linux/solr/build/solr-core/test/J0/./solrtest-SliceStateUpdateTest-1375492541711/data2/
   [junit4]   2> 356167 T1581 oasc.JmxMonitoredMap.<init> JMX monitoring is enabled. Adding Solr mbeans to JMX Server: com.sun.jmx.mbeanserver.JmxMBeanServer@855c0c
   [junit4]   2> 356168 T1581 oasc.CachingDirectoryFactory.get return new directory for /mnt/ssd/jenkins/workspace/Lucene-Solr-trunk-Linux/solr/build/solr-core/test/J0/./solrtest-SliceStateUpdateTest-1375492541711/data2
   [junit4]   2> 356168 T1581 oasc.SolrCore.getNewIndexDir New index directory detected: old=null new=/mnt/ssd/jenkins/workspace/Lucene-Solr-trunk-Linux/solr/build/solr-core/test/J0/./solrtest-SliceStateUpdateTest-1375492541711/data2/index/
   [junit4]   2> 356168 T1581 oasc.SolrCore.initIndex WARN [collection1] Solr index directory '/mnt/ssd/jenkins/workspace/Lucene-Solr-trunk-Linux/solr/build/solr-core/test/J0/./solrtest-SliceStateUpdateTest-1375492541711/data2/index' doesn't exist. Creating new index...
   [junit4]   2> 356169 T1581 oasc.CachingDirectoryFactory.get return new directory for /mnt/ssd/jenkins/workspace/Lucene-Solr-trunk-Linux/solr/build/solr-core/test/J0/./solrtest-SliceStateUpdateTest-1375492541711/data2/index
   [junit4]   2> 356170 T1581 oasc.SolrDeletionPolicy.onCommit SolrDeletionPolicy.onCommit: commits: num=1
   [junit4]   2> commit{dir=RateLimitedDirectoryWrapper(MockDirWrapper(org.apache.lucene.store.RAMDirectory@77b885 lockFactory=org.apache.lucene.store.NativeFSLockFactory@1fb8d5)),segFN=segments_1,generation=1}
   [junit4]   2> 356170 T1581 oasc.SolrDeletionPolicy.updateCommits newest commit generation = 1
   [junit4]   2> 356171 T1581 oasc.SolrCore.initWriters created xml: solr.XMLResponseWriter
   [junit4]   2> 356174 T1581 oasup.UpdateRequestProcessorChain.init inserting DistributedUpdateProcessorFactory into updateRequestProcessorChain "dedupe"
   [junit4]   2> 356175 T1581 oasup.UpdateRequestProcessorChain.init inserting DistributedUpdateProcessorFactory into updateRequestProcessorChain "dedupe-allfields"
   [junit4]   2> 356175 T1581 oasup.UpdateRequestProcessorChain.init inserting DistributedUpdateProcessorFactory into updateRequestProcessorChain "stored_sig"
   [junit4]   2> 356176 T1581 oasup.UpdateRequestProcessorChain.init inserting DistributedUpdateProcessorFactory into updateRequestProcessorChain "uniq-fields"
   [junit4]   2> 356176 T1581 oasup.UpdateRequestProcessorChain.init inserting DistributedUpdateProcessorFactory into updateRequestProcessorChain "distrib-dup-test-chain-implicit"
   [junit4]   2> 356177 T1581 oasc.RequestHandlers.initHandlersFromConfig adding lazy requestHandler: solr.ReplicationHandler
   [junit4]   2> 356177 T1581 oasc.RequestHandlers.initHandlersFromConfig created /replication: solr.ReplicationHandler
   [junit4]   2> 356178 T1581 oasc.RequestHandlers.initHandlersFromConfig created standard: solr.StandardRequestHandler
   [junit4]   2> 356179 T1581 oasc.RequestHandlers.initHandlersFromConfig created /get: solr.RealTimeGetHandler
   [junit4]   2> 356179 T1581 oasc.RequestHandlers.initHandlersFromConfig created dismax: solr.SearchHandler
   [junit4]   2> 356180 T1581 oasc.RequestHandlers.initHandlersFromConfig created mock: org.apache.solr.core.MockQuerySenderListenerReqHandler
   [junit4]   2> 356180 T1581 oasc.RequestHandlers.initHandlersFromConfig created /admin/: org.apache.solr.handler.admin.AdminHandlers
   [junit4]   2> 356181 T1581 oasc.RequestHandlers.initHandlersFromConfig created defaults: solr.StandardRequestHandler
   [junit4]   2> 356181 T1581 oasc.RequestHandlers.initHandlersFromConfig adding lazy requestHandler: solr.StandardRequestHandler
   [junit4]   2> 356182 T1581 oasc.RequestHandlers.initHandlersFromConfig created lazy: solr.StandardRequestHandler
   [junit4]   2> 356182 T1581 oasc.RequestHandlers.initHandlersFromConfig created /update: solr.UpdateRequestHandler
   [junit4]   2> 356183 T1581 oasc.RequestHandlers.initHandlersFromConfig created /terms: org.apache.solr.handler.component.SearchHandler
   [junit4]   2> 356184 T1581 oasc.RequestHandlers.initHandlersFromConfig created spellCheckCompRH: org.apache.solr.handler.component.SearchHandler
   [junit4]   2> 356184 T1581 oasc.RequestHandlers.initHandlersFromConfig created spellCheckCompRH_Direct: org.apache.solr.handler.component.SearchHandler
   [junit4]   2> 356185 T1581 oasc.RequestHandlers.initHandlersFromConfig created spellCheckWithWordbreak: org.apache.solr.handler.component.SearchHandler
   [junit4]   2> 356186 T1581 oasc.RequestHandlers.initHandlersFromConfig created spellCheckWithWordbreak_Direct: org.apache.solr.handler.component.SearchHandler
   [junit4]   2> 356186 T1581 oasc.RequestHandlers.initHandlersFromConfig created spellCheckCompRH1: org.apache.solr.handler.component.SearchHandler
   [junit4]   2> 356187 T1581 oasc.RequestHandlers.initHandlersFromConfig created mltrh: org.apache.solr.handler.component.SearchHandler
   [junit4]   2> 356188 T1581 oasc.RequestHandlers.initHandlersFromConfig created tvrh: org.apache.solr.handler.component.SearchHandler
   [junit4]   2> 356188 T1581 oasc.RequestHandlers.initHandlersFromConfig created /mlt: solr.MoreLikeThisHandler
   [junit4]   2> 356189 T1581 oasc.RequestHandlers.initHandlersFromConfig created /debug/dump: solr.DumpRequestHandler
   [junit4]   2> 356191 T1581 oashl.XMLLoader.init xsltCacheLifetimeSeconds=60
   [junit4]   2> 356193 T1581 oasc.SolrCore.initDeprecatedSupport WARN solrconfig.xml uses deprecated <admin/gettableFiles>, Please update your config to use the ShowFileRequestHandler.
   [junit4]   2> 356194 T1581 oasc.SolrCore.initDeprecatedSupport WARN adding ShowFileRequestHandler with hidden files: [OLD_SYNONYMS.TXT, STOPWORDS.TXT, PROTWORDS.TXT, OPEN-EXCHANGE-RATES.JSON, SYNONYMS.TXT, CURRENCY.XML, MAPPING-ISOLATIN1ACCENT.TXT]
   [junit4]   2> 356195 T1581 oass.SolrIndexSearcher.<init> Opening Searcher@144f1d6 main
   [junit4]   2> 356196 T1581 oasu.CommitTracker.<init> Hard AutoCommit: disabled
   [junit4]   2> 356196 T1581 oasu.CommitTracker.<init> Soft AutoCommit: disabled
   [junit4]   2> 356197 T1581 oashc.SpellCheckComponent.inform Initializing spell checkers
   [junit4]   2> 356201 T1581 oass.DirectSolrSpellChecker.init init: {name=direct,classname=DirectSolrSpellChecker,field=lowerfilt,minQueryLength=3}
   [junit4]   2> 356226 T1582 oasc.SolrCore.registerSearcher [collection1] Registered new searcher Searcher@144f1d6 main{StandardDirectoryReader(segments_1:1)}
   [junit4]   2> 356238 T1581 oasc.CoreContainer.registerCore registering core: collection1
   [junit4]   2> 356238 T1581 oasc.ZkController.register Register replica - core:collection1 address:http://127.0.0.1:8983/solr collection:collection1 shard:shard1
   [junit4]   2> 356239 T1581 oascsi.HttpClientUtil.createClient Creating new http client, config:maxConnections=10000&maxConnectionsPerHost=20&connTimeout=15000&socketTimeout=30000&retry=false
   [junit4]   2> 356244 T1581 oascc.SolrZkClient.makePath makePath: /collections/collection1/leader_elect/shard1/election
   [junit4]   2> 356249 T1581 oasc.ShardLeaderElectionContext.runLeaderProcess Running the leader process for shard shard1
   [junit4]   2> 356251 T1581 oasc.ShardLeaderElectionContext.waitForReplicasToComeUp Enough replicas found to continue.
   [junit4]   2> 356251 T1581 oasc.ShardLeaderElectionContext.runLeaderProcess I may be the new leader - try and sync
   [junit4]   2> 356252 T1581 oasc.ShardLeaderElectionContext.runLeaderProcess I am the new leader: http://127.0.0.1:8983/solr/collection1/ shard1
   [junit4]   2> 356252 T1581 oascc.SolrZkClient.makePath makePath: /collections/collection1/leaders/shard1
   [junit4]   2> 356845 T1579 oascc.ZkStateReader.updateClusterState Updating cloud state from ZooKeeper...
   [junit4]   2> 356850 T1578 oascc.ZkStateReader$2.process A cluster state change: WatchedEvent state:SyncConnected type:NodeDataChanged path:/clusterstate.json, has occurred - updating... (live nodes size: 1)
   [junit4]   2> 356862 T1581 oasc.ZkController.register We are http://127.0.0.1:8983/solr/collection1/ and leader is http://127.0.0.1:8983/solr/collection1/
   [junit4]   2> 356862 T1581 oasc.ZkController.register No LogReplay needed for core=collection1 baseURL=http://127.0.0.1:8983/solr
   [junit4]   2> 356863 T1581 oasc.ZkController.checkRecovery WARN Skipping recovery according to sys prop solrcloud.skip.autorecovery
   [junit4]   2> 356863 T1581 oasc.ZkController.publish publishing core=collection1 state=active
   [junit4]   2> 356863 T1581 oasc.ZkController.publish numShards not found on descriptor - reading it from system property
   [junit4]   2> 356864 T1581 oascc.ZkStateReader.updateClusterState Updating cloud state from ZooKeeper...
   [junit4]   2> 356865 T1563 oasc.CoreContainer.load Loading cores into CoreContainer [instanceDir=/mnt/ssd/jenkins/workspace/Lucene-Solr-trunk-Linux/solr/build/solr-core/test-files/solr/]
   [junit4]   2> 356866 T1563 oashc.HttpShardHandlerFactory.getParameter Setting socketTimeout to: 120000
   [junit4]   2> 356866 T1563 oashc.HttpShardHandlerFactory.getParameter Setting urlScheme to: http://
   [junit4]   2> 356867 T1563 oashc.HttpShardHandlerFactory.getParameter Setting connTimeout to: 15000
   [junit4]   2> 356867 T1563 oashc.HttpShardHandlerFactory.getParameter Setting maxConnectionsPerHost to: 20
   [junit4]   2> 356868 T1563 oashc.HttpShardHandlerFactory.getParameter Setting corePoolSize to: 0
   [junit4]   2> 356868 T1563 oashc.HttpShardHandlerFactory.getParameter Setting maximumPoolSize to: 2147483647
   [junit4]   2> 356868 T1563 oashc.HttpShardHandlerFactory.getParameter Setting maxThreadIdleTime to: 5
   [junit4]   2> 356869 T1563 oashc.HttpShardHandlerFactory.getParameter Setting sizeOfQueue to: -1
   [junit4]   2> 356869 T1563 oashc.HttpShardHandlerFactory.getParameter Setting fairnessPolicy to: false
   [junit4]   2> 356870 T1563 oascsi.HttpClientUtil.createClient Creating new http client, config:maxConnectionsPerHost=20&maxConnections=10000&socketTimeout=120000&connTimeout=15000&retry=false
   [junit4]   2> 356874 T1563 oasc.ZkContainer.initZooKeeper Zookeeper client=127.0.0.1:58096/solr
   [junit4]   2> 356874 T1563 oasc.ZkController.checkChrootPath zkHost includes chroot
   [junit4]   2> 356875 T1563 oascc.ConnectionManager.waitForConnected Waiting for client to connect to ZooKeeper
   [junit4]   2> 356876 T1585 oascc.ConnectionManager.process Watcher org.apache.solr.common.cloud.ConnectionManager@1396b61 name:ZooKeeperConnection Watcher:127.0.0.1:58096 got event WatchedEvent state:SyncConnected type:None path:null path:null type:None
   [junit4]   2> 356877 T1563 oascc.ConnectionManager.waitForConnected Client is connected to ZooKeeper
   [junit4]   2> 356878 T1563 oascsi.HttpClientUtil.createClient Creating new http client, config:maxConnections=500&maxConnectionsPerHost=16&socketTimeout=120000&connTimeout=15000
   [junit4]   2> 356881 T1563 oascc.ConnectionManager.waitForConnected Waiting for client to connect to ZooKeeper
   [junit4]   2> 356882 T1587 oascc.ConnectionManager.process Watcher org.apache.solr.common.cloud.ConnectionManager@1f07cae name:ZooKeeperConnection Watcher:127.0.0.1:58096/solr got event WatchedEvent state:SyncConnected type:None path:null path:null type:None
   [junit4]   2> 356882 T1563 oascc.ConnectionManager.waitForConnected Client is connected to ZooKeeper
   [junit4]   2> 356885 T1563 oascc.ZkStateReader.createClusterStateWatchersAndUpdate Updating cluster state from ZooKeeper...
   [junit4]   2> 357889 T1563 oasc.ZkController.createEphemeralLiveNode Register node as live in ZooKeeper:/live_nodes/127.0.0.1:8983_solr
   [junit4]   2> 357890 T1578 oascc.ZkStateReader$2.process A cluster state change: WatchedEvent state:SyncConnected type:NodeChildrenChanged path:/live_nodes, has occurred - updating... (live nodes size: 1)
   [junit4]   2> 357890 T1563 oasc.ZkController.createEphemeralLiveNode Found a previous node that still exists while trying to register a new live node /live_nodes/127.0.0.1:8983_solr - removing existing node to create another.
   [junit4]   2> 357891 T1563 oascc.SolrZkClient.makePath makePath: /live_nodes/127.0.0.1:8983_solr
   [junit4]   2> 357891 T1587 oascc.ZkStateReader$3.process Updating live nodes... (0)
   [junit4]   2> 357891 T1578 oascc.ZkStateReader$3.process Updating live nodes... (0)
   [junit4]   2> 357892 T1578 oascc.ZkStateReader$2.process A cluster state change: WatchedEvent state:SyncConnected type:NodeChildrenChanged path:/live_nodes, has occurred - updating... (live nodes size: 0)
   [junit4]   2> 357893 T1587 oascc.ZkStateReader$3.process Updating live nodes... (1)
   [junit4]   2> 357894 T1578 oascc.ZkStateReader$3.process Updating live nodes... (1)
   [junit4]   2> 357898 T1588 oasc.ZkController.publish publishing core=collection1 state=down
   [junit4]   2> 357898 T1588 oasc.ZkController.publish numShards not found on descriptor - reading it from system property
   [junit4]   2> 357899 T1588 oasc.ZkController.waitForCoreNodeName look for our core node name
   [junit4]   2> 357900 T1588 oasc.ZkController.waitForShardId waiting to find shard id in clusterstate for collection1
   [junit4]   2> 357900 T1588 oasc.CoreContainer.create Creating SolrCore 'collection1' using instanceDir: /mnt/ssd/jenkins/workspace/Lucene-Solr-trunk-Linux/solr/build/solr-core/test-files/solr/collection1
   [junit4]   2> 357900 T1588 oasc.ZkController.createCollectionZkNode Check for collection zkNode:collection1
   [junit4]   2> 357901 T1588 oasc.ZkController.createCollectionZkNode Collection zkNode exists
   [junit4]   2> 357901 T1588 oasc.ZkController.readConfigName Load collection config from:/collections/collection1
   [junit4]   2> 357902 T1588 oasc.SolrResourceLoader.<init> new SolrResourceLoader for directory: '/mnt/ssd/jenkins/workspace/Lucene-Solr-trunk-Linux/solr/build/solr-core/test-files/solr/collection1/'
   [junit4]   2> 357902 T1588 oasc.SolrResourceLoader.replaceClassLoader Adding 'file:/mnt/ssd/jenkins/workspace/Lucene-Solr-trunk-Linux/solr/build/solr-core/test-files/solr/collection1/lib/README' to classloader
   [junit4]   2> 357903 T1588 oasc.SolrResourceLoader.replaceClassLoader Adding 'file:/mnt/ssd/jenkins/workspace/Lucene-Solr-trunk-Linux/solr/build/solr-core/test-files/solr/collection1/lib/classes/' to classloader
   [junit4]   2> 357950 T1588 oasc.SolrConfig.<init> Using Lucene MatchVersion: LUCENE_50
   [junit4]   2> 357975 T1588 oasc.SolrConfig.<init> Loaded SolrConfig: solrconfig.xml
   [junit4]   2> 357977 T1588 oass.IndexSchema.readSchema Reading Solr Schema from schema.xml
   [junit4]   2> 357983 T1588 oass.IndexSchema.readSchema [collection1] Schema name=test
   [junit4]   2> 358184 T1588 oass.OpenExchangeRatesOrgProvider.init Initialized with rates=open-exchange-rates.json, refreshInterval=1440.
   [junit4]   2> 358192 T1588 oass.IndexSchema.readSchema default search field in schema is text
   [junit4]   2> 358195 T1588 oass.IndexSchema.readSchema unique key field: id
   [junit4]   2> 358275 T1588 oass.FileExchangeRateProvider.reload Reloading exchange rates from file currency.xml
   [junit4]   2> 358279 T1588 oass.FileExchangeRateProvider.reload Reloading exchange rates from file currency.xml
   [junit4]   2> 358282 T1588 oass.OpenExchangeRatesOrgProvider.reload Reloading exchange rates from open-exchange-rates.json
   [junit4]   2> 358283 T1588 oass.OpenExchangeRatesOrgProvider$OpenExchangeRates.<init> WARN Unknown key IMPORTANT NOTE
   [junit4]   2> 358283 T1588 oass.OpenExchangeRatesOrgProvider$OpenExchangeRates.<init> WARN Expected key, got STRING
   [junit4]   2> 358283 T1588 oass.OpenExchangeRatesOrgProvider.reload Reloading exchange rates from open-exchange-rates.json
   [junit4]   2> 358284 T1588 oass.OpenExchangeRatesOrgProvider$OpenExchangeRates.<init> WARN Unknown key IMPORTANT NOTE
   [junit4]   2> 358285 T1588 oass.OpenExchangeRatesOrgProvider$OpenExchangeRates.<init> WARN Expected key, got STRING
   [junit4]   2> 358285 T1588 oasc.SolrCore.initDirectoryFactory org.apache.solr.core.MockDirectoryFactory
   [junit4]   2> 358285 T1588 oasc.SolrCore.<init> [collection1] Opening new SolrCore at /mnt/ssd/jenkins/workspace/Lucene-Solr-trunk-Linux/solr/build/solr-core/test-files/solr/collection1/, dataDir=/mnt/ssd/jenkins/workspace/Lucene-Solr-trunk-Linux/solr/build/solr-core/test/J0/./solrtest-SliceStateUpdateTest-1375492541711/data2/
   [junit4]   2> 358286 T1588 oasc.JmxMonitoredMap.<init> JMX monitoring is enabled. Adding Solr mbeans to JMX Server: com.sun.jmx.mbeanserver.JmxMBeanServer@855c0c
   [junit4]   2> 358287 T1588 oasc.CachingDirectoryFactory.get return new directory for /mnt/ssd/jenkins/workspace/Lucene-Solr-trunk-Linux/solr/build/solr-core/test/J0/./solrtest-SliceStateUpdateTest-1375492541711/data2
   [junit4]   2> 358287 T1588 oasc.SolrCore.getNewIndexDir New index directory detected: old=null new=/mnt/ssd/jenkins/workspace/Lucene-Solr-trunk-Linux/solr/build/solr-core/test/J0/./solrtest-SliceStateUpdateTest-1375492541711/data2/index/
   [junit4]   2> 358287 T1588 oasc.SolrCore.initIndex WARN [collection1] Solr index directory '/mnt/ssd/jenkins/workspace/Lucene-Solr-trunk-Linux/solr/build/solr-core/test/J0/./solrtest-SliceStateUpdateTest-1375492541711/data2/index' doesn't exist. Creating new index...
   [junit4]   2> 358288 T1588 oasc.CachingDirectoryFactory.get return new directory for /mnt/ssd/jenkins/workspace/Lucene-Solr-trunk-Linux/solr/build/solr-core/test/J0/./solrtest-SliceStateUpdateTest-1375492541711/data2/index
   [junit4]   2> 358289 T1588 oasc.SolrDeletionPolicy.onCommit SolrDeletionPolicy.onCommit: commits: num=1
   [junit4]   2> commit{dir=RateLimitedDirectoryWrapper(MockDirWrapper(org.apache.lucene.store.RAMDirectory@ef2f45 lockFactory=org.apache.lucene.store.NativeFSLockFactory@9caf08)),segFN=segments_1,generation=1}
   [junit4]   2> 358290 T1588 oasc.SolrDeletionPolicy.updateCommits newest commit generation = 1
   [junit4]   2> 358290 T1588 oasc.SolrCore.initWriters created xml: solr.XMLResponseWriter
   [junit4]   2> 358295 T1588 oasup.UpdateRequestProcessorChain.init inserting DistributedUpdateProcessorFactory into updateRequestProcessorChain "dedupe"
   [junit4]   2> 358296 T1588 oasup.UpdateRequestProcessorChain.init inserting DistributedUpdateProcessorFactory into updateRequestProcessorChain "dedupe-allfields"
   [junit4]   2> 358296 T1588 oasup.UpdateRequestProcessorChain.init inserting DistributedUpdateProcessorFactory into updateRequestProcessorChain "stored_sig"
   [junit4]   2> 358296 T1588 oasup.UpdateRequestProcessorChain.init inserting DistributedUpdateProcessorFactory into updateRequestProcessorChain "uniq-fields"
   [junit4]   2> 358297 T1588 oasup.UpdateRequestProcessorChain.init inserting DistributedUpdateProcessorFactory into updateRequestProcessorChain "distrib-dup-test-chain-implicit"
   [junit4]   2> 358297 T1588 oasc.RequestHandlers.initHandlersFromConfig adding lazy requestHandler: solr.ReplicationHandler
   [junit4]   2> 358298 T1588 oasc.RequestHandlers.initHandlersFromConfig created /replication: solr.ReplicationHandler
   [junit4]   2> 358299 T1588 oasc.RequestHandlers.initHandlersFromConfig created standard: solr.StandardRequestHandler
   [junit4]   2> 358300 T1588 oasc.RequestHandlers.initHandlersFromConfig created /get: solr.RealTimeGetHandler
   [junit4]   2> 358301 T1588 oasc.RequestHandlers.initHandlersFromConfig created dismax: solr.SearchHandler
   [junit4]   2> 358302 T1588 oasc.RequestHandlers.initHandlersFromConfig created mock: org.apache.solr.core.MockQuerySenderListenerReqHandler
   [junit4]   2> 358303 T1588 oasc.RequestHandlers.initHandlersFromConfig created /admin/: org.apache.solr.handler.admin.AdminHandlers
   [junit4]   2> 358304 T1588 oasc.RequestHandlers.initHandlersFromConfig created defaults: solr.StandardRequestHandler
   [junit4]   2> 358304 T1588 oasc.RequestHandlers.initHandlersFromConfig adding lazy requestHandler: solr.StandardRequestHandler
   [junit4]   2> 358304 T1588 oasc.RequestHandlers.initHandlersFromConfig created lazy: solr.StandardRequestHandler
   [junit4]   2> 358305 T1588 oasc.RequestHandlers.initHandlersFromConfig created /update: solr.UpdateRequestHandler
   [junit4]   2> 358306 T1588 oasc.RequestHandlers.initHandlersFromConfig created /terms: org.apache.solr.handler.component.SearchHandler
   [junit4]   2> 358307 T1588 oasc.RequestHandlers.initHandlersFromConfig created spellCheckCompRH: org.apache.solr.handler.component.SearchHandler
   [junit4]   2> 358309 T1588 oasc.RequestHandlers.initHandlersFromConfig created spellCheckCompRH_Direct: org.apache.solr.handler.component.SearchHandler
   [junit4]   2> 358310 T1588 oasc.RequestHandlers.initHandlersFromConfig created spellCheckWithWordbreak: org.apache.solr.handler.component.SearchHandler
   [junit4]   2> 358311 T1588 oasc.RequestHandlers.initHandlersFromConfig created spellCheckWithWordbreak_Direct: org.apache.solr.handler.component.SearchHandler
   [junit4]   2> 358311 T1588 oasc.RequestHandlers.initHandlersFromConfig created spellCheckCompRH1: org.apache.solr.handler.component.SearchHandler
   [junit4]   2> 358312 T1588 oasc.RequestHandlers.initHandlersFromConfig created mltrh: org.apache.solr.handler.component.SearchHandler
   [junit4]   2> 358313 T1588 oasc.RequestHandlers.initHandlersFromConfig created tvrh: org.apache.solr.handler.component.SearchHandler
   [junit4]   2> 358315 T1588 oasc.RequestHandlers.initHandlersFromConfig created /mlt: solr.MoreLikeThisHandler
   [junit4]   2> 358316 T1588 oasc.RequestHandlers.initHandlersFromConfig created /debug/dump: solr.DumpRequestHandler
   [junit4]   2> 358318 T1588 oashl.XMLLoader.init xsltCacheLifetimeSeconds=60
   [junit4]   2> 358320 T1588 oasc.SolrCore.initDeprecatedSupport WARN solrconfig.xml uses deprecated <admin/gettableFiles>, Please update your config to use the ShowFileRequestHandler.
   [junit4]   2> 358321 T1588 oasc.SolrCore.initDeprecatedSupport WARN adding ShowFileRequestHandler with hidden files: [OLD_SYNONYMS.TXT, STOPWORDS.TXT, PROTWORDS.TXT, OPEN-EXCHANGE-RATES.JSON, SYNONYMS.TXT, CURRENCY.XML, MAPPING-ISOLATIN1ACCENT.TXT]
   [junit4]   2> 358323 T1588 oass.SolrIndexSearcher.<init> Opening Searcher@12a1ec1 main
   [junit4]   2> 358324 T1588 oasu.CommitTracker.<init> Hard AutoCommit: disabled
   [junit4]   2> 358324 T1588 oasu.CommitTracker.<init> Soft AutoCommit: disabled
   [junit4]   2> 358325 T1588 oashc.SpellCheckComponent.inform Initializing spell checkers
   [junit4]   2> 358327 T1588 oass.DirectSolrSpellChecker.init init: {name=direct,classname=DirectSolrSpellChecker,field=lowerfilt,minQueryLength=3}
   [junit4]   2> 358348 T1589 oasc.SolrCore.registerSearcher [collection1] Registered new searcher Searcher@12a1ec1 main{StandardDirectoryReader(segments_1:1)}
   [junit4]   2> 358354 T1579 oascc.ZkStateReader.updateClusterState Updating cloud state from ZooKeeper...
   [junit4]   2> 358355 T1579 oasc.Overseer$ClusterStateUpdater.updateState Update state numShards=null message={
   [junit4]   2>  "operation":"state",
   [junit4]   2>  "core_node_name":"core_node1",
   [junit4]   2>  "numShards":null,
   [junit4]   2>  "shard":"shard1",
   [junit4]   2>  "roles":null,
   [junit4]   2>  "state":"active",
   [junit4]   2>  "shard_state":"active",
   [junit4]   2>  "core":"collection1",
   [junit4]   2>  "collection":"collection1",
   [junit4]   2>  "shard_range":null,
   [junit4]   2>  "node_name":"127.0.0.1:8983_solr",
   [junit4]   2>  "base_url":"http://127.0.0.1:8983/solr"}
   [junit4]   2> 358362 T1588 oasc.CoreContainer.registerCore registering core: collection1
   [junit4]   2> 358363 T1588 oasc.ZkController.register Register replica - core:collection1 address:http://127.0.0.1:8983/solr collection:collection1 shard:shard1
   [junit4]   2> 358363 T1588 oascsi.HttpClientUtil.createClient Creating new http client, config:maxConnections=10000&maxConnectionsPerHost=20&connTimeout=15000&socketTimeout=30000&retry=false
   [junit4]   2> 358413 T1588 oasc.ZkController.register We are http://127.0.0.1:8983/solr/collection1/ and leader is http://127.0.0.1:8983/solr/collection1/
   [junit4]   2> 358413 T1579 oasc.Overseer$ClusterStateUpdater.updateState node=core_node1 is already registered
   [junit4]   2> 358413 T1588 oasc.ZkController.register No LogReplay needed for core=collection1 baseURL=http://127.0.0.1:8983/solr
   [junit4]   2> 358414 T1588 oasc.ZkController.checkRecovery WARN Skipping recovery according to sys prop solrcloud.skip.autorecovery
   [junit4]   2> 358414 T1579 oasc.Overseer$ClusterStateUpdater.updateState Update state numShards=null message={
   [junit4]   2>  "operation":"state",
   [junit4]   2>  "core_node_name":"core_node1",
   [junit4]   2>  "numShards":null,
   [junit4]   2>  "shard":null,
   [junit4]   2>  "roles":null,
   [junit4]   2>  "state":"down",
   [junit4]   2>  "shard_state":"active",
   [junit4]   2>  "core":"collection1",
   [junit4]   2>  "collection":"collection1",
   [junit4]   2>  "shard_range":null,
   [junit4]   2>  "node_name":"127.0.0.1:8983_solr",
   [junit4]   2>  "base_url":"http://127.0.0.1:8983/solr"}
   [junit4]   2> 358414 T1588 oasc.ZkController.publish publishing core=collection1 state=active
   [junit4]   2> 358415 T1588 oasc.ZkController.publish numShards not found on descriptor - reading it from system property
   [junit4]   2> 358414 T1579 oasc.Overseer$ClusterStateUpdater.updateState shard=shard1 is already registered
   [junit4]   2> 358625 T1588 oascc.ZkStateReader.updateClusterState Updating cloud state from ZooKeeper...
   [junit4]   2> 358627 T1563 oasc.SliceStateUpdateTest.setUp ####SETUP_END testSliceStateUpdate
   [junit4]   2> 358628 T1579 oasc.Overseer$ClusterStateUpdater.updateState Update state numShards=null message={
   [junit4]   2>  "operation":"state",
   [junit4]   2>  "core_node_name":"core_node1",
   [junit4]   2>  "numShards":null,
   [junit4]   2>  "shard":"shard1",
   [junit4]   2>  "roles":null,
   [junit4]   2>  "state":"active",
   [junit4]   2>  "shard_state":"active",
   [junit4]   2>  "core":"collection1",
   [junit4]   2>  "collection":"collection1",
   [junit4]   2>  "shard_range":null,
   [junit4]   2>  "node_name":"127.0.0.1:8983_solr",
   [junit4]   2>  "base_url":"http://127.0.0.1:8983/solr"}
   [junit4]   2> 358628 T1563 oascc.ConnectionManager.waitForConnected Waiting for client to connect to ZooKeeper
   [junit4]   2> 358629 T1592 oascc.ConnectionManager.process Watcher org.apache.solr.common.cloud.ConnectionManager@133c687 name:ZooKeeperConnection Watcher:127.0.0.1:58096/solr got event WatchedEvent state:SyncConnected type:None path:null path:null type:None
   [junit4]   2> 358630 T1563 oascc.ConnectionManager.waitForConnected Client is connected to ZooKeeper
   [junit4]   2> 358631 T1587 oascc.ZkStateReader$2.process A cluster state change: WatchedEvent state:SyncConnected type:NodeDataChanged path:/clusterstate.json, has occurred - updating... (live nodes size: 1)
   [junit4]   2> 358631 T1578 oascc.ZkStateReader$2.process A cluster state change: WatchedEvent state:SyncConnected type:NodeDataChanged path:/clusterstate.json, has occurred - updating... (live nodes size: 1)
   [junit4]   2> 396141 T1563 oasc.CoreContainer.shutdown Shutting down CoreContainer instance=9506903
   [junit4]   2> 396176 T1579 oascc.ZkStateReader.updateClusterState Updating cloud state from ZooKeeper...
   [junit4]   2> 396177 T1579 oasc.Overseer$ClusterStateUpdater.updateState Update state numShards=null message={
   [junit4]   2>  "operation":"state",
   [junit4]   2>  "core_node_name":"core_node1",
   [junit4]   2>  "shard":null,
   [junit4]   2>  "roles":null,
   [junit4]   2>  "state":"down",
   [junit4]   2>  "core":"collection1",
   [junit4]   2>  "collection":"collection1",
   [junit4]   2>  "node_name":"127.0.0.1:8983_solr",
   [junit4]   2>  "base_url":"http://127.0.0.1:8983/solr"}
   [junit4]   2> 396177 T1579 oasc.Overseer$ClusterStateUpdater.updateState shard=shard1 is already registered
   [junit4]   2> 396180 T1578 oascc.ZkStateReader$2.process A cluster state change: WatchedEvent state:SyncConnected type:NodeDataChanged path:/clusterstate.json, has occurred - updating... (live nodes size: 1)
   [junit4]   2> 396180 T1587 oascc.ZkStateReader$2.process A cluster state change: WatchedEvent state:SyncConnected type:NodeDataChanged path:/clusterstate.json, has occurred - updating... (live nodes size: 1)
   [junit4]   2> 398144 T1563 oasc.ZkController.publish publishing core=collection1 state=down
   [junit4]   2> 398144 T1563 oasc.ZkController.publish numShards not found on descriptor - reading it from system property
   [junit4]   2> 398146 T1563 oasc.SolrCore.close [collection1]  CLOSING SolrCore org.apache.solr.core.SolrCore@10a79c7
   [junit4]   2> 398156 T1563 oasu.DirectUpdateHandler2.close closing DirectUpdateHandler2{commits=0,autocommits=0,soft autocommits=0,optimizes=0,rollbacks=0,expungeDeletes=0,docsPending=0,adds=0,deletesById=0,deletesByQuery=0,errors=0,cumulative_adds=0,cumulative_deletesById=0,cumulative_deletesByQuery=0,cumulative_errors=0}
   [junit4]   2> 398156 T1563 oasu.SolrCoreState.decrefSolrCoreState Closing SolrCoreState
   [junit4]   2> 398156 T1563 oasu.DefaultSolrCoreState.closeIndexWriter SolrCoreState ref count has reached 0 - closing IndexWriter
   [junit4]   2> 398157 T1563 oasu.DefaultSolrCoreState.closeIndexWriter closing IndexWriter with IndexWriterCloser
   [junit4]   2> 398157 T1563 oasc.SolrCore.closeSearcher [collection1] Closing main searcher on request.
   [junit4]   2> 398158 T1563 oasc.CachingDirectoryFactory.close Closing MockDirectoryFactory - 2 directories currently being tracked
   [junit4]   2> 398158 T1563 oasc.CachingDirectoryFactory.closeCacheValue looking to close /mnt/ssd/jenkins/workspace/Lucene-Solr-trunk-Linux/solr/build/solr-core/test/J0/./solrtest-SliceStateUpdateTest-1375492541711/data2 [CachedDir<<refCount=0;path=/mnt/ssd/jenkins/workspace/Lucene-Solr-trunk-Linux/solr/build/solr-core/test/J0/./solrtest-SliceStateUpdateTest-1375492541711/data2;done=false>>]
   [junit4]   2> 398158 T1563 oasc.CachingDirectoryFactory.close Closing directory: /mnt/ssd/jenkins/workspace/Lucene-Solr-trunk-Linux/solr/build/solr-core/test/J0/./solrtest-SliceStateUpdateTest-1375492541711/data2
   [junit4]   2> 398159 T1563 oasc.CachingDirectoryFactory.closeCacheValue looking to close /mnt/ssd/jenkins/workspace/Lucene-Solr-trunk-Linux/solr/build/solr-core/test/J0/./solrtest-SliceStateUpdateTest-1375492541711/data2/index [CachedDir<<refCount=0;path=/mnt/ssd/jenkins/workspace/Lucene-Solr-trunk-Linux/solr/build/solr-core/test/J0/./solrtest-SliceStateUpdateTest-1375492541711/data2/index;done=false>>]
   [junit4]   2> 398159 T1563 oasc.CachingDirectoryFactory.close Closing directory: /mnt/ssd/jenkins/workspace/Lucene-Solr-trunk-Linux/solr/build/solr-core/test/J0/./solrtest-SliceStateUpdateTest-1375492541711/data2/index
   [junit4]   2> 398160 T1579 oasc.Overseer$ClusterStateUpdater.amILeader According to ZK I (id=90144279213834244-127.0.0.1:8983_solr-n_0000000000) am no longer a leader.
   [junit4]   2> 398161 T1563 oasc.CoreContainer.shutdown Shutting down CoreContainer instance=32565094
   [junit4]   2> 398162 T1587 oascc.SolrZkClient.makePath makePath: /overseer_elect/leader
   [junit4]   2> 398164 T1587 oasc.Overseer.start Overseer (id=90144279213834246-127.0.0.1:8983_solr-n_0000000001) starting
   [junit4]   2> 398167 T1594 oasc.OverseerCollectionProcessor.run Process current queue of collection creations
   [junit4]   2> 398168 T1593 oasc.Overseer$ClusterStateUpdater.run Starting to work on the main queue
   [junit4]   2> 398168 T1587 oasc.ShardLeaderElectionContext.runLeaderProcess Running the leader process for shard shard1
   [junit4]   2> 398170 T1587 oasc.ShardLeaderElectionContext.shouldIBeLeader Checking if I should try and be the leader.
   [junit4]   2> 398170 T1587 oasc.ShardLeaderElectionContext.shouldIBeLeader My last published State was Active, it's okay to be the leader.
   [junit4]   2> 398170 T1587 oasc.ShardLeaderElectionContext.runLeaderProcess I may be the new leader - try and sync
   [junit4]   2> 398170 T1593 oascc.ZkStateReader.updateClusterState Updating cloud state from ZooKeeper...
   [junit4]   2> 398170 T1587 oasc.ShardLeaderElectionContext.runLeaderProcess I am the new leader: http://127.0.0.1:8983/solr/collection1/ shard1
   [junit4]   2> 398171 T1587 oascc.SolrZkClient.makePath makePath: /collections/collection1/leaders/shard1
   [junit4]   2> 398171 T1593 oasc.Overseer$ClusterStateUpdater.updateState Update state numShards=null message={
   [junit4]   2>  "operation":"state",
   [junit4]   2>  "core_node_name":"core_node1",
   [junit4]   2>  "numShards":null,
   [junit4]   2>  "shard":"shard1",
   [junit4]   2>  "roles":null,
   [junit4]   2>  "state":"down",
   [junit4]   2>  "shard_state":"active",
   [junit4]   2>  "core":"collection1",
   [junit4]   2>  "collection":"collection1",
   [junit4]   2>  "shard_range":null,
   [junit4]   2>  "node_name":"127.0.0.1:8983_solr",
   [junit4]   2>  "base_url":"http://127.0.0.1:8983/solr"}
   [junit4]   2> 398180 T1587 oascc.ZkStateReader$2.process A cluster state change: WatchedEvent state:SyncConnected type:NodeDataChanged path:/clusterstate.json, has occurred - updating... (live nodes size: 1)
   [junit4]   2> 399162 T1563 oasc.ZkController.publish publishing core=collection1 state=down
   [junit4]   2> 399162 T1563 oasc.ZkController.publish numShards not found on descriptor - reading it from system property
   [junit4]   2> 399164 T1563 oasc.SolrCore.close [collection1]  CLOSING SolrCore org.apache.solr.core.SolrCore@1e14684
   [junit4]   2> 399182 T1563 oasu.DirectUpdateHandler2.close closing DirectUpdateHandler2{commits=0,autocommits=0,soft autocommits=0,optimizes=0,rollbacks=0,expungeDeletes=0,docsPending=0,adds=0,deletesById=0,deletesByQuery=0,errors=0,cumulative_adds=0,cumulative_deletesById=0,cumulative_deletesByQuery=0,cumulative_errors=0}
   [junit4]   2> 399182 T1563 oasu.SolrCoreState.decrefSolrCoreState Closing SolrCoreState
   [junit4]   2> 399183 T1563 oasu.DefaultSolrCoreState.closeIndexWriter SolrCoreState ref count has reached 0 - closing IndexWriter
   [junit4]   2> 399183 T1563 oasu.DefaultSolrCoreState.closeIndexWriter closing IndexWriter with IndexWriterCloser
   [junit4]   2> 399183 T1563 oasc.SolrCore.closeSearcher [collection1] Closing main searcher on request.
   [junit4]   2> 399184 T1563 oasc.CachingDirectoryFactory.close Closing MockDirectoryFactory - 2 directories currently being tracked
   [junit4]   2> 399184 T1563 oasc.CachingDirectoryFactory.closeCacheValue looking to close /mnt/ssd/jenkins/workspace/Lucene-Solr-trunk-Linux/solr/build/solr-core/test/J0/./solrtest-SliceStateUpdateTest-1375492541711/data2 [CachedDir<<refCount=0;path=/mnt/ssd/jenkins/workspace/Lucene-Solr-trunk-Linux/solr/build/solr-core/test/J0/./solrtest-SliceStateUpdateTest-1375492541711/data2;done=false>>]
   [junit4]   2> 399184 T1563 oasc.CachingDirectoryFactory.close Closing directory: /mnt/ssd/jenkins/workspace/Lucene-Solr-trunk-Linux/solr/build/solr-core/test/J0/./solrtest-SliceStateUpdateTest-1375492541711/data2
   [junit4]   2> 399185 T1563 oasc.CachingDirectoryFactory.closeCacheValue looking to close /mnt/ssd/jenkins/workspace/Lucene-Solr-trunk-Linux/solr/build/solr-core/test/J0/./solrtest-SliceStateUpdateTest-1375492541711/data2/index [CachedDir<<refCount=0;path=/mnt/ssd/jenkins/workspace/Lucene-Solr-trunk-Linux/solr/build/solr-core/test/J0/./solrtest-SliceStateUpdateTest-1375492541711/data2/index;done=false>>]
   [junit4]   2> 399185 T1563 oasc.CachingDirectoryFactory.close Closing directory: /mnt/ssd/jenkins/workspace/Lucene-Solr-trunk-Linux/solr/build/solr-core/test/J0/./solrtest-SliceStateUpdateTest-1375492541711/data2/index
   [junit4]   2> 399186 T1593 oasc.Overseer$ClusterStateUpdater.amILeader According to ZK I (id=90144279213834246-127.0.0.1:8983_solr-n_0000000001) am no longer a leader.
   [junit4]   2> 399188 T1563 oasc.ZkTestServer.send4LetterWord connecting to 127.0.0.1:58096 58096
   [junit4]   2> 399189 T1563 oas.SolrTestCaseJ4.tearDown ###Ending testSliceStateUpdate
   [junit4]   1> client port:0.0.0.0/0.0.0.0:0
   [junit4]   2> NOTE: reproduce with: ant test  -Dtestcase=SliceStateUpdateTest -Dtests.method=testSliceStateUpdate -Dtests.seed=57A23F39F6A09DF7 -Dtests.multiplier=3 -Dtests.slow=true -Dtests.locale=mk -Dtests.timezone=Africa/Ceuta -Dtests.file.encoding=UTF-8
   [junit4] FAILURE 45.7s J0 | SliceStateUpdateTest.testSliceStateUpdate <<<
   [junit4]    > Throwable #1: org.junit.ComparisonFailure: expected:<[in]active> but was:<[]active>
   [junit4]    > at __randomizedtesting.SeedInfo.seed([57A23F39F6A09DF7:87C0B275A8754773]:0)
   [junit4]    > at org.apache.solr.cloud.SliceStateUpdateTest.testSliceStateUpdate(SliceStateUpdateTest.java:183)
   [junit4]    > at java.lang.Thread.run(Thread.java:724)
   [junit4]   2> 399216 T1563 oas.SolrTestCaseJ4.deleteCore ###deleteCore
   [junit4]   2> 45668 T1562 ccr.ThreadLeakControl.checkThreadLeaks WARNING Will linger awaiting termination of 3 leaked thread(s).
   [junit4]   2> 400487 T1587 oascc.ZkStateReader$3.process WARN ZooKeeper watch triggered, but Solr cannot talk to ZK
   [junit4]   2> 400487 T1587 oascc.ZkStateReader$2.process A cluster state change: WatchedEvent state:SyncConnected type:NodeChildrenChanged path:/live_nodes, has occurred - updating... (live nodes size: 1)
   [junit4]   2> 400488 T1587 oascc.ZkStateReader$2.process WARN ZooKeeper watch triggered, but Solr cannot talk to ZK
   [junit4]   2> NOTE: test params are: codec=FastDecompressionCompressingStoredFields(storedFieldsFormat=CompressingStoredFieldsFormat(compressionMode=FAST_DECOMPRESSION, chunkSize=268), termVectorsFormat=CompressingTermVectorsFormat(compressionMode=FAST_DECOMPRESSION, chunkSize=268)), sim=DefaultSimilarity, locale=mk, timezone=Africa/Ceuta
   [junit4]   2> NOTE: Linux 3.2.0-51-generic i386/Oracle Corporation 1.8.0-ea (32-bit)/cpus=8,threads=1,free=160705080,total=319815680
   [junit4]   2> NOTE: All tests run in this JVM: [TestFieldTypeResource, SoftAutoCommitTest, TestMaxScoreQueryParser, SearchHandlerTest, WordBreakSolrSpellCheckerTest, QueryEqualityTest, SpellingQueryConverterTest, ResponseLogComponentTest, SynonymTokenizerTest, TestPluginEnable, TestSerializedLuceneMatchVersion, TermsComponentTest, TestJoin, CoreAdminHandlerTest, ReturnFieldsTest, TestIBSimilarityFactory, TestValueSourceCache, DocValuesTest, DirectUpdateHandlerOptimizeTest, LegacyHTMLStripCharFilterTest, OverseerCollectionProcessorTest, SpatialFilterTest, ChaosMonkeyNothingIsSafeTest, DateFieldTest, BinaryUpdateRequestHandlerTest, OverseerTest, DistributedTermsComponentTest, TestBadConfig, ShowFileRequestHandlerTest, SuggesterTest, DistributedSpellCheckComponentTest, TestFieldResource, CoreMergeIndexesAdminHandlerTest, TestStressVersions, AddSchemaFieldsUpdateProcessorFactoryTest, SolrCoreTest, TestFastWriter, FastVectorHighlighterTest, PluginInfoTest, TestRandomDVFaceting, CachingDirectoryFactoryTest, SolrTestCaseJ4Test, TestDynamicFieldCollectionResource, TestDynamicFieldResource, TestPseudoReturnFields, SystemInfoHandlerTest, SuggesterFSTTest, UpdateRequestProcessorFactoryTest, SliceStateUpdateTest]
   [junit4] Completed on J0 in 47.20s, 1 test, 1 failure <<< FAILURES!

[...truncated 766 lines...]
BUILD FAILED
/mnt/ssd/jenkins/workspace/Lucene-Solr-trunk-Linux/build.xml:389: The following error occurred while executing this line:
/mnt/ssd/jenkins/workspace/Lucene-Solr-trunk-Linux/build.xml:369: The following error occurred while executing this line:
/mnt/ssd/jenkins/workspace/Lucene-Solr-trunk-Linux/build.xml:39: The following error occurred while executing this line:
/mnt/ssd/jenkins/workspace/Lucene-Solr-trunk-Linux/solr/build.xml:181: The following error occurred while executing this line:
/mnt/ssd/jenkins/workspace/Lucene-Solr-trunk-Linux/solr/common-build.xml:449: The following error occurred while executing this line:
/mnt/ssd/jenkins/workspace/Lucene-Solr-trunk-Linux/lucene/common-build.xml:1230: The following error occurred while executing this line:
/mnt/ssd/jenkins/workspace/Lucene-Solr-trunk-Linux/lucene/common-build.xml:873: There were test failures: 320 suites, 1347 tests, 1 failure, 37 ignored (6 assumptions)

Total time: 38 minutes 12 seconds
Build step 'Invoke Ant' marked build as failure
Description set: Java: 32bit/jdk1.8.0-ea-b99 -client -XX:+UseG1GC
Archiving artifacts
Recording test results
Email was triggered for: Failure
Sending email for trigger: Failure




---------------------------------------------------------------------
To unsubscribe, e-mail: [hidden email]
For additional commands, e-mail: [hidden email]